##TITLE=C13_PR193_k
 D2O, 23800 sc

 3.8.2020
##JCAMPDX= 6.0         $$ Bruker NMR JCAMP-DX V2.0
##DATA TYPE= NMR SPECTRUM
##DATA CLASS= NTUPLES
##ORIGIN= UXNMR, Bruker Analytische Messtechnik GmbH
##OWNER= root
$$ XWIN-NMR		Version 3.5
$$ Tue Aug  4 13:28:16 2020 Russian Standard Time (UT+4h)  she@DPX200
##.OBSERVE FREQUENCY= 50.327896
##.OBSERVE NUCLEUS= ^13C
##.ACQUISITION MODE= SIMULTANEOUS
##.ACQUISITION SCHEME= undefined
##.AVERAGES= 23800
##.DIGITISER RES= 17
##SPECTROMETER/DATA SYSTEM= spect
##.PULSE SEQUENCE= zgpg30
##.SOLVENT NAME= D2O
##.SHIFT REFERENCE= (INTERNAL, D2O, 0, 222.661)
##AUDIT TRAIL= $$ (NUMBER, WHEN, WHO, WHERE, WHAT)
$$ ##TITLE= Audit trail, XWIN-NMR		Version 3.5
$$ ##JCAMPDX= 5.01
$$ ##ORIGIN= Bruker BioSpin GmbH
$$ ##OWNER= she
$$ F:/spectra/data/she/nmr/c13/1/pdata/1/auditp.txt
$$ ##AUDIT TRAIL=  $$ (NUMBER, WHEN, WHO, WHERE, WHAT)
(   1,<2020-08-04 13:27:13.42 +0400>,<she>,<DPX200>,
      <created by zg, POWCHK disabled, PULCHK disabled
       terminated by command 'halt'
       configuration hash MD5:
       00 E9 B6 7A A2 85 ED C7 34 08 36 98 17 FE 4E 26
       data hash MD5: 32K
       17 40 12 02 C0 C6 00 65 EC EB 4B F7 10 F2 8F 80>)
(   2,<2020-08-04 13:27:15.20 +0400>,<she>,<DPX200>,
      <Start of raw data processing
       efp BC_mod = 2 LB = 1 FT_mod = 6 PKNL = 1 PHC0 = -243.505 PHC1 = 45.16238 SI = 32K 
       data hash MD5: 32K
       D4 E9 75 89 D8 6E 83 6A 27 47 2D B3 6C 80 A6 06>)
(   3,<2020-08-04 13:27:17.78 +0400>,<she>,<DPX200>,
      <abs ABSG = 5 
       data hash MD5: 32K
       84 D3 7D 67 21 4C DC 98 4F BF 36 8F 2D B7 11 80>)
(   4,<2020-08-04 13:27:49.57 +0400>,<she>,<DPX200>,
      <pk PHC0 = 20.03127 PHC1 = -29.6 
       data hash MD5: 32K
       17 C4 18 DD A5 B5 3F 62 FF 33 6B 40 02 67 0C 0D>)
(   5,<2020-08-04 13:27:52.75 +0400>,<she>,<DPX200>,
      <abs ABSG = 5 
       data hash MD5: 32K
       3C F7 C4 22 1C 0A 1E A6 DB D5 4D 11 58 1F 25 0B>)
$$ ##END=
$$ 
$$ hash MD5
$$ A2 EA A3 51 02 1C 4E 92 5D D0 B0 8B D8 71 39 B4
##$RELAX= 
##$RELAX= 
##$RELAX= 
##$RELAX= 
##$RELAX= 
##$RELAX= 
##$RELAX= 
##$RELAX= 
$$ Bruker specific parameters
$$ --------------------------
##$DU= <F:/spectra>
##$EXPNO= 1
##$NAME= <c13>
##$PROCNO= 1
##$TYPE= <nmr>
##$USER= <she>
##$AMP= (0..31)
100 100 100 100 100 100 100 100 100 100 100 100 100 100 100 100 100 100 
100 100 100 100 100 100 100 100 100 100 100 100 100 100 
##$AQSEQ= 0
##$AQ_mod= 1
##$AUNM= <au_zg>
##$AUTOPOS= <>
##$BF1= 50.322709
##$BF2= 200.13
##$BF3= 50.322709
##$BF4= 500.13
##$BF5= 500.13
##$BF6= 500.13
##$BF7= 500.13
##$BF8= 500.13
##$BYTORDA= 1
##$CFDGTYP= 0
##$CFRGTYP= 5
##$CHEMSTR= <none>
##$CNST= (0..31)
1 1 145 1 1 1 1 1 1 1 1 1 1 1 1 1 1 1 1 1 1 1 1 1 1 1 1 1 1 1 1 1 
##$CPDPRG= <waltz16>
##$CPDPRG1= <>
##$CPDPRG2= <waltz16>
##$CPDPRG3= <>
##$CPDPRG4= <mlev>
##$CPDPRG5= <mlev>
##$CPDPRG6= <mlev>
##$CPDPRG7= <mlev>
##$CPDPRG8= <mlev>
##$CPDPRGB= <>
##$CPDPRGT= <>
##$D= (0..31)
$$ [...]
##$SUBNAM4= <"">
##$SUBNAM5= <"">
##$SUBNAM6= <"">
##$SUBNAM7= <"">
##$SUBNAM8= <"">
##$SUBNAM9= <"">
##$SW= 239.972175391363
##$SWIBOX= (0..15)
0 1 3 0 0 0 0 0 0 0 0 0 0 0 0 0 
##$SW_h= 12077.2946859903
##$TD= 32768
##$TD0= 1
##$TE= 0
##$TE2= 300
##$TE3= 300
##$TEG= 300
##$TL= (0..7)
120 120 120 120 120 120 120 120 
##$TP= (0..7)
150 150 150 150 150 150 150 150 
##$TP07= 0
##$TPNAME0= <>
##$TPNAME1= <>
##$TPNAME2= <>
##$TPNAME3= <>
##$TPNAME4= <>
##$TPNAME5= <>
##$TPNAME6= <>
##$TPNAME7= <>
##$TPOAL= (0..7)
0.5 0.5 0.5 0.5 0.5 0.5 0.5 0.5 
##$TPOFFS= (0..7)
0 0 0 0 0 0 0 0 
##$TUNHIN= 0
##$TUNHOUT= 0
##$TUNXOUT= 0
##$USERA1= <user>
##$USERA2= <user>
##$USERA3= <user>
##$USERA4= <user>
##$USERA5= <user>
##$V9= 5
##$VALIST= <valist>
##$VCLIST= <CCCCCCCCCCCCCCC>
##$VD= 0
##$VDLIST= <DDDDDDDDDDDDDDD>
##$VPLIST= <PPPPPPPPPPPPPPP>
##$VTLIST= <TTTTTTTTTTTTTTT>
##$WBST= 1024
##$WBSW= 4
##$XGAIN= (0..3)
0 0 0 0 
##$XL= 0
##$YL= 0
##$YMAX_a= 128980746
##$YMIN_a= -34193730
##$ZGOPTNS= <>
##$ZL1= 120
##$ZL2= 120
##$ZL3= 120
##$ZL4= 120
##$ABSF1= 222.6606
##$ABSF2= -17.33621
##$ABSG= 5
##$ABSL= 3
##$ALPHA= 0
##$AQORDER= 0
##$ASSFAC= 0
##$ASSFACI= 0
##$ASSFACX= 0
##$ASSWID= 0
##$AUNMP= <proc_1d>
##$AZFE= 0.1
##$AZFW= 0.5
##$BCFW= 0
##$BC_mod= 2
##$BYTORDP= 0
##$COROFFS= 0
##$CY= -3
##$DATMOD= 1
##$DC= 0
##$DFILT= <>
##$DTYPP= 0
##$F1P= 0
##$F2P= 0
##$FCOR= 0.5
##$FTSIZE= 32768
##$FT_mod= 6
##$GAMMA= 0
##$GB= 0
##$INTBC= 1
##$INTSCL= 4.134877e-10
##$ISEN= 128
##$LB= 1
##$LEV0= 0
##$LPBIN= 0
##$MAXI= 10000
##$MC2= 0
##$MEAN= 0
##$ME_mod= 0
##$MI= 0.1934396
##$NCOEF= 0
##$NC_proc= 1
##$NLEV= 6
##$NOISF1= 120.0001
##$NOISF2= 80.00006
##$NSP= 0
##$NTH_PI= 0
##$NZP= 0
##$OFFSET= 222.6606
##$PC= 1.4
##$PHC0= -223.4737
##$PHC1= 15.56238
##$PH_mod= 1
##$PKNL= yes
##$PPARMOD= 0
##$PSCAL= 0
##$PSIGN= 0
##$REVERSE= no
##$SF= 50.322729756361
##$SI= 32768
##$SIGF1= 140
##$SIGF2= 120
##$SINO= 11.81781
##$SIOLD= 32768
##$SREGLST= <13C.CDCl3>
##$SSB= 0
##$STSI= 32768
##$STSR= 0
##$SW_p= 12077.2946859903
##$SYMM= 0
##$S_DEV= 0
##$TDeff= 32768
##$TDoff= 0
##$TI= <>
##$TILT= no
##$TM1= 0
##$TM2= 0
##$TOPLEV= 0
##$USERP1= <user>
##$USERP2= <user>
##$USERP3= <user>
##$USERP4= <user>
##$USERP5= <user>
##$WDW= 1
##$XDIM= 32768
##$YMAX_p= 377641217
##$YMIN_p= -5428991
$$ End of Bruker specific parameters
$$ ---------------------------------
##NTUPLES= NMR SPECTRUM
##VAR_NAME=  FREQUENCY,     SPECTRUM/REAL,   SPECTRUM/IMAG
##SYMBOL=    X,             R,               I
##VAR_TYPE=  INDEPENDENT,   DEPENDENT,       DEPENDENT
##VAR_FORM=  AFFN,          ASDF,            ASDF
##VAR_DIM=   32768,         32768,           32768
##UNITS=     HZ,            ARBITRARY UNITS, ARBITRARY UNITS
##FACTOR=    0.368581032318806, 1,           1
##FIRST=     11204.8891385315, 0,            0
##LAST=      -872.405547458802, 0,           0
##MIN=       -872.405547458802, -5428991,    0
##MAX=       11204.8891385315, 377641217,    0
$$ Real data points
##PAGE= N=1
##DATA TABLE= (X++(R..R)), XYDATA
$$ [...]
16047 -2006092 -3122490 -3024516 -2512708 -1635778 414855 2333852 3297376 3884130 3658965
16038 3658965 3221179 1866479 197917 10810 181685 613333 521114 -149795 -39782
16029 -39782 620816 1228451 834175 140828 285147 474876 -556205 -1570669 -2490638
16020 -2490638 -2855579 -2339444 -2178817 -1165866 166321 48556 193767 -113472 -802390
16011 -802390 -1151936 -978156 -399669 163666 799121 629805 -727733 -1484369 -871852
16002 -871852 -359028 443410 1278503 1531400 1390115 1249257 558007 -538181 -380011
15993 -380011 716748 1145071 1025859 -184614 -1080323 -216902 415706 238422 1197159
15984 1197159 1911443 1466198 1019385 1351791 1316992 1348254 1656702 750290 -202352 -174258
15974 -174258 975681 1181518 639496 159326 -236921 275632 -679072 -2596476 -3548321
15965 -3548321 -3295992 -2626320 -1968062 -1504008 -1034628 -324542 -391715 -931153 -467420 345519
15955 345519 -27 -215425 -447677 -722983 -1517847 -2446791 -2259833 -1306515 -25408
15946 -25408 719195 1031000 1676432 2263654 2594412 2662354 2757960 2170865 1237035 173845
15936 173845 -894284 -1068933 -868066 -925657 -578063 579533 293679 -788848 -968480
15927 -968480 -983210 -854752 81436 1234642 570099 539103 1134277 1088133 439801 -12662
15917 -12662 -248227 -603493 -877753 -1736201 -2074921 -1729165 -1070864 -868302 -710462 -356527
15907 -356527 -185848 -116166 -10681 61539 -594448 -830476 -346361 -269785 -449816 -448510
15897 -448510 -846661 -1784879 -1843229 -1165199 -1164231 -1021669 -1293620 -1142826 -549362 -37153
15887 -37153 -1085 241612 537156 356032 462154 376069 -459101 -507125 -48317 -727700
15877 -727700 -500475 270814 -269014 -1076458 -1066494 -65749 231413 80372 405663 555831
15867 555831 525489 323720 -162281 -302230 67637 219859 268550 -174112 91056 621934
15857 621934 661977 1016969 124944 -821330 -632111 460686 2443045 3046309 2807982
15848 2807982 2807926 1757008 -318450 -1082199 -429113 -307103 -1046890 -1713865 -1788206 -1508878
15838 -1508878 -1676583 -1448225 -874504 -876701 -1978442 -2861888 -1990171 -798946 -199832
15829 -199832 -79609 -423396 -923666 -1212296 -1976963 -2052384 -1428299 -749020 -64202 78177
15819 78177 267411 717039 572801 315406 255668 998620 1355656 1214933 1650917 2262148
15809 2262148 1934771 1467859 1366557 788445 366236 622101 367577 -747075 -1317655
15800 -1317655 -1501058 -1119563 379821 2130333 2553729 1300680 -10847 -276434 -101953
15791 -101953 166707 240437 -289193 -446401 -318228 -573923 -1045466 -1346433 -1574092 -1815610
15781 -1815610 -1446416 35064 1219095 1116918 1449855 2040693 1816064 1706678 2015542
15772 2015542 2087240 2028256 1819414 1250808 143526 -579988 -279832 347023 232915 223824
15762 223824 -396979 -393234 -620474 -1530428 -1085646 116362 657197 -154549 -583494 -291790
15752 -291790 -10331 581950 1045814 681347 378560 638679 813553 133345 -142254 -97130
15742 -97130 -143203 -266606 -378569 855410 2147970 2187121 1722096 1079554 774605 667414
15732 667414 255817 365382 476406 561899 1520603 2422766 2660675 2116067 1445316 1827637
15722 1827637 1723463 1486172 1167960 1289755 1607985 1227331 609257 -6054 -358911
15713 -358911 -305635 -437058 -494406 -906659 -914578 311732 613783 850949 1100779 1037435
15703 1037435 1035234 942820 976013 1449684 1166431 -33608 -1324833 -1633239 -1583875 -2103693
15693 -2103693 -2236398 -1396168 120895 1366300 792087 -3878 -357399 618600 700424
15684 700424 -9418 462042 1370499 1985065 1944877 1287919 661173 190063 377958 955312
15674 955312 758286 -91802 -1011396 -882067 487043 1042992 999533 1194346 1078439 525596
15664 525596 209025 31689 -790270 -551875 117355 418858 410935 1325034 2236614 2426778
15654 2426778 1231560 156782 2960 21118 508858 1695024 1338348 1137778 1121345
15645 1121345 1063464 956366 1293781 574103 -921329 -1665538 -1604011 -1758625 -2495128 -2650940
15635 -2650940 -1925338 -1281954 -241610 1178651 1231100 118325 -581539 -174623 55846
15626 55846 -205985 -738902 -1500656 -1755778 -1529558 -1422473 -1349400 -1027553 -734449 -521177
15616 -521177 -153165 389203 249749 -995082 -1381472 -1203618 -789392 -458444 -1090738
15607 -1090738 -1576461 -1097078 -1189651 -1429940 -733836 -126645 158607 247287 55015 153366
15597 153366 200647 453181 754032 875469 155428 309225 575695 624845 1272173 1111247
15587 1111247 78770 -870846 -1445640 -1246907 -714699 -173707 -300780 -734855 -1107873
15578 -1107873 -1173099 -955784 -954283 -1019679 -1389899 -1647061 -1788001 -553431 570622 636245
15568 636245 406942 -376225 -727076 -679383 -849950 -1538172 -1471543 -1067598 -933008 -790742
15558 -790742 -377213 -63832 -469209 -1069298 -811830 650921 2204658 2451110 1753968
15549 1753968 815889 371998 477966 740152 936733 349024 -738269 -1957898 -2040984
15540 -2040984 -1847217 -1901933 -2021848 -1976435 -2086993 -2228414 -2289969 -2191400 -1729502 -1609667
15530 -1609667 -2057878 -2218319 -1201004 -564157 17458 364803 293247 383975 506252 253978
15520 253978 -636059 -772028 33486 418467 -138053 -485305 -311054 369100 179594 -87806
15510 -87806 -342944 -1138940 -1327812 -136099 385102 125097 589723 1519913 1715231 1336047
15500 1336047 1124535 160680 -696364 -1410734 -1705095 -1193591 -657557 247550 492468
15491 492468 -62888 295840 126356 -1030537 -1355226 -473551 -315861 -846608 -294557
15482 -294557 786721 740222 425897 284841 -305513 -359392 -54027 552940 1416002 2143390
15472 2143390 2728338 3326967 3614751 2667144 1571739 856869 1208766 1458783 1277099
15463 1277099 1701794 1420553 213852 -689151 -73410 999223 1191133 1058187 678066
15454 678066 504547 569187 75398 -307620 -380504 -38873 453406 91312 -654120 -1067920
15444 -1067920 -1008393 -791309 -445644 588645 1328924 1838579 2307093 2622462 2092699
15435 2092699 848469 319409 902529 2171028 1867933 791864 -510952 -785364 -532489
15426 -532489 85936 872164 591338 723880 903599 792483 132253 -257839 -1107865 -1941237
15416 -1941237 -1805385 -1144439 -397209 43503 243696 -460258 -1655055 -1573271 -1356037
15407 -1356037 -1547526 -427290 597356 1006515 1397180 1071147 -471642 -1917877 -2958289
15398 -2958289 -3181767 -3140130 -2693368 -2053107 -824973 478104 554498 350284 763739
15389 763739 683464 457039 63825 131203 -465661 -1901114 -2184042 -1132584 -254038 -297396
15379 -297396 -548971 -871027 -1147697 -735192 -1260473 -2058644 -1842479 -1458308 -841386 151774
15369 151774 993304 955616 1220008 1995177 2778725 2754330 2590369 2746945 2115683 1095848
15359 1095848 572441 343643 129092 -121897 -837423 -1098336 -697350 245769 1049019
15350 1049019 1057249 947821 711286 474756 268591 479775 -179107 -1408040 -1872012 -1277459
15340 -1277459 -1270937 -1623267 -1716091 -1286845 -204525 551227 641402 624776 861016 703129
15330 703129 812678 1179481 1184414 650674 -423361 -1525959 -2547613 -1550493 -532163
15321 -532163 -296773 205374 1101755 684238 39782 353385 883764 964720 933841 1348549
15311 1348549 1706072 1452389 1128669 733034 393295 608420 703695 403547 51183 311
15301 311 -583754 -669268 827375 1992983 2204593 1620567 702611 609120 1090943 1567065
15291 1567065 1399602 681947 834730 974596 522613 317418 379025 -687337 -2055740
15282 -2055740 -2656514 -2864095 -2130175 -1026636 -128655 350857 1034025 1816995 3108819
15273 3108819 3133014 1126393 -735980 -1211781 -978589 -1108575 -1535144 -2221322 -2041577
15264 -2041577 -1558760 -1112984 -811988 -1376016 -1849975 -1915435 -2281930 -2412414 -2799858 -2949424
15254 -2949424 -1385090 226296 -345411 -1130782 -976668 -691588 -463244 -160545 29313
15245 29313 527707 594198 442968 -23608 55997 117550 -1065193 -1660226 -1681543 -1616338
15235 -1616338 -1406428 -847958 415879 1397540 1924041 716239 -263145 -151227 281165
15226 281165 661090 295741 -245904 -867362 -1390023 -1641541 -1486782 -2067892 -2935283 -2718499
15216 -2718499 -1507093 -1166269 -812132 -275972 77391 -29901 641728 1855353 1464504
15207 1464504 630963 50193 -915238 -1207396 -808061 -569296 -58433 872675 1490605
15198 1490605 1588002 474389 2841 -197070 -1002342 -1650301 -1577226 -1777796 -1763376 -881128
15188 -881128 93798 312127 393898 782602 1330134 1440117 1776995 2403465 2568058 2078177
15178 2078177 1528565 826022 248372 -264986 -40183 1152286 1946420 1785892 1493067
15169 1493067 1671177 1872990 1343963 906942 890313 915225 480041 775919 1088635 680386
15159 680386 39635 98930 198225 752090 1601077 1129681 333015 -634441 -1940277 -1620137
15149 -1620137 -778530 -917203 -1096832 -300755 318753 205635 -470994 -1042727 -1191003
15140 -1191003 -1216844 -324322 795514 479030 20081 523231 554677 358700 736096 76073
15130 76073 -693208 -943485 -1359350 -1529935 -896680 -274274 755335 1687982 791612 -294200
15120 -294200 -555696 -693847 -772275 -672969 -1061401 -1305486 -171919 997352 484246 -490775
15110 -490775 -968677 -768588 -151230 427067 951461 1495938 905385 -421479 -626130
15101 -626130 176172 282698 -261805 -1122482 -933131 6209 623066 655591 796121 1451054
15091 1451054 1924480 1241943 165757 -1036600 -1168824 279218 1572121 2021696 1432276
15082 1432276 878903 -360861 -2189888 -2725841 -1850649 -829910 370655 1038369 395966
15073 395966 -650972 -1424219 -1090208 -1143441 -829250 -343323 -448888 -348486 -245058 -543534
15063 -543534 -998709 -963109 -821519 -1062661 -488246 -475215 -1384321 -2444685 -3120840 -3448649
15053 -3448649 -3241366 -2300542 -1124376 -1447170 -2490452 -3052408 -2319741 -959119 -567532
15044 -567532 -829470 -1059607 -843842 -938119 -1398002 -825645 -103068 669209 1699496 2316095
15034 2316095 2327100 1814876 1688350 2347980 2260040 1934330 1260925 667887 160805 6740
15024 6740 -233769 -812865 -698373 288763 412238 -625730 -577513 -203551 -428934 -1123773
15014 -1123773 -1402712 -537283 205352 1077153 1395569 926587 1269650 1180541 671243 346597
15004 346597 133507 676524 935211 1502586 2127106 1509116 733617 656100 841081 710416
14994 710416 649467 1190586 1038570 -76914 -1119883 17948 1543372 1711489 1277812
14985 1277812 1380065 1169920 326553 -285070 -492084 -1078338 -1102179 -1278543 -2008481 -2593501
14975 -2593501 -2223982 -984756 -255290 293687 231380 108067 -120976 -215215 -474668 -300932
14965 -300932 -585491 -368574 112661 -232133 -718460 -625501 -319171 -24206 -637954 -1253441
14955 -1253441 -1228060 -1009117 -1530587 -1237159 14521 1460332 1544858 222714 -586643
14946 -586643 -244508 452771 1122257 1813613 1633547 892650 833556 1566018 1681456 1469752
14936 1469752 1353733 708422 552025 1227409 1635639 2173137 1727595 365786 -1480107
14927 -1480107 -2555432 -3514661 -3674984 -2932280 -2424677 -2558810 -2089490 -1418598 -1195938
14918 -1195938 -917031 -1337335 -1582742 -1635433 -1319774 -1302658 -1128506 -1412116 -1578149 -1462213
14908 -1462213 -985053 -589661 -575041 -527622 -135027 28623 340009 1102954 1789702 2334850
14898 2334850 3064899 2760070 1191719 -226480 -576791 -414227 -223489 -12674 339299
14889 339299 467523 -27199 -366520 -1730430 -2762011 -2790617 -2447026 -1965000 -2021571 -2580579
14879 -2580579 -3076964 -3057280 -2105724 -1031973 -131504 260470 -199991 -1445172 -1843219
14870 -1843219 -2033306 -1884971 -1309314 -917120 -889535 -365734 641911 1245811 1557087
14861 1557087 1716413 1358547 1169025 1758935 1777021 1009141 110748 -304471 -980407 -1987965
14851 -1987965 -2520408 -2156852 -2162962 -1858261 -1327211 -730031 -485562 -916347 -980053 -843605
14841 -843605 -1069689 -1215191 -1459326 -1305353 -840160 -649825 -509067 -642182 -163438 60390
14831 60390 -350288 -756252 -419177 87072 -7145 83120 721446 983626 6687 -33282
14821 -33282 -484402 -1190355 -1103355 459884 1864464 2572654 2080060 1465433 990509 545069
14811 545069 128728 -353872 -646814 -1436377 -2079368 -1572217 -740482 -4942 295743 672697
14801 672697 1351011 865330 -247982 -619871 -759975 -400912 167330 235750 197272 297413
14791 297413 428624 610985 249290 -65188 645386 1347728 918755 -47606 68539 194803
14781 194803 184904 391253 646536 784225 447720 -583687 -1748213 -2581989 -2469711 -2154156
14771 -2154156 -2063618 -1790293 -1060379 -873042 -595157 -783166 -1510069 -1445161 -900747 -82213
14761 -82213 1124275 2317952 2944745 3870135 4215879 3569305 2603207 1560373 425821
14752 425821 -811683 -1331542 -1292022 -1219610 -901513 -588787 -18640 866979 999207 -313131
14742 -313131 -1332673 -1052337 -444207 -274278 -588284 -739825 94640 922731 1076586
14733 1076586 881045 969954 1294238 2081646 1881811 846520 319703 379491 -98665 -1381237
14723 -1381237 -1935432 -1239400 -641215 -588489 -242915 -754977 -1109719 -1169360 -1436683 -1782723
14713 -1782723 -1446171 -1081710 -1968593 -2756532 -2492008 -1597067 -473035 -623689 -955043
14704 -955043 -919513 -668482 264121 386497 199566 434377 531612 756360 1036906 1579866
14694 1579866 2055719 1756409 114577 -1107105 -39520 1402016 2012951 1715415 1040261
14685 1040261 1263729 1338250 1222189 851177 378243 -421428 -587195 -443634 111421 886648
14675 886648 1315226 616853 -939867 -1441623 -732620 -325909 -393420 -312208 -93789 114380
14665 114380 1429442 2704733 3121584 2648929 2429325 2089600 1812526 1084034 671564
14656 671564 785264 400793 -112616 -116672 417409 896833 2203813 2173873 1637131 848405
14646 848405 151184 -53395 50480 337073 -847844 -1647979 -1177512 232363 1035877
14637 1035877 24561 -630329 92110 1723700 1985819 1462433 129270 -1267162 -1180286
14628 -1180286 -214012 629680 662519 96579 299234 260015 374152 438742 251057 132908
14618 132908 541996 1123859 745272 -207472 -1186157 -974805 -113821 -79101 -778377 -462101
14608 -462101 358020 606870 758827 767146 290792 454616 1146334 1280213 1007629 474202
14598 474202 -554744 -630256 339381 868873 774599 464238 336583 -207932 -976893 -1475390
14588 -1475390 -899353 -512062 -1225442 -2350600 -3045834 -2637421 -1740412 -1333666 -1934385
14579 -1934385 -2234839 -1499156 -797754 -388608 -172678 -80659 -626264 -1421123 -1541347 -1097273
14569 -1097273 -1163308 -1108292 -1292613 -1633890 -1673403 -1947106 -899148 769476 1768920 1876616
14559 1876616 2257284 1766232 -181542 -1002620 -546141 -70002 -360184 -498349 -275236
14550 -275236 111199 650077 501814 1215099 1976833 2490371 2331109 2622543 2708935 1875746
14540 1875746 841448 647517 670165 500994 440237 -219665 -1092864 -1500136 -848427 -66169
14530 -66169 -811077 -511946 765389 1122977 792291 576287 793124 1205929 1111954 807687
14520 807687 975261 713628 31615 -1367168 -2417669 -2601148 -2183716 -1257359 -525361
14511 -525361 -295114 -621434 -466777 -191844 -678662 -1406076 -1302211 -263032 488705
14502 488705 817906 440940 -111425 -735431 -1290241 -745153 -525892 -1240712 -1848269 -2213297
14492 -2213297 -1917351 -1467159 -1353950 -897898 -291091 115473 753748 1412891 1983559
14483 1983559 1487896 633087 678175 1481747 882812 -714795 -1353541 -1148246 -1098477 -86283
14473 -86283 1004528 733963 -527139 -1879525 -2826729 -2643531 -3395692 -3156699 -933015
14464 -933015 1191354 1426558 424350 333147 10919 -1137440 -1553679 -1829478 -2170162
14455 -2170162 -1500022 -594746 317995 632493 212522 -244914 -240255 -329465 -58574 -198834
14445 -198834 -322471 638214 1076422 231895 -1010235 -1686101 -2305241 -2478206 -1347852
14436 -1347852 -949861 -915470 -463598 250355 663605 686416 278020 -863892 -932240 -224773
14426 -224773 603578 1138458 808079 -289820 -818727 -439101 -99014 -390338 -637962
14417 -637962 -817705 -591326 -113868 45747 381785 1030815 1542727 1930385 1933389 1940212
14407 1940212 2492543 2989976 3071460 3008154 2516078 2259249 1757971 271045 -951239
14398 -951239 -1581135 -1798581 -1738655 -978930 46746 1094121 1204638 548721 743318
14389 743318 245906 -984215 -1273321 -1429929 -919868 178409 1026233 1378878 1105308
14380 1105308 385574 152468 -50023 -600838 -351378 -10444 118643 754101 1927078
14371 1927078 1491543 105480 -660428 -933399 -1419318 -2090327 -1712710 -883330 -346328
14362 -346328 139040 645978 443831 -771671 -1509785 -1235197 -218143 912655 755924
14353 755924 211076 367848 993903 1685919 1232224 705270 575247 523096 -84922 -163277
14343 -163277 276310 603222 437110 -57942 376315 406504 -44323 -22667 30919 -240648
14333 -240648 -31330 886986 1349349 487364 52608 -503686 -531959 -24526 734889 886259
14323 886259 515902 621052 142977 -1271082 -1618760 -1028212 -121680 485281 598193
14314 598193 498858 1335674 2539167 2266860 1020289 -241589 -632119 253459 1812299
14305 1812299 1830213 1032165 946085 1546668 1674008 1078192 359563 -248183 -694826 -1297358
14295 -1297358 -1864012 -2228298 -1903248 -1226735 -697626 -1219231 -2160359 -2302845 -1935773
14286 -1935773 -1199869 -1058493 -613819 -568417 -1432700 -1346300 -1187265 -1419350 -1459766 -352173
14276 -352173 864561 1048431 296143 754418 2189462 1311639 -545392 -537061 512010
14267 512010 1149217 1085968 808725 499916 -501564 -1478976 -1363850 -1263131 -1216508 -604468
14257 -604468 184542 402826 530698 687835 681607 766789 1296115 1460507 530973 -400995
14247 -400995 -286191 -272579 -815530 -939034 -332387 395 582451 337491 102631 214177
14237 214177 -262382 644056 1664160 1765400 2079046 2532200 1442796 428090 -126275
14228 -126275 -505213 -438757 294575 -173814 -1140592 -1078884 -1146375 -1685176 -1922575 -1494163
14218 -1494163 -1328191 -1770159 -2152634 -1661274 -242761 464366 615151 671222 171293
14209 171293 -802880 -1367726 -768668 13908 93091 -935005 -1906281 -2738033 -3692438 -3907555
14199 -3907555 -2920744 -1509377 -445287 265011 767759 961778 835024 261748 -170036
14190 -170036 19388 273839 -168432 -323759 -46097 -230810 -418058 -568510 -452311 307618
14180 307618 591706 228000 -678159 -298616 -118321 -839927 -689438 97368 748222 953454
14170 953454 1275188 1675430 2059330 1580250 312307 -1196415 -1953097 -1844229 -1864099
14161 -1864099 -1678700 -1062747 -867001 -84037 646270 458068 116153 -386481 -943317
14152 -943317 -1048686 -1848479 -2854054 -2185491 -1272900 -1135667 -938163 -542851 -774155
14143 -774155 -1333425 -1083440 -715990 -127709 906404 1493568 1882220 2406153 2337098 1411133
14133 1411133 -212265 29829 1154416 1008316 369094 -141905 -541067 -537022 -250550
14124 -250550 -224541 236807 1017041 975254 1970821 2966891 3181292 2323694 659539 453686
14114 453686 1279782 1880131 1854203 1871620 2239360 1786558 141402 76050 330654 -77680
14104 -77680 -259519 -384029 -451916 -88923 1069739 1814838 1146418 96935 -174625 -539893
14094 -539893 -1053466 -1391563 -1920095 -2369038 -2028831 -1642758 -1779178 -2192488 -2259559 -1206127
14084 -1206127 -945864 -2500680 -3368256 -3145236 -2956905 -3429427 -3030174 -2083273 -1022641
14075 -1022641 -274431 198284 433212 376042 -710264 -2582830 -3493055 -2441130 -238230
14066 -238230 809738 902304 680776 83404 -334541 -684416 -1843291 -2675882 -2002781
14057 -2002781 -922861 -747235 -1131672 -1331535 -1716991 -1208322 -1043992 -1854859 -2609547
14048 -2609547 -2458591 -1323202 26033 1522390 2597808 2319695 864596 -285600
14040 -285600 -764052 -800112 -142095 74843 501702 1097505 307260 -1135506 -1712703 -1590455
14030 -1590455 -1359934 -536480 -143171 468824 -160008 -1358634 -2046819 -2373056 -2199854
14021 -2199854 -1445894 -1480489 -1782941 -850477 106899 342361 1141721 1768347 1755144 1594579
14011 1594579 1373492 679006 486431 243720 434338 1358639 1875902 1171528 -464289
14002 -464289 -867730 -1206393 -1682851 -1979203 -2009108 -794003 -485745 -1487738 -1422450 -787318
13992 -787318 -689989 -944418 -1057299 -1249437 -1563359 -1315517 -757771 -163735 -345842 -998053
13982 -998053 -1213517 -2227431 -2714108 -2163456 -1596820 -1057478 -446810 706030 643204
13973 643204 -240628 -635735 -614220 -204848 201737 488418 533293 439699 747462 267637
13963 267637 62566 875277 1305658 1075144 1584492 2180340 2167016 1809187 1853091 1956074
13953 1956074 1323642 918430 1080928 956275 1216542 1661955 1417868 866242 -280669
13944 -280669 -873326 -1041615 -212535 1219546 1980698 2203243 2810432 2338827 995723
13935 995723 -505786 -1186003 -1454332 -1330407 -794491 -228487 -289851 275763 1171020 1464657
13925 1464657 1576791 1181617 386125 -390002 147333 1600790 2138082 1351249 726143
13916 726143 906328 668420 -443229 34056 769259 388530 -323677 -893173 -1006005
13907 -1006005 -781879 -375703 -303564 -425786 -620619 -1441164 -1407702 -803082 -289595 -776165
13897 -776165 -342388 449180 37928 91900 -286180 -930866 -826501 -896267 -1247310 -1613426
13887 -1613426 -2175225 -1976757 -1773596 -1765011 -1586075 -452303 788868 1025322 393519
13878 393519 -947818 -1183623 -125198 353862 817457 428754 -451179 -599284 -887566
13869 -887566 -682105 -225443 -458390 -198880 -4285 -261258 70518 202806 -157916 -827308
13859 -827308 -1321591 -1565879 -730990 -867525 -1728075 -2561209 -2402827 -1312800 -706523
13850 -706523 -490766 -562024 -792239 -565531 120529 798211 814404 730873 215907 338264
13840 338264 1091725 1557652 773750 -365021 -153743 464520 462670 -27597 415298 525104
13830 525104 592340 499214 122730 -328127 -736629 -1370074 -2673166 -2824498 -2248581 -1030150
13820 -1030150 722506 1039365 738567 469265 625518 533735 897986 1271008 637135
13811 637135 53772 389471 406900 207870 -428397 -1956896 -2714977 -1835778 -782381
13802 -782381 350409 611589 1089773 1525875 616059 -472140 -532361 -392572 233180
13793 233180 986197 968500 1075826 1232667 984043 408997 23680 304050 712313 934717
13783 934717 260353 -180793 -628458 -985011 -829945 -1050912 -1338656 -1662028 -1372030 -1309597
13773 -1309597 -1602708 -1747090 -1526286 -1733208 -1413620 -977163 -1472228 -1144202 -132028
13764 -132028 308673 685703 1010389 1670519 1548977 1085539 725297 308536 -63360 -786210
13754 -786210 -1158729 -384092 307045 958940 589958 -1155688 -2197262 -1907245 -2088222
13745 -2088222 -2164063 -2182113 -1719817 -1237894 -1138256 -762696 -564913 -157672 -482099 -750445
13735 -750445 -997547 -1005973 -511674 227372 844869 531843 -580450 -1151985 -239890 637668
13725 637668 -210713 -711774 -289169 -487501 -989872 -1357704 -1199259 -759914 -276056 75895
13715 75895 -28656 -58897 -236116 -698975 -974404 -1396508 -1313430 -576881 -587372 -1236945
13705 -1236945 -1526754 -1838550 -1578288 -589235 281009 660727 603761 52888 363848 1364636
13695 1364636 1304675 -174451 -1490768 -630715 788748 1335915 1868831 1378280 490254
13686 490254 131272 -739968 -1029348 -1239150 -1023552 -792994 -1249461 -1534493 -700166 89782
13676 89782 -575185 -1836679 -2428945 -2292674 -2076571 -1536881 -1229802 -1059912 -764304 -713172
13666 -713172 -1169630 -1348250 -1164320 -1458383 -1750445 -1083304 -414132 -834021 -987364 -599282
13656 -599282 -498613 -703825 -652740 177441 682725 535411 883491 1162441 764399 686338
13646 686338 838404 447224 -180416 -740540 -1346834 -1806132 -1995042 -1851928 -1407520 -1602082
13636 -1602082 -2044241 -2456728 -2219292 -1576660 -436660 103686 411701 331038 -119705
13627 -119705 -45928 266424 71560 -86317 -172140 -732605 -1425951 -1565224 -1918313 -1737060
13617 -1737060 -848795 -734916 -838041 -752791 -1941671 -2448904 -1981391 -1116346 -599861
13608 -599861 -75387 1193546 1850768 1466549 165400 -36290 257096 338905 1109546
13599 1109546 1355121 893356 102083 -55081 -559232 -1427001 -1687869 -1709954 -1854972 -2070675
13589 -2070675 -2014425 -1568075 -1142557 -1080825 -491661 106864 698423 1144464 1311015 296530
13579 296530 -641686 -1372991 -1716689 -1359493 -1226601 -1136923 -10903 668479 344362 -574581
13569 -574581 -1539372 -1905898 -2295666 -3213352 -3523364 -2861798 -1471816 -956617 -387253
13560 -387253 -558125 -987178 60072 1929766 3308824 3086170 1783775 891526 656263
13551 656263 -194545 -875849 -282822 13415 460642 1155585 1925957 1995647 780701 354535
13541 354535 1232028 1223318 841832 -7906 -533864 211682 369937 370448 -244470 -622247
13531 -622247 -843118 -1631107 -472630 1174646 1281071 348847 -31605 -90908 890936
13522 890936 2543421 4788410 7198654 7986865 6866551 5608083 4432017 3740476 3855294
13513 3855294 4146868 3771975 2737006 2431970 2297069 2066605 1997727 1992894 1494249 872910
13503 872910 751036 879249 598724 990268 442645 -90045 204982 -149277 -715868 -801093
13493 -801093 -484820 91699 19435 -34582 530356 620403 404274 1299785 1954091 2206797
13483 2206797 1605667 798070 374118 139264 535853 1039333 1490190 2304123 2612351
13474 2612351 2278565 1110070 -242090 -1291923 -1497897 -349295 932017 1162012 1062632
13465 1062632 163397 -919457 -1079347 -990457 -1138873 -1048441 -860222 -437025 -1014870 -1456558
13455 -1456558 -671823 -171358 -483103 -283126 -405866 -487088 -405696 -853523 -564106 -748232
13445 -748232 -1037223 -1624063 -1816179 -1428806 -738652 -183386 293387 593646 444303 -151003
13435 -151003 -473041 -1016647 -1540247 -2023208 -1808757 -1310489 -1584761 -1743855 -618413
13426 -618413 838803 1035637 63608 -354566 277338 873851 262492 376121 1102742
13417 1102742 1150144 1330271 895169 129374 -183948 -418493 -15451 400609 131414 -184936
13407 -184936 50823 16151 -472160 -651325 265510 1286271 1419844 1952353 2191522 1258747
13397 1258747 544888 419179 158746 -175292 -530453 -219530 742528 550461 -329954
13388 -329954 -213492 -418410 -710504 -689377 -1061862 -434585 185170 -263431 66322 47497
13378 47497 -67345 78454 594842 914033 902201 1342685 1239101 703824 771913 670650
13368 670650 415667 -67848 -55413 608219 1218274 1503843 1167870 911554 750449 471740
13358 471740 170633 -490716 -1158984 -1171740 -905000 -343282 -298247 -230066 -792653 -791375
13348 -791375 -198661 -530684 -1115140 -1180549 -44239 561850 809958 898455 -348663 -660668
13338 -660668 502939 1225451 1163625 571037 643702 726362 425963 254918 382172 30444
13328 30444 -269691 -722571 -807115 -358450 41531 499051 610482 739300 469999 1228432
13318 1228432 2479353 2519707 1931828 625850 -399495 -200080 254098 295445 44239
13309 44239 -225591 -13399 -219119 -419151 -484275 9971 274648 -232599 -685800 -682639
13299 -682639 -747627 -503112 20722 381648 677442 -170048 -490119 -203776 -245618 -792166
13289 -792166 -871968 -1330275 -1303633 -660120 -52703 -265875 -650177 -310427 -8797 308211
13279 308211 138374 -32613 325291 1612920 2234709 1845252 683411 -919290 -1460254
13270 -1460254 -1200859 -939432 -589170 -104970 142173 -595233 -792246 -305656 221517
13261 221517 751894 1890270 2198903 946794 242042 353221 429868 269257 892257
13252 892257 1500153 1590423 1705861 1643161 915419 191527 -965762 -1262060 -1302871 -2232739
13242 -2232739 -3064903 -3557670 -3839234 -3585003 -2370588 -540238 285148 772154 1023221
13233 1023221 771813 216364 -266151 -614638 -520824 -677588 -942298 -474553 272888 705187
13223 705187 655476 766879 411901 -521967 -1905856 -2079912 -1001534 -426231 230791
13214 230791 980097 293602 -96165 460625 1256125 2236405 1777431 1142688 684399 -583512
13204 -583512 -992044 -866914 -1457517 -1631681 -860629 -470013 -1305568 -2000124 -1329362 -917474
13194 -917474 -353851 181444 -52596 -873890 -1526327 -1730816 -1772293 -1624369 -1373358 -1194145
13184 -1194145 -902333 -237423 293864 943850 1009683 89171 -713523 -930605 -818707 -529868
13174 -529868 -668273 -739216 -273911 -996643 -2044570 -2018030 -1648917 -2495402 -3521045 -3569432
13164 -3569432 -3052009 -3036327 -2611704 -1329137 -768929 -811925 -1856186 -2727090 -2259877
13155 -2259877 -1721433 -1554326 -1931893 -2207458 -2452149 -2876413 -2872028 -1992252 -513189 270611
13145 270611 67585 -326774 453751 1493021 2387499 1323374 -137547 -412686 -363035
13136 -363035 -459330 -971434 -589942 -96040 283239 286078 -55751 -473136 -1147316 -1075345
13126 -1075345 293544 1614474 1108003 -215445 -313464 -346738 312995 1175354 1157167
13117 1157167 1169235 1205330 811379 1155628 667519 -481192 -506580 -253234 -290786 -287256
13107 -287256 -189113 -822330 -1436206 -1407491 -699045 -619719 -823394 -971297 -803617 -334770
13097 -334770 107825 839962 339104 -274169 -723759 -1159672 -1118668 -1188808 -1579876 -2063563
13087 -2063563 -2462546 -1809348 -1571569 -1475334 -350694 536654 797595 923247 700753
13078 700753 -137422 -608870 -626709 -1161962 -2046711 -1369661 -814319 -2264438 -3094373 -2402166
13068 -2402166 -1519121 -799000 257091 1005265 939838 1125424 1555947 1469253 590752 -173760
13058 -173760 -689048 -991353 -325673 772373 1681315 2537866 2787689 2106429 1403708
13049 1403708 1246224 1052426 823870 -12442 -676301 -532257 52057 216429 341306
13040 341306 272822 298084 173176 2973 -798252 -1921979 -2504949 -1933382 -1835920 -2423046
13030 -2423046 -2230103 -1869232 -1770674 -1236238 -667795 -442975 -740723 -1161371 -987926 -10861
13020 -10861 843694 -243875 -525962 -128280 -51791 432463 321113 60271 954452 1678415
13010 1678415 1296405 1136853 832618 -197394 -593411 242671 1113568 1580609 1157377
13001 1157377 -261057 -1072237 -850654 -697156 -1245618 -1598953 -1785271 -1865179 -1138632
12992 -1138632 -598385 -952388 -1088798 -587458 -457589 -520227 -571193 -79016 781755 1225217
12982 1225217 968033 659751 1247064 1160077 219101 190384 -154667 -1028789 -1662453 -2119362
12972 -2119362 -1274331 205205 781648 1042320 571820 -441528 -837092 -702322 -50626
12963 -50626 183906 -279814 -1324155 -1741477 -1521482 -1286954 -1448379 -1724992 -1965664 -2154047
12953 -2154047 -2646374 -2897907 -2045788 -1504322 -1507526 -1187399 -880483 -1209295 -1605344 -1712702
12943 -1712702 -1110011 -407427 593882 970742 579442 283764 269811 1068130 1517794
12934 1517794 898230 -425090 -1033699 -731528 -791989 -125043 734621 740363 734187 1411673
12924 1411673 1968126 1897233 1654707 952082 91206 -780716 -1040228 -1192724 -1820057 -2516768
12914 -2516768 -2534135 -2142787 -1015243 323646 826916 381107 -372090 -347092 1109863
12905 1109863 2081400 2106514 611662 -1181803 -1412642 -903184 94089 -425591 -1264288
12896 -1264288 -1157553 -1181777 -1198392 -1394008 -1251339 -659927 -52473 50304 -796184 -1521012
12886 -1521012 -1523469 -1091297 -265155 196432 581704 878171 1573080 1360276 644362 797901
12876 797901 1448060 1520656 1160252 849753 919060 865276 605522 1087481 779600 313649
12866 313649 317513 952015 1344999 540892 -622305 -1261939 -1825812 -1605810 -633368 -248693
12856 -248693 -64880 202556 582214 56383 -964912 -1056898 -638385 24547 708560 799594
12846 799594 1373581 1809678 1683987 1380266 482663 -70246 -321574 -276931 -366316 -712297
12836 -712297 -462036 -123386 -507449 -911481 -342694 1145243 1727710 1495914 1118653
12827 1118653 634264 480957 549305 1441242 2829997 3241918 2898128 2503146 2062200
12818 2062200 1452401 797058 933279 1263680 1412627 1394960 1026518 1064689 711757 623517
12808 623517 1322856 2153227 2885349 2661864 1765601 867387 313560 905628 1380973 2095268
12798 2095268 2700891 2532423 1765742 945977 761197 717365 195081 -144147 -2167 -195345
12788 -195345 -45261 140043 789776 2122555 3166668 3294561 2942267 3375027 2853338
12779 2853338 1027516 -150467 -485291 -458122 62735 477013 250217 55967 345625
12770 345625 490387 679889 699069 -397975 -1271394 -1762788 -2636402 -3746564 -3968536
12761 -3968536 -2544745 -967598 778712 169441 -1230000 -1220635 -1478722 -1585364 -1529302
12752 -1529302 -2170828 -2678250 -2174239 -1481656 -260118 371549 -741522 -2143254 -1522783
12743 -1522783 -481074 -659806 -826298 -770547 -1094076 -1884896 -2519156 -2732843 -2922771
12734 -2922771 -2422340 -1301039 -1094860 -987607 513 635084 240439 -1399525 -1896145
12725 -1896145 -1192857 -990798 -1192064 -1620218 -2014106 -1853863 -1017558 -590976 -448027
12716 -448027 -817091 -1015820 -511183 203175 869637 958179 682834 546953 857321 941043
12706 941043 760601 315263 226490 533630 782346 407038 -349575 -878428 -1504113 -1332121
12696 -1332121 -687744 -557217 -446978 -303728 -308438 -690202 -494042 155953 77953 -213077
12686 -213077 -533210 -563730 -150492 138696 492795 467914 271078 438597 603543 501672
12676 501672 245646 -12483 -49190 5787 -619901 -1590906 -1725107 -1496834 -1142192 -1352366
12666 -1352366 -1313229 3618 769955 42038 -1221154 -1728707 -2287375 -2677075 -1417296
12657 -1417296 -452556 -926073 -972346 -979839 -268537 589569 1289554 2047233 2044460 1942948
12647 1942948 2303959 2299315 1856727 1934074 1611994 1381559 1260222 1012384 440822 433601
12637 433601 942604 1011548 746665 503301 588480 -96633 -545136 631407 1234091 2014657
12627 2014657 1472037 96828 -230992 -410616 -453032 643670 2023142 2589568 2364033
12618 2364033 1693380 643148 392056 496805 48374 658155 1001359 221524 -292838
12609 -292838 -334251 -563709 -675736 -787634 -1148966 -686670 -184315 343084 1411526 1672385
12599 1672385 1235556 213114 -1502122 -2822198 -2481179 -1390402 -710772 -651487 -585460
12590 -585460 -275799 428698 591653 442666 -82913 -64929 -701997 -1502363 -235146 1645035
12580 1645035 2802295 2642479 1706947 1197355 591565 452563 425349 919013 1417293
12571 1417293 2113325 2634746 2323007 1275044 632261 1062404 1096095 830733 516814
12562 516814 -92815 -316539 -388273 -486090 -341055 -570259 -976848 -1476562 -1932356 -2296714
12552 -2296714 -1735063 -1114444 -802101 -1303849 -1385495 -678353 -327995 -317021 -356461 -33306
12542 -33306 579551 1071209 336221 -1029100 -1042325 -670448 -710429 -239721 201904 302111
12532 302111 707919 922864 605037 302725 -124187 -991385 -786285 191805 136508 -341760
12522 -341760 -444079 285316 764662 435540 -144836 -1099192 -676168 487024 2467
12513 2467 -1237889 -1054846 240183 841632 797209 739160 418457 -260073 -283884 -294904
12503 -294904 -382047 -391906 -955736 -997297 -272938 543398 446977 -459335 -1066536 -1577566
12493 -1577566 -1883581 -2027714 -2387760 -2163753 -2270793 -2667946 -2792712 -3094176 -2677452
12484 -2677452 -2048772 -1685795 -952025 -1337294 -2279498 -2292761 -2567055 -1703280 -887778 -861624
12474 -861624 -1090406 -1094044 -338090 74011 562915 734185 453338 204570 -370984 -395159
12464 -395159 75661 -371586 -1271417 -1400882 -1243453 -1372578 -657060 395780 253747
12455 253747 -447550 -405986 -489599 -630419 -485914 -489810 -837210 -1292064 -1024642 -620127
12445 -620127 233678 1289687 1809202 2080882 1716392 860662 367359 -75089 -302488
12436 -302488 -368992 -272120 163799 516684 576823 129827 -185722 668590 518823 -454759
12426 -454759 -943660 -761250 704599 1438389 250650 -424646 8207 424834 535850
12417 535850 933360 1250275 1283018 1220240 750216 612826 674547 446901 255887 418979
12407 418979 -130189 -799233 -222101 -492007 -1305631 -978994 19347 959787 1414222 1162545
12397 1162545 878133 1707726 2190329 2580151 2626348 1825220 1623628 1743488 2473083 2150287
12387 2150287 657552 -96590 -496856 -1292555 -1371688 -909045 -528210 -293201 -10706
12378 -10706 182403 188669 401829 944109 1152236 1101419 -49774 -1092516 -1480312 -1662123
12368 -1662123 -1556897 -1728295 -1326036 205811 1505884 1597749 1069443 858388 974731
12359 974731 821943 747200 983942 587051 282722 437650 147652 -494881 -763778 -658538
12349 -658538 -1521603 -2103069 -1207934 91188 608720 1194294 1387184 894406 835429 595864
12339 595864 829589 1931204 2498328 3063109 3782637 4444988 3687576 2964849 2395001
12330 2395001 1883180 1058513 332264 -379174 -1078116 -978790 -246386 -212385 -256719 -379281
12320 -379281 -624203 -758232 -610584 -651799 -634121 -1314816 -1601484 -987761 -739682 -1223635
12310 -1223635 -778924 824167 1788196 1969189 1434049 1464253 1462309 1264699 1385715 369911
12300 369911 -195512 -47427 738623 1199598 668848 -349284 -1246186 -962978 -553731
12291 -553731 68950 680203 796136 649743 287176 -304185 -891946 -1761125 -1346092 159942
12281 159942 1287402 1772672 1916438 1332341 1061239 1082839 961685 1311832 1883442 1721735
12271 1721735 672943 -343227 -353214 150685 239571 742892 1185942 1026839 732431 488807
12261 488807 -340650 -1365903 -1145678 -674614 -350089 226170 765944 1890719 2524634
12252 2524634 2040394 920699 875373 1592433 1460149 784608 488396 907588 1081493
12243 1081493 641280 485339 273881 91 577192 916005 637174 -142180 -883435
12234 -883435 -951080 -819107 -988716 -1175115 -1320380 -1467536 -442092 1108046 1253935
12225 1253935 564872 14287 -669808 -1194827 -1701956 -2510898 -2133948 -884051 -315336
12216 -315336 -282223 -696125 -1263271 -1723160 -1984411 -1474188 -648028 -205315 -549425 -757664
12206 -757664 -566217 -545780 -695536 -902744 -1014338 -1481140 -2021713 -1170740 26260 455608
12196 455608 1132064 1437355 1196040 765101 398177 -41739 -433550 -468872 -600352 -127122
12186 -127122 216068 556038 1828476 2729509 2024704 1021894 693481 97986 307343
12177 307343 592698 607196 243563 241011 1528183 2892668 3726047 3728286 2773793 1802004
12167 1802004 1256125 771605 868893 1149987 1310064 1182609 802907 165913 -315975 523465
12157 523465 1898331 1937299 1901221 1597717 1072844 -98513 -1031801 -895612 51465 1627540
12147 1627540 2612595 2800866 3006868 2666646 2303330 2285474 1318804 120910 13313
12138 13313 693591 913813 -982784 -1917387 -771172 508815 225846 -765768 -728962
12129 -728962 -431491 632569 1571486 1492629 970848 407128 -386507 -1232904 -1766119 -1894075
12119 -1894075 -2007550 -2412649 -1984290 -1127615 -1308119 -1769495 -1435073 -904961 -706010
12110 -706010 -815287 -975635 -845434 -49089 426757 -47659 -837058 -947405 -711546 -703944
12100 -703944 -928469 -1506757 -2265103 -2278511 -1465860 -840852 -1211050 -1464182 -1082726 -961384
12090 -961384 -946371 -775338 -483962 -400730 -464243 -467721 -451060 7013 -75148 -692151 -343004
12079 -343004 436874 893757 493732 -537230 -819579 -419114 664646 700608 144289
12070 144289 -441299 -1177895 -870891 -736808 -1448856 -1688842 -1391896 -2069856 -3636156
12061 -3636156 -4262718 -4286100 -4092171 -3906126 -2930911 -1406366 -121352 202101 -778581
12052 -778581 -1627994 -1573958 -1634935 -2109444 -1715630 -508290 738092 1666031 1656064 818949
12042 818949 640297 1125829 1590754 718330 -283733 -679793 -471360 163579 1489521
12033 1489521 1571432 1589312 1891895 1651039 1820913 1752863 1172688 723871 701589 1233929
12023 1233929 1037502 764992 1292988 1518254 1238130 1908423 2189664 1416900 751640
12014 751640 766265 1192553 411589 -624949 -940589 -1108268 -1563616 -1366936 -600312 -318053
12004 -318053 -438372 -197988 752215 1504132 893655 -365154 -580700 896997 1861225
11995 1861225 1795218 1634732 499267 -253928 -942755 -1856320 -1604964 -600228 -295126
11986 -295126 130708 176731 -389858 31639 828893 778108 587453 659323 664558 838359
11976 838359 1043173 1819073 2669060 2746884 2591357 2124317 1565986 362698 -123140 -956490
11966 -956490 -1864490 -1807449 -1894723 -1893852 -1595544 -1568951 -2040183 -1462461 -114481 153217
11956 153217 152409 679381 1089113 1261904 -376 -1232449 -2244762 -2468664 -1442379
11947 -1442379 166372 1237008 604961 286011 1171960 1200534 -411162 -759691 487660
11938 487660 1831572 2592398 2387795 2038465 1751531 1798113 1489224 925064 484706 765084
11928 765084 847359 427144 264093 575194 932005 1998372 2977192 2488514 2111398 2228875
11918 2228875 2637341 2681730 1680162 445904 34732 -368956 428044 1337602 1552069
11909 1552069 1320978 357461 -222067 1051397 3010778 4015749 4053912 3951140 3667433
11900 3667433 3428001 3006454 2364113 2338108 2576856 3043499 3804849 3939727 4175363 4487119
11890 4487119 4432140 4880639 5627438 7124121 8327290 8047772 7558043 7750815 8342671
11881 8342671 9430299 10443658 10365554 10290219 12323378 14925405 17024804 19811347 23375097
11872 23375097 27775977 33675260 39570305 43615344 45495581 47081864 49303599 54013527
11864 54013527 62136919 73078120 87350758 107979310 135022960 170820120 220397655
11857 220397655 283741105 347713682 377641217 352409367 295375837 238142133 192388493
11850 192388493 156474799 126896907 102722015 84731367 70770891 59656668 50761366
11843 50761366 43675913 37768572 33087282 29689893 26403803 23069014 19968119 18260479
11835 18260479 16416990 14212738 13256585 12496559 11993902 11888222 11400710 10685792 10105686
11826 10105686 9400045 7860157 6339922 6093215 6413654 6344204 5433781 3905362 2886513
11817 2886513 2409332 2163818 1482729 1443752 2003948 3261935 3609713 3506527 3837199
11808 3837199 3715727 3634325 3673245 3363297 2161230 872687 584114 234503 30545
11799 30545 439509 1064423 1250382 1414740 1171126 476395 -616112 -1213372 -1824308 -2146051
11789 -2146051 -1235969 -381728 129998 629799 456462 37887 -283875 -530453 -704375
11780 -704375 -355396 -419746 -642790 -1234580 -1650616 -1097912 -557358 -312418 23360 956957
11770 956957 1298217 923856 220540 67186 145316 -63192 390668 474163 137477 866659
11760 866659 992578 519293 734598 788386 1094394 1155243 1210996 2089861 2885359 2978044
11750 2978044 2494651 1221882 410702 7312 -22767 -225567 -342110 39623 175408
11741 175408 271699 74248 -240462 -723582 -1682101 -1767502 -538290 1371539 1587436 806945
11731 806945 898676 989474 1897340 1189491 -382917 -1020144 -1627274 -1581079 -319071 964258
11721 964258 1251445 375116 -665419 -1204423 -1531783 -1786660 -805422 -97003 504229
11712 504229 1488457 1717435 1578513 1118325 659485 1038961 1301892 722867 53648 -150598
11702 -150598 230868 231373 -845848 -1687203 -1671991 -1099040 113866 1642112 3080781 3029422
11692 3029422 2684547 2341085 1481990 1312405 1671482 1726890 1402045 981710 57486 -301747
11682 -301747 -221311 -112899 -264764 -170369 67695 -580695 -931111 -724515 -143071 418036
11672 418036 25028 296615 1323557 1346579 1255002 1598577 682350 -388733 -1317561 -1885698
11662 -1885698 -1834488 -1173588 -942729 -1156833 -855711 -1222571 -2163309 -2800628 -2802105 -2316393
11652 -2316393 -1361292 -1069464 -1138657 -569635 547725 1885284 2160250 1938074 1786868
11643 1786868 2467792 2819672 1617134 580023 249627 792393 1562268 1525334 663628
11634 663628 808563 1148479 1375166 1550541 1311755 945360 1034627 1078027 521962 566629
11624 566629 1223883 2233352 2510015 2035354 1164620 1124279 486363 225215 1287859
11615 1287859 1828493 2650200 3336362 2461762 1594405 1048769 1391348 1760705 1720552 672185
11605 672185 -516175 -569575 184965 369007 -89798 -151772 370352 38519 -794597 -627927
11595 -627927 -1088532 -1606853 -941636 118973 272494 52680 84090 -281290 -947978 -1810763
11585 -1810763 -1815283 -1583012 -1502462 -1328750 -727460 -253255 -108912 -468965 -406559 695552
11575 695552 1709009 2258550 2055676 1539936 1440654 1397308 657362 135326 -140676 -238742
11565 -238742 -416538 -706200 -607603 -690376 -836044 -453862 -704645 -654026 -251887 -115246
11555 -115246 57271 -37757 -218822 -648965 -1002292 -1175077 -1085001 -494935 158405 1134775
11545 1134775 1713749 1290340 540025 -717457 -1416120 -877729 -10715 479999 537989
11536 537989 637105 795238 783737 -206334 -1466845 -1889846 -1634541 -1784276 -1434186 -734656
11526 -734656 -787794 -1352087 -833671 133444 806120 520588 56097 -956106 -1616145 -1365748
11516 -1365748 -781854 -20141 848771 1642445 2097877 1866825 1993533 1932948 1105836 510017
11506 510017 -225789 -852204 -948030 -838046 -895879 -890244 134288 882966 1453009 1814620
11496 1814620 1807296 1357841 903911 1243893 1916122 1473163 1577777 1743509 1187787 -127098
11486 -127098 -1078226 -1256532 -763911 -157544 -1101991 -1609861 -1760066 -1463957 -593306 183591
11476 183591 187642 -210872 517118 1804353 1637008 746856 217344 394292 -9002 -825892
11466 -825892 -290680 666093 1383383 1783791 1382858 1182728 756666 695893 1526047 2284980
11456 2284980 2496790 1929958 1399124 897909 -373526 -1582291 -1769437 -1488733 -891746
11447 -891746 273914 910098 512645 -364086 -381303 64780 -18274 -393753 -922045 -705543
11437 -705543 -310728 -404336 -584064 -355854 -422396 -326968 681366 3089396 3863824 2655856
11427 2655856 1876258 458837 -550929 -581921 -457983 -400282 -1029292 -1051890 -277497 446640
11417 446640 727513 645406 454904 151698 -893942 -1179269 -635202 22798 749599 1520697
11407 1520697 2740181 2896676 2253773 2092781 2163320 2171650 1570667 885204 439475 -617444
11397 -617444 -1416064 -778480 565497 859631 562324 235456 424294 467243 644789 304985
11387 304985 -38262 -557081 -706307 72596 651077 1005923 801889 -642417 -1960843
11378 -1960843 -2004523 -1377368 -818798 -671844 -618138 -799413 -729500 -76616 -111062 -1100845
11368 -1100845 -1684991 -2057474 -1958788 -2053904 -1891720 -693769 165045 977520 625148 -1080374
11358 -1080374 -2559109 -2027660 -1455025 -1480331 -1791452 -1669550 -785786 -205396 -132983 203877
11348 203877 536236 540109 726704 868803 496679 477177 775746 487141 -130465 -1196998
11338 -1196998 -1755200 -2168355 -2341921 -2187807 -1829205 -826469 -675493 -933841 -696311
11329 -696311 -354879 184410 251898 274887 915107 845226 178792 -516002 -865940 -670975
11319 -670975 9588 171747 483517 1763222 2354159 2333314 1471922 599569 681068 849895
11309 849895 953472 877701 1102516 1282505 1734979 2479452 2550920 2219568 1608687 815431
11299 815431 -311169 -762721 -680249 -1061202 -1354192 -1482293 -890901 -313681 -359201 343047
11289 343047 763082 792495 774061 889385 1205567 2061145 3071387 3354353 3411407 3246932
11279 3246932 3015282 2514587 2025905 3193283 5661542 8390929 11022763 13575146 15233924
11270 15233924 15176341 13905990 11394978 8487462 6150769 4525004 3104290 1897532
11262 1897532 1385363 737831 -71706 -1044381 -1352725 -1061670 -828874 -1250924 -1213669 -551184
11252 -551184 -599067 -954036 -905892 -262421 435860 1610100 1478971 990471 818248 966981
11242 966981 1405457 1686178 1922033 1677298 1653240 1296977 1263891 1372517 989375 408315
11232 408315 -856077 -1627321 -1681760 -1565665 -1774009 -2220611 -2152281 -1878504 -1143397 -604501
11222 -604501 -378075 -385855 -923224 -1012144 -300118 125194 -338029 -333923 280569 618154
11212 618154 902773 725389 10737 -335613 -698034 -1006365 -315394 696518 585777
11203 585777 -28059 -669214 -2229356 -3426632 -3637704 -2892477 -1859017 -1179234 575693
11194 575693 1603239 788160 -690505 -1256291 -1178129 -1537500 -1732814 -1252746 -763107
11185 -763107 -824817 -1207593 -1163958 -149964 692746 289621 392292 476502 72475 -405982
11175 -405982 -1010020 -1058270 -706551 -116582 60013 -453173 -372674 595358 1199118 1089352
11165 1089352 999412 1512786 2244260 2656122 2759151 2326638 803100 -218238 107094
11156 107094 322702 506356 1005562 625906 -505475 -611682 47121 466786 1126114
11147 1126114 1395359 951426 178026 197751 1079711 1735116 2177795 2353687 2012223 1075214
11137 1075214 367206 -116505 -492952 -731843 -595822 -491435 -683432 161222 854513
11128 854513 1581091 1918303 1602626 1379389 1201357 869021 -163588 -486044 241400
11119 241400 910158 1263910 1104190 629540 348914 1138627 1697152 1684534 566770 -381495
11109 -381495 -590291 -295547 353400 1357499 1644995 1655726 1969383 2426248 2735172 2130246
11099 2130246 2588404 4446589 4990636 4119304 3321167 2404062 1520224 1369415 1687709
11090 1687709 2200288 2206550 1686039 2305845 3032797 2850821 2797248 2809676 3125848 4231915
11080 4231915 5775216 6837031 7252863 7760194 9080095 11069110 14216619 17810591
11072 17810591 20474757 21528772 20824248 19146509 17230601 16525315 16238418 16050178 16804694
11063 16804694 18152426 19130087 20461836 22455860 25650859 28879433 32116291 36235229
11055 36235229 42123341 50352839 60500602 71875127 87208744 108885530 138660875
11048 138660875 177835475 225978531 279521430 323623696 336985177 311502671 263456326
11041 263456326 212961968 169415005 135352755 109481082 90166100 75708621 64203626
11034 64203626 55054549 47663472 41898165 37350350 32810877 28533824 25231864 22757692
11026 22757692 20304350 18524414 17428925 15659234 13693202 11819996 10462712 9715757
11018 9715757 9661936 9206906 7558017 6671191 6972700 6649384 6277623 6168671 5444179
11009 5444179 4485695 3758436 3539942 3584611 3606692 3176354 2228256 2008354 2460599 2637889
10999 2637889 3069231 4047913 4815904 4530349 4533223 4686165 4119038 3266215 2675200 1955790
10989 1955790 1371460 890559 425850 -324514 -446388 -331621 -14990 1177652 2172686
10980 2172686 2183935 2217398 2145585 1484096 1373787 644321 355986 1260144 1250284 812308
10970 812308 790551 1146079 1049469 1305816 1772025 1956616 1714522 315080 -120393 166037
10960 166037 128882 287433 1054040 1376143 1552191 1565729 1342322 2068136 2305638 1176260
10950 1176260 86062 -1263846 -1863108 -1588418 -761698 -89836 -330160 -231153 -7083
10941 -7083 -294681 -596839 -916619 -975509 -557804 192381 1183489 725275 271966 749473
10931 749473 901843 1333825 1876058 2174359 1630922 419809 -753097 -1161610 329224
10922 329224 1961364 2599410 2091727 1582981 959299 156604 -431018 -900466 -1294102
10913 -1294102 -1047042 6897 -291963 -1384583 -1223787 -660273 -778097 -808980 -1012571
10904 -1012571 -731578 -41922 205847 -441212 -878652 -1294345 -1472107 -876728 -963639 -1063470
10894 -1063470 -386904 462879 783109 583813 190319 191775 888406 1058299 267543 -967528
10884 -967528 -2092408 -3402671 -4648958 -4126314 -2991104 -2664179 -2027674 -789850 152426
10875 152426 366895 47432 876184 2124480 3184692 3403658 2633010 1279681 21380
10866 21380 359276 1095454 1935543 2478632 2198667 2006677 1616083 652647 -170194 -1030135
10856 -1030135 -1419923 -1675600 -1974453 -1605837 -375066 347624 1002129 962332 510873
10847 510873 461892 903826 666192 89939 -449021 -1213699 -689253 334832 898246 1082836
10837 1082836 1144370 1562720 1663294 2430713 2799516 1813044 1067696 553474 -273130 -513098
10827 -513098 -563648 -628297 -921526 -829429 -407763 -270580 -317158 -66432 995534 1633129
10817 1633129 1895578 1912697 1607640 1315772 1744447 2017083 1155258 -222216 -1131552
10808 -1131552 -2090800 -2388809 -1443923 -1077720 -1406545 -1543307 -2788870 -3079663 -2157854
10799 -2157854 -1799289 -1413991 -434281 385114 839846 -71040 -1178467 -1033003 -226885
10790 -226885 400505 -81595 -141010 824340 1713534 1369707 491569 -381913 -937805 -181977
10780 -181977 351650 -202864 130845 423660 209568 151047 -761906 -1638020 -2464091 -2501286
10770 -2501286 -1976371 -1408854 -1039205 -1024209 -603643 958127 1801295 1407961 1033435
10761 1033435 326450 -1062663 -2538639 -3063319 -2469697 -1079691 417534 1198974 1152610
10752 1152610 847458 449020 562259 705201 -367235 -1242172 -1752222 -1196848 -323551
10743 -323551 -244923 608150 1875900 1814929 1092819 538169 143212 -50315 -14911 231638
10733 231638 777477 1049262 496988 65365 624768 1244281 747007 -317811 -1152325
10724 -1152325 -1368999 -719229 -7245 258915 284416 76632 -519335 -315571 133026 300169
10714 300169 742488 1091997 574915 -349453 -245054 -112062 -485168 -425438 946212 1761955
10704 1761955 1748116 2170841 2816255 3005260 2268872 1552898 1778443 1777401 1794513 1592551
10694 1592551 244857 -1140314 -1758197 -1799630 -1388463 -554899 432727 1387524 1683918
10685 1683918 1708580 1660731 1060024 229156 -757049 -1244236 -180856 1079064 1389953
10676 1389953 936624 147224 -599829 -410214 -230621 -70426 405685 775471 842778 191043
10666 191043 132657 1142948 1287781 682025 -633018 -863888 718598 2846291 3988681
10657 3988681 3799227 3844920 3544799 2837922 1606723 1277129 1118033 792782 614973
10648 614973 724554 841990 701203 837407 1032100 1246203 1488641 1065606 620802 258040
10638 258040 175204 147056 296305 -57512 -316444 -210480 261312 695022 259248 -118450
10628 -118450 553217 588132 -1737 -476665 -464935 -477835 -1001409 -878990 -652791 -852771
10618 -852771 -1903047 -1769772 -230329 713509 1365408 2260559 2151539 1629013 1683636
10609 1683636 882745 -565927 -1025869 -1048994 -570416 -68365 -139492 503002 911666 1590022
10599 1590022 2436721 3052902 3102420 2224693 1307915 1610221 1925018 1204244 514348 458404
10589 458404 825737 1075022 854168 -324538 -944952 -950120 -559920 -128413 236723 678279
10579 678279 1148735 1194318 1750438 1922037 726479 87899 558342 827454 -61281 -985019
10569 -985019 -1723049 -1680922 -1614751 -1791597 -1442248 64031 945531 1321260 1397331 1030488
10559 1030488 934457 821188 1222235 853455 -440500 -668223 -293979 -437697 -514282 -1159935
10549 -1159935 -1448159 -765219 -306347 -499256 61834 132738 10111 608247 836288 596811
10539 596811 512856 733409 1255602 1884095 2081110 1764075 1747006 2248948 2485015 2484294
10529 2484294 2135959 1127348 -309168 -1348698 -1341569 -1346442 -1421550 -1877721 -2790301 -2361654
10519 -2361654 -1568761 -1080554 -1186430 -1023991 -406502 370310 1067557 827680 503430
10510 503430 1121690 2102340 2277823 1945096 2051347 2441979 2056582 2176411 3190692
10501 3190692 3380926 3118347 2914244 1448303 -283977 -1080746 -1538271 -1847032 -2026562
10492 -2026562 -1791548 -1228602 -451153 531636 347187 -423151 -811818 -716925 -521967 -633835
10482 -633835 -636245 -353927 -450459 -306787 -562584 -926252 41791 1310660 1500494 1607346
10472 1607346 2294855 2330332 2091333 1363648 518745 110019 -299291 -817951 -1006250 32451
10462 32451 284774 -619460 -2344410 -3084778 -2402692 -1587287 -927949 -387469 237865 835945
10452 835945 1006034 484946 -767702 -1511798 -1408703 -1508610 -1738407 -2156771 -2380898 -2021179
10442 -2021179 -1174661 -504399 343667 188644 -197902 -183253 -502907 -294194 399146 881094
10432 881094 1432869 1336166 347747 -633691 -1163808 -315745 511008 374884 669935 1200999
10422 1200999 736989 -915218 -1678873 -1046656 -481319 -631163 -1239987 -1760530 -1737608
10413 -1737608 -969966 -195595 627904 516822 -79069 -443943 263835 1541315 1660729
10404 1660729 892319 327976 -114939 -273351 -74365 -559220 -998270 -1227028 -1541228
10395 -1541228 -1650482 -1984222 -2638934 -2526719 -2038165 -1426882 -942102 -434745 -251212
10386 -251212 -163757 -285649 -584133 -570661 -366877 -694241 -771216 -289575 351872 366124
10376 366124 324983 -68072 -1515175 -2560549 -2381854 -2418214 -1882972 78524 468897
10367 468897 449941 1420708 1887726 1544794 715246 -104173 -1061974 -1735075 -1997492 -2379253
10357 -2379253 -1496471 -325261 194790 -90843 227675 517529 -270993 -1114754 -1748762
10348 -1748762 -1624190 -1117118 -357654 302332 435757 -578903 -926925 -198128 -216814
10339 -216814 -786777 -268875 364560 711378 738593 -206638 -1226038 -2337578 -2265893 -1500889
10329 -1500889 -1011639 -1012439 -757690 -311196 -303781 650522 1554216 1526910 1033924 -134957
10319 -134957 -815045 -957707 -762011 -609544 -576672 -966559 -1185376 -325746 326790 476128
10309 476128 -21188 348879 1901076 2361929 1189313 612960 355882 750169 1335497
10300 1335497 1878855 1820144 1396602 1837430 1528315 263489 36258 289288 106373
10291 106373 462763 1027682 1519279 909953 484564 429894 27689 -244990 36508 -113556
10281 -113556 -173745 190178 -120690 182094 1416068 1890216 1224145 519489 -122795 65246
10271 65246 615482 208145 -1322280 -1724432 -1192619 -701596 -1605411 -1932622 -1290766 -844117
10261 -844117 -604365 -890704 -1049304 -728796 -649630 -974398 -836975 -1187200 -2177235 -2456342
10251 -2456342 -1866786 -1246131 -272036 711909 1153305 1299395 966790 -270432 -1046342
10242 -1046342 -1223367 -665178 36996 874017 1901460 1469200 319599 134983 676676
10233 676676 661492 488772 862465 1790619 2229182 2284402 2205876 1500385 1011378 1265193
10223 1265193 1392520 890236 410232 -209069 -1071408 -1415506 -884914 -274690 -186439 -122068
10213 -122068 62865 -54282 -173647 -53136 -611373 -1352986 -1162589 -408996 -172042 -564042
10203 -564042 -763563 -371538 -494456 -837130 -378690 223627 416557 403200 401712 55295
10193 55295 -234555 -535510 -150543 -296497 -112590 758644 1229376 1160978 929121 742888
10183 742888 939930 291224 -479702 -808764 -757320 -1091218 -891855 -812024 -1043165 -1155205
10173 -1155205 -1229921 -411577 -304849 -607376 -681519 10097 933947 1089147 1399258 1089038
10163 1089038 407755 272587 138390 312863 605112 276718 274619 -339159 -731977 -754714
10153 -754714 -1250733 -1629984 -777009 65451 620495 1007344 328529 -580287 -1708502
10144 -1708502 -2119613 -2689514 -2819260 -1731056 -1091717 -2078727 -2464283 -1989417 -938894
10135 -938894 -248806 -369429 29099 308919 240104 -707271 -1369791 -974586 -692807 -1350041
10125 -1350041 -2488927 -2670066 -2279122 -1951538 -1137628 -1377519 -1510376 -314999 362234
10116 362234 560766 82537 -422568 -46018 1384086 1776255 1920189 2859565 2797251 2254904
10106 2254904 1954372 1585192 1648284 1288288 564840 -138951 -182971 72784 548043 769595
10096 769595 484705 342026 527037 948525 1242159 1078477 516910 -47695 -133364 538871
10086 538871 777173 592258 329777 89816 725871 716804 75268 233880 -78552 -927110
10076 -927110 -2179013 -1874422 -1173360 -1614494 -1589126 -1231449 -790954 -826678 -855878 -261961
10066 -261961 172794 -46939 31059 855978 1591280 1445590 724341 921853 1090597 1170069
10056 1170069 1072462 520187 245268 332495 753839 891066 950426 1373319 1158467 991655
10046 991655 1169367 1227349 873298 462457 -26901 -850483 -1224195 -805659 -434491 -767772
10036 -767772 -73501 821994 959679 1267409 684619 -46030 223202 834234 1098025 1121938
10026 1121938 1053243 1107021 1585838 1690846 1460571 1294540 1625098 1840915 2112561 1866415
10016 1866415 1586984 1414515 908095 919012 635559 275350 237969 -68551 -1484427 -2482307
10006 -2482307 -2359953 -2434482 -2583596 -2552143 -1529342 -559459 -222096 154688 309382 807621
9996 807621 1321096 757048 604084 1066624 644201 189155 765453 820787 662972 1496786
9986 1496786 1917441 1075420 -106399 -638400 270539 667600 410760 467083 385721 80551
9976 80551 -461016 -1315643 -1829397 -766406 910814 2371650 3016797 2501360 1725372
9967 1725372 565433 -723218 -1297268 -1035897 -509668 -494846 -1187507 -637403 1324841
9958 1324841 2201932 1649200 843742 27254 -267271 612585 1206356 298319 -59389 201307
9948 201307 1711356 2886425 2364281 1742657 1237876 787930 -341187 -1141930 -692545
9939 -692545 -13259 551946 1457626 2270492 2511548 2135991 1668559 1955562 2522672 2300516
9929 2300516 2355525 2534888 1869125 1114543 1090958 1684512 1535462 862740 276763 -158316
9919 -158316 -499715 -1265010 -1235430 -39566 139415 -546815 -1318938 -916601 925841 2048840
9909 2048840 1887796 1341310 768067 821493 365286 -633475 143896 1073957 820244 714947
9899 714947 1692774 1937184 1217049 456651 268063 535979 338733 -155505 -1067270 -1323481
9889 -1323481 95017 1506621 2080220 1989115 1768773 1620053 2068140 2768622 3066731
9880 3066731 2442794 2262712 2125384 1837686 2155984 2413973 1826683 1027678 1179702 2040159
9870 2040159 2534774 2138071 1740022 1582395 1840290 2209121 1483504 1237731 2138514 2335084
9860 2335084 2651893 3214066 3420170 3158116 2901803 3088226 3608038 3658214 3839614 4593854
9850 4593854 5098208 4274665 3013945 3128243 3656553 3771117 3729987 4032799 3841079 3835278
9840 3835278 4423881 5373438 6140105 5543543 5098564 5410712 6134417 6086827 5351064 4851890
9830 4851890 5127216 5112733 5379863 5768242 5541007 5712534 5902561 6059939 6536588 7903029
9820 7903029 10182843 11786562 12396715 13142058 14764871 17012264 18518519 19824159 22398329
9811 22398329 26691129 31986381 36391878 37588004 37249577 38283908 40816676 44753641
9803 44753641 50341031 57874187 68129951 82898703 102358974 128400291 162726739
9796 162726739 208336569 265657381 323524759 352534239 331143224 278066487 221809095
9789 221809095 175829245 140122057 113417884 94192157 79341805 67391836 57098019
9782 57098019 48470387 42455982 37670960 33549335 30045390 27138041 23787754 20322859
9774 20322859 17201827 15470486 14763785 14089551 13595474 12332480 10418705 9245932 8691153
9765 8691153 9083221 8718061 7252316 7049286 7220237 7309652 6149242 5214435 5180914 4393769
9755 4393769 3751683 3721468 3755912 3416250 2522804 2099443 2556260 3522767 4165202 4016718
9745 4016718 3947433 4056730 3723453 3855399 4360213 4159146 3398037 3168678 2590706 1988854
9735 1988854 2203557 3004171 4248559 4172108 3268096 3162576 3422105 3986209 4232331 3215562
9725 3215562 2493779 2187423 1940049 2354028 1940380 1518384 1574520 1677735 2340003 2215177
9715 2215177 1014448 237476 505234 1063632 1293478 990259 212337 -332763 -568201
9706 -568201 182860 1332812 1579677 1501630 1141721 1110707 1710739 2264005 2298638 1896423
9696 1896423 1832935 1475192 1071269 1355942 1741999 1358755 1251459 1074482 1466238 2227775
9686 2227775 2958812 3290318 3457902 3661471 3172146 2410725 2004712 1882297 1904796 1272084
9676 1272084 -123149 -718634 -645063 -327904 485794 288092 -627385 -1042497 -1045390 -1214755
9666 -1214755 -1028054 -845601 -1425805 -1615579 -727390 -464781 -1141258 -1695176 -1468177 -848050
9656 -848050 -364867 159814 404698 642713 38057 -364162 -871552 -1220747 -896074 -133054
9646 -133054 -410171 -1153344 -1236264 -214157 1161898 678512 -508721 -1443312 -1312807
9637 -1312807 -514892 -428317 -653396 -933702 -1211968 -926524 533619 1740708 3225021
9628 3225021 3622938 2794483 1772380 672219 -148533 -323449 496371 1136551 1468952
9619 1468952 1974284 1517763 666676 688843 1145734 1186802 807924 357401 500904 340072
9609 340072 -5490 -460049 -1045294 -726041 -570136 -379883 -219593 -258760 -570667 -726031
9599 -726031 -628199 -544288 166609 704108 1070962 2002345 2607359 1919363 638917 102686
9589 102686 72465 -33390 248313 687595 1694462 2530402 1340961 294190 867292
9580 867292 926674 -71649 -353663 845473 2004576 2502695 1496683 509026 164873
9571 164873 -272273 -1016080 -1242889 -1231336 -1477564 -885638 -570228 -452922 -942301 -1773045
9561 -1773045 -1037075 431294 243460 -15854 2047 -894801 -1879464 -1503889 -941494 -1345308
9551 -1345308 -1197009 -578954 -759399 -1353479 -2381525 -2637048 -2221925 -1637725 -712468
9542 -712468 234987 1035359 806038 -422298 -559294 -184183 815055 1520751 759184 -189906
9532 -189906 -186658 -114454 -496290 -606503 -471158 -1108447 -1310293 -1055486 -1205904 -1015987
9522 -1015987 -727426 -723015 -655713 -1389235 -1490673 -946828 -781937 -728677 -437242 419114
9512 419114 1629787 2331567 2199208 1082875 -242035 -1592072 -2289753 -1719519 -1081814
9503 -1081814 -832655 -1024598 83389 802177 972761 916616 1213549 1521559 1509091 1860550
9493 1860550 1155257 519274 246655 -765355 -1288375 -474954 953633 1584721 650812
9484 650812 306659 466463 -248842 -962145 -626828 -130752 -19409 -76105 -1046926 -1908949
9474 -1908949 -1706988 -949257 -471685 -56103 -156768 -1282677 -2118952 -1425546 -405998
9465 -405998 381546 632516 745270 479377 -389221 -430034 -147830 -330173 -595626 -252697
9455 -252697 13763 -266203 165083 670228 724572 119577 -230794 131244 259402 177053
9445 177053 6733 -736880 -1612759 -1949997 -2128011 -1734494 -1338115 -1677527 -2517678 -2511203
9435 -2511203 -1915709 -1969907 -2888918 -4454911 -4922630 -4260582 -2690872 -1405670 -1071973
9426 -1071973 -746424 -152617 -55799 -34300 -3508 -139081 -323892 288424 1059329 1028473
9416 1028473 516527 70756 -77149 280010 546603 359402 429772 553741 225658 -729121
9406 -729121 -399951 45756 -186318 -402916 -323815 -291847 -742773 -762901 -570166 -598287
9396 -598287 -771791 -448399 379950 759668 907569 994099 1045368 768463 36382 -765740
9386 -765740 -1520498 -3083210 -3819780 -3311365 -2824144 -2330474 -1549133 -562698 570650
9377 570650 1109483 970461 1055055 1657149 1575960 893155 444144 -455477 -1907229 -1972963
9367 -1972963 -1349428 -888080 -106506 -7730 -238230 -591789 -994151 -1524680 -1708927 -848213
9357 -848213 272656 327661 80176 -20055 -734926 -1204793 -703378 -600443 -1188958 -1674489
9347 -1674489 -1460343 -806526 -217742 278720 590046 1103959 1227689 325048 -342772 -218971
9337 -218971 700172 825960 511421 -43335 -899750 -1161069 -355714 -172836 -400094 -270944
9327 -270944 521108 665161 439153 167772 -170145 484339 356975 -25689 284061 845721
9317 845721 1336209 1332572 655156 -337651 -563626 -369212 125910 84564 -461939 -480030
9307 -480030 -131746 383531 487647 90329 -1031261 -1873714 -1796071 -1501912 -2209020 -2724171
9297 -2724171 -2688860 -2459435 -1515258 -657406 604395 1357379 1456921 1398709 1753251 1479082
9287 1479082 893514 256290 -667845 -911253 -186418 189406 309682 594537 638701 966599
9277 966599 1218841 1618073 1834253 1468177 836244 492138 1050250 2109592 1983154 1339028
9267 1339028 976478 600037 -101919 -924010 -1292949 -1163771 -1007124 -1128693 -1288525 -1382422
9257 -1382422 -1007075 -1114827 -1993850 -1549841 45206 1426657 1810709 1532153 831286
9248 831286 -129853 141205 -146905 -1505689 -1912840 -1632031 -1466054 -1616460 -1077337 351135
9238 351135 2058799 2593022 2197565 1630508 926281 492025 1222827 2115644 1170101 381141
9228 381141 267558 335971 404202 234430 -109274 -629370 -327167 -595352 -1106601 -1121056
9218 -1121056 -1290797 -2007956 -2493741 -2091037 -1478658 -1292820 -1368005 -1863913 -2091407 -1511808
9208 -1511808 -1314924 -2204646 -1337463 -358938 -977598 -1108602 -794524 -712549 -773371 -274363
9198 -274363 429616 399552 -147517 248443 955967 829220 681666 326326 127534 -96727
9188 -96727 -374522 -299564 244317 920606 1461118 1454812 512055 286312 504327 806798
9178 806798 1420978 551584 -1124535 -1933136 -1643902 -968971 -1760737 -2616140 -2188673 -1058854
9168 -1058854 187963 756621 461261 170328 -83870 -293925 -314929 -651075 -1031367 -1316041
9158 -1316041 -1243518 -553645 139484 345047 720579 352279 -143845 -129988 201223 452146
9148 452146 252213 145784 84944 8182 -94676 788965 1061618 467612 399148 374276
9138 374276 110498 -680743 -864559 -877513 -1131392 -1393143 -1010865 -358555 44010 102656
9128 102656 -571618 -1255238 -1489680 -1693797 -1748974 -1490165 -733931 -644735 -1422079 -1449036
9118 -1449036 -1123788 -1146369 -717479 -570923 -763027 -593622 -608686 -1174946 -1579651 -818443
9108 -818443 -1059614 -2524689 -3330776 -2429068 -1892664 -1852576 -1317434 -401319 312515 298307
9098 298307 461176 289014 -741477 -1431132 -2110654 -2987445 -3165003 -2916113 -2108923 -559626
9088 -559626 506892 571253 923416 1075471 1265672 608230 167241 447284 1328236 1774165
9078 1774165 1160113 600082 957766 1885773 1820755 1180922 869345 673746 421509 -18929
9068 -18929 -1037801 -1032725 -222862 -269342 -634092 -375046 287120 364025 -521640 -1192311
9058 -1192311 -892409 -672497 -1006987 -1271920 -1072299 -800801 -857236 -581195 -103024 -1490
9048 -1490 -351254 -861780 -1655332 -1925438 -1926566 -2088933 -2298731 -2155635 -1470580 -1139478
9038 -1139478 -1109425 -1030490 -1220415 -1552708 -1163471 -1049549 -1285669 -1244980 -1052127 -1158695
9028 -1158695 -1819022 -1997368 -1801628 -979685 -472014 -603551 -1056489 -1760259 -2321712 -1975303
9018 -1975303 -596308 64993 -250135 -439084 -370802 -335534 -827 1073359 1223822 1454539
9008 1454539 1887013 1838064 1703833 790698 266574 910387 2081270 2694802 1992080 1449919
8998 1449919 1667299 1499063 859051 199157 -362014 -446357 -614691 -1191002 -1342969 -1691520
8988 -1691520 -2606048 -2372975 -1930972 -722859 640108 1037034 912857 501178 33870
8979 33870 -61478 274833 406857 -433564 -1872493 -2315183 -1968715 -1420275 -836258 -266229
8969 -266229 -378821 -874722 -700763 122523 744207 387334 -142217 -621419 -879722 -710623
8959 -710623 -589504 -955217 -1587264 -2025864 -1783476 -1475731 -1186869 -1019572 -678990 -612041
8949 -612041 -1475078 -1689571 -797178 98057 603384 1396127 1013381 606359 814351 1381533
8939 1381533 1731133 2351733 2681055 2051249 1681116 2065296 2263988 1682133 1435431 1859373
8929 1859373 2766900 2938520 2405015 1878769 1389750 794906 727531 1178607 1271488 655692
8919 655692 -451289 -1764631 -3055500 -3051265 -2103248 -1963873 -866246 453955 591319
8910 591319 -467551 -923247 -744249 -712910 -85824 -585580 -1082445 -1355676 -1551684 -1108419
8900 -1108419 -551247 -313720 67704 -17514 -483565 -1056468 -1572339 -1085556 -12563 191617
8890 191617 -505287 -1057716 -1255846 -970920 -337747 -19363 -478660 -921550 -902383 7287
8880 7287 330020 318868 254067 257774 362428 947713 1456955 1239213 942406 387239 299299
8869 299299 1079533 1237515 605987 73479 130358 -686241 -2044452 -1683914 -700307 -677976
8859 -677976 -1087645 -1247640 -1292257 -748896 10003 1120078 2440437 3051114 2329459 1178922
8849 1178922 430859 283774 -43347 -875654 -2449950 -3001599 -2509236 -2071316 -1454029
8840 -1454029 -1458420 -2314871 -2832474 -2128412 -784404 646759 428476 202215 596231 1385068
8830 1385068 2063725 2281073 2206382 1882334 2026078 2165888 1880666 1150387 563167 903407
8820 903407 1437507 892882 789013 1232396 1497394 733036 34047 453941 924937 402773
8810 402773 -492852 -375808 28399 247225 960114 749380 -454360 -1416506 -975256 105083
8800 105083 99505 -688234 -764710 -610084 -52875 409345 319219 -202169 -1077197 -760022
8790 -760022 467515 1502737 2664879 4132292 5415235 6101364 7737920 9962621 11544489
8781 11544489 13020715 14784663 14956346 12824998 10270826 8333523 6974321 5251348
8773 5251348 4411599 4404700 3415164 2446143 2401484 2144053 1484401 1603953 2026227 1143190
8763 1143190 -632339 -1139171 -251126 1188661 1498929 603325 53395 42535 410551
8754 410551 1250745 1923671 1398851 693832 723313 257727 -275491 85652 1059974 1115145
8744 1115145 658612 583215 928583 1172200 838351 554592 523932 10910 -264436 155468
8734 155468 852666 769136 804723 494120 350841 457847 1466169 3048591 3121129 2442802
8724 2442802 1865680 1682261 1368995 1106056 719599 789190 899938 -47501 -566983 -374728
8714 -374728 220156 438754 -69797 -1001966 -1442512 -838133 -122613 98633 678734 1531763
8704 1531763 1195712 1225854 650148 948257 1226954 794402 691264 455398 172726 420724
8694 420724 -105416 -865289 -622121 -344573 -508249 129595 771439 260421 5934 -16610
8684 -16610 438563 546450 -686240 -980014 -32634 688562 1085241 1302709 814797 159788
8674 159788 -658810 -965283 -1206994 -1519427 -1341636 -1009546 -1513705 -2226168 -1945042 -874526
8664 -874526 -49934 483774 1106548 1753558 1573679 1226771 509188 -21015 588723 1121974
8654 1121974 508992 -520617 -840714 -331903 -798518 -1510595 -953501 -457170 -204478
8645 -204478 -19035 279629 78115 -110316 792401 910021 -221572 -1459847 -1167800
8636 -1167800 -940692 -1329553 -986106 -700538 -577891 -560092 -1275678 -1001480 -180434 -112730
8626 -112730 564326 1299901 1289363 511881 -245112 -506832 -76532 301769 284306 201531
8616 201531 332576 368370 369240 740413 877727 728536 103221 124449 450016 115247 21997
8605 21997 137766 -70049 -198858 134882 457523 927965 1263556 716491 -911818 -2258589
8595 -2258589 -2553900 -1390973 -1275775 -1481936 -543024 225009 222958 -227942 -329352 -563837
8585 -563837 -598575 232562 11255 -1202608 -2175588 -2574158 -2295835 -1583494 -1518707 -1413007
8575 -1413007 -1211290 -699274 -628740 -823945 -786132 -163068 489797 129286 -63449 656797
8565 656797 433726 51070 1198275 2891835 2855512 1783202 800510 273757 26069
8556 26069 -66464 788766 1017066 435029 427591 481039 190509 171194 631405 -143292 -1987391
8545 -1987391 -2973715 -2664852 -2123190 -1390717 -1088591 -1032085 -404205 -241797 -1066809 -1316503
8535 -1316503 -1161017 -918733 -379846 -144596 -21836 126650 594886 1242450 1318080 769885
8525 769885 241099 -519381 -654463 -75977 394731 208197 121261 120122 -916673 -1905061
8515 -1905061 -1566490 -1396636 -1321388 -960451 -400501 -558818 -952901 -515188 -821193 -1626037
8505 -1626037 -2562980 -3218484 -3570544 -3320713 -2701561 -2163511 -1899423 -2074438 -2090199 -1508639
8495 -1508639 -331822 126134 -369030 -843686 -395265 603211 925571 625895 154165
8486 154165 -453235 542850 1018641 980452 1127090 1135473 812623 317297 -523882 -1107668
8476 -1107668 -469551 919276 1530183 1089525 819894 1243810 803732 -266530 -1468089
8467 -1468089 -2250012 -1590877 -659230 113176 636092 506613 1110127 2320524 2199458
8458 2199458 1396916 1507351 905508 245040 214268 -737322 -1614022 -1131624 -293388 508222
8448 508222 1108473 1183152 1159507 1095237 966413 31636 -1206489 -1774358 -1570983 -1334422
8438 -1334422 -1034511 -1052152 -1568509 -1391298 -840983 -642588 -867965 -679542 -214096 464090
8428 464090 836834 1122267 1618151 1202328 -66274 -604106 -350210 -34691 81733 1161417
8418 1161417 2217093 2587751 2452211 1981522 1653594 1200147 581730 616973 771541 242254
8408 242254 355890 1222311 1138171 602161 121910 62147 622899 642317 292962 950017
8398 950017 1925227 1350539 935134 498378 -12945 -266546 -130623 -139171 178764 70139
8388 70139 -333303 -198741 446936 763032 874736 -84505 -1503423 -1753477 -1521946 -1519267
8378 -1519267 -1584968 -2410320 -3017770 -2638121 -1853820 -1422219 -941939 -122911 -180334 -1211229
8368 -1211229 -2391646 -2796687 -1810612 -917625 -992114 -872408 -253562 719377 700620 229300
8358 229300 -78707 -414041 424019 2000304 2949569 2390016 836755 -251377 -1088319
8349 -1088319 -1514180 -326497 719123 670302 -242271 -1084484 -1274522 -2007509 -2633771
8340 -2633771 -2030745 -1321332 -69310 541666 319328 -145964 -44575 315364 338321 12689
8330 12689 -235874 -254303 -821913 -1938282 -2537951 -2047698 -1581127 -922793 -402575 -550345
8320 -550345 -867987 -691511 -578681 -1306460 -1064115 -123357 282788 496623 -224711 -404295
8310 -404295 -95439 -441762 -1099388 -1215152 -929858 -539691 -425991 -801691 -1331329 -1606492
8300 -1606492 -1216443 -297134 -1058302 -1973848 -2047105 -1942613 -1854722 -1751735 -1534785 -695856
8290 -695856 341968 548346 -140242 -1089233 -2003424 -2447199 -2545795 -2184577 -1966482 -1919666
8280 -1919666 -1717227 -1048779 -397608 170024 136470 -167749 178139 29184 -850780 -566911
8270 -566911 254953 79781 -257332 -977559 -1731822 -1610062 -1417672 -1229099 -177314 131253
8260 131253 -351893 -613336 -568352 -339282 378916 625074 -4836 -866038 -1150424 -609334
8250 -609334 127060 159980 194458 -203974 -433634 -39567 -21019 -59544 -309284 -512485
8240 -512485 -117562 -131620 -298868 -210584 -224436 -327121 -387870 -239319 -1120216 -1670472
8230 -1670472 -1697126 -2569407 -2646692 -1842716 -78165 887506 304252 -29446 -437967 -708665
8220 -708665 -1062942 458633 1146103 82979 -308729 -629498 -1223564 -1563822 -1362484
8211 -1362484 -1682125 -2092507 -1989545 -1494421 -1116408 -950740 -1331248 -2277312 -3206849 -2560141
8201 -2560141 -1250659 -320019 299959 317219 98907 -47331 -611825 -989815 -1024891 -556498
8191 -556498 -132394 -905474 -1692549 -2021146 -2432664 -2555260 -2216011 -1373611 -1146613 -1633522
8181 -1633522 -2097042 -2673104 -2359570 -904009 -105547 -165115 -618962 -781966 -861813 -965406
8171 -965406 -801264 -166693 239745 -522744 -862274 -747380 -1447660 -1777682 -2117180 -2124145
8161 -2124145 -1895854 -1922079 -1938587 -1543166 -1000784 -1899722 -2528242 -1681132 -747561 687619
8151 687619 2017357 2016958 1281666 932994 1109906 1065487 1041737 1315528 1369762 1429080 2006850
8140 2006850 1952280 1054724 494700 973234 1541060 1672775 1550560 1060285 1127418 1480622
8130 1480622 1715070 1530722 1380439 2494935 3605316 3499965 3147637 2562146 2242925
8121 2242925 2088860 1392149 1398309 1042060 -677296 -1865971 -1889395 -2172840 -1883798 -1362374
8111 -1362374 -1203124 -1012036 -199440 982732 2215019 2787808 2478692 2342810 2154587
8102 2154587 1750593 1541856 238395 -1129037 -1117994 -867593 -582527 148056 1272840
8093 1272840 1960925 1360626 -211783 -1288808 -641587 253335 762599 576426 -489800
8084 -489800 -896338 36282 368893 26651 157076 -55964 169410 1484782 2823787
8075 2823787 2983738 1666936 401135 32750 473821 223456 -424807 -1018514 -522802
8066 -522802 1391229 2400024 1656134 1313127 1659542 1568226 1805089 1439806 220963
8057 220963 -645712 -874851 -691325 -277190 381909 1194241 1151465 623922 1071661 2367996
8047 2367996 3503315 3911225 3847969 3458653 3166175 2618752 1739226 1526201 1811905 1584811
8037 1584811 929920 972068 1432301 1729313 1089949 196262 47955 65494 512719 1210629
8027 1210629 1200840 1411559 2069962 2163537 1674854 1182056 591139 140013 338786 540996
8017 540996 280217 286934 548862 418119 -388305 -89106 798646 87144 -596352 -938719
8007 -938719 -1031411 -672507 -803285 -164902 889270 2424541 4041873 4199121 3124872
7998 3124872 2124594 2430785 2319955 2550394 3085403 3136859 3185645 3377803 3114316 2793724
7988 2793724 3766501 4364210 4019108 3718607 3932348 3819474 3824994 3686876 3091818 2959647
7978 2959647 3852130 5289110 6079630 6643057 7471382 7650849 7901530 7960483 7960218 8891711
7968 8891711 9441150 10770928 12802086 14741635 17005032 20707194 24878792 29119195
7960 29119195 35005750 42973520 53177171 67503720 86085975 108916002 135579534
7953 135579534 157996097 164435663 151408641 128959387 106412224 86682404 70328127
7946 70328127 57095134 46151374 37982623 32615815 28267963 24252814 20327533 17856413
7938 17856413 16413686 15300760 14625132 13438978 11562675 9307981 7845718 7527673
7930 7527673 6511763 5669958 5395480 5184622 5299905 5080931 3671270 2496866 2667465
7921 2667465 3148358 2776083 2576104 2620298 2790021 2717413 1751136 1299425 2116560 2836450
7911 2836450 3027557 3783221 4807465 5630876 6137176 5611854 3874329 2590340 1343252
7902 1343252 634216 160551 -448875 -1063386 -657614 592985 1691750 1428275 766944
7893 766944 632250 394057 -42051 43050 -228990 -456695 489046 1778266 2103006 2066699
7883 2066699 1054667 -13932 65982 869266 1539957 1383560 1222807 691902 206452
7874 206452 -358858 -713159 177877 1163903 1220660 -442609 -2122185 -2543347 -1779073 38786
7864 38786 979913 660009 -148704 -686015 -1353355 -1483983 -598952 335416 197818 17515
7854 17515 63945 -45014 -428255 -469602 -1029143 -1223706 -1037458 -838921 249851 1220351
7844 1220351 451992 -390194 -317530 338708 -140520 -1377254 -1720148 -1234265 -1009485 -1396321
7834 -1396321 -692531 865150 1921682 1723273 1565944 1297441 884928 1056743 880240
7825 880240 600815 487636 -1205974 -2318982 -1970948 -763632 -16661 -190046 -1025935
7816 -1025935 -1592704 -1423510 -1027775 -1042875 -1721660 -2717143 -1762101 -185003 511087 -114425
7806 -114425 -628398 -220514 -246063 -619526 -1225284 -1856726 -1856294 -929454 -57280 128434
7796 128434 -898975 -1442939 -853992 -301662 -43286 -224852 260427 1743332 2484599
7787 2484599 2072450 1803186 2065652 2768745 3983510 4204469 3169835 1316263 54551
7778 54551 -277523 103486 221702 -457314 -582691 -876608 -1021181 415563 1218183 1584802
7768 1584802 1849953 1600224 1570193 1686359 2122979 2268870 1409890 593691 160517 82021
7758 82021 -369828 -432319 -318861 -374123 -536616 -465943 -402921 -1526740 -1730295 -997695
7748 -997695 -137764 285308 -366178 -865427 -936288 -1388497 -1088020 -297568 594504 692570
7738 692570 953864 1630272 1325036 714689 326362 275218 259534 540107 1222984 1710384
7728 1710384 925102 -252233 -382426 -267136 -723415 -338773 90101 -15982 269226
7719 269226 383053 198191 222931 930383 2067615 2271968 1852240 130676 -1746569
7710 -1746569 -2920655 -3543363 -3685811 -2485017 -2035465 -2205822 -1177567 -52618 496942
7701 496942 612645 413963 -168595 -1297268 -1819309 -1128400 -841281 -1246801 -1628668 -1322185
7691 -1322185 -526361 -631706 -918462 -617210 -545325 -196160 566711 806248 158053 -338736
7681 -338736 -105574 434903 907577 633834 -433773 -445119 191881 -54345 -754009 -825598
7671 -825598 -404291 -649329 -905526 -878516 -85667 35282 -875615 -1027584 -1166652 -385120
7661 -385120 1095455 1676672 1545660 -342581 -1829299 -2102743 -2627388 -2758927 -1200303
7652 -1200303 291468 416218 -90702 -436528 -754012 -810572 -765255 -222351 210679 94289
7642 94289 1014603 1201178 683034 296860 213043 -736252 -539347 394653 105242 -1034090
7632 -1034090 -2046917 -1982523 -1881932 -1991320 -1737514 -2008244 -1627379 -743034 -172786 -86100
7622 -86100 382738 480607 166319 -681809 -984191 -715935 -869919 -698346 -1444983 -2162109
7612 -2162109 -1694095 -979407 -1363327 -1766713 -969452 -770904 -1059837 -805421 -453044 109241
7602 109241 629332 799564 746268 777198 1156991 1171574 321401 -580742 -1199790 -1233904
7592 -1233904 -694222 932663 1979798 1457371 103453 -1515646 -2274805 -2036659 -648261
7583 -648261 852306 1385342 819945 160626 343044 -380307 -133935 1332715 979670
7574 979670 69521 511612 1057278 574519 50836 -279984 -340339 -728294 -459620 111086
7564 111086 97814 -16816 -77085 -103027 221707 245155 -588519 -981699 -784940 -363931
7554 -363931 207686 124607 -44512 900664 1845705 1736383 1070057 903276 1934786 2416761
7544 2416761 1859046 1292084 1620416 1030847 -173342 -388069 -275682 -167246 134540
7535 134540 130418 164666 430777 629008 -279319 -1277510 -876571 -633036 -434151 -736643
7525 -736643 -1182209 -665678 157729 1062183 1093214 418380 28398 -404096 -668882 -1320027
7515 -1320027 -1777943 -1853657 -1037953 237964 1103908 2097822 2612576 2670259 2409922 1985209
7505 1985209 1022089 809867 812623 992060 1293954 1563813 852376 -5719 32460 -69537
7495 -69537 217025 1014928 1474006 1321723 1222960 675511 110069 21299 -699578 -1660588
7485 -1660588 -1714720 -1514733 -1290971 -414618 372783 1155209 729695 815852 2189866 2887893
7475 2887893 3012704 2497320 2566088 2784606 2110783 956874 561943 795353 1081971 1115045
7465 1115045 1193539 1496417 831421 -26451 172197 542299 442881 30519 -442393 -769101
7455 -769101 -662286 -1183674 -1578885 -2002079 -3058850 -2618574 -610886 56393 -404734
7446 -404734 -565226 -356747 -254668 -544237 -628891 -307519 -166221 -191039 577719 1500258
7436 1500258 1760051 1335672 1359961 1621723 1706119 1264618 904773 783689 649460 454453
7426 454453 267853 698913 1220555 604654 -364801 -1153855 -1237642 -925043 -1115988 -883838
7416 -883838 -775186 -1325772 -1030437 -713500 -586673 262078 1339173 2402826 2016761
7407 2016761 1098359 1374771 1770000 1147074 318002 -395768 -340755 381191 1307272 1641278
7397 1641278 2358796 2340506 1999864 2000767 2574904 2676793 2895244 2995784 2611227 2279876
7387 2279876 1426226 733913 191861 -317722 -665687 -588043 -449548 -175388 201096 844913
7377 844913 1588278 1132567 691219 43676 -933909 -1183198 -13061 1213548 1387987
7368 1387987 936540 970773 2104339 2470785 3101728 2953156 1637652 695230 -426930
7359 -426930 -367946 192682 -402065 -1256397 -1258274 -1677628 -1706731 -1032430 -3573 440911
7349 440911 -305270 -1161246 -1775631 -2589019 -3003846 -2583461 -1686066 -1419110 -1941689 -2565617
7339 -2565617 -2683191 -2290283 -1541578 -558497 -90937 432276 1079343 1173457 769391 875199
7329 875199 376290 -762106 -865617 -50713 51983 -241756 -309537 -630474 -805047 193431
7319 193431 1632378 1371819 329178 -150097 -609433 -1487330 -1772743 -1380380 -452666
7310 -452666 354589 640206 341427 1133460 2572181 2808332 2402369 1622528 481114
7301 481114 -678814 -1688446 -2240905 -2557657 -2472871 -1673852 -735060 -499036 -394574 -324504
7291 -324504 -828447 -480480 -179452 -78509 -198183 -439920 -211362 -3789 33189 -115021
7281 -115021 -1115177 -2491825 -3021524 -2787471 -2414849 -2474727 -2737126 -2380383 -1595430 -1552889
7271 -1552889 -2029065 -2088700 -1491009 -1141676 -586073 78847 418220 1230845 878143 357189
7261 357189 442237 289551 -276200 -1068708 -1442639 -669330 140003 -36533 -523556 -1380573
7251 -1380573 -1830745 -2089921 -1758095 -948692 -283872 650542 1156613 921526 647002 220250
7241 220250 193241 -540278 -2146190 -2648109 -2183113 -1564699 -1469716 -1995423 -2299774 -2319830
7231 -2319830 -1884320 -887317 -176564 -363927 -608315 -570401 -1572326 -1894502 -796967
7222 -796967 92845 -162523 -1248365 -1674463 -1396166 -1404029 -1556610 -1468358 -464910 127853
7212 127853 -32269 -514299 -1798480 -2473923 -2041060 -1721056 -1582226 -785379 541422
7203 541422 1999053 2588804 2389192 2463993 2419801 2541461 1940198 1295935 1870056 1759289
7193 1759289 184018 -690495 -226488 49751 283322 1007910 906032 184588 344218
7184 344218 1303100 1724346 1710931 1049886 326449 600844 1223784 1564482 1556115 1399529
7174 1399529 1458927 1045452 130575 74295 730334 750275 894609 1216298 1521141 1284946
7164 1284946 1338487 1305789 1020166 169735 -505765 -669669 -621569 -727902 -699321 -1206665
7154 -1206665 -1861774 -2141125 -2118711 -2290566 -2290788 -1153603 308180 1101930 1619614 1560279
7144 1560279 1336539 1212605 155025 -734475 -545448 543149 1098441 331870 -401024
7135 -401024 -365373 -295030 -322651 -1329692 -1173087 -713384 -319213 -206829 -775585 -1301204
7125 -1301204 -1201171 -636209 -351725 -85913 -5399 -55686 -608780 -1755065 -2166885 -1826319
7115 -1826319 -1381981 -846088 -425518 278286 471811 646042 929141 1323134 823243 -29302
7105 -29302 323191 851664 1057757 1118184 772347 46684 -558321 -999264 -1344759 -1289674
7095 -1289674 -510971 709088 998321 363868 -759765 -955648 -433356 202523 199846 -383430
7085 -383430 -416153 176240 327948 -134046 5980 -400082 -1069290 -1268784 -112388 1022139
7075 1022139 899563 897376 206421 -546996 -186769 -174866 -991112 -298879 69626 -490518
7065 -490518 -39372 202241 257780 295207 -280430 -1295232 -2136018 -1793514 -2099410 -2246317
7055 -2246317 -1552690 -1238986 -1095857 -1498030 -1621224 -682040 402434 1143219 1042071
7046 1042071 594113 205466 -65150 -289929 -158112 192995 1114668 2025231 2468293 3077478
7036 3077478 2911532 2631147 2146368 1539132 1089299 876968 1069440 914934 689791 392652
7026 392652 -646132 -1468355 -1801024 -1809586 -1954335 -1893502 -1345517 -443527 573671 1121167
7016 1121167 1300719 1155714 -319371 -1118689 -1039844 -474078 -200822 -313232 -575602 -886874
7006 -886874 -221024 887842 1529738 1583164 1431775 1453425 2102690 2278554 1406251 517424
6996 517424 398676 484121 -590616 -1039831 -430827 119625 341193 312279 -327226 -775486
6986 -775486 -1619098 -1634423 -1288614 -1427825 -1415198 -1236723 -364251 291244 220242 398285
6976 398285 863397 1221810 1425151 1153383 540807 804036 1545659 1542130 1213360 843964
6966 843964 734949 970000 1430353 1700716 1262134 355431 -169342 -446566 -1264074 -1670129
6956 -1670129 -1498294 -1384249 -489357 34545 30108 74236 -259008 -388568 22125 956131
6946 956131 1661234 1629065 1770061 2273844 2076187 1884147 1620409 846469 635921 90531
6936 90531 -365287 -723203 -748877 245154 789431 1365616 1395322 220586 -1264893 -1606543
6926 -1606543 -823270 -156665 392522 901908 1119836 946512 1018979 1519836 1551236 1390488
6916 1390488 749207 197051 112687 -316924 -697287 95327 559073 -409843 -1743518 -1767010
6906 -1767010 -834790 -953658 -1642131 -2407461 -2161355 -1241004 -455223 304671 170641 -336463
6896 -336463 -1245728 -2012633 -1723460 -1563306 -2191115 -1521060 -407701 70589 -365509 -410464
6886 -410464 39972 1023914 1877853 1745757 703445 -169437 -794865 -570398 -370182 -232690
6876 -232690 -238593 -88232 6737 -873176 -1598439 -1807721 -1147367 361119 898366 257639
6866 257639 406011 898031 688289 -63264 123276 233054 -92946 476900 1215376 864709
6856 864709 -9233 -326931 138355 129320 -558153 -481209 -846 -849580 -1333917 -1045848
6846 -1045848 -345910 440316 1057914 1126000 1285160 1216944 728424 449515 306460 387976
6836 387976 1749313 1841689 799166 -521185 -883447 -68964 356613 240763 -744481
6827 -744481 -1798766 -2179374 -1479319 -461843 -218313 -588332 -682537 -1200854 -1961453 -1987157
6817 -1987157 -1999657 -2035610 -1073761 -220835 498819 976448 1003368 553138 377589 441592
6807 441592 952171 1744716 1454887 588304 -230136 -395698 -408854 -622126 -690774 -343145
6797 -343145 -856182 -1877636 -2014388 -1135451 -153 656110 461749 403139 -81700 -1144113
6787 -1144113 -1180134 -284124 737128 1319216 1252566 812502 395257 -108449 -541438 -223508
6777 -223508 79906 106633 386964 134102 -293859 -1218927 -1438722 -1198982 -1406742 -1748666
6767 -1748666 -2007540 -1726615 -2100710 -2067100 -1840082 -2078468 -1775570 -788563 -528168 -627377
6757 -627377 -895163 -1092033 -1148521 -1033189 -675618 -504889 82667 378895 -294963 -900015
6747 -900015 -604153 209204 816144 1467420 1667407 843213 -276664 -383454 325622 434471
6737 434471 10870 66179 458198 -211392 -621746 77252 85965 -369005 -200671 167671
6727 167671 533794 904101 1573120 1155113 -159724 -256430 -139131 -146231 -390192 -119175
6717 -119175 100332 713719 1964992 2700238 1858587 348552 -790495 -1136407 -1307624
6708 -1307624 -691174 -523331 -1136015 -1491333 -1157073 -191651 236616 -252504 -304974 131970
6698 131970 533356 1438634 1777068 1558233 1375122 685640 286754 102545 -227732 -18106
6688 -18106 -189600 -834698 -1361947 -1372235 -925530 -723744 257230 401697 142446 -329336
6678 -329336 -829299 -881557 -1026948 -935272 -337587 30696 287327 96891 -653631 -650479
6668 -650479 -316068 70457 61054 89110 -544900 -1550346 -1127931 -297597 24853 20180
6658 20180 432254 1587984 2178326 2051429 696030 -640276 -2170893 -3079338 -2988543
6649 -2988543 -2097148 -478151 -6506 -885572 -472341 92932 -41495 474272 950634
6640 950634 1009546 317384 -683773 -837709 158305 838820 919741 792403 643836 1139531
6630 1139531 1809847 2639474 2461714 2157808 1593974 501199 33279 -530965 -296059
6621 -296059 -250615 -362574 751990 2283705 2599377 1342460 111538 -18774 5958
6612 5958 -52939 -145990 460728 1448576 1568841 1590100 318359 -385629 -531838 -1211569
6602 -1211569 -1954927 -1559681 -942467 -496221 -328353 -230985 474315 844593 630184 1089524
6592 1089524 1328609 505509 -172937 -1052434 -1755826 -1441248 -783534 -500936 -484786 -595421
6582 -595421 -429088 130626 325084 274193 -449114 -1010214 -889643 -813013 -564555 -686876
6572 -686876 -1423348 -973735 -201683 -135127 -473051 -1144566 -1928528 -1562037 136423 855615
6562 855615 1073524 711439 -497503 -1554962 -1716087 -1589740 -1806961 -1045787 -328756
6553 -328756 468997 1130609 668681 -206111 152494 1065555 1174765 945165 567996 660174
6543 660174 385209 26020 220046 299216 395642 86263 -934667 -856252 -297905 -85697
6533 -85697 -222431 -575456 -1051757 -969178 -813962 -1423898 -1722342 -2950431 -4442837 -4834181
6523 -4834181 -4125174 -3126005 -2002772 -1393251 -1303465 -878275 -643676 -1122456 -1173124 -1641236
6513 -1641236 -2262051 -2219264 -2117834 -1264462 51933 885935 1147916 1406931 1411534 1125865
6503 1125865 852827 315312 -643549 -812685 -937188 -1100119 -1732524 -2061833 -1898711 -2015819
6493 -2015819 -1639008 -966614 -569042 69978 139488 56729 1490777 1928888 887266 -223416
6483 -223416 -1263488 -1175312 -422487 289962 654205 334783 56627 553396 377322 -699996
6473 -699996 -1437281 -1608084 -911261 -254678 -881181 -1318165 -640362 -221022 89941 -530114
6463 -530114 -1916503 -2927131 -2723409 -3553927 -4224069 -3238195 -2698050 -2342118 -1426589
6454 -1426589 -311277 580776 1149967 1064850 230605 -276943 47855 29722 -603221 -669408
6444 -669408 -820098 -1457182 -1872045 -2064906 -1626922 -1302887 -1572263 -1451014 -981278 -438954
6434 -438954 -271213 -368707 -296948 -223732 -347308 -1245616 -1453016 -1091094 -1249975 -1997756
6424 -1997756 -2233111 -1824059 -655024 341295 488573 255743 401983 769835 770762 1206861
6414 1206861 1088247 451124 124266 -277692 -1031643 -260353 1828369 2587365 2287443
6405 2287443 1060350 349492 825120 1479980 1777546 2080767 2664458 3030965 2618686
6396 2618686 1139719 -824121 -2109174 -2172558 -775280 -140441 611258 719974 -95063
6387 -95063 -1261752 -1308192 -485243 -152833 -1339 331503 1322003 1958460 1614795 945318
6377 945318 1387833 1503645 1203684 1573593 1510412 888116 139732 -240135 -554921 -902692
6367 -902692 -802513 201819 884544 388972 -398793 -969619 -1190800 -847644 -358609 154093
6357 154093 -73868 -559774 -950853 -1010001 -1228586 -1507513 -513239 -1794 -389573 -1125085
6347 -1125085 -1092737 -1131238 -1255813 -1682296 -2198232 -2479762 -2703826 -2675513 -2586841 -2443691
6337 -2443691 -2609409 -3002658 -2285198 -1193199 -772649 -257992 1125317 1313692 594733
6328 594733 541939 732327 -150238 -868768 -400539 368789 738018 236019 179965 869322
6318 869322 1072949 691864 138733 158278 755524 1571371 1600779 1332746 510977 156494
6308 156494 -413877 -1520433 -1936903 -2665358 -2952036 -2285784 -1362487 -1102486 -1259176 -1408851
6298 -1408851 -806647 -161919 137691 794771 642485 -301007 -649430 -399530 -601041 -1110421
6288 -1110421 -1201858 -1168817 -1343775 -1858779 -1762079 -1532402 -1535821 -1152206 -1008217 -613097
6278 -613097 -32727 -502074 -1685000 -1604126 -1731658 -1524601 -624183 -443665 -23193 1165850
6268 1165850 988962 527100 421044 814280 1551667 1669407 1718092 1135044 1023045 854059
6258 854059 178541 94101 -248535 -969461 -592518 -103468 -217506 -80624 344649 575928
6248 575928 648205 923715 1142982 579717 21880 9155 533303 846723 1087426 993793
6238 993793 613615 -171566 -1121552 -1269223 -1015902 -53850 1073810 1656703 1701953 747571
6228 747571 -325457 -682405 -435895 100707 -66647 -750600 -552577 171281 331254 -466303
6218 -466303 -964884 -1523584 -2484920 -2367791 -1034311 -167778 122745 -236335 -154696 882735
6208 882735 1266624 -280715 -1358721 -1408788 -1008522 -220238 -68726 -430910 -340972 -455927
6198 -455927 -481630 -325647 -53398 726378 -23190 -713678 -810799 -538660 256921 815991
6188 815991 685981 144440 -269477 -1002049 -1217408 -594134 -140848 -799794 -1118983 -1362651
6178 -1362651 -2230670 -2327664 -1129474 413513 1954132 1370136 354188 -36905 -38450
6169 -38450 204352 -361847 -1308956 -1397890 -895093 -888377 -993727 -1053631 -1321002 -1920848 -1910015
6158 -1910015 -1174019 -175156 411243 859609 991309 240769 -652821 -1310300 -728456 136877
6148 136877 14245 335181 1156748 1051174 70399 186861 1320401 1153603 -145652
6139 -145652 -452681 -506305 -204571 711303 1361863 904085 155492 411747 427175 232199
6129 232199 420295 454144 1052440 1732764 359552 -1306138 -2243740 -2104514 -1306616 -625149
6119 -625149 59104 166805 -491416 -480830 318063 354734 512584 753412 1046507 1862545
6109 1862545 3176968 4216353 4837913 4278648 3552362 3019575 2482188 1811178 1780077
6100 1780077 1886887 620406 -1352309 -2330473 -1751934 137857 1423620 1599373 660954
6091 660954 -211877 -232141 364374 1158122 1525271 1545125 1107290 1024595 1340419 1001515
6081 1001515 449338 476382 335502 320484 -527717 -1194264 -553956 512240 1239350 866116
6071 866116 -28359 -226975 166754 1080077 1242883 813733 623832 -225911 -263250 -38843
6061 -38843 381020 627155 -87431 -1420921 -2461008 -1899953 -710554 -123198 114936
6052 114936 4095 -151489 -708386 -1350900 -1396425 -903146 -180686 -88179 -484027 -938991
6042 -938991 -1603581 -1450907 -1142353 -755503 -516767 -815323 -1398344 -1774897 -1805956 -2258410
6032 -2258410 -2100722 -1416124 -854236 -119022 -513755 -1911354 -2413511 -2128991 -1226011
6023 -1226011 -509647 -387736 -354643 194309 845786 456492 -134924 -106624 1017761 1853345
6013 1853345 1596178 1144930 213662 -920147 -944252 -175489 400354 717056 501382 235009
6003 235009 310881 189474 410082 306064 351796 387784 -313257 -990690 -1493971 -1535668
5993 -1535668 -1113887 84293 637846 557279 773726 1501443 1290561 675192 1001617 1005130
5983 1005130 318024 -247959 -781557 -771160 -206062 -586560 -1132060 -1984240 -1815506 -1458647
5973 -1458647 -1450066 -674457 726920 1493588 1526393 1202008 587186 149678 166693 -416554
5963 -416554 -1238238 -1994480 -1832253 -1206837 -1436307 -1641170 -1453036 -1427746 -1127520 -361290
5953 -361290 456122 965164 526434 -288038 -657576 -848283 -567433 39392 -386980 -1161755
5943 -1161755 -1753725 -1413219 -987178 -1235055 -1093999 -1501282 -1759828 -1097686 -280764 331299
$$ [...]
##END NTUPLES=NMR SPECTRUM
##END=
