##TITLE=C13_PR192_5ACN
 D2O, 23267 sc

 22.10.2020
##JCAMPDX= 6.0         $$ Bruker NMR JCAMP-DX V2.0
##DATA TYPE= NMR SPECTRUM
##DATA CLASS= NTUPLES
##ORIGIN= UXNMR, Bruker Analytische Messtechnik GmbH
##OWNER= root
$$ XWIN-NMR		Version 3.5
$$ Fri Oct 23 11:44:08 2020 Russian Standard Time (UT+4h)  she@DPX200
##.OBSERVE FREQUENCY= 50.327896
##.OBSERVE NUCLEUS= ^13C
##.ACQUISITION MODE= SIMULTANEOUS
##.ACQUISITION SCHEME= undefined
##.AVERAGES= 23268
##.DIGITISER RES= 17
##SPECTROMETER/DATA SYSTEM= spect
##.PULSE SEQUENCE= zgpg30
##.SOLVENT NAME= CDCl3
##.SHIFT REFERENCE= (INTERNAL, CDCl3, 0, 222.661)
##AUDIT TRAIL= $$ (NUMBER, WHEN, WHO, WHERE, WHAT)
$$ ##TITLE= Audit trail, XWIN-NMR		Version 3.5
$$ ##JCAMPDX= 5.01
$$ ##ORIGIN= Bruker BioSpin GmbH
$$ ##OWNER= she
$$ F:/spectra/data/she/nmr/c13/1/pdata/1/auditp.txt
$$ ##AUDIT TRAIL=  $$ (NUMBER, WHEN, WHO, WHERE, WHAT)
(   1,<2020-10-23 11:41:09.90 +0400>,<she>,<DPX200>,
      <created by zg, POWCHK disabled, PULCHK disabled
       terminated by command 'halt'
       configuration hash MD5:
       00 E9 B6 7A A2 85 ED C7 34 08 36 98 17 FE 4E 26
       data hash MD5: 32K
       6F E2 80 2E E4 43 AE B0 26 24 37 43 59 FD 9E F6>)
(   2,<2020-10-23 11:41:32.00 +0400>,<she>,<DPX200>,
      <Start of raw data processing
       efp BC_mod = 2 LB = 1 FT_mod = 6 PKNL = 1 PHC0 = -234.4448 PHC1 = 29.76241 SI = 32K 
       data hash MD5: 32K
       68 F7 BB C0 3E 58 C4 2F 25 B5 D3 74 5B C2 82 86>)
(   3,<2020-10-23 11:41:34.87 +0400>,<she>,<DPX200>,
      <abs ABSG = 5 
       data hash MD5: 32K
       D2 DB A8 EA C2 00 01 82 AD 4B 85 DE 43 53 C1 70>)
(   4,<2020-10-23 11:42:01.65 +0400>,<she>,<DPX200>,
      <pk PHC0 = -4.332202 PHC1 = 3.799999 
       data hash MD5: 32K
       FD CA DB EB C5 D3 01 A7 B0 A7 BC A9 A9 5D 8D 60>)
(   5,<2020-10-23 11:42:04.71 +0400>,<she>,<DPX200>,
      <abs ABSG = 5 
       data hash MD5: 32K
       41 26 EB FE E9 5A 1C 46 D5 46 9E 0B 47 E5 6A 1A>)
(   6,<2020-10-23 11:43:15.03 +0400>,<she>,<DPX200>,
      <pk PHC0 = 12.59513 PHC1 = -15.2 
       data hash MD5: 32K
       33 94 35 76 4D 46 DD 57 E4 C0 76 76 90 06 97 DD>)
(   7,<2020-10-23 11:43:30.75 +0400>,<she>,<DPX200>,
      <abs ABSG = 5 
       data hash MD5: 32K
       8C 19 FD 66 9F B6 AC 6D F8 27 74 3C 84 D8 02 76>)
$$ ##END=
$$ 
$$ hash MD5
$$ 9E 7F CA 31 36 52 7A F0 58 EE F0 69 1F C0 1A 89
##$RELAX= 
##$RELAX= 
##$RELAX= 
##$RELAX= 
##$RELAX= 
##$RELAX= 
##$RELAX= 
##$RELAX= 
$$ Bruker specific parameters
$$ --------------------------
##$DU= <F:/spectra>
##$EXPNO= 1
##$NAME= <c13>
##$PROCNO= 1
##$TYPE= <nmr>
##$USER= <she>
##$AMP= (0..31)
100 100 100 100 100 100 100 100 100 100 100 100 100 100 100 100 100 100 
100 100 100 100 100 100 100 100 100 100 100 100 100 100 
##$AQSEQ= 0
##$AQ_mod= 1
##$AUNM= <au_zg>
##$AUTOPOS= <>
##$BF1= 50.322709
##$BF2= 200.13
##$BF3= 50.322709
##$BF4= 500.13
##$BF5= 500.13
##$BF6= 500.13
##$BF7= 500.13
##$BF8= 500.13
##$BYTORDA= 1
##$CFDGTYP= 0
##$CFRGTYP= 5
##$CHEMSTR= <none>
$$ [...]
##$SUBNAM4= <"">
##$SUBNAM5= <"">
##$SUBNAM6= <"">
##$SUBNAM7= <"">
##$SUBNAM8= <"">
##$SUBNAM9= <"">
##$SW= 239.972175391363
##$SWIBOX= (0..15)
0 1 3 0 0 0 0 0 0 0 0 0 0 0 0 0 
##$SW_h= 12077.2946859903
##$TD= 32768
##$TD0= 1
##$TE= 0
##$TE2= 300
##$TE3= 300
##$TEG= 300
##$TL= (0..7)
120 120 120 120 120 120 120 120 
##$TP= (0..7)
150 150 150 150 150 150 150 150 
##$TP07= 0
##$TPNAME0= <>
##$TPNAME1= <>
##$TPNAME2= <>
##$TPNAME3= <>
##$TPNAME4= <>
##$TPNAME5= <>
##$TPNAME6= <>
##$TPNAME7= <>
##$TPOAL= (0..7)
0.5 0.5 0.5 0.5 0.5 0.5 0.5 0.5 
##$TPOFFS= (0..7)
0 0 0 0 0 0 0 0 
##$TUNHIN= 0
##$TUNHOUT= 0
##$TUNXOUT= 0
##$USERA1= <user>
##$USERA2= <user>
##$USERA3= <user>
##$USERA4= <user>
##$USERA5= <user>
##$V9= 5
##$VALIST= <valist>
##$VCLIST= <CCCCCCCCCCCCCCC>
##$VD= 0
##$VDLIST= <DDDDDDDDDDDDDDD>
##$VPLIST= <PPPPPPPPPPPPPPP>
##$VTLIST= <TTTTTTTTTTTTTTT>
##$WBST= 1024
##$WBSW= 4
##$XGAIN= (0..3)
0 0 0 0 
##$XL= 0
##$YL= 0
##$YMAX_a= 128673771
##$YMIN_a= -38756181
##$ZGOPTNS= <>
##$ZL1= 120
##$ZL2= 120
##$ZL3= 120
##$ZL4= 120
##$ABSF1= 222.6606
##$ABSF2= -17.33621
##$ABSG= 5
##$ABSL= 3
##$ALPHA= 0
##$AQORDER= 0
##$ASSFAC= 0
##$ASSFACI= 0
##$ASSFACX= 0
##$ASSWID= 0
##$AUNMP= <proc_1d>
##$AZFE= 0.1
##$AZFW= 0.5
##$BCFW= 0
##$BC_mod= 2
##$BYTORDP= 0
##$COROFFS= 0
##$CY= -3
##$DATMOD= 1
##$DC= 0
##$DFILT= <>
##$DTYPP= 0
##$F1P= 0
##$F2P= 0
##$FCOR= 0.5
##$FTSIZE= 32768
##$FT_mod= 6
##$GAMMA= 0
##$GB= 0
##$INTBC= 1
##$INTSCL= 4.134877e-10
##$ISEN= 128
##$LB= 1
##$LEV0= 0
##$LPBIN= 0
##$MAXI= 10000
##$MC2= 0
##$MEAN= 0
##$ME_mod= 0
##$MI= 0.1934396
##$NCOEF= 0
##$NC_proc= -1
##$NLEV= 6
##$NOISF1= 120.0001
##$NOISF2= 80.00006
##$NSP= 0
##$NTH_PI= 0
##$NZP= 0
##$OFFSET= 222.6606
##$PC= 1.4
##$PHC0= -226.1819
##$PHC1= 18.36241
##$PH_mod= 1
##$PKNL= yes
##$PPARMOD= 0
##$PSCAL= 0
##$PSIGN= 0
##$REVERSE= no
##$SF= 50.322729756361
##$SI= 32768
##$SIGF1= 140
##$SIGF2= 120
##$SINO= 11.81781
##$SIOLD= 32768
##$SREGLST= <13C.CDCl3>
##$SSB= 0
##$STSI= 32768
##$STSR= 0
##$SW_p= 12077.2946859903
##$SYMM= 0
##$S_DEV= 0
##$TDeff= 32768
##$TDoff= 0
##$TI= <>
##$TILT= no
##$TM1= 0
##$TM2= 0
##$TOPLEV= 0
##$USERP1= <user>
##$USERP2= <user>
##$USERP3= <user>
##$USERP4= <user>
##$USERP5= <user>
##$WDW= 1
##$XDIM= 32768
##$YMAX_p= 499019616
##$YMIN_p= -21906091
$$ End of Bruker specific parameters
$$ ---------------------------------
##NTUPLES= NMR SPECTRUM
##VAR_NAME=  FREQUENCY,     SPECTRUM/REAL,   SPECTRUM/IMAG
##SYMBOL=    X,             R,               I
##VAR_TYPE=  INDEPENDENT,   DEPENDENT,       DEPENDENT
##VAR_FORM=  AFFN,          ASDF,            ASDF
##VAR_DIM=   32768,         32768,           32768
##UNITS=     HZ,            ARBITRARY UNITS, ARBITRARY UNITS
##FACTOR=    0.368581032318806, 1,           1
##FIRST=     11204.8891385315, 0,            0
##LAST=      -872.405547458802, 0,           0
##MIN=       -872.405547458802, -21906091,   0
##MAX=       11204.8891385315, 499019616,    0
$$ Real data points
##PAGE= N=1
##DATA TABLE= (X++(R..R)), XYDATA
$$ [...]
##PAGE= N=2
##DATA TABLE= (X++(I..I)), XYDATA
$$ plain form
6783 151147300 150258520 149699579 146818316 145835883 147226446 149941171 151057353 147606707
6775 147606707 146744806 147483364 145154037 140203272 137692037 137232783 136412636 138952949 144265039
6766 144265039 146758684 146710791 142937467 135748389 136632409 140579565 139497519 139202250 138870778
6757 138870778 142412616 145218017 145894196 145070072 145615589 145104690 146192976 150714959 151999835
6748 151999835 149400767 148402589 148904359 150445241 151383257 153321679 152149793 151491293 152918759
6739 152918759 158082949 165135287 169021446 168347527 166339783 159126736 150524194 146511902
6731 146511902 146083564 148571827 147318431 142108819 140261832 139702569 140024355 140463035 142164911
6722 142164911 145563109 148413786 150935197 151247539 149155932 147134128 147417930 148355207
$$ packed form
6783A51147300q88780n58941k881263r82433J390563K714725J116182l450646
6775A47606707q61901P38558k329327m950765k511235m59254q20147K540313N312090
6766A44265039K493645m7893l773324p189078Q84020L947156j082046k95269l31472
6757A38870778L541838K805401O76179q24124N45517n10899J088286M521983J284876
6748A51999835k599068r98178N01770J540882R38016J938422j171886o58500J427466
6739A52918759N164190P052338L886159o73919k007744p213047q602542m012292
6731A46511902m28338K488263j253396n209612j846987n59263L21786M38680J701876
6722A42164911L398198K850677K521411L12342k091607k021804K83802R37277
$$ plain form
6714 148355207 152398034 154257998 151331790 148760540 148341300 147392943 145471567 144945412
6706 144945412 149689118 153117672 153306034 154320676 154437165 151053044 148067180 146959485
6698 146959485 145263157 142359873 141696157 145165555 146863511 144809843 144339563 146441191
6690 146441191 147175492 146655503 147376302 148786499 149911509 150651133 150757182 150855538 149633386
6681 149633386 147711735 144240459 140715213 138753490 141099569 147168630 150053947 150154892
6673 150154892 147841264 144403222 143060832 144379218 144227892 146166101 147040687 146797691
6665 146797691 148245790 150971744 153948042 150859703 145577255 143749768 147140098 152307284
6657 152307284 155861874 158226584 155714557 148269550 145779260 147499622 146029512 143178818
$$ packed form
6714A48355207M042827J859964k926208k571250m19240r48357j921376n26155
6706A44945412M743706L428554J88362J014642J16489l384121k985864j107695
6698A46959485j696328k903284o63716L469398J697956k053668m70280K101628
6690A46441191P34301n19989P20799J410197J125010P39624J06049R8356j222152
6681A49633386j921651l471276l525246j961723K346079O069061K885317J00945
6673A50154892k313628l438042j342390J318386j51326J938209Q74586k42996
6665A46797691J448099K725954K976298l088339n282448j827487L390330N167186
6657A52307284L554590K364710k512027p445007k490290J720362j470110k850694
$$ plain form
6649 143178818 144668238 145632582 145768304 147906038 151636667 155000004 155583882 154383109
6641 154383109 155815627 156258277 153565226 151475688 149012631 147096896 144925346 142073718
6633 142073718 140789440 141075179 142182224 143800875 141964492 140352203 141503941 142472941
6625 142472941 142985230 145023071 150821680 153622914 152586558 152569462 152648386 150002558 150900350
6616 150900350 152972050 152029746 150414426 147444930 140878722 135592421 134718802 136436402
6608 136436402 139590206 143224311 146767823 147508772 145819089 143375753 143534008 142680049
6600 142680049 141716728 137956085 135838554 139196550 141693598 143055677 145034482 147569494
6592 147569494 148974151 148911992 146848917 143567626 141564374 141939505 144363639 146139474
$$ packed form
6649A43178818J489420R64344J35722K137734L730629L363337N83878j200773
6641A54383109J432518M42650k693051k089538k463057j915735k171550k851628
6633A42073718j284278K85739J107045J618651j836383j612289J151738R69000
6625A42472941N12289K037841N798609K801234j036356j7096P8924k645828Q97792
6616A50900350K071700r42304j615320k969496o566208n286301q73619J717600
6608A36436402L153804L634105L543512P40949j689683k443336J58255q53959
6600A42680049r63321l760643k117531L357996K497048J362079J978805K535012
6592A47569494J404657o2159k063075l281291k003252L75131K424134J775835
$$ plain form
6584 146139474 145512860 145988764 145906319 145716364 145918916 142114514 141414122 147201193 149163099
6575 149163099 147682899 146104273 146862233 147808754 147721716 147685767 145755692 143912475 142699865
6566 142699865 141797910 145805104 153861639 156507856 152767109 152265267 152629582 151029495
6558 151029495 150872416 152271542 149971300 146742801 147152385 147421301 144275833 141937094
6550 141937094 141715319 141925054 142016149 142748122 142721317 143502340 145059744 143264340 141599502
6541 141599502 141693160 142481355 144723368 146032665 142818047 139613136 138156575 140034922
6533 140034922 139217824 135143644 132949055 135569171 140333088 146333590 150980147 151599797
6525 151599797 151027289 152642717 153387157 148175877 140855684 140033879 143342950 142035107
$$ packed form
6584A46139474o26614M75904q2445j89955K02552l804402p00392N787071J961906
6575A49163099j480200j578626P57960R46521q7038l5949j930075j843217j212610
6566A42699865r01955M007194Q056535K646217l740747n01842L64315j600087
6558A51029495j57079J399126k300242l228499M09584K68916l145468k338739
6550A41937094k21775K09735R1095P31973k6805P81023J557404j795404j664838
6541A41599502R3658P88195K242013J309297l214618l204911j456561J878347
6533A40034922q17098m074180k194589K620116M763917O000502M646557O19650
6525A51599797n72508J615428P44440n211280p320193q21805L309071j307843
$$ plain form
6517 142035107 140170765 141927445 144064938 147874808 154883500 158079937 156897960 155413446
6509 155413446 155308031 155070487 156426578 154509096 151233769 145398020 143256963 145222229
6501 145222229 147655164 148712990 147758504 146025232 144350623 143936683 147098282 151860407
6493 151860407 155145731 153373427 150535725 149413588 149252438 152769037 156490994 155734910
6485 155734910 153670984 151094798 147409454 148283634 149679005 151285799 153187000 150464181
6477 150464181 145278913 147458982 151176908 150259189 150634905 152319177 151437005 149582533
6469 149582533 148759857 150654949 151511066 151204402 148658376 150115720 151296911 152534085
6461 152534085 152724741 151011151 147761017 147085370 146162820 143068337 141024317 141470011 142164074
$$ packed form
6517A42035107j864342J756680K137493L809870P008692L196437j181977j484514
6509A55413446j05415k37544J356091j917482l275327n835749k141057J965266
6501A45222229K432935J057826r54486j733272j674609m13940L161599M762125
6493A51860407L285324j772304k837702j122137j61150L516599L721957p56084
6485A55734910k063926k576186l685344Q74180J395371J606794J901201k722819
6477A50464181n185268K180069L717926r17719L75716J684272q82172j854472
6469A49582533q22676J895092Q56117l06664k546026J457344J181191J237174
6461A52534085J90656j713590l250134o75647r22550l094483k044020M45694O94063
$$ plain form
6452 142164074 141857117 144981765 146520901 143196170 140120865 140781197 143189515 148855513
6444 148855513 151196199 152038690 153435080 153890963 153348976 151373759 146857912 146255827 146778866
6435 146778866 147468203 143688675 139674268 139371826 141106122 138486975 138058287 141360748
6427 141360748 141215640 140460507 140470271 139783387 137061055 138429674 144348857 152182624 152183163
6418 152183163 148786162 145091209 145303989 147734911 150701620 154518050 156444838 156110942
6410 156110942 155199891 154496184 152636677 153316536 155665149 154406336 151786827 148349778
6402 148349778 144348300 142775464 144815015 143813540 144291106 143986917 142280861 141605751
6394 141605751 142488567 146513951 149220589 147490528 146558337 146776376 145605687 141575862
$$ packed form
6452A42164074l06957L124648J539136l324731l075305O60332K408318N665998
6444A48855513K340686Q42491J396390M55883n41987j975217m515847o02085N23039
6435A46778866O89337l779528m014407l02442J734296k619147m28688L302461
6427A41360748j45108p55133R764o86884k722332J368619N919183P833767N39
6418A52183163l397001l694953K12780K430922K966709L816430J926788l33896
6410A56110942r11051p03707j859507O79859K348613j258813k619509l437049
6402A48349778m001478j572836K039551j001475M77566l04189j706056o75110
6394A41605751Q82816M025384K706638j730061r32191K18039j170689m029825
$$ plain form
6386 141575862 138021032 136191558 138246295 140057620 143346608 147960207 151796083 153531177
6378 153531177 153516104 152787111 149927706 145374474 141598229 140890474 143588880 145189281 146821490
6369 146821490 150935519 150302648 148861125 150164753 148887193 146425604 142835753 142997593
6361 142997593 146422926 150704578 153406232 152035699 150649377 150446205 149111728 146727626
6353 146727626 150132328 151560567 151158413 148162644 148407719 153205922 150251378 144954354
6345 144954354 145679288 149801921 150913608 149889626 148882072 151612693 153878015 153093553
6337 153093553 154023165 156149577 156276375 155553101 156168223 158433026 156823720 153200705 153219163
6328 153219163 151101804 147893709 148294472 150247069 153349837 156458428 154239523 147628465
$$ packed form
6386A41575862l554830j829474K054737J811325L288988M613599L835876J735094
6378A53531177j5073p28993k859405m553232l776245p07755K698406J600401J632209
6369A46821490M114029o32871j441523J303628j277560k461589l589851J61840
6361A42997593L425333M281652K701654j370533j386322k03172j334477k384102
6353A46727626L404702J428239m02154k995769K45075M798203k954544n297024
6345A44954354P24934M122633J111687j023982j007554K730621K265322p84462
6337A53093553R29612K126412J26798p23274O15122K264803j609306l623015J8458
6328A53219163k117359l208095M00763J952597L102768L108591k218905o611058
$$ plain form
6320 147628465 144795863 148203704 152013843 151891924 150425244 154087610 155746942 153962202
6312 153962202 154431554 157080086 157370765 153784638 151242847 150771485 148410597 145785516
6304 145785516 144729706 144201873 145896023 146422041 145887589 148434521 153947035 157168637
6296 157168637 158534515 159714222 159310868 159859608 162605822 164097812 162396267 158998108
6288 158998108 157335363 156703711 155633982 154375472 152723122 151795570 153304601 152792924
6280 152792924 151743852 152391400 152306607 153258480 152903194 151951062 154325951 154420617 152246529
6271 152246529 152220232 152708782 153594295 153043704 151998061 149737120 150568773 150285180 150243521
6262 150243521 149540958 150023038 149961744 149296165 146375302 145420462 148742593 150601938 152623892
$$ packed form
6320A47628465k832602L407841L810139j21919j466680L662366J659332j784740
6312A53962202M69352K648532K90679l586127k541791m71362k360888k625081
6304A45785516j055810n27833J694150N26018n34452K546932N512514L221602
6296A57168637J365878J179707m03354N48740K746214J491990j701545l398159
6288A58998108j662745o31652j069729j258510j652350r27552J509031n11677
6280A52792924j049072O47548q4793R51873l55286r52132K374889R4666k174088
6271A52246529k6297M88550Q85513n50591j045643k260941Q31653k83593m1659
6262A50243521p02563M82080o1294o65579k920863r54840L322131J859345K021954
$$ plain form
6253 152623892 156854521 158483719 155998653 154570348 155677926 152901663 151695665 151768415
6245 151768415 151314513 153599097 153702482 155543558 156178055 156892736 156941457 157710124 160055909
6236 160055909 159789749 159523788 157953097 157620768 159354695 161309620 161185056 159950915 158738450
6227 158738450 157932109 160513312 162519374 164083160 168176498 168977016 166596976 163140529
6219 163140529 161791882 159168968 155354483 154122657 154090984 152486735 153131209 158773011
6211 158773011 163137677 162378626 159904147 158856598 158450959 159430007 161032655 162130841
6203 162130841 164264409 161219872 156953941 154749414 153095040 155371683 157090812 160482507
6195 160482507 165256082 163903815 161081281 162551380 164950698 166262256 163329486 160602171
$$ packed form
6253A52623892M230629J629198k485066j428305J107578k776263j205998P2750
6245A51768415m53902K284584J03385J841076O34497P14681M8721P68667K345785
6236A60055909k66160k65961j570691l32329J733927J954925j24564j234141j212465
6227A58738450q06341K581203K006062J563786M093338Q00518k380040l456447
6219A63140529j348647k622914l814485j231826l1673j604249O44474N641802
6211A58773011M364666p59051k474479j047549m05639R79048J602648J098186
6203A62130841K133568l044537m265931k204527j654374K276643J719129L391695
6195A60482507M773575j352267k822534J470099K399318J311558k932770k727315
$$ plain form
6187 160602171 164389721 167272613 169250093 172183657 172719831 167965733 161529026 159658041
6179 159658041 163817128 168280218 169003189 170297922 172299732 171349045 168920662 169247263
6171 169247263 171691929 172738860 168283822 165820427 168066204 167612699 165474274 166754718
6163 166754718 170224073 172727143 173546660 173446129 174574370 177099759 177221470 176902956 178616915
6154 178616915 182175816 185417380 186258220 184986566 185814491 185127972 184585998 186190104 189318298
6145 189318298 192784078 195194816 194584689 197103926 204307236 207741883 204522895 205108381
6137 205108381 212444582 218075771 220587659 220315254 224504750 230937348 232570248 235970977
6129 235970977 242735586 249017906 258048838 265723782 270639235 276412349 283887592 293106187
$$ packed form
6187A60602171L787550K882892J977480K933564N36174m754098o436707j870985
6179A59658041M159087M463090P22971J294733K001810r50687k428383L26601
6171A69247263K444666J046931m455038k463395K245777m53505k138425J280444
6163A66754718L469355K503070Q19517j00531J128241K525389J21711l18514J713959
6154A78616915L558901L241564Q40840j271654Q27925o86519n41974J604106L128194
6145A89318298L465780K410738o10127K519237P203310L434647l218988N85486
6137B05108381P336201N631189K511888k72405M189496O432598J632900L400729
6129B35970977O764609O282320R030932P674944M915453N773114P475243R218595
$$ plain form
6121 293106187 303354589 314750411 327270860 332974101 327144229 294614177 217115848
6114 217115848 106113852 7534649 -42854996 -56507377 -51594407 -39735114 -25983255
6107 -25983255 -10448776 2993837 14414345 23391288 29610634 35155525 42657225 49962437
6099 49962437 56024908 63548267 70844860 73726121 71577453 70944741 72398697 73722712
6091 73722712 76850929 82307924 85923283 88768421 90901982 91680547 93021494 94713644
6083 94713644 93408321 93838590 95975255 96628854 101979901 110684242 112614628 113224049 114511584
6074 114511584 114459163 115391084 114585313 114498210 117242228 118389978 115177651 113449020 115067937
6065 115067937 117098057 117402228 115358952 115039364 118330536 117228966 113992210 115434626
$$ packed form
6121B93106187J0248402J1395822J2520449N703241n829872l2530052p7498329
6114B17115848j11001996r8579203n0389645j3652381M912970J1859293J3751859
6107b5983255J5534479J3442613J1420508Q976943O219346N544891P501700P305212
6099D9962437O062471P523359P296593K881261k148668o32712J453956J324015
6091G3722712L128217N456995L615359K845138K133561P78565J340947J692150
6083I4713644j305323M30269K136665O53599N351047Q704341J930386O09421J287535
6074A14511584n2421R31921q05771q7103K744018J147750l212327j728631J618917
6065A15067937K030120L04171k043276l19588L291172j101570l236756J442416
$$ plain form
6057 115434626 116549282 118756142 119468763 120330182 126341490 129180115 128842977 126965808
6049 126965808 124552894 122943178 124626334 134470393 139993259 136855053 133912987 131576446
6041 131576446 127684681 126275828 128600815 127956090 125559912 124290619 120245339 115938434
6033 115938434 115021623 118106200 120159958 121650374 123193853 125228108 130384931 132233897
6025 132233897 130440575 128446417 127676235 128563138 130585807 132133459 132510662 133403045 134723824
6016 134723824 132525468 130971050 128449965 125431836 123985466 126380241 126685372 123290995
6008 123290995 122512591 125860100 127760597 126748856 122441225 121179295 125782028 129901617
6000 129901617 129058076 126594389 126670180 128040582 130773028 132820930 135397929 135894904 133823997
$$ packed form
6057A15434626J114656K206860P12621Q61419O011308K838625l37138j877169
6049A26965808k412914j609716J683156R844059N522866l138206k942066k336541
6041A31576446l891765j408853K324987o44725k396178j269293m045280m306905
6033A15938434r16811L084577K053758J490416J543479K034255N156823J848966
6025A32233897j793322j994158p70182Q86903K022669J547652L77203Q92383J320779
6016A34723824k198356j554418k521085l018129j446370K394775L05131l394377
6008A23290995p78404L347509J900497j011741m307631j261930M602733M119589
6000A29901617q43541k463687P5791J370402K732446K047902K576999M96975k070907
$$ plain form
5991 133823997 131051928 129800796 134359706 139366123 142539256 142370042 139594690 134415843
5983 134415843 133043482 133775082 129570613 128466344 131956732 133836716 135172201 136902197
5975 136902197 137771751 135466852 134324941 134785169 137038635 139599420 137731325 134385381
5967 134385381 134426928 134730977 133904152 134331023 137526533 137293549 132847921 132995498 133646605
5958 133646605 131954256 132852079 133260022 134401127 133753564 131857722 134020545 135977553
5950 135977553 136929716 135237000 132238534 131975004 133154791 133432141 134172651 134565100 135590164
5941 135590164 134835574 135002995 132275166 129881144 128579739 126300450 127930756 131706540
5933 131706540 136458128 140761829 142190466 141947756 141108813 143640134 143407099 138424041
$$ packed form
5991A33823997k772069j251132M558910N006417L173133j69214k775352n178847
5983A34415843j372361P31600m204469j104269L490388J879984J335485J729996
5975A36902197Q69554k304899j141911M60228K253466K560785j868095l345944
5967A34385381M1547L04049q26825M26871L195510k32984m445628J47577O51107
5958A33646605j692349Q97823M07943J141105o47563j895842K162823J957008
5950A35977553R52163j692716k998466k63530J179787K77350P40510L92449J025064
5941A35590164p54590J67421k727829k394022j301405k279289J630306L775784
5933A31706540M751588M303701J428637k42710q38943K531321k33035m983058
$$ plain form
5925 138424041 135700431 136152842 135727451 135037912 134641643 135709918 137284384 140205365 140655130
5916 140655130 139182242 138741459 140134011 137154299 133715603 135237224 136058219 136125522 137881961
5907 137881961 143090202 145414493 142234911 140623091 141279485 138817767 138714191 139017580
5899 139017580 136252341 136675565 137809105 136344914 132896110 132767740 137197035 137867046
5891 137867046 136226803 134825456 132849124 134620071 137666569 139920553 139625484 136898530
5883 136898530 134918620 138061269 141780917 142546871 141091391 141224919 142065935 141515053 141700150
5874 141700150 143741279 144223791 143345407 140560169 136241615 132781008 131961120 131357086 129323341
5865 129323341 127127892 128453846 129842023 132102434 137303962 138685923 139421105 141658686
$$ packed form
5925A38424041k723610M52411m25391o89539l96269J068275J574466K920981M49765
5916A40655130j472888m40783J392552k979712l438696J521621Q20995O7303J756439
5907A37881961N208241K324291l179582j611820O56394k461718j03576L03389
5899A39017580k765239M23224J133540j464191l448804j28370M429295O70011
5891A37867046j640243j401347j976332J770947L046498K253984k95069k726954
5883A36898530j979910L142649L719648P65954j455480J33528Q41016n50882J85097
5874A41700150K041129M82512q78384k785238m318554l460607q19888o04034k033745
5865A29323341k195449J325954J388177K260411N201528J381961P35182K237581
$$ plain form
5857 141658686 139355661 135400699 133836226 133002805 133449628 134064163 135156744 133988792
5849 133988792 132325897 130715222 128804562 129623935 134854554 139665544 139587010 137035592
5841 137035592 138905890 141845141 142616720 141829572 141215436 144898119 149557515 149858576 148960285
5832 148960285 147598133 146098241 144613806 143884080 143602877 141886742 139663099 135513393
5824 135513393 130985280 132913586 133936730 134508692 133949538 131461647 130506339 132330355
5816 132330355 135450941 136036345 134123092 134749339 138660254 141011554 141097955 137229676 132519813
5807 132519813 134482234 137859014 137907043 138787547 140806246 142362190 139911947 139180524 138544368
5798 138544368 135785093 135190714 138186091 139577866 140178969 140056217 139016918 137867410
$$ packed form
5857A41658686k303025l954962j564473q33421M46823O14535J092581j167952
5849A33988792j662895j610675j910660Q19373N230619M810990p8534k551418
5841A37035592J870298K939251P71579p87148o14136L682683M659396L01061q98291
5832A48960285j362152j499892j484435p29726k81203j716135k223643m149706
5824A35513393m528113J928306J023144N71962n59154k487891r55308J824016
5816A32330355L120586N85404j913253O26247L910915K351300Q6401l868279m709863
5807A32519813J962421L376780M8029Q80504K018699J555944k450243p31423o36156
5798A38544368k759275n94379K995377J391775O01103j22752j039299j149508
$$ plain form
5790 137867410 139137288 141874137 137634070 133934175 137054077 141748960 142932057 140322033
5782 140322033 137592742 137777832 136444237 133781042 133804808 136628395 138799785 139815367
5774 139815367 141124661 141650840 141225448 142192666 144408203 142089047 136813210 135930885 136914125
5765 136914125 137464167 135718993 134918328 137778010 143207632 146139632 145152640 140135193
5757 140135193 135723282 136325351 137436401 137140625 135896376 133022089 133639748 136843906
5749 136843906 137876441 136423160 135935083 132309728 130447940 132392458 132320220 134100993
5741 134100993 135942364 137242677 139072121 138296212 136655956 136817028 135719428 134195560
5733 134195560 134500629 136620933 134852185 132070775 132229131 137847629 141341440 142881446
$$ packed form
5790A37867410J269878K736849m240067l699895L119902M694883J183097k610024
5782A40322033k729291J85090j333595k663195K3766K823587K171390J015582
5774A39815367J309294N26179m25392R67218K215537k319156n275837q82325R83240
5765A36914125N50042j745174q00665K859682N429622K932000r86992n017447
5757A40135193m411911O02069J111050k95776j244249k874287O17659L204158
5749A36843906J032535j453281m88077l625355j861788J944518p2238J780773
5741A34100993J841371J300313J829444p75909j640256J61072j097600j523868
5733A34195560L05069K120304j768748k781410J58356N618498L493811J540006
$$ plain form
5725 142881446 145671566 147494958 148684472 147885853 148865175 151059998 150247360 149102844
5717 149102844 149278283 145729531 140230248 138171371 136265978 138003007 142423552 145515297
5709 145515297 148996334 151232662 148213022 141789969 138845977 139534247 144579447 148189552
5701 148189552 144142837 140482070 141552861 143838679 145633627 146717681 142651255 137780713
5693 137780713 138695527 141142667 141865052 143132292 141923628 141406676 144062262 147105832
5685 147105832 145416892 142467387 141006448 135703096 132206147 133671143 135540641 141611098
5677 141611098 145823449 146213353 144860438 143895028 143493273 142119687 142265980 141293343 140609752
5668 140609752 141904389 143103856 144364401 145057866 144109260 141823535 139113405 137907476
$$ packed form
5725A42881446K790120J823392J189514p98619R79322K194823q12638j144516
5717A49102844J75439l548752n499283k058877j905393J737029M420545L091745
5709A45515297L481037K236328l019640o423053k943992O88270N045200L610105
5701A48189552m046715l660767J070791K285818J794948J084054m066426m870542
5693A37780713R14814K447140P22385J267240j208664n16952K655586L043570
5685A47105832j688940k949505j460939n303352l496949J464996J869498O070457
5677A41611098M212351L89904j352915r65410m01755j373586J46293r72637o83591
5668A40609752J294637J199467J260545O93465r48606k285725k710130j205929
$$ plain form
5660 137907476 141003581 142379250 142702334 144145236 143481172 141159816 139311602 139730805
5652 139730805 140205304 141581982 141383557 141381557 143136656 144511755 144328326 145420897 149261166
5643 149261166 155551364 158445387 154562563 149800695 149829364 150127061 146599820 142607320
5635 142607320 143583557 142635010 139347167 135712622 133056408 134671962 136451981 136479937 136992901
5626 136992901 138788588 139723993 137423396 134433701 132654915 134270990 135586353 136167613
5618 136167613 139640067 142036606 138393343 132805539 131657113 135044323 138501925 140269803
5610 140269803 143801516 146161677 143450935 141216688 140483107 136580093 133587399 134056089
5602 134056089 137295316 139693803 141107251 145212952 146870865 146278137 144308573 142053036
$$ packed form
5660A37907476L096105J375669L23084J442902o64064k321356j848214M19203
5652A39730805M74499J376678j98425k000J755099J375099j83429J092571L840269
5643A49261166O290198K894023l882824m761868K8669K97697l527241l992500
5635A42607320R76237r48547l287843l634545k656214J615554J780019K7956N12964
5626A36992901J795687R35405k300597k989695j778786J616075J315363N81260
5618A36167613L472454K396539l643263n587804j148426L387210L457602J767878
5610A40269803L531713K360161k710742k234247p33581l903014k992694M68690
5602A34056089L239227K398487J413448M105701J657913n92728j969564k255537
$$ plain form
5594 142053036 143139588 143770281 146717665 146847493 143838227 143543311 143209506 143925893 146153784
5585 146153784 145027442 142166842 136874524 134818967 138898233 145426288 149944600 147345773
5577 147345773 147030625 147951377 148967826 149838334 151487421 152172617 151299238 150322033 147229707
5568 147229707 142907623 140555285 141068459 141124244 138427480 136851476 139705649 141616050
5560 141616050 140581018 141997596 145405036 147766588 145977199 143616640 145334453 148827990
5552 148827990 148661634 148480832 149576361 154297213 161898779 167211806 166871543 160889982
5544 160889982 160344052 160758083 151669595 138340485 129008465 127343520 124563842 120572694
5536 120572694 118414994 120310494 123387674 122408142 121852750 122516765 126013894 129776183
$$ packed form
5594A42053036J086552O30693K947384J29828l009266k94916l33805P16387K227891
5585A46153784j126342k860600n292318k055557M079266O528055M518312k598827
5577A47345773l15148R20752J016449Q70508J649087O85196q73379r77205l092326
5568A47229707m322084k352338N13174N5785k696764j576004K854173J910401
5560A41616050j035032J416578L407440K361552j789389k360559J717813L493537
5552A48827990j66356j80802J095529M720852P601566N313027l40263n981561
5544A60889982n45930M14031r088488j3329110r332020j664945k779678l991148
5536A20572694k157700J895500L077180r79532n55392O64015L497129L762289
$$ plain form
5528 129776183 133320390 134122891 133822059 134567921 136814292 136797037 136897895 137779111 136055507
5519 136055507 134766134 134709745 134284173 135650697 137613513 137144465 138127651 140272505 140056892
5510 140056892 140574911 142594821 142843605 140636174 135591524 134182971 137902259 140397543
5502 140397543 139126333 141354079 142475275 141534745 145260596 142240741 136147983 135784812
5494 135784812 138365986 141805616 140880915 138582008 136766679 136668069 138327410 138523321 138407693
5485 138407693 139184924 138863931 134900596 132883421 132548581 135596109 138281513 137971937 139744271
5476 139744271 139377363 139573864 139795557 139937045 142100417 142710587 144703380 145455287 146896133
5467 146896133 147471633 148314023 147962603 147363502 146557748 146711895 149714400 151882744 150930009
$$ packed form
5528A29776183L544207Q02501l00832P45862K246371j7255J00858Q81216j723604
5519A36055507j289373n6389m25572J366524J962816m69048R83186K144854k15613
5510A40056892N18019K019910K48784k207431n044650j408553L719288K495284
5502A40397543j271210K227746J121196r40530L725851l019855o092758l63171
5494A35784812K581174L439630r24701k298907j815329r8610J659341J95911j15628
5485A38407693P77231l20993l963335k017175l34840L047528K685404l09576J772334
5476A39744271l66908J96501K21693J41488K163372O10170J992793P51907J440846
5467A46896133N75500Q42390l51420n99101q05754J54147L002505K168344r52735
$$ plain form
5458 150930009 147850608 145127553 145959392 145758730 145602004 144802776 143772937 144632125 142633980
5449 142633980 139256290 137179773 138642050 135194547 129719025 130048538 134090034 136738738
5441 136738738 136726203 134218185 132713028 131817122 131608802 135756962 139206170 137297374 138952675
5432 138952675 139750271 136373607 137373665 137531184 137999029 139884393 140390746 142683065 144861810
5423 144861810 144615125 143352301 144686494 143527330 140623286 139809151 142168985 146175865
5415 146175865 146997726 142627711 138768446 139986057 142157662 141160634 143006484 144465660
5407 144465660 144541487 147202917 146630163 141032171 139140971 142087896 147348323 149378808
5399 149378808 147599237 145838875 147521811 149538228 150547443 153491185 153836752 149804634
$$ packed form
5458A50930009l079401k723055Q31839k00662j56726p99228j029839Q59188j998145
5449A42633980l377690k076517J462277l447503n475522L29513M041496K648704
5441A36738738j2535k508018j505157q95906k08320M148160L449208j908796J655301
5432A38952675P97596l376664J000058J57519M67845J885364N06353K292319K178745
5423A44861810k46685j262824J334193j159164k904044q14135K359834M006880
5415A46175865Q21861m370015l859265J217611K171605r97028J845850J459176
5407A44465660P5827K661430n72754n597992j891200K946925N260427K030485
5399A49378808j779571j760362J682936K016417J009215K943742L45567m032118
$$ plain form
5391 149804634 145818214 145333659 147334470 147454162 142344738 139452324 138062886 139269485
5383 139269485 141908692 142202473 142484575 144265780 143551407 143408629 146523315 148655415 146826704
5374 146826704 144169006 144051482 143093724 142706295 143971970 141544730 136417260 135105623
5366 135105623 136946789 136654682 137044083 137948861 141280049 145802424 150892919 152655703
5358 152655703 150633226 149995122 152294450 154393735 153233839 151510852 148085438 146605070
5350 146605070 144936211 144012086 145466060 145789772 144831444 143555863 143600629 145190752 146062485
5341 146062485 146090558 147125989 151898688 153803260 153190002 146891732 142846551 140858381
5333 140858381 138450229 139172632 137090340 131787919 128060327 127327462 127630388 132669784
$$ packed form
5391A49804634l986420m84555K000811J19692n109424k892414j389438J206599
5383A39269485K639207K93781K82102J781205p14373j42778L114686K132100j828711
5374A46826704k657698j17524r57758l87429J265675k427240n127470j311637
5366A35105623J841166k92107L89401R04778L331188M522375N090495J762784
5358A52655703k022477o38104K299328K099285j159896j722987l425414j480368
5350A46605070j668859r24125J453974L23712r58328j275581M4766J590123Q71733
5341A46062485K8073J035431M772699J904572o13258o298270m045181j988170
5333A40858381k408152P22403k082292n302421l727592p32865L02926N039396
$$ plain form
5325 132669784 138177350 144168398 149489955 151796597 151635456 152027102 151011610 148305080
5317 148305080 147652152 151017136 153393587 154304335 154286268 154071045 152839995 144301854 139248279
5308 139248279 141522726 144670493 143162030 139707166 137951205 138105465 139135096 140899492
5300 140899492 143521399 144947341 146399908 144830651 144556031 147530713 150883566 151400717
5292 151400717 151926389 153440306 156041011 156118154 155990609 153872355 152018889 151306562 148557728
5283 148557728 150480150 155936277 160137743 163952556 162165492 160893977 159548507 156999548
5275 156999548 158922570 162277590 164684764 163916540 158893351 151966082 145288182 139248612
5267 139248612 134050094 131858643 128411421 126000817 128573230 133841683 137078784 139338550
$$ packed form
5325A32669784N507566N991048N321557K306642j61141L91646j015492k706530
5317A48305080o52928L364984K376451R10748j8067k15223j231050q538141n053575
5308A39248279K274447L147767j508463l454864j755961J54260J029631J764396
5300A40899492K621907J425942J452567j569257k74620K974682L352853N17151
5292A51400717N25672J513917K600705P7143j27545k118254j853466p12327k748834
5283A48557728J922422N456127M201466L814813j787064j271515j345470k548959
5275A56999548J923022L355020K407174p68224n023189o927269o677900o039570
5267A39248612n198518k191451l447222k410604K572413N268453L237101K259766
$$ plain form
5259 139338550 139172408 137565407 135128168 132609499 130739672 131823651 135167493 136007167
5251 136007167 137359209 138330803 139212327 139829660 138693859 141422718 147365151 149515221
5243 149515221 149839439 149449335 147991197 148587456 149472520 146835674 145701111 146226060 143450127
5234 143450127 140063888 139084296 142296635 145682022 145626206 144374208 142434501 142021907 143120130
5225 143120130 144714470 144981338 142385060 142842080 143066326 141994285 139996523 138288696
5217 138288696 139810617 144671967 148118830 149773666 148381010 143548020 139022927 134445859
5209 134445859 131245800 134295442 140445502 141723552 137402477 136219482 138267040 137266523
5201 137266523 135191264 133965029 135132364 135694630 134743524 131277039 129837417 132051162
$$ packed form
5259A39338550j66142j607001k437239k518669j869827J083979L343842Q39674
5251A36007167J352042R71594Q81524O17333j135801K728859N942433K150070
5243A49515221L24218l90104j458138N96259Q85064k636846j134563N24949k775933
5234A43450127l386239r79592L212339L385387n5816j251998j939707m12594J098223
5225A43120130J594340K66868k596278M57020K24246j072041j997762j707827
5217A38288696J521921M861350L446863J654836j392656m832990m525093m577068
5209A34445859l200059L049642O150060J278050m321075j182995K047558j000517
5201A37266523k075259j226235J167335N62266r51106l466485j439622K213745
$$ plain form
5193 132051162 135421369 138784876 142981066 146057777 145704452 142849472 140830004 139287495
5185 139287495 141696647 145369467 145285838 142015623 139683345 141046168 143168334 144476903
5177 144476903 145814508 146231708 145945119 144339528 143452046 141223822 140735691 140964641 140701025
5168 140701025 142806567 146467105 147794247 147015455 145928219 146817206 144129270 139421670
5160 139421670 139527151 140897102 141904642 143139547 142520714 138931876 139743010 143120238
5152 143120238 145044429 143500477 139224652 135904254 139101539 144064157 147093924 147851595
5144 147851595 144844706 144323649 145365497 149138418 150294324 146717321 144236180 145222751
5136 145222751 145619748 145092279 148946820 151557446 150757543 151114979 151303972 149893600 146355598
$$ packed form
5193A32051162L370207L363507M196190L076711l53325k854980k019468j542509
5185A39287495K409152L672820q3629l270215k332278J362823K122166J308569
5177A44476903J337605M17200k86589j605591q87482k228224m88131K28950k63616
5168A40701025K105542L660538J327142p78792j087236Q88987k687936m707600
5160A39421670J05481J369951J007540J234905o18833l588838Q11134L377228
5152A43120238J924191j543952m275825l320398L197285M962618L029767P57671
5144A47851595l006889n21057J041848L772921J155906l577003k481141R86571
5136A45222751L96997n27469L854541K610626p99903L57436J88993j410372l538002
$$ plain form
5127 146355598 146718550 147931251 150069326 151799122 152575103 155413382 157539744 155138934
5119 155138934 152515734 151642357 152596825 152708496 153915225 153603333 149575189 146656558 142767497
5110 142767497 142131788 144220409 145355541 144348858 143713008 142802189 142487413 145289883 145146329
5101 145146329 141088352 135725474 135071218 139144834 141917659 143732894 141655521 141594501
5093 141594501 144974565 142679058 143240386 145599782 142632734 137481092 134891825 135582621
5085 135582621 138834212 142786303 145657361 148108463 150557498 151045503 146373043 140616156
5077 140616156 137247605 135452525 136806868 141375602 143495496 144139931 144146067 144672436 146508556
5068 146508556 146084298 144110880 141734960 141540190 144882438 147578206 151215445 153223395
$$ packed form
5127A46355598L62952J212701K138075J729796P75981K838279K126362k400810
5119A55138934k623200q73377R54468J11671J206729l11892m028144k918631l889061
5110A42767497o35709K088621J135132j006683o35850r10819l14776K802470j43554
5101A45146329m057977n362878o54256M073616K772825J815235k077373o1020
5093A41594501L380064k295507N61328K359396k967048n151642k589267O90796
5085A35582621L251591L952091K871058K451102K449035M88005m672460n756887
5077A40616156l368551j795080J354343M568734K119894O44435O136N26369J836120
5068A46508556m24258j973418k375920j94770L342248K695768L637239K007950
$$ plain form
5060 153223395 149211157 148001442 146344210 144410505 145433526 148502485 151251495 148629236
5052 148629236 145736711 146956622 149334220 152986112 154336056 154716638 155416755 155535371
5044 155535371 154141110 151834375 147640480 142444994 142661528 145710908 145554883 141761770
5036 141761770 140240072 140643452 142350738 142252739 140604715 137719911 138179727 139716550 140230921
5027 140230921 142541010 148287048 151422682 151076416 154663535 156948993 158181093 155216360
5019 155216360 152890860 152865329 149497189 145993787 145417059 149109354 148391856 142781220 139360263
5010 139360263 139427696 139661978 137618782 138045861 139282284 139014575 139148767 140631155 144825033
5001 144825033 143457448 141361979 141736665 142360200 144219200 145515567 147310184 148093363
$$ packed form
5060A53223395m012238j209715j657232j933705J023021L068959K749010k622259
5052A48629236k892525J219911K377598L651892J349944L80582P00117J18616
5044A55535371j394261k306735m193895n195486K16534L049380j56025l793113
5036A41761770j521698M03380J707286r7999j648024k884804M59816J536823N14371
5027A40230921K310089N746038L135634l46266L587119K285458J232100k964733
5019A55216360k325500k5531l368140l503402n76728L692295p17498n610636l420957
5010A39360263O7433K34282k043196M27079J236423k67709J34192J482388M193878
5001A44825033j367585k095469L74686O23535J859000J296367J794617P83179
$$ plain form
4993 148093363 147925582 148424864 150490553 150180533 147405772 143798236 140391836 137203904
4985 137203904 133735336 135383530 137710125 143884742 150156908 148061788 146156972 148256222
4977 148256222 155351389 158307536 155550756 153645865 150713016 147140264 144319797 142984458
4969 142984458 145626512 146855887 146933968 145149362 139807845 135542626 137868645 138321776
4961 138321776 137900580 141052044 143322752 145709335 147743601 147474287 146436199 147640759
4953 147640759 145971491 142872766 144462975 145348644 141557768 140197807 144635186 148338141
4945 148338141 146618418 142961519 142581071 143948297 140436417 136838289 135957990 137405559
4937 137405559 136246174 136421719 137792391 138424333 138602939 139563837 140021225 142522651 144731031
$$ packed form
4993A48093363j67781M99282K065689l10020k774761l607536l406400l187932
4985A37203904l468568J648194K326595O174617O272166k095120j904816K099250
4977A48256222P095167K956147k756780j904891k932849l572752k820467j335339
4969A42984458K642054J229375P8081j784606n341517m265219K326019M53131
4961A38321776m21196L151464K270708K386583K034266k69314j038088J204560
4953A47640759j669268l098725J590209Q85669l790876j359961M437379L702955
4945A48338141j719723l656899l80448J367226l511880l598128q80299J447569
4937A37405559j159385J75545J370672O31942J78606R60898M57388K501426K208380
$$ plain form
4928 144731031 145157263 147201094 148938035 146732173 144817369 142397792 143731081 148492113
4920 148492113 152089049 154176844 152905480 149935185 146932389 144652329 144057387 145403753
4912 145403753 147616082 147474398 147393269 151082856 155098648 153236005 148979029 146336222
4904 146336222 141576682 136943978 133857491 132658381 134925288 138412848 138312263 137034149
4896 137034149 137497673 142098186 146642825 147994154 147537360 144978447 141212499 143367336
4888 143367336 150586052 153858907 150002631 145516132 145267380 144231914 144145489 146533716
4880 146533716 149955010 155582294 158803448 153587566 149173954 153143929 158835976 161492721
4872 161492721 160596338 156792754 154356468 151603446 151056275 154030392 154016233 153161845 150103759
$$ packed form
4928A44731031M26232K043831J736941k205862j914804k419577J333289M761032
4920A48492113L596936K087795j271364k970295l002796k280060n94942J346366
4912A45403753K212329j41684q1129L689587M015792j862643m256976k642807
4904A46336222m759540m632704l086487j199110K266907L487560j00585j278114
4896A37034149M63524M600513M544639J351329m56794k558913l765948K154837
4888A43367336P218716L272855l856276m486499k48752j035466q6425K388227
4880A46533716L421294N627284L221154n215882m413612L969975N692047K656745
4872A61492721q96383l803584k436286k753022n47171K974117j4159q54388l058086
$$ plain form
4863 150103759 146542239 144658153 145790004 148045083 149585735 149615606 151358197 151265331 150389328
4854 150389328 152402787 152509901 152441882 152050707 152853153 153224163 151475089 151107101 151176600
4845 151176600 150104017 146284729 144254558 144311205 146412108 150480005 152803995 153033899
4837 153033899 150471031 149753344 148355219 147069774 145560877 144599816 145713317 148019538
4829 148019538 149276487 150088454 152230084 152854184 150272616 148130118 148359275 148178951 145833236
4820 145833236 146269204 145959543 144971812 144501158 146131016 147360307 150477861 155406624 151941614
4811 151941614 146678145 140897177 138785059 139740433 139811075 139051623 138213662 138956429 143743105
4802 143743105 150618016 152484119 150644483 150384422 153310725 153909542 152658472 151614917
$$ packed form
4863A50103759l561520j884086J131851K255079J540652K9871J742591r2866q76003
4854A50389328K013459J07114o8019l91175Q02446L71010j749074l67988O9499
4845A51176600j072583l819288k030171N6647K100903M067897K323990K29904
4837A53033899k562868p17687j398125j285445j508897r61061J113501K306221
4829A48019538J256949Q11967K141630O24100k581568k142498K29157j80324k345715
4820A45833236M35968l09661r87731m70654J629858J229291L117554M928763l465010
4811A51941614n263469n780968k112118R55374P0642p59452q37961P42767M786676
4802A43743105O874911J866103j839636k60061K926303N98817j251070j043555
$$ plain form
4794 151614917 150073463 150138750 149070865 148026463 151820595 153857259 149587421 144870492
4786 144870492 144065763 145502624 147157719 147645192 147269849 147585832 148800966 151524861 152581424
4777 152581424 151144027 150293852 153594199 156935746 158339806 155693381 152214690 151166880
4769 151166880 149581426 147468330 148084833 151465574 152632423 154209121 153243309 149557825
4761 149557825 149464224 152222206 154772025 156984203 156147495 152642216 149612879 149602343 151058046
4752 151058046 150964329 152240096 153460687 153511311 154198397 154308651 153823247 154467866 155417394
4743 155417394 155031717 154845767 154123878 154653278 155378385 154279807 153647428 152983106 152089187
4734 152089187 154301290 160225804 160790406 159499381 160458017 160282099 160083556 157166706 153964725
$$ packed form
4794A51614917j541454O5287j067885j044402L794132K036664m269838m716929
4786A44870492q04729J436861J655095M87473l75343L15983J215134K723895J056563
4777A52581424j437397q50175L300347L341547J404060k646425l478691j047810
4769A51166880j585454k113096O16503L380741J166849J576698r65812l685484
4761A49557825r3601K757982K549819K212178q36708l505279l029337j0536J455703
4752A51058046r3717J275767J220591N0624O87086J10254m85404O44619R49528
4743A55417394l85677j85950p21889N29400P25107j098578o32379o64322q93919
4734A52089187K212103N924514N64602j291025R58636j75918j98543k916850l201981
$$ plain form
4725 153964725 154517135 153484439 153707680 150971063 149141144 151308910 154308655 159324503
4717 159324503 164143194 166970696 165019438 159624579 155306297 152874433 151943412 153200115
4709 153200115 152689107 151744339 150832452 149114312 147720612 144902904 146656557 149529127
4701 149529127 145429963 138874319 137887534 140285515 144168573 144899741 141993371 140378919
4693 140378919 144463001 147888850 148356948 149577858 151718888 151538124 152985267 153796875
4685 153796875 154608433 157999740 157023261 155037112 154600539 157356560 158858614 157152971
4677 157152971 156758150 157195989 154105658 150495388 148826653 148196197 148959799 151192604 153122845
4668 153122845 151561501 148632596 149969751 151223854 152388141 153034067 153079056 152085696 151593605
$$ packed form
4725A53964725N52410j032696K23241k736617j829919K167766K999745N015848
4717A59324503M818691K827502j951258n394859m318282k431864r31021J256703
4709A53200115n11008r44768r11887j718140j393700k817708J753653K872570
4701A49529127m099164o555644r86785K397981L883058P31168k906370j614452
4693A40378919M084082L425849M68098J220910K141030j80764J447143Q11608
4685A53796875Q11558L391307r76479j986149m36573K756021J502054j705643
4677A57152971l94821M37839l090331l610270j668735o30456P63602K232805J930241
4668A53122845j561344k928905J337155J254103J164287O45926M4989r93360m92091
$$ plain form
4659 151593605 151866320 152720886 153273214 154697533 155543125 156954417 155698610 150269860 147676625
4650 147676625 148704653 154609217 159151073 159752234 159240789 158069797 158098243 157020210 153310516
4641 153310516 152310865 152125534 152769919 153463685 150550900 147087492 146464683 147824457 148398854
4632 148398854 147188880 147706749 150391212 149269244 149536645 149345475 149555274 153075543 157922873
4623 157922873 156833505 153541641 153680088 156241729 157854506 156422833 155942667 155116579
4615 155116579 153831856 153047347 152978234 152947395 152392323 153170171 154957178 156629102 155972727
4606 155972727 156005606 156066446 161162600 165299032 163691263 161885486 162484160 162907402 161103028
4597 161103028 158248741 155327841 153333204 153058608 153442877 152461547 152459688 151459533 149671494
$$ packed form
4659A51593605K72715Q54566N52328J424319Q45592J411292j255807n428750k593235
4650A47676625J028028N904564M541856O01161n11445j170992K8446j078033l709694
4641A53310516r99651j85331O44385O93766k912785l463408o22809J359774N74397
4632A48398854j209974N17869K684463j121968K67401j91170K09799L520269M847330
4623A57922873j089368l291864J38447K561641J612777j431673m80166q26088
4615A55116579j284723p84509o9113l0839n55072P77848J787007J671924o56375
4606A55972727L2879O0840N096154M136432j607769j805777N98674M23242j804374
4597A61103028k854287k920900j994637k74596L84269r81330j859j000155j788039
$$ plain form
4588 149671494 149499364 149251235 147080556 150816207 159319198 163352082 161305152 160519414
4580 160519414 160022282 156679182 153313911 152121646 147840199 146146931 146467704 149083875
4572 149083875 154725828 155343962 153572947 153585969 156163510 157890367 158409201 159688716 159054089
4563 159054089 159673247 157426358 153871421 155376220 156458341 155396602 157431083 156703678
4555 156703678 155758626 158747237 163776531 163801821 163852141 162706760 160698034 161387820 163751008
4546 163751008 164695803 165883879 165655569 166068158 164925128 163041027 165502210 166686281
4538 166686281 164137333 165577686 166528242 165571509 165559822 163854853 163891896 163744174 162812514
4529 162812514 163735742 164258427 162029561 164506868 171732915 172625459 165726378 157691137
$$ packed form
4588A49671494j72130k48129k170679L735651Q502991M032884k046930p85738
4580A60519414m97132l343100l365271j192265m281447j693268L20773K616171
4572A49083875N641953O18134j771015J3022K577541J726857N18834J279515o34627
4563A59054089O19158k246889l554937J504799J082121j061739K034481p27405
4555A56703678r45052K988611N029294K5290N0320j145381k008726O89786K363188
4546A63751008R44795J188076k28310M12589j143030j884101K461183J184071
4538A66686281k548948J440353R50556r56733j1687j704969L7043j47722r31660
4529A62812514R23228N22685k228866K477307P226047Q92544o899081q035241
$$ plain form
4521 157691137 157584073 161886217 165116737 168922088 169727497 168359188 165753564 166506349
4513 166506349 167351085 168333338 167936231 165239850 162826460 165839079 170335717 170530254 168245287
4504 168245287 167321350 168232065 169320887 167342669 163934901 164487533 168278130 170487581
4496 170487581 169485068 169291868 169898199 172289600 173647198 174692901 176991054 177528580
4488 177528580 178159127 181328764 186546853 188299761 186598923 185643374 184079160 180520839
4480 180520839 180279325 182485638 186482405 193800436 199683901 198759707 196923429 198138973
4472 198138973 201538479 205124068 208930663 208788975 208147102 212029920 215551294 219067497
4464 219067497 222345025 226389407 234379901 240393237 242573657 245724974 252292687 260574072
$$ packed form
4521A57691137j07064M302144L230520L805351Q05409j368309k605624P52785
4513A66506349Q44736R82253l97107k696381k413390L012619M496638J94537k284967
4504A68245287r23937R10715J088822j978218l407768N52632L790597K209451
4496A70487581j002513j93200O06331K391401J357598J045703K298153N37526
4488A77528580O30547L169637N218089J752908j700838r55549j564214l558321
4480A80520839k41514K206313L996767P318031N883465r24194j836278J215544
4472A98138973L399506L585589L806595j41688o41873L882818L521374L516203
4464B19067497L277528M044382P990494O013336K180420L151317O567713Q281385
$$ plain form
4456 260574072 272751344 290126673 303388002 312475367 327656346 344652744 363636216
4449 363636216 379717615 384451533 361383889 271788965 112606481 -31336881 -94744265
4442 -94744265 -102959208 -89439009 -71268515 -53906003 -39639928 -25871122 -11288504
4435 -11288504 2320910 15015975 26022789 35361795 47673174 59009658 65930044
4428 65930044 67076093 66487327 69036429 70874370 71325412 73149660 78768139 84258226
4420 84258226 86536980 88570019 90808145 93005072 95007540 94263858 95692137 99947404
4412 99947404 100637525 100079167 104751545 108181715 105801361 104359005 107523998 110396964
4404 110396964 110863024 109466895 109375435 113972384 117242724 116570853 118039875 118637230 116447669
$$ packed form
4456B60574072J2177272J7375329J3261329R087365J5180979J6996398J8983472
4449C63636216J6081399M733918k3067644q9594924j59182484j43943362o3407384
4442i4744265q214943J3520199J8170494J7362512J4266075J3768806J4582618
4435a1288504J3609414J2695065J1006814R339006J2311379J1336484O920386
4428F5930044J146049n88766K549102J837941M51042J824248N618479N490087
4420H4258226K278754K033039K238126K196927K002468p43682J428279M255267
4412I9947404O90121n58358M672378L430170k380354j442356L164993K872966
4404A10396964M66060j396129r1460M596949L270340o71871J469022N97355k189561
$$ plain form
4395 116447669 112598392 111521727 108978957 110840097 115362041 116762738 116652370 117150180
4387 117150180 119799087 122477471 124184757 127086490 127937736 125415415 122050254 123174405
4379 123174405 123917530 122559692 125445658 125431038 122294982 121047731 120624180 119789668 123162613
4370 123162613 128468896 129869824 127906184 128974936 130843162 129475995 126789390 126058236
4362 126058236 126989137 128883908 130980839 131903338 131044301 128375153 128506523 129390556 127828770
4353 127828770 129044390 132106714 132385301 131420987 129822238 128777819 129178673 127722117
4345 127722117 123189789 123243295 123988371 123830210 125939071 128630744 133467437 135633183 134494401
4336 134494401 135603852 133360803 130543804 131031677 129111965 128252458 128844342 130254358
$$ packed form
4395A16447669l849277j076665k542770J861140M521944J400697j10368M97810
4387A17150180K648907K678384J707286K901733Q51246k522321l365161J124151
4379A23174405P43125j357838K885966j4620l136056j247251m23551q34512L372945
4370A23162613N306283J400928j963640J068752J868226j367167k686605p31154
4362A26058236R30901J894771K096931R22499q59037k669148J31370Q84033j561786
4353A27828770J215620L062324K78587r64314j598749j044419M00854j456556
4345A27722117m532328N3506P45076j58161K108861K691673M836693K165746j138782
4336A34494401J109451k243049k816999M87873j919712q59507N91884J410016
$$ plain form
4328 130254358 134579506 137133436 137426190 133585156 129141882 126557585 125879582 125940870 127133668
4319 127133668 130195791 132746589 133287425 135762398 138154505 137985997 139169964 141758441
4311 141758441 144873814 145544512 142487096 140498597 141915734 144081293 144417090 139216703
4303 139216703 135206332 135081229 134463367 132658403 131283330 130429210 132115505 133725896
4295 133725896 132074389 131176107 131519895 131741597 132882625 132907514 132970529 135482822 137601951
4286 137601951 138328455 140896872 142454626 140443341 134659914 129883194 128331034 129723712
4278 129723712 130744293 132600378 132192876 132023776 132246663 132300947 132596028 134477595 134226564
4269 134226564 134432477 139836861 144623747 147556258 145563586 140070469 135601749 135293014
$$ packed form
4328A30254358M325148K553930K92754l841034m443274k584297o78003O1288J192798
4319A27133668L062123K550798N40836K474973K392107j68508J183967K588477
4311A41758441L115373O70698l057416j988499J417137K165559L35797n200387
4303A39216703m010371j25103o17862j804964j375073q54120J686295J610391
4295A33725896j651507q98282L43788K21702J141028K4889O3015K512293K119129
4286A37601951P26504K568417J557754k011285n783427m776720j552160J392678
4278A29723712J020581J856085m07502j69100K22887N4284K95081J881567k51031
4269A34226564K05913N404384M786886K932511j992672n493117m468720l08735
$$ plain form
4261 135293014 136621358 135791347 136520189 136927643 136405313 135120423 137238685 140218137 138692843
4252 138692843 136994720 137871091 138646013 137199395 137419294 140163700 144724097 144998231 141965606
4243 141965606 141940080 144182919 147512494 149607600 150282542 148384825 146535758 148012276
4235 148012276 148653743 146199738 141486420 137968394 137298848 138603217 139795498 137018502
4227 137018502 135516007 140306631 145983816 144607450 137285745 133697272 135256782 137362803
4219 137362803 136468737 134505224 137780862 141063397 141866711 139175693 136950372 137490150
4211 137490150 138262226 136720721 137659696 138215808 136116070 134172337 133914842 134885857 135005763
4202 135005763 133635129 135360247 138155716 140185419 141349756 141096269 140021737 137194750
$$ packed form
4261A35293014J328344q30011P28842M07454n22330j284890K118262K979452j525294
4252A38692843j698123Q76371P74922j446618K19899K744406M560397K74134l032625
4243A41965606k5526K242839L329575K095106O74942j897717j849067J476518
4235A48012276O41467k454005m713318l518026o69546J304369J192281k776996
4227A37018502j502495M790624N677185j376366p321705l588473J559510K106021
4219A37362803q94066j963513L275638L282535Q03314k691018k225321N39778
4211A37490150P72076j541505R38975N56112k099738j943733k57495R71015J19906
4202A35005763j370634J725118K795469K029703J164337k53487j074532k826987
$$ plain form
4194 137194750 134764932 135726797 137113934 137809771 138640075 138585597 139231852 140808483 142263190
4185 142263190 140013781 137049997 135650036 138238622 141028539 139946017 139684812 140861949
4177 140861949 143385989 144697614 146411689 144418131 141805470 143942682 145653304 146029153
4169 146029153 149097520 149575911 145448739 139966220 137938438 137655539 135230203 134728181
4161 134728181 135903269 138647043 142125821 142388138 141325744 137521891 134826527 135706312
4153 135706312 135658615 133395261 134798878 137449962 140008213 138878793 135694020 131487762
4145 131487762 126952141 128072476 130751909 132103228 132845304 135430446 136413600 134406111
4137 134406111 134019850 136129554 137515194 138874291 140487798 142527064 140383933 137601633
$$ packed form
4194A37194750k429818R61865J387137O95837Q30304n4478O46255J576631J454707
4185A42263190k249409k963784j399961K588586K789917j082522k61205J177137
4177A40861949K524040J311625J714075j993558k612661K137212J710622L75849
4169A46029153L068367M78391m127172n482519k027782k82899k425336n02022
4161A34728181J175088K743774L478778K62317j062394l803853k695364Q79785
4153A35706312m7697k263354J403617K651084K558251j129420l184773m206258
4145A31487762m535621J120335K679433J351319P42076K585142R83154k007489
4137A34406111l86261K109704J385640J359097J613507K039266k143131k782300
$$ plain form
4129 137601633 137186617 136136979 135945869 139168410 141581961 144428319 146716545 147647271
4121 147647271 147546686 145804403 143601875 141604936 138085614 138435547 138804976 136654567
4113 136654567 136910770 138135837 141814065 145277826 148146959 149315746 147167611 144834257
4105 144834257 142271019 141205544 141310871 140246458 138094437 139791376 143609533 147862977
4097 147862977 150073651 149454324 147653824 147930869 149068819 148024494 146887353 150559759
4089 150559759 151573272 150678557 147327392 142455905 138783422 140122458 141982431 143027553
4081 143027553 144144246 144566053 141456257 137761712 137348248 136860168 134559663 132133971
4073 132133971 134303749 138214911 139267770 140919448 143043944 144363775 143744479 141392911
$$ packed form
4129A37601633m15016j049638j91110L222541K413551K846358K288226R30726
4121A47647271j00585j742283k202528j996939l519322L49933L69429k150409
4113A36654567K56203J225067L678228L463761K869133J168787k148135k333354
4105A44834257k563238j065475J05327j064413k152021J696939L818157M253444
4097A47862977K210674o19327j800500K77045J137950j044325j137141L672406
4089A50559759J013513q94715l351165m871487l672483J339036J859973J045122
4081A43027553J116693M21807l109796l694545m13464m88080k300505k425692
4073A32133971K169778L911162J052859J651678K124496J319831o19296k351568
$$ plain form
4065 141392911 142012321 143632050 141565134 141107813 144141486 143575418 142369467 143858065
4057 143858065 145292563 149050092 152520165 152631664 152986295 153190466 149533359 145488764
4049 145488764 144422355 144452892 144013712 143751945 144724497 144083668 142980165 142569929 145688816
4040 145688816 150682319 149574964 148118922 149067362 150149425 149839969 147781219 144379816
4032 144379816 143796569 143490893 141906385 143840212 146509443 143027995 137693562 138790400
4024 138790400 141833733 139757709 138820308 137864923 138643537 140041027 139128207 136246223 131581127
4015 131581127 128822110 131943023 133088963 132027719 134703126 138423247 142890438 144772067
4007 144772067 145704216 149346100 156091366 157904612 153223391 147969330 145675091 145572072
$$ packed form
4065A41392911O19410J619729k066916m57321L033673n66068j205951J488598
4057A43858065J434498L757529L470073J11499L54631K04171l657107m044595
4049A45488764j066409L0537m39180k61767R72552o40829j103503m10236L118887
4040A45688816M993503j107355j456042R48440J082063l09456k058750l401403
4032A44379816n83247l05676j584508J933827K669231l481448n334433J096838
4024A38790400L043333k076024r37401r55385P78614J397490r12820k881984m665096
4015A31581127k759017L120913J145940j061244K675407L720121M467191J881629
4007A44772067R32149L641884O745266J813246m681221n254061k294239j03019
$$ plain form
3999 145572072 142516724 139084899 141983021 148648820 150582502 150644949 149810874 147624444
3991 147624444 147599750 144102282 139293629 139068723 139212336 139922442 140470648 139048018 137978191
3982 137978191 138639521 140818645 140674704 137743665 136828723 136869627 136428536 138002936 142546077
3973 142546077 147249119 145763904 143283401 139684961 137113751 137578062 138699867 141475478
3965 141475478 146978662 148505186 151404272 154667761 154721659 153424596 154963985 153759182
3957 153759182 148064387 143171122 141072232 140528614 142652114 144357178 147050325 147193590
3949 147193590 145090287 147127315 149238208 148556004 148478477 150841938 150265870 148398645 147785304
3940 147785304 147828245 149063173 147548702 143551996 143174582 145557329 145049557 144485007 144079519
$$ packed form
3999A45572072l055348l431825K898122O665799J933682O2447q34075k186430
3991A47624444k4694l497468m808653k24906J43613P10106N48206j422630j069827
3982A37978191O61330K179124j43941k931039r14942M0904m41091J574400M543141
3973A42546077M703042j485215k480503l598440k571210M64311J121805K775611
3965A41475478N503184J526524K899086L263489N3898j297063J539389j204803
3957A53759182n694795m893265k098890n43618K123500J705064K693147J43265
3949A47193590k103303K037028K110893o82204p7527K363461n76068j867225o13341
3940A47785304M2941J234928j514471l996706l77414K382747n07772n64550m05488
$$ plain form
3931 144079519 142379019 139563549 139546182 141583906 144341996 146579246 147830125 149106813
3923 149106813 148786426 148628079 151964681 156392832 154551985 154435111 153195798 151320460
3915 151320460 151558526 151643826 149584307 148447882 148013219 143130566 138312031 136142168 137079392
3906 137079392 140010472 143297037 145221028 147750050 150647209 147239291 143091574 143285208
3898 143285208 142338755 142168874 143699392 144903221 144954054 148937343 151012836 150366444 153604029
3889 153604029 153388320 150548137 146442343 143409398 145498981 150766950 150998616 147478360
3881 147478360 146018171 145899440 147091363 147988762 146524875 143798709 142061445 140200534
3873 140200534 141240184 143019929 143193733 141583578 144905595 148756124 149815532 148831997
$$ packed form
3931A44079519j700500k815470j7367K037724K758090K237250J250879J276688
3923A49106813l20387j58347L336602M428151j840847j16874j239313j875338
3915A51320460K38066Q5300k059519j136425m34663m882653m818535k169863R37224
3906A37079392K931080L286565J923991K529022K897159l407918m147717J93634
3898A43285208r46453j69881J530518J203829N0833L983289K075493o46392L237585
3889A53604029k15709k840183m105794l032945K089583N267969K31666l520256
3881A47478360j460189j18731J191923Q97399j463887k726166j737264j860911
3873A40200534J039650J779745J73804j610155L322017L850529J059408r83535
$$ plain form
3865 148831997 149622782 150914716 150327032 152155277 155304015 158056170 159592621 156516446
3857 156516446 153341469 151267197 149807866 148442569 150204372 151066234 151574192 152851574
3849 152851574 149488830 143991825 141928952 145445050 148379172 149220666 147635396 143766599
3841 143766599 143814642 146650224 147015521 145518295 145801874 146803001 148103875 153144050 155923048
3832 155923048 154392368 150595829 148782584 146760432 142517036 139424564 140515494 143847382
3824 143847382 143749452 141736320 140270818 143087993 145583885 145960232 147856694 149690286
3816 149690286 150035007 148504282 147950668 148748677 148481700 143807525 141387758 141809642 143111826
3807 143111826 143611679 142957985 141418687 141245827 143723013 142494143 141444896 142300042 142989749
$$ packed form
3865A48831997P90785J291934n87684J828245L148738K752155J536451l076175
3857A56516446l174977k074272j459331j365297J761803Q61862N07958J277382
3849A52851574l362744n497005k062873L516098K934122Q41494j585270l868797
3841A43766599M8043K835582L65297j497226K83579J001127J300874N040175K778998
3832A55923048j530680l796539j813245k022152m243396l092472J090930L331888
3824A43847382r7930k013132j465502K817175K495892L76347J896462J833592
3816A49690286L44721j530725n53614P98009k66977m674175k419767M21884J302184
3807A43111826M99853o53694j539298j72860K477186j228870j049247Q55146O89707
$$ plain form
3798 142989749 142147315 142319410 143661544 141985212 140033156 140054521 142048879 144243740 144490844
3789 144490844 142426252 144870622 150658184 153769274 153712456 153310509 152676036 152325038 154031846
3780 154031846 154332768 153492729 149730956 146834438 144749147 145062919 146079848 147150641
3772 147150641 149957607 150322802 153127102 156167689 157515255 156284212 155725012 155934974
3764 155934974 153246638 151277971 149803163 146924336 144825650 143603453 141592035 142081881
3756 142081881 145252670 145683888 143631858 141329254 139691553 138847750 141695089 142823978
3748 142823978 143063182 142971959 143122515 145043572 146956899 147716935 145106931 142402439 142780693
3739 142780693 143672842 143608485 146113023 147447746 146036913 145024314 142198326 136740619
$$ packed form
3798A42989749q42434J72095J342134j676332j952056K1365J994358K194861K47104
3789A44490844k064592K444370N787562L111090n6818m01947o34473l50998J706808
3780A54031846L00922q40039l761773k896518k085291L13772J016929J070793
3772A47150641K806966L65195K804300L040587J347566j231043n59200K09962
3764A55934974k688336j968667j474808k878827k098686j222197k011418M89846
3756A42081881L170789M31218k052030k302604j637701q43803K847339J128889
3748A42823978K39204r1223J50556J921057J913327P60036k610004k704492L78254
3739A42780693Q92149o4357K504538J334723j410833j012599k825988n457707
$$ plain form
3731 136740619 131906529 129875980 131449386 136344728 142093060 149986484 156564613 157025292
3723 157025292 154227810 146150740 142409278 145553538 147887848 146712143 144688558 141001773
3715 141001773 137688041 137910127 137765647 136281815 136404516 140241136 143842842 143855657 144203926
3706 144203926 143612788 146126853 150329393 151041369 151372948 148551930 145047847 142692835
3698 142692835 139805825 137396020 138687455 139938342 141180766 140108340 137067191 138352087
3690 138352087 144638193 147461732 145627380 143653929 145499982 148355301 152551907 152577359
3682 152577359 148423358 144220846 140702961 137899018 135483572 134002255 137657978 144353495
3674 144353495 147321670 145362853 142325867 140586319 141212202 145592216 146396999 143324269
$$ packed form
3731A36740619m834090k030549J573406M895342N748332P893424O578129M60679
3723A57025292k797482q077070l741462L144260K334310j175705k023585l686785
3715A41001773l313732K22086j44480j483832J22701L836620L601706J2815L48269
3706A44203926n91138K514065M202540P11976L31579k821018l504083k355012
3698A42692835k887010k409805J291435J250887J242424j072426l041149J284896
3690A38352087O286106K823539j834352j973451J846053K855319M196606K5452
3682A52577359m154001m202512l517885k803943k415446j481317L655723O695517
3674A44353495K968175j958817l036986j739548O25883M380014Q04783l072730
$$ plain form
3666 143324269 142802089 144359154 143355016 141272732 140717586 143810301 144018276 142756863
3658 142756863 143576244 145517531 145591219 144655955 144523962 144211651 142399071 139285227 138569047
3649 138569047 140775040 145695144 150820655 149594447 146021321 145447838 144904007 145444027
3641 145444027 145149456 143688255 144736666 148499206 149769978 148228615 148214015 147954192 150439475
3632 150439475 150689733 148054510 148187445 146401196 143752606 144617945 147969710 149544948
3624 149544948 149917229 149849145 148835034 147150779 148275647 150877925 153683986 153669467 151141462
3615 151141462 147963358 144736727 142454711 144343772 146295204 146955321 147624625 144685706
3607 144685706 141369287 143372701 146160066 146950003 146430361 151748369 157621663 155602848
$$ packed form
3666A43324269n22180J557065j004138k082284n55146L092715K07975j261413
3658A42756863Q19381J941287P3688r35264j31993l12311j812580l113844p16180
3649A38569047K205993M920104N125511j226208l573126n73483n43831N40020
3641A45444027k94571j461201J048411L762540J270772j541363j4600k59823K485283
3632A50439475K50258k635223J32935j786249k648590Q65339L351765J575238
3624A49544948L72281o8084j014111j684255J124868K602278K806061j4519k528005
3615A51141462l178104l226631k282016J889061J951432O60117O69304k938919
3607A44685706l316419K003414K787365P89937n19642N318008N873294k018815
$$ plain form
3599 155602848 149875323 144637195 142200322 141588340 143681090 145926838 147113009 147138278
3591 147138278 149139415 149513316 151250406 152574913 150192364 147762549 146626042 145730741
3583 145730741 147682579 151558361 154263028 152873212 151034724 149900365 149850399 151056529
3575 151056529 150509103 145452616 140690360 138758794 140537707 143956399 144438067 143617335
3567 143617335 142842180 144399261 147747799 149089570 142745424 139881199 143799060 145893606
3559 145893606 146745817 145835902 144959085 145063827 146523887 147377464 147497587 150387733 150553938
3550 150553938 148723274 147626505 147130442 150708853 155455961 155046664 152588710 146506727
3542 146506727 142276254 145297877 148532504 148785786 147958090 146016793 144715414 143758191
$$ packed form
3599A55602848n727525n238128k436873o11982K092750K245748J186171K5269
3591A47138278K001137L73901J737090J324507k382549k429815j136507q95301
3583A45730741J951838L875782K704667j389816j838488j134359m9966J206130
3575A51056529n47426n056487m762256j931566J778913L418692M81668q20732
3567A43617335p75155J557081L348538J341771o344146k864225L917861K094546
3559A45893606Q52211r09915q76817J04742J460060Q53577J20123K890146J66205
3550A50553938j830664j096769m96063L578411M747108m09297k457954o081983
3542A46506727m230473L021623L234627K53282q27696j941297j301379r57223
$$ plain form
3534 143758191 144385875 147816944 149599188 151828122 155101677 157968223 156226049 149039853
3526 149039853 144250713 142617690 142517799 141832668 143269801 144939614 146040641 147284983
3518 147284983 147756376 148291827 147882504 146399446 147931131 151762308 151331072 149242767 148094729
3509 148094729 147731572 148493717 145818681 145863839 148236780 147865782 147295315 151214585 153435523
3500 153435523 152581706 148080475 145004906 147224753 148728457 152138787 152853929 151043039
3492 151043039 150989589 150806445 151980379 150271353 149246445 146533392 144268163 144326706 144355744
3483 144355744 145216242 145546211 146151679 147954758 149091097 147141122 146295832 145568415 146385025
3474 146385025 146204902 145589945 144635347 143467772 143839453 145346903 148361436 150281218 148423491
$$ packed form
3534A43758191O27684L431069J782244K228934L273555K866546j742174p186196
3526A49039853m789140j633023r9891o85131J437133J669813J101027J244342
3518A47284983M71393N35451m09323j483058J531685L831177m31236k088305j148038
3509A48094729l63157P62145k675036M5158K372941l70998n70467L919270K220938
3500A53435523q53817m501231l075569K219847J503704L410330P15142j810890
3492A51043039n3450j83144J173934j709026j024908k713053k265229N8543K9038
3483A44355744Q60498L29969O05468J803079J136339j949975q45290p27417Q16610
3474A46385025j80123o14957r54598j167575L71681J507450L014533J919782j857727
$$ plain form
3465 148423491 146108752 144364146 144240459 142576742 141061576 144232782 147197425 148170812
3457 148170812 146966345 147062030 148438193 149630958 151899485 152943598 150817879 146926452
3449 146926452 146911489 145784851 147361806 150321262 151729375 150992507 151023261 151716843 152345340
3440 152345340 149889724 146903419 147224575 148327289 150703545 149842275 144587298 139491516
3432 139491516 140591422 142891363 145722379 146810532 143677765 143793637 148008142 149253051
3424 149253051 148449073 149589538 147242657 143815480 144297000 146145760 147058420 149192728
3416 149192728 150170818 148934569 146261459 147020726 152216507 154637327 151632629 150611935
3408 150611935 150600519 148280840 149318617 153073376 152748756 149957785 148353669 147351849
$$ packed form
3465A48423491k314739j744606j23687j663717j515166L171206K964643R73387
3457A48170812j204467R5685J376163J192765K268527J044113k125719l891427
3449A46926452j4963j126638J576955K959456J408113p36868L0754O93582O28497
3440A52345340k455616k986305L21156J102714K376256q61270n254977n095782
3432A39491516J099906K299941K831016J088153l132767J15872M214505J244909
3424A49253051q03978J140465k346881l427177M81520J848760R12660K134308
3416A49192728R78090j236249k673110P59267N195781K420820l004698j020694
3408A50611935j1416k319679J037777L754759l24620k790971j604116j001820
$$ plain form
3400 147351849 145362816 142561059 143319789 144726573 142652599 141198108 140321055 139947025
3392 139947025 142271462 146218642 146486116 143620925 139880325 139851035 140306377 140989842 141463225
3383 141463225 140376299 141654390 144399142 145476043 147485748 149133802 148900814 146515287
3375 146515287 146452903 147892734 149309915 148871113 144158542 142645287 143616938 145751922 146234988
3366 146234988 146358020 145210106 144844842 147397436 148865495 145297660 137219657 134464401
3358 134464401 139545110 144911639 148717184 149083733 146675529 146509938 147058175 146823841 147916403
3349 147916403 149620961 148550352 146727497 144878671 144260201 142441773 141037352 143525526
3341 143525526 147328047 149585011 151662225 152453352 151342714 146642608 144330026 143940225
$$ packed form
3400A47351849j989033k801757P58730J406784k073974j454491q77053l74030
3392A39947025K324437L947180K67474k865191l740600k9290M55342O83465M73383
3383A41463225j086926J278091K744752J076901K009705J648054k32988k385527
3375A46515287o2384J439831J417181m38802m712571j513255R71651K134984M83066
3366A46234988J23032j147914l65264K552594J468059l567835q078003k755256
3358A34464401N080709N366529L805545L66549k408204j65591N48237k34334J092562
3349A47916403J704558j070609j822855j848826o18470j818428j404421K488174
3341A43525526L802521K256964K077214P91127j110638m700106k312582l89801
$$ plain form
3333 143940225 147053913 151684400 153192621 152633609 150887261 147851488 143643506 144535119
3325 144535119 153448548 159276498 157590065 155483607 159153730 164889822 161471154 155326175
3317 155326175 152592430 154554325 156330863 152035418 146922827 144650785 144023137 147766087
3309 147766087 149407782 148850101 150010634 151398611 152621828 154625867 155297811 151473950
3301 151473950 147678711 147031168 144699713 144666347 145347112 141905561 140372737 141435587 143316637
3292 143316637 143160445 141224071 140970209 142912572 144931624 144617173 141706371 140745085 141721660
3283 141721660 141625179 142272190 144163059 148764654 150193998 147898465 146344229 144761843
3275 144761843 143415377 141426055 139920237 141176255 145002015 148162773 147181321 147900367
$$ packed form
3333A43940225L113688M630487J508221n59012j746348l035773m207982Q91613
3325A44535119Q913429N827950j686433k106458L670123N736092l418668o144979
3317A55326175k733745J961895J776538m295445n112591k272042o27648L742950
3309A47766087J641695n57681J160533J387977J223217K004039O71944l823861
3301A51473950l795239o47543k331455l3366O80765l441551j532824J062850J881050
3292A43316637j56192j936374k53862J942363K019052l14451k910802r61286R76575
3283A41721660r6481O47011J890869M601595J429344k295533j554236j582386
3275A44761843j346466j989322j505818J256018L825760L160758r81452P19046
$$ plain form
3267 147900367 146524931 141548425 138770299 140597573 143715633 144918975 143336895 143375009
3259 143375009 148192849 149671195 147801177 147008294 150631240 153870530 154024032 153881609
3251 153881609 152577038 152079380 152735364 152320886 151231391 148268946 145254978 142157345
3243 142157345 140683268 140878696 145045693 148040655 148174879 149108987 149974524 151444478 151283694
3234 151283694 153563032 153695227 152029589 151530092 155229694 157561351 156868447 153490875
3226 153490875 152168448 152500732 153006628 151595377 150569413 151793766 151835356 151908655 152370509
3217 152370509 153062849 153770170 151447493 151446993 150807889 150011681 147637479 145938049 142751832
3208 142751832 137351807 136549103 139258824 142023758 142519567 142399265 142357861 141275936 144240650
$$ packed form
3267A47900367j375436m976506k778126J827274L118060J203342j582080L8114
3259A43375009M817840J478346j870018p92883L622946L239290J53502j42423
3251A53881609j304571m97658O55984m14478j089495k962445l013968l097633
3243A42157345j474077J95428M166997K994962J34224R34108Q65537J469954j60784
3234A51283694K279338J32195j665638m99497L699602K331657o92904l377572
3226A53490875j322427L32284N05896j411251j025964J224353M1590P3299M61854
3217A52370509O92340P07321k322677n00o39104p96208k374202j699430l186217
3208A42751832n400025q02704K709721K764934M95809j20302m1404j081925K964714
$$ plain form
3199 144240650 150524956 154941618 157365425 155652167 155651883 156899700 156456183 156625866 155849596
3190 155849596 150902790 146656392 143293175 142155729 143498443 142122048 139002616 137066718
3182 137066718 140648560 146528446 147454896 149998289 154915100 154961067 152483356 149486757
3174 149486757 150819720 156803447 157426325 152248464 148990578 148146391 145328389 140862804
3166 140862804 141795996 146491815 148966039 147514279 144390735 142438201 144274376 147150423
3158 147150423 147076612 146447036 146199563 145817123 145730127 143923565 140997654 141828192 143826340
3149 143826340 144006200 143832594 140073427 138208216 140604242 140665123 141906822 144270571 145058080
3140 145058080 142392375 138870998 138674659 139788287 140033426 142597785 146818816 148201382
$$ packed form
3199A44240650O284306M416662K423807j713258k84J247817m43517J69683p76270
3190A55849596m946806m246398l363217j137446J342714j376395l119432j935898
3182A37066718L581842N879886R26450K543393M916811M5967k477711k996599
3174A49486757J332963N983727O22878n177861l257886q44187k818002m465585
3166A40862804R33192M695819K474224j451760l123544j952534J836175K876047
3158A47150423p3811o29576k47473l82440q6996j806562k925911Q30538J998148
3149A43826340J79860j73606l759167j865211K396026O0881J241699K363749P87509
3140A45058080k665705l521377j96339J113628K45139K564359M221031J382566
$$ plain form
3132 148201382 149489999 153053695 154667614 158081930 159778170 156647520 152154327 149920376
3124 149920376 149833339 152820616 151556855 146394133 144718561 141454919 139702614 140593381
3116 140593381 140438037 141070761 137848053 138305213 141496050 139964217 139068630 142106243 143255215
3107 143255215 143837398 147303734 149581057 149475184 148991208 147328156 143748477 141369272
3099 141369272 144162808 148725287 151945625 153514765 150477179 145976109 144794976 147508724
3091 147508724 147531776 146125128 147248892 148340511 153885798 157425242 159560768 162239513
3083 162239513 161147432 155155992 150696922 150109565 148794499 149145518 150813790 149024374
3075 149024374 144530815 144034923 147665819 149613160 148474533 149184698 150630594 156110897
$$ packed form
3132A48201382J288617L563696J613919L414316J696240l130650m493193k233951
3124A49920376q7037K987277j263761n162722j675572l263642j752305Q90767
3116A40593381j55344O32724l222708M57160L190837j531833q95587L037613J148972
3107A43255215N82183L466336K277323j05873m83976j663052l579679k379205
3099A41369272K793536M562479L220338J569140l037586m501070j181133K713748
3091A47508724K3052j406648J123764J091619N545287L539444K135526K678745
3083A62239513j092081n991440m459070n87357j315066L51019J668272j789416
3075A49024374m493559m95892L630896J947341j138627P10165J445896N480303
$$ plain form
3067 156110897 155586212 154198136 156176763 158031328 158824047 157522103 157397961 157125502 151358839
3058 151358839 146791700 145946758 146536442 149380566 149704563 143635058 139423503 139267809 141289647
3049 141289647 142130563 143721709 147859783 147951546 148102392 150525118 148814044 147926905 151008535
3040 151008535 152505619 149411682 146629688 147132601 148080454 148532425 146560676 143952441
3032 143952441 142880332 143317063 143092943 144597319 147427218 149525371 150858308 149540410
3024 149540410 147229119 145113985 146825992 150703783 152018712 150572616 152226763 154445065
3016 154445065 154101058 151843939 149974133 150762815 153589723 153886448 149936894 150633712 151471563
3007 151471563 151326935 150264394 151135056 152646216 153261087 154491503 154921888 153911388 155139551
$$ packed form
3067A56110897n24685j388076J978627J854565P92719j301944j24142k72459n766663
3058A51358839m567139q44942N89684K844124L23997o069505m211555j55694K021838
3049A41289647Q40916J591146M138074R1763J50846K422726j711074q87139L081630
3040A51008535J497084l093937k781994N02913R47853M51971j971749k608235
3032A43952441j072109M36731k24120J504376K829899K098153J332937j317898
3024A49540410k311291k115134J712007L877791J314929j446096J654147K218302
3016A54445065l44007k257119j869806P88682K826908K96725l949554O96818Q37851
3007A51471563j44628j062541Q70662J511160O14871J230416M30385j010500J228163
$$ plain form
2998 155139551 154739637 152332545 150162179 146505829 140888881 140179826 146408027 150080377
2990 150080377 148138308 146301491 147858487 147262645 146173063 148508125 149873573 152366746
2982 152366746 152747756 151241540 150342779 149426420 149136028 149514957 148600984 145755484 142729762
2973 142729762 143229418 145324970 147479997 148477295 147577722 143770184 138155385 136975556
2965 136975556 140078117 141236937 137889581 135581554 135877177 137079424 139454530 145654887
2957 145654887 151469380 150095291 144973802 141069797 141727405 144979485 147090669 150198622
2949 150198622 150975276 150909648 153023003 153957055 154339378 154225510 153228050 150708223 147595926
2940 147595926 149286399 152176882 154808582 153922062 149599731 148095252 148782632 149662812
$$ packed form
2998A55139551l99914k407092k170366l656350n616948p09055O228201L672350
2990A50080377j942069j836817J556996n95842j089582K335062J365448K493173
2982A52366746L81010j506216q98761r16359k90392L78929r13973k845500l025722
2973A42729762M99656K095552K155027R97298q99573l807538n614799j179829
2965A36975556L102561J158820l347356k308027K95623J202247K375106O200357
2957A45654887N814493j374089n121489l904005O57608L252080K111184L107953
2949A50198622P76654o5628K113355R34052L82323j13868r97460k519827l112297
2940A47595926J690473K890483K631700q86520m322331j504479O87380Q80180
$$ plain form
2932 149662812 151865443 154529428 156190986 158603040 156986082 152374911 152109131 151181261
2924 151181261 148542133 146987277 147910298 152042448 154995011 155994093 155200639 153666576
2916 153666576 148590704 145778079 147768859 149175212 149040248 148117160 144326257 143626903
2908 143626903 145730899 144280525 138188984 133351483 134161589 133429954 134858577 141489955
2900 141489955 146851491 151031966 153177534 154242211 155127082 156989559 160389515 163907648
2892 163907648 163732884 159406891 151642351 147440577 147432273 149743674 151925793 152544026 151928492
2883 151928492 148287855 144688353 145559923 148763872 148469707 148763785 146884312 145285327
2875 145285327 143202210 142607139 142541850 141234249 141692545 143288661 145197558 147156361 148649645
$$ packed form
2932A49662812K202631K663985J661558K412054j616958m611171k65780r27870
2924A51181261k639128j554856R23021M132150K952563R99082p93454j534063
2916A53666576n075872k812625J990780J406353j34964r23088l790903o99354
2908A43626903K103996j450374o091541m837501Q10106p31635J428623O631378
2900A41489955N361536M180475K145568J064677Q84871J862477L399956L518133
2892A63907648j74764m325993p764540m201774q304K311401K182119O18233o15534
2883A51928492l640637l599502Q71570L203949k94165K94078j879473j598985
2875A45285327k083117n95071o5289j307601M58296J596116J908897J958803J493284
$$ plain form
2866 148649645 151858635 155152567 159315435 158919455 157932274 158448123 151086718 145571336
2858 145571336 144634416 145396901 148300508 150548805 152105782 153330728 150985925 147773682
2850 147773682 147948721 147696037 147642175 149034429 151491761 151909072 147932055 144360798 144836067
2841 144836067 147115169 147592640 142851518 137456505 136703070 137418673 143377218 150033837
2833 150033837 151898216 150292188 148755076 147906074 146150759 146023906 147125113 146896237
2825 146896237 144708764 145705669 149884404 152588761 154006083 155904687 157927219 156168661
2817 156168661 153626984 152957523 154044366 155297048 151861065 151132739 156814897 159234848
2809 159234848 159656841 157883306 157187847 157773764 155345918 154487956 152095010 145344171 141725890
$$ packed form
2866A48649645L208990L293932M162868l95980r87181N15849p361405n515382
2858A45571336r36920P62485K903607K248297J556977J224946k344803l212243
2850A47773682J75039k52684n3862J392254K457332M17311l977017l571257M75269
2841A44836067K279102M77471m741122n395013p53435P15603N958545O656619
2833A50033837J864379j606028j537112q49002j755315j26853J101207k28876
2825A46896237k187473R96905M178735K704357J417322J898604K022532j758558
2817A56168661k541677o69461J086843J252682l435983p28326N682158K419951
2809A59234848M21993j773535o95459N85917k427846q57962k392946o750839l618281
$$ plain form
2800 141725890 143040807 144972692 147939366 151249470 154037198 155623383 154952426 157680902
2792 157680902 160019183 158525630 155895358 153781515 150642179 149870844 150533868 150809765
2784 150809765 150864216 152543590 154682100 154317893 153937453 156939611 156532968 158292992 161175439
2775 161175439 160701407 160237701 159096326 159411004 158470854 155245315 152832756 148091784 145819064
2766 145819064 150459512 153804066 152514227 152294483 153703657 154509022 154445354 153545539 156369111
2757 156369111 156242290 153184617 150848843 148288931 145796136 146119592 147048960 147741795 149994518
2748 149994518 152992922 153860844 150105326 144779260 146347076 151964057 154259556 152288112
2740 152288112 148808817 150212826 153532588 155501472 156622708 154647652 152580703 151270156
$$ packed form
2800A41725890J314917J931885K966674L310104K787728J586185o70957K728476
2792A57680902K338281j493553k630272k113843l139336p71335O63024K75897
2784A50809765N4451J679374K138510l64207l80440L002158m06643J760024K882447
2775A61175439m74032m63706j141375L14678r40150l225539k412559m740972k272720
2766A45819064M640448L344554j289839k19744J409174Q05365o3668q99815K823572
2757A56369111j26821l057673k335774k559912k492795L23456R29368O92835K252723
2748A49994518K998404Q67922l755518n326066J567816N616981K295499j971444
2740A52288112l479295J404009L319762J968884J121236j975056k066949j310547
$$ plain form
2732 151270156 151839054 155692039 160953479 160269063 156838991 154846966 154553984 154510801 152847279
2723 152847279 150914429 151912315 152687513 158583486 166938703 167561452 166407571 165607136 162891428
2714 162891428 163149945 163005251 163636136 161632485 158019190 157357210 155923179 152436494 150426605
2705 150426605 150229997 151574880 152594608 151530877 151797170 153891347 151472287 147369555
2697 147369555 148970336 153917069 153868569 150815337 148975989 148799542 151402057 154980119
2689 154980119 154799480 148738432 142681793 142542820 145730350 146917653 145911749 147531284
2681 147531284 150403019 152482800 151796718 148412232 146271063 147135187 150774986 152461956
2673 152461956 150230148 152385510 154672114 154877439 158673141 161108076 158249428 152146064
$$ packed form
2732A51270156N68898L852985N261440o84416l430072j992025k92982m3183j663522
2723A52847279j932850R97886P75198N895973Q355217O22749j153881q00435k715708
2714A62891428K58517j44694O30885k003651l613295o61980j434031l486685k009889
2705A50426605j96608J344883J019728j063731K66293K094177k419060m102732
2697A47369555J600781M946733m8500l053232j839348j76447K602515L578062
2689A54980119j80639o061048o056639j38973L187530J187303j005904J619535
2681A47531284K871735K079781o86082l384486k141169Q64124L639799J686970
2673A52461956k231808K155362K286604K05325L795702K434935k858648o103364
$$ plain form
2665 152146064 150139831 153025848 153957964 150757462 148305569 147142907 146427164 145997258
2657 145997258 146577381 148587001 146331326 145584256 149794851 152231149 149170676 147163423
2649 147163423 150725772 152050686 148665989 146176570 145267528 144243649 145092260 146570319
2641 146570319 147084397 147632287 147467955 148011950 149195989 149512309 149333836 151624895 150269558
2632 150269558 148978697 150364013 152724500 153858389 151560191 151959303 152258696 151839007
2624 151839007 151037847 150229135 150266389 148608421 148869239 152335854 153614296 151687496 151072806
2615 151072806 154670255 152423754 146704248 144476196 144136991 147685590 151433339 151674739
2607 151674739 149371171 147435931 146702491 150789605 152560793 149756880 150259300 153158401
$$ packed form
2665A52146064k006233K886017R32116l200502k451893j162662p15743m29906
2657A45997258N80123K009620k255675p47070M210595K436298l060473k007253
2649A47163423L562349J324914l384697k489419r09042j023879Q48611J478059
2641A46570319N14078N47890j64332N43995J184039L16320j78473K291059j355337
2632A50269558j290861J385316K360487J133889k298198L99112K99393m19689
2624A51839007q01160q08712L7254j657968K60818L466615J278442j926800o14690
2615A51072806L597449k246501n719506k228052l39205L548599L747749K41400
2607A51674739k303568j935240p33440M087114J771188k803913N02420K899101
$$ plain form
2599 153158401 153788303 154334163 151893829 151263989 151118270 147943773 144914446 141745222 141215306
2590 141215306 142243132 145797839 148656943 149286668 148771499 148648861 146396260 146678611 150422459
2581 150422459 153376998 154086819 153281778 146483962 140576732 137828028 140405640 145479713
2573 145479713 150007643 150370516 147684705 144182507 144645015 148001990 151196110 154717272
2565 154717272 157261896 155676679 153071173 152833179 154798738 153665811 151019708 147947520
2557 147947520 145697941 144218328 142449893 145769132 149333953 152136336 153784855 154713538
2549 154713538 153938313 152794811 156098027 157986759 156424078 153720904 153352911 155693027
2541 155693027 159721627 158960431 155327522 151565575 148543316 147933266 149049763 149898647
$$ packed form
2599A53158401O29902N45860k440334o29840j45719l174497l029327l169224n29916
2590A41215306J027826L554707K859104O29725n15169j22638k252601K82351L743848
2581A50422459K954539P09821q05041o797816n907230k748704K577612N074073
2573A45479713M527930L62873k685811l502198M62508L356975L194120L521162
2565A54717272K544624j585217k605506k37994J965559j132927k646103l072188
2557A47947520k249579j479613j768435L319239L564821K802383J648519R28683
2549A54713538p75225j143502L303216J888732j562681k703174l67993K340116
2541A55693027M028600p61196l632909l761947l022259o10050J116497Q48884
$$ plain form
2533 149898647 151697097 150426928 150444755 151097318 150466149 151255612 151536658 153595783 158589963
2524 158589963 160776372 158317172 157617720 158477315 158527159 159141369 161962349 161207658 157301585
2515 157301585 155021077 156477193 156960552 153094028 151021229 150465263 149215113 150088440
2507 150088440 150518997 149554265 151058410 151021812 150560006 155482252 158571378 160830566 165604300
2498 165604300 168428140 169614739 171775411 174598636 178380000 180276198 181043120 180709217
2490 180709217 183671672 187915775 192107331 196707548 196467849 182830922 151882929 125045284
2482 125045284 115118035 116046639 117914434 117425543 120927304 125938258 127033525 128066833
2474 128066833 130468807 134101511 137263942 140597583 143355363 139935119 136545952 136110474
$$ packed form
2533A49898647J798450j270169J7827O52563o31169P89463K81046K059125M994180
2524A58589963K186409k459200o99452Q59595M9844O14210K820980p54691l906073
2515A57301585k280508J456116M83359l866524k072799n55966j250150Q73327
2507A50088440M30557r64732J504145l6598m61806M922246L089126K259188M773734
2498A65604300K823840J186599K160672K823225L781364J896198P66922l33903
2490A80709217K962455M244103M191556M600217k39699j3636927l0947993k6837645
2482A25045284r927249R28604J867795m88891L501761N010954J095267J033308
2474A28066833K401974L632704L162431L333641K757780l420244l389167m35478
$$ plain form
2466 136110474 139180278 143151210 142389345 137732539 136512381 135436691 134562878 138250067
2458 138250067 140143591 141632896 141617867 142041157 143137901 141591022 140391344 142256561
2450 142256561 143008562 141237933 142927988 144528747 144387396 144840317 145033140 144276330 143677321
2441 143677321 144697758 143064214 142697221 142087558 136508280 136103580 138039491 140705535
2433 140705535 145066053 147028815 144985576 142867721 142207484 140431324 141092839 144862105
2425 144862105 147669482 145909403 141786824 141356821 142461166 143220856 143107848 143592582 143357743
2416 143357743 141030749 139409460 140441466 140971894 144957419 149661377 150856209 149581012
2408 149581012 147214165 148753016 151299687 151003861 148807646 145125702 141483996 140199172
$$ packed form
2466A36110474L069804L970932p61865m656806j220158j075690q73813L687189
2458A38250067J893524J489305j5029M23290J096744j546879j199678J865217
2450A42256561P52001j770629J690055J600759j41351M52921J92823p56810n99009
2441A43677321J020437j633544l66993o09663n579278m04700J935911K666044
2433A40705535M360518J962762k043239k117855o60237j776160O61515L769266
2425A44862105K807377j760079m122579m30003J104345P59690j13008M84734k34839
2416A43357743k326994j621289J032006N30428L985525M703958J194832j275197
2408A49581012k366847J538851K546671k95826k196215l681944l641706j284824
$$ plain form
2400 140199172 142141863 142374249 145729646 151364947 152046159 149060825 144527022 143207949
2392 143207949 143875922 146074333 146847955 146177407 149185933 151633489 150967042 150624903 148381021
2383 148381021 148848709 150389103 146683586 145119286 146796879 146938314 148168880 149860235
2375 149860235 153893862 153766571 148285859 148195462 147019299 143571363 142602212 146343425 149614601
2366 149614601 151328660 150492769 148429328 147478673 145905266 143373700 142992919 145832525
2358 145832525 148178451 147945809 146792720 142860015 141603743 143303454 143901796 143865838 141175545
2349 141175545 140711667 145202362 146764003 144926619 141995632 144443368 149003257 150250057
2341 150250057 151238695 154722827 157539743 155425299 153679581 152204755 150759628 150148691
$$ packed form
2400A40199172J942691K32386L355397N635301O81212k985334m533803j319073
2392A43207949O67973K198411P73622o70548L008526K447556o66447l42139k243882
2383A48381021M67688J540394l705517j564300J677593J41435J230566J691355
2375A49860235M033627j27291n480712r0397j176163l447936r69151L741213L271176
2366A49614601J714059q35891k063441r50655j573407k531566l80781K839606
2358A45832525K345926k32642j153089l932705j256272J699711N98342l5958k690293
2349A41175545m63878M490695J561641j837384k930987K447736M559889J246800
2341A50250057R88638L484132K816916k114444j745718j474826j445127o10937
$$ plain form
2333 150148691 149959191 149627011 150730259 152916586 153781053 154626620 155396185 153779989 154156433
2324 154156433 154047687 154175217 154530701 156579961 157362358 157787059 156261870 155239500 153791844
2315 153791844 149930319 148207867 148246840 146584287 144717378 148755502 150838138 147419171
2307 147419171 143838746 142936302 143625795 144907767 145599149 148148468 150536535 151878050
2299 151878050 153072552 153047382 154986865 158265219 159370767 157595173 155367430 153461950
2291 153461950 153614358 153319986 152533029 151131595 149643981 148113763 147025260 147976891 149537406
2282 149537406 151021863 152213170 152320210 151835854 151909866 155022553 156864790 155289789 151536436
2273 151536436 151538286 154572549 156585918 154809140 151850023 148812280 144915780 142983570
$$ packed form
2333A50148691j89500l32180J103248K186327Q64467Q45567P69565j616196L76444
2324A54156433j08746J27530L55484K049260P82397M24701j525189j022370j447656
2315A53791844l861525j722452L8973j662553j866909M038124K082636l418967
2307A47419171l580425r02444O89493J281972O91382K549319K388067J341515
2299A51878050J194502k5170J939483L278354J105548j775594k227743j905480
2291A53461950J52408k94372p86957j401434j487614j530218j088503R51631J560515
2282A49537406J484457J191307J07040m84356P4012L112687J842237j575001l753353
2273A51536436J850L034263K013369j776778k959117l037743l896500j932210
$$ plain form
2265 142983570 141855513 145443364 148075575 147705099 147233750 145461515 143321755 141004152
2257 141004152 136219015 134969711 138278808 142801736 149676609 154818390 156476328 154976632
2249 154976632 154235956 155431911 152827208 149995470 149159600 148505499 147464611 148506858
2241 148506858 149374954 147279954 144229598 139983172 142473314 147594563 150828840 154113411
2233 154113411 156922725 156811798 150700485 145817780 148311371 151873888 150248756 146610796
2225 146610796 144317298 145259686 148354033 150026449 149701614 149426537 151158648 153962517
2217 153962517 153150656 153104000 153941946 157424931 156233598 150825976 152542152 155879856 153956005
2208 153956005 149674191 148526170 148429108 148566981 150306327 152943549 152341132 150857951 151321333
$$ packed form
2265A42983570j128057L587851K632211l70476m71349j772235k139760k317603
2257A41004152m785137j249304L309097M522928O874873N141781J657938j499696
2249A54976632p40676J195955k604703k831738q35870o54101j040888J042247
2241A48506858Q68096k095000l050356m246426K490142N121249L234277L284571
2233A54113411K809314j10927o111313m882705K493591L562517j625132l637960
2225A46610796k293498R42388L094347J672416l24835k75077J732111K803869
2217A53962517q11861m6656Q37946L482985j191333n407622J716176L337704j923851
2208A53956005m281814j148021r7062J37873J739346K637222o02417j483181M63382
$$ plain form
2199 151321333 152246380 151770543 149866707 149396439 149052196 148114983 147181480 146659519 147794175
2190 147794175 151228223 151765891 148698036 146931771 147367109 150268751 151858048 152391691
2182 152391691 148673587 145974699 148253730 154560347 155507990 150069043 147589925 146776685
2174 146776685 146731632 148617212 148448822 149097118 151953933 152398182 149092929 149910335 151095563
2165 151095563 149946098 146954442 143175785 144352625 144800492 144568960 145765567 146199482
2157 146199482 145866017 149453493 149287902 151291872 152061154 153908468 157395198 160569870
2149 160569870 163000788 161514393 156336201 149835222 143387726 142819596 144931913 144643289
2141 144643289 147550540 150915460 149847412 148584080 154079707 157559996 156459524 155379114
$$ packed form
2199A51321333R25047m75837j903836m70268l44243r37213r33503n21961J134656
2190A47794175L434048N37668l067855j766265M35338K901642J589297N33643
2182A52391691l718104k698888K279031O306617R47643n438947k479118q13240
2174A46776685m5053J885580j68390O48296K856815M44249l305253Q17406J185228
2165A51095563j149465k991656l778657J176840M47867k31532J196607M33915
2157A46199482l33465L587476j65591K003970P69282J847314L486730L174672
2149A60569870K430918j486395n178192o500979o447496n68130K112317k88624
2141A44643289K907251L364920j068048j263332N495627L480289j100472j080410
$$ plain form
2133 155379114 153677673 151145266 151225398 151546610 151316675 150494569 149571375 152962008 154626468
2124 154626468 151732398 153481766 156037713 157302924 159117561 158794071 158469009 155626944
2116 155626944 153988834 153394694 151370703 148973186 144490258 143547048 144705451 147122173
$$ packed form
2133A55379114j701441k532407Q0132L21212k29935q22106r23194L390633J664460
2124A54626468k894070J749368K555947J265211J814637l23490l25062k842065
2116A55626944j638110n94140k023991k397517m482928r43210J158403K416722
$$ [...]
##END NTUPLES=NMR SPECTRUM
##END=
