##TITLE=C13_PR168_C
 DMSO-d6, 2600 sc

 15.02.2019
##JCAMPDX= 6.0         $$ Bruker NMR JCAMP-DX V2.0
##DATA TYPE= NMR SPECTRUM
##DATA CLASS= NTUPLES
##ORIGIN= UXNMR, Bruker Analytische Messtechnik GmbH
##OWNER= root
$$ XWIN-NMR		Version 3.5
$$ Fri Feb 15 15:33:06 2019 Russian Standard Time (UT+4h)  she@DPX200
##.OBSERVE FREQUENCY= 50.32789651
##.OBSERVE NUCLEUS= ^13C
##.ACQUISITION MODE= SIMULTANEOUS
##.ACQUISITION SCHEME= undefined
##.AVERAGES= 1302
##.DIGITISER RES= 17
##SPECTROMETER/DATA SYSTEM= spect
##.PULSE SEQUENCE= zgpg30
##.SOLVENT NAME= CDCl3
##.SHIFT REFERENCE= (INTERNAL, CDCl3, 0, 222.661)
##AUDIT TRAIL= $$ (NUMBER, WHEN, WHO, WHERE, WHAT)
$$ ##TITLE= Audit trail, XWIN-NMR		Version 3.5
$$ ##JCAMPDX= 5.01
$$ ##ORIGIN= Bruker BioSpin GmbH
$$ ##OWNER= she
$$ F:/spectra/data/she/nmr/c13/2/pdata/1/auditp.txt
$$ ##AUDIT TRAIL=  $$ (NUMBER, WHEN, WHO, WHERE, WHAT)
(   1,<2019-02-15 15:31:47.75 +0400>,<she>,<DPX200>,
      <created by zg, POWCHK disabled, PULCHK disabled
       terminated by command 'halt'
       configuration hash MD5:
       00 E9 B6 7A A2 85 ED C7 34 08 36 98 17 FE 4E 26
       data hash MD5: 32K
       1A 8B 49 C9 DB E0 78 75 15 FE 0F 1B FA 5B EA F0>)
(   2,<2019-02-15 15:31:50.07 +0400>,<she>,<DPX200>,
      <Start of raw data processing
       efp BC_mod = 2 LB = 1 FT_mod = 6 PKNL = 1 PHC0 = 1439.068 PHC1 = 41.22154 SI = 32K 
       data hash MD5: 32K
       91 3D 54 FF B1 39 C4 F3 E9 AA D7 91 44 4D 98 6E>)
(   3,<2019-02-15 15:31:53.10 +0400>,<she>,<DPX200>,
      <abs ABSG = 5 
       data hash MD5: 32K
       47 E1 77 2A 89 1F B1 F9 38 EF 29 C7 19 FC F0 E2>)
(   4,<2019-02-15 15:32:11.17 +0400>,<she>,<DPX200>,
      <pk PHC0 = 16.46491 PHC1 = -20.2 
       data hash MD5: 32K
       D7 44 2E E1 69 5A DA 90 DE 4E F3 03 6C DF 29 B6>)
(   5,<2019-02-15 15:32:14.62 +0400>,<she>,<DPX200>,
      <abs ABSG = 5 
       data hash MD5: 32K
       60 22 32 B2 F2 C5 33 D4 6E 56 7C 6A 7B D0 D7 E7>)
$$ ##END=
$$ 
$$ hash MD5
$$ 44 A2 A9 F2 15 77 27 00 1C 95 65 24 EC DF F1 72
##$RELAX= 
##$RELAX= 
##$RELAX= 
##$RELAX= 
##$RELAX= 
##$RELAX= 
##$RELAX= 
##$RELAX= 
$$ Bruker specific parameters
$$ --------------------------
##$DU= <F:/spectra>
##$EXPNO= 2
##$NAME= <c13>
##$PROCNO= 1
##$TYPE= <nmr>
##$USER= <she>
##$AMP= (0..31)
100 100 100 100 100 100 100 100 100 100 100 100 100 100 100 100 100 100 
100 100 100 100 100 100 100 100 100 100 100 100 100 100 
##$AQSEQ= 0
##$AQ_mod= 1
##$AUNM= <au_zg>
##$AUTOPOS= <>
##$BF1= 50.322709
##$BF2= 200.13
##$BF3= 50.322709
##$BF4= 500.13
##$BF5= 500.13
##$BF6= 500.13
##$BF7= 500.13
##$BF8= 500.13
##$BYTORDA= 1
##$CFDGTYP= 0
##$CFRGTYP= 5
##$CHEMSTR= <none>
##$CNST= (0..31)
1 1 145 1 1 1 1 1 1 1 1 1 1 1 1 1 1 1 1 1 1 1 1 1 1 1 1 1 1 1 1 1 
##$CPDPRG= <waltz16>
##$CPDPRG1= <>
##$CPDPRG2= <waltz16>
##$CPDPRG3= <>
##$CPDPRG4= <mlev>
##$CPDPRG5= <mlev>
##$CPDPRG6= <mlev>
##$CPDPRG7= <mlev>
##$CPDPRG8= <mlev>
##$CPDPRGB= <>
##$CPDPRGT= <>
##$D= (0..31)
$$ [...]
##$SUBNAM4= <"">
##$SUBNAM5= <"">
##$SUBNAM6= <"">
##$SUBNAM7= <"">
##$SUBNAM8= <"">
##$SUBNAM9= <"">
##$SW= 239.972172959595
##$SWIBOX= (0..15)
0 1 3 0 0 0 0 0 0 0 0 0 0 0 0 0 
##$SW_h= 12077.2946859903
##$TD= 32768
##$TD0= 1
##$TE= 0
##$TE2= 300
##$TE3= 300
##$TEG= 300
##$TL= (0..7)
120 120 120 120 120 120 120 120 
##$TP= (0..7)
150 150 150 150 150 150 150 150 
##$TP07= 0
##$TPNAME0= <>
##$TPNAME1= <>
##$TPNAME2= <>
##$TPNAME3= <>
##$TPNAME4= <>
##$TPNAME5= <>
##$TPNAME6= <>
##$TPNAME7= <>
##$TPOAL= (0..7)
0.5 0.5 0.5 0.5 0.5 0.5 0.5 0.5 
##$TPOFFS= (0..7)
0 0 0 0 0 0 0 0 
##$TUNHIN= 0
##$TUNHOUT= 0
##$TUNXOUT= 0
##$USERA1= <user>
##$USERA2= <user>
##$USERA3= <user>
##$USERA4= <user>
##$USERA5= <user>
##$V9= 5
##$VALIST= <valist>
##$VCLIST= <CCCCCCCCCCCCCCC>
##$VD= 0
##$VDLIST= <DDDDDDDDDDDDDDD>
##$VPLIST= <PPPPPPPPPPPPPPP>
##$VTLIST= <TTTTTTTTTTTTTTT>
##$WBST= 1024
##$WBSW= 4
##$XGAIN= (0..3)
0 0 0 0 
##$XL= 0
##$YL= 0
##$YMAX_a= 7238941
##$YMIN_a= -5872901
##$ZGOPTNS= <>
##$ZL1= 120
##$ZL2= 120
##$ZL3= 120
##$ZL4= 120
##$ABSF1= 222.6608
##$ABSF2= -17.33601
##$ABSG= 5
##$ABSL= 3
##$ALPHA= 0
##$AQORDER= 0
##$ASSFAC= 0
##$ASSFACI= 0
##$ASSFACX= 0
##$ASSWID= 0
##$AUNMP= <proc_1d>
##$AZFE= 0.1
##$AZFW= 0.5
##$BCFW= 0
##$BC_mod= 2
##$BYTORDP= 0
##$COROFFS= 0
##$CY= -3
##$DATMOD= 1
##$DC= 0
##$DFILT= <>
##$DTYPP= 0
##$F1P= 0
##$F2P= 0
##$FCOR= 0.5
##$FTSIZE= 32768
##$FT_mod= 6
##$GAMMA= 0
##$GB= 0
##$INTBC= 1
##$INTSCL= 1.329259e-09
##$ISEN= 128
##$LB= 1
##$LEV0= 0
##$LPBIN= 0
##$MAXI= 10000
##$MC2= 0
##$MEAN= 0
##$ME_mod= 0
##$MI= 0.9312502
##$NCOEF= 0
##$NC_proc= -2
##$NLEV= 6
##$NOISF1= 120.0001
##$NOISF2= 80.00006
##$NSP= 0
##$NTH_PI= 0
##$NZP= 0
##$OFFSET= 222.6608
##$PC= 1.4
##$PHC0= 1455.533
##$PHC1= 21.02154
##$PH_mod= 1
##$PKNL= yes
##$PPARMOD= 0
##$PSCAL= 0
##$PSIGN= 0
##$REVERSE= no
##$SF= 50.3227302600002
##$SI= 32768
##$SIGF1= 140
##$SIGF2= 120
##$SINO= 35.31775
##$SIOLD= 32768
##$SREGLST= <13C.CDCl3>
##$SSB= 0
##$STSI= 32768
##$STSR= 0
##$SW_p= 12077.2946859903
##$SYMM= 0
##$S_DEV= 0
##$TDeff= 32768
##$TDoff= 0
##$TI= <>
##$TILT= no
##$TM1= 0
##$TM2= 0
##$TOPLEV= 0
##$USERP1= <user>
##$USERP2= <user>
##$USERP3= <user>
##$USERP4= <user>
##$USERP5= <user>
##$WDW= 1
##$XDIM= 32768
##$YMAX_p= 519887990
##$YMIN_p= -9063618
$$ End of Bruker specific parameters
$$ ---------------------------------
##NTUPLES= NMR SPECTRUM
##VAR_NAME=  FREQUENCY,     SPECTRUM/REAL,   SPECTRUM/IMAG
##SYMBOL=    X,             R,               I
##VAR_TYPE=  INDEPENDENT,   DEPENDENT,       DEPENDENT
##VAR_FORM=  AFFN,          ASDF,            ASDF
##VAR_DIM=   32768,         32768,           32768
##UNITS=     HZ,            ARBITRARY UNITS, ARBITRARY UNITS
##FACTOR=    0.368581032318806, 1,           1
##FIRST=     11204.8992329031, 0,            0
##LAST=      -872.395453087158, 0,           0
##MIN=       -872.395453087158, -9063618,    0
##MAX=       11204.8992329031, 519887990,    0
$$ Real data points
##PAGE= N=1
##DATA TABLE= (X++(R..R)), XYDATA
$$ [...]
10530b221048O23813L44698k6614l41151J215386K302264K139292o96116k910112
10521D30412k252651j605043k077109j350181J35944k59644O56129K87924k63032
10512f297251J039291J995504N13622Q34482Q30229k98750L6373n14916j132563
10503b993979k783773j029561K50567M72430j25823J720322K240508j98560k108246
10494d556115n58379J14683J225594K716491J431751p79547m87475J088547j385291
10485a189741p44678n16706o45396p96060l90308J164611J732747J481806J645189
10476A741464J130297J759951L82198o08204k126616j335035o67000k281278n95561
10467b599784J488141J296118P00219J856552M98237k062526j691431j730975
$$ y = [-2221048, -1597235, -1252537, -1279151, -1620302, -404916, 1897348, 4036640, 3340524, 430412, -1822239, -3427282, -5504391, -6854572, -6718628, -6978272, -6322143, -6034219, -6297251, -5257960, -3262456, -2748834, -1914352, -1084123, -1382873, -1346500, -1861416, -2993979, -5777752, -6807313, -6556746, -6084316, -6210139, -4489817, -2249309, -2447869, -4556115, -5114494, -4999811, -3774217, -1057726, 374025, -405522, -892997, 195550, -1189741, -1934419, -2451125, -3096521, -3892581, -4282889, -3118278, -1385531, 96275, 1741464, 2871761, 4631712, 5013910, 4405706, 2279090, 944055, 277055, -2004223, -2599784, -1111643, 184475, 884694, 2741246, 3239483, 1176957, -514474, -2245449]
10459b245449p57873J213665K477491J898102j356850j516116M44122J508816
10451A665908J039770j54430j360494j511355L99490n78478n70478m64067l86449
10442a920583N96237N46112R51779Q71414O6063q13304o24795J399923K306748
10433C379594O97555q71840r90129j329948k197297r79777N18132J426079O94023
10424C46392j31266o53705m50837K25897j48946K54554M08832o84680J151865
10415C18106J480376M59278R06974J348136P64873O6554K84233j379286k357235
10406A892009j420308P87878N95397K38900q26405L22081J593074M96238R9351
10397C778215j146047j521831j203212Q0572M90475K59049L46251K02245p98596
$$ y = [-2245449, -3003322, -1789657, 687834, 2585936, 1229086, -287030, 157092, 1665908, 2705678, 2551248, 1190754, -320601, 78889, -499589, -1070067, -1534134, -1920583, -1324346, -778234, 173545, 1044959, 1111022, 297718, -327077, 1072846, 3379594, 4077149, 3205309, 2215180, 885232, -1312065, -2291842, -1773710, -347631, 346392, 215126, -438579, -889416, -663519, -812465, -557911, -149079, -833759, 318106, 1798482, 2257760, 3164734, 4512870, 5277743, 5344297, 5628530, 4249244, 1892009, 471701, 1259579, 1854976, 2093876, 1267471, 1589552, 3182626, 3678864, 3778215, 2632168, 1110337, -92875, -12303, 478172, 737221, 1083472, 1285717, 487121]
10388D87121j052627o41814P03982J549589p42247m90466N36162J465017K050784
10379C865501N18012k064845k558962o71521J223527p7283q89503k22436N95103
10370b82407Q37801J729886J193264o07099j125934p76623N6584l41585o32225
10361E1662k85974l2632R45577P03040k74678j252187m93516K14709m35373p4468
10351i33840P06616N75593m34605j378737r77343j91448l0159M63924Q83455J690988
10341C74444J791875o1162K32691n8823l43428J21831K8962J61188J28569m94131
10331A882016k460058j943752p98920R48369O36112j10771Q885R7926N68429J16623
10321a055141k01146m58672o49619m2821k13529L64363J491145J235696R23866
$$ y = [487121, -565506, -1207320, -503338, 1046251, 304004, -186462, 349700, 1814717, 3865501, 4383513, 2318668, -240294, -911815, 311712, 234429, -655074, -877510, -282407, 555394, 2285280, 3478544, 2871445, 1745511, 968888, 1025472, 683887, 51662, -234312, -266944, 678633, 1381673, 1106995, -145192, -638708, -423999, -859372, -933840, -227224, 348369, -86236, -1464973, -2442316, -2633764, -2663923, -2199999, -1316544, 374444, 2166319, 2105157, 2337848, 2279025, 1935597, 2057428, 2086390, 2247578, 2376147, 1882016, -578042, -2521794, -3320714, -2372345, -1736233, -1847004, -1838119, -1740193, -1171764, -1055141, -1256287, -1714959, -2364578, -2407399, -2620928, -2256565, -765420, 470276, 1394142]
10312A394142m31312j04694P19532j057512j278181M20401L11759O05924r6766
10303D83293q95138O9312N8234l65692J095560J865789K9498m62698P66336J432673
10293D077167j22886k237712j390167j15583J66055P85416n74993j588798R6392
10284i05109J648403J306159k60494q72700j114890R59057J984789K10166j066557
10275A888824j369872j439119j193633l84646j621527m73750O44482p61704n42524
10266e253469M16760J050332J387990L70866J089232N85421M67833J056480j62096
10257A009349j947248k012037J093869K056292R0132J01641M09025O03032J819531
10248C223586J036191p07600K293896L587328K77115j511912j738183j976750
$$ y = [1394142, 962830, 858136, 1577668, 520156, -758025, -337624, -25865, 580059, 483293, -411845, -342533, -284299, -649991, 445569, 2311358, 2340856, 1878158, 2644494, 4077167, 3954281, 1716569, 326402, 210819, 376874, 1162290, 587297, -1001501, -905109, 743294, 2049453, 1788959, 916259, -198631, 760426, 2745215, 2955381, 1888824, 518952, -920167, -2113800, -2498446, -4119973, -4593723, -3949241, -4710945, -5253469, -4836709, -3786377, -2398387, -2027521, -938289, -352868, 114965, 1171445, 1009349, -937899, -2949936, -1856067, 200225, 290357, 391998, 801023, 1404055, 3223586, 4259777, 3552177, 5846073, 9433401, 9710516, 8198604, 6460421, 4483671]
10240D483671l909828k603766m30660k81588L46208J186965J213792M91373J740395
10231B236562Q68539n77211j268205j961614j095391O5408q61940N45470K399848
10222C51466m5587j798591o5001J257420J225531J883544K56285o47640Q96157
10213C313584L31872j200924j31106O15381L20506L63123P57286Q12298j586921
10204C595099j001600J97968K18594o37623p87230K68768j60648j204273k409043
10195a919988k82573J348961P65140q75783r06679O85131q3127j434026p78948
10186c481892p26023r25567K90300L14872o7264K71523O45563J246980L68867
10177b062641J206978J285769L05650p7895Q01059K64803K12778R68966k05964
$$ y = [4483671, 573843, -2029923, -2460583, -2742171, -2395963, -1208998, 4794, 496167, 2236562, 3105101, 2527890, 1259685, -701929, -1797320, -1731912, -2593852, -2048382, 351466, 305879, -1492712, -1557713, -300293, 925238, 2808782, 3065067, 2417427, 3313584, 3645456, 2444532, 2313426, 2928807, 3249313, 3612436, 4369722, 5182020, 3595099, 2593499, 2791467, 3010061, 2372438, 1585208, 1853976, 1693328, 489055, -1919988, -2202561, -853600, -88460, -964243, -1870922, -1185791, -1268918, -2702944, -3481892, -4207915, -5133482, -4843182, -4528310, -4595574, -4324051, -3678488, -2431508, -2062641, -855663, 430106, 735756, 657861, 1458920, 1723723, 1936501, 2905467, 2699503]
10168B699503o24343m73147K23523m45416j323202r89507J72296L07152K52451
10159b00690l45887P546j1192L67120j30037j285086l3884N48578P57512J29611
10149a96409j63010j660835j452394R50275J818859K201491J333758k53086j157325
10140A421324j363745j128264p85027m00375N76841O00527J5862j652157j525101
10131d240115Q74824K35329n22754L02928J55795M91037N63122J161199J51517
10122h27118m94918J82274l34830J128198L7913j461977m97326K47440J175591
10113h44753K32374n3669k09359m4839K04022L15323J160615o22404o30132L76573
10103a16249N24885r84516j725977r07824j18307J238268J647650P48918M87056
$$ y = [2699503, 2075160, 1602013, 1825536, 1380120, 56918, -932589, -760293, -453141, -200690, -546577, -539031, -550223, -183103, -313140, -1598226, -1632110, -1083532, -326020, -196409, -359419, -2020254, -3472648, -2522373, -703514, 1497977, 2831735, 2578649, 1421324, 57579, -1070685, -1855712, -2256087, -1679246, -1078719, -1062857, -2715014, -4240115, -3365291, -3129962, -3652716, -3349788, -3193993, -2702956, -2139834, -978635, -827118, -1322036, -1139762, -1474592, -346394, -308481, -1770458, -2267784, -2020344, -844753, -612379, -666048, -875407, -920246, -716224, -400901, 759714, 137310, -492822, -116249, 408636, -575880, -2301857, -3209681, -3327988, -2089720, -442070, 306848, 793904]
10094G93904R39000J482040J443742o8083q69716k282555k694568J242778K260758
10085B247300m00027j112600J078998M06245O79890J15849m46787r95205o57961
10076I15702J243536J331557J425959R70534j631680k849918j372019l16172k26424
10067e08925Q07772o9439j033643R99734Q31802P52850K68100N26689r73666k447812
10057h46538r83787J09812j01589M59595R5349m9588J56336J515781J944380K434815
10047D734566J545690j76610j511096k796489j617202J441766P85898j327804
10039A078719k421342k322935Q11835K380843J959688l53995j789367q21900n93787
10030b072241J234318N28555K45742o32357j540295N00274J114044O90967r30600
$$ y = [793904, 1732904, 3214944, 4658686, 4590603, 3720887, 1438332, -1256236, -13458, 2247300, 1847273, 734673, 1813671, 2219916, 2899806, 3015655, 2568868, 1573663, 915702, 2159238, 3490795, 4916754, 5887288, 4255608, 1405690, 33671, -282501, -508925, 298847, 229408, -804235, 195499, 1027301, 1780151, 2048251, 2574940, 1601274, -846538, -1830325, -1720513, -1822102, -1362507, -1267158, -1316746, -1160410, 355371, 2299751, 4734566, 6280256, 6103646, 4592550, 1796061, 178859, 1620625, 2406523, 1078719, -1342623, -3665558, -2853723, -472880, 1486808, 1132813, -656554, -1478454, -2072241, -837923, -309368, -63626, -695983, -2236278, -1736004, -621960, 69007, -861593]
10021h61593n57033N78323J195806O23926R50408J412205J658950K063048J957892
10012I021932j191673m335676k444023R54687M55011p1719r42379j489573j221786
10003a265199j301620J200127K354144Q17963J077033J294356j040179k446936
9995F89689m99801P62758R66040l97858k452159j550947j452983P57099J795777
9986a382385J161464N86167P77609K44505l50341j230449j526646J869556K393610
9977B543090m99379q76621j704076j346114L2384J485998N91404n7546p93061
9968f23921j462633j290554P58228r48643j90150J486024M46877Q81480J486976
9959E43684J86643j647119j176535P20000P92622j64374J301405J756891J758938
$$ y = [-861593, -1418626, -840303, 355503, 979429, 1929837, 3342042, 5000992, 7064040, 9021932, 7830259, 3494583, 1050560, 2005247, 2460258, 2388539, 1446160, -43413, -1265199, -2566819, -1366692, 987452, 1805415, 2882448, 4176804, 3136625, 689689, 189888, 952646, 1918686, 1520828, -931331, -2482278, -3935261, -3178162, -1382385, -220921, 365246, 1142855, 1387360, 1037019, -193430, -1720076, 149480, 2543090, 2043711, 1167090, -536986, -1883100, -1850716, -364718, 226686, 169140, -623921, -2086554, -3377108, -2618880, -3567523, -3757673, -2271649, -1824772, -943292, 543684, 730327, -916792, -2093327, -1373327, -580705, -745079, 556326, 2313217, 4072155]
9950D072155M22909P40732j55596r35072M72477O83720j588669k139311j209073
9941C64272n93613o51550L55065J053950M7327n19067k95040m26869N28585j0171
9931a47111p50608m99389J317995R91776L44705l61553L73365L53506J22639o97236
9921A048089k760114n90495K041733K428655J11392j533003k78888J7027r81094
9912d96698j023030P81321J128937O03409N1148m78590P07497p63670k550369
9903b040045l00188n73008j07969L52310Q36638J478501k92181j296326k57996
9894b200264N12903K78082j61040K26803J233286O51987j523481l42188R45242
9885c78670L44054M1529j609648j197462L15354J40755j24914L90844J091768
$$ y = [4072155, 4495064, 5235796, 5080200, 4145128, 4617605, 5301325, 3712656, 1573345, 364272, -229341, -880891, -525826, 528124, 575451, 56384, -238656, -665525, -136940, -147111, -897719, -1397108, -79113, 912663, 1257368, 895815, 1269180, 1622686, 1745325, 1048089, -1712025, -2302520, -260787, 2167868, 2279260, 746257, 467369, 484396, -496698, -1519728, -738407, 390530, 993939, 1045087, 566497, 1273994, 510324, -2040045, -2340233, -2913241, -3021210, -2668900, -1832262, -353761, -645942, -1942268, -2200264, -1687361, -1409279, -1570319, -1343516, -110230, 541757, -981724, -1323912, -378670, -34616, 6913, -1602735, -2800197, -2484843, -2344088, -2469002, -2078158, -986390]
9876i86390J388545K87133j97331l26802M25308R14368l92896j47815J263500
9867B227620J554378J662965l79602j543631j775891k72477K83045J426060K57137
9858C439604k286306k15049J113248K28571j471881p63762J190991p7494K85283
9849A443205j3866p73199K54065O7210j460854j185455R77256K316554N29164
9840B154080j073253p84359K15395J098626o8667k171279k939130q15818K17587
9831d166818J529764J275956Q15084K130537Q80378q69052k276162l080425J295
9822c759443J261155N59875J52997j339250J18488J283205L47861M32288N63944
9813c78880O57959J3348j90753J74357J917417M57301j823610l02885O56772N23050
$$ y = [-986390, 402155, 689288, 491957, 165155, 590463, 1504831, 1111935, 964120, 2227620, 3781998, 5444963, 5065361, 3521730, 1745839, 1473362, 1756407, 3182467, 3439604, 1153298, 938249, 2051497, 2280068, 808187, 44425, 1235416, 1157922, 1443205, 1429339, 656140, 910205, 977415, -483439, -1668894, -691638, 1624916, 2154080, 1080827, 296468, 511863, 1610489, 1541822, -629457, -3568587, -4384405, -4166818, -2637054, -1361098, -546014, 1584523, 2464901, 1595849, -680313, -3760738, -3759443, -2498288, -1938413, -1785416, -3124666, -3006178, -1722973, -1375112, -942824, -378880, 279079, 292427, 101674, 276031, 2193448, 2650749, 827139, 524254, 1181026, 1704076]
9803A704076M31997p41320p23036r54469L84415n43376r66085j126589j432898
9794c967285K98480J474911J263311l98088q74679J635259J016515J53419n25857
9785G5986j678243l82773N22608q90688r97663O21697Q40485J323675O57404o87940
9775e95452j25743O38540K05209q05456Q8615J040688J340437J804672q23304
9766B768206k066870k546564j199304N34663K290664J212423L45136Q853J467963
9757B815170N20083j878771j757234k04122Q12437j46345j83504L82482j750225
9748a390029p80325Q50959l20823J050813K351593Q44198K26076P25324N10812
9739D068598R02963p32708r29251j000368j018884j314573l08300K168476K33919
$$ y = [1704076, 2136073, 1394753, 671717, -282752, 101663, -441713, -1407798, -2534387, -3967285, -3668805, -2193894, -930583, -1328671, -2203350, -568091, 448424, 601843, 75986, -1602257, -1985030, -1462422, -2353110, -3350773, -2729076, -1888591, -564916, 92488, -595452, -721195, -82655, 122554, -682902, -594287, 446401, 1786838, 3591510, 2768206, 701336, -1845228, -3044532, -2509869, -219205, 993218, 1338354, 1347207, 2815170, 3335253, 1456482, -300752, -504874, 307563, 161218, -22286, 360196, -1390029, -2170354, -1319395, -1640218, -589405, 1762188, 2606386, 2832462, 3557786, 4068598, 4971561, 4238853, 3309602, 2309234, 1290350, -24223, -332523, 1835953, 2069872]
9730B069872l337408q22988K097758J323367L55777k08638o74839j418985O51181
9721C5097J323362m14292k005286P5941O86196J53779j55994M05811J66470q5596
9711A85488Q02061R89109m56245o77751J74858j937528j338368J555034J285111
9702E81769M36767J38993J71517q92390q7149m45463K73622R48821L47644n75895
9692H98236k103027k216233p72043J171715J407600L12147J209103K531023K020667
9683D459188J529057j059602k101355k86647k47836M3921N4153j804390r22244
9674c35755J336295J240128O19275J280987N50992n63096j103155m5187l87578
9665B592906j616353K56167l72715k558103n64771J724524K124974J002114j092516
$$ y = [2069872, -1267536, -2090524, 7234, 1330601, 1686378, 1477740, 802901, -616084, 35097, 1358459, 944167, -1061119, -985178, -298982, -145203, -301197, 104614, 271084, 185488, 987549, 1976658, 1520413, 842662, 1017520, -920008, -2258376, -703342, 581769, 1018536, 1157529, 1329046, 436656, 349507, -95956, 177666, 1126487, 1474131, 898236, -1204791, -3421024, -4193067, -3021352, -1613752, -1301605, -92502, 2438521, 4459188, 5988245, 4928643, 2827288, 2540641, 2292805, 2336726, 2390879, 586489, -335755, 1000540, 2240668, 2859943, 4140930, 4691922, 4128826, 3025671, 2980484, 2592906, 976553, 1232720, 860005, -1698098, -2262869, -538345, 1586629, 2588743, 1496227]
9656A496227j338686O23144J123710j156294k506007j166070J08438l8504m17821
9647c271863M23779Q17310k6809o5390O18377J514435m7884n91034J83335O27794
9637A82050Q81853k53809O32912J094701n44646k420881j460312J111330Q86918
9628A10116j46274Q85873k1639k40716L70406o05112q7657L89961j56237J063567
9618A562288L77468K01631Q51693L23661j278864j681424j097269j114074j027151
9609b882041M3578J861030J154951l37071j00003q98494N92495R32957K07510
9600E74912j040982o98038l19016k006901r49082J273470Q12665L27388L17477
9591a708107L06057K196160J292568j445077j510106M83820J301035m56271O17385
$$ y = [1496227, 157541, 780685, 1904395, 748101, -1757906, -2923976, -2815538, -2854042, -3271863, -2848084, -2030774, -2057583, -2122973, -1504596, 9839, -38045, -629079, -445744, 182050, 1063903, 810094, 1443006, 2537707, 1993061, -427820, -1888132, -776802, 110116, -36158, 849715, 828076, 587360, 957766, 352654, 264997, 654958, 498721, 1562288, 1939756, 2141387, 2993080, 3316741, 2037877, 356453, -740816, -1854890, -2882041, -2838463, -977433, 177518, -159553, -259556, -1158050, -565555, 367402, 574912, -466070, -1164108, -1483124, -3490025, -4439107, -3165637, -2352972, -2025584, -1708107, -1402050, 794110, 2086678, 641601, -868505, -384685, 916350, 460079, 1077464]
9582A077464K306248M41024P56057L22655o21108j707463j526082m71602J396018
9573A973211J138624q89013l65302l69186o72441R71222Q35014m26061q45615
9564A350453m46850k03503N82761P70734n27722m0385j300779p68925J268659
9555F84443L36415p48966J356499K910530J65873j976780l18535O78937R04170
9546C992586j397013j206054L01207M3169j962983l299467j235555J141091L006111
9537f16908L185541J812441K41752P18616N17407j696988j570758m62672R9485
9528B227916j626049r73597O63014N42599J032988K46553j887289j665654M39501
9519a000018J732044K46035n68567k95517j70206l3883K9216J89600L29007n46015
$$ y = [1077464, 3383712, 3824736, 4580793, 4903448, 4282340, 2574877, 1048795, 577193, 1973211, 3111835, 2222822, 1857520, 1488334, 815893, 1787115, 2622129, 2196068, 1350453, 903603, 700100, 1282861, 2053595, 1525873, 1485488, 184709, -584216, 684443, 1020858, 271892, 1628391, 4538921, 4704794, 2728014, 2409479, 3088416, 3992586, 2595573, 1389519, 1690726, 1733895, -229088, -3528555, -4764110, -3623019, -616908, 2568633, 4381074, 4622826, 5341442, 5858849, 4161861, 2591103, 2128431, 2227916, 601867, -371730, 291284, 833883, 1866871, 2113424, 226135, -1439519, -1000018, 732026, 978061, 409494, 113977, -56229, -90112, -60896, 128704, 457711, -88304]
9509h8304j14096J344077p9293n93046K08677k26120j114109j596721J120134
9500a138801K533503P80188L84964O68910o41541r58171q65254k800487k45439
9491b282128J588616O24711n08381n98810N72436L04248Q64288Q91981q92250
9482E64711n6518N41782p39648R74034K096945m67374k054703j418715O1679o27190
9472a124997L48748N48672j28730j2037Q9496N14193o0054l61402M02657p86518
9462e69972k25325Q40501K02080j144465p67358P56918M30967J974176K171932
9453C669454n69104n20426N25927K89304q05858k109034j598471M05704N51653
9444a60851k42075j75003n41542L9356R61692J546278K44834j559877j400580
$$ y = [-88304, -202400, 1141677, 1062384, 469338, 678015, 451895, -662214, -2258935, -1138801, 1394702, 2174890, 2559854, 3228764, 2587223, 1629052, 763798, -2036689, -2282128, -693512, -68801, -577182, -1175992, -603556, -299308, 564980, 1456961, 564711, 508193, 1049975, 310327, 1284361, 3381306, 2913932, 859229, -559486, -497807, -1124997, -776249, -227577, -356307, -368344, -278848, 235345, 175291, -186111, 216546, -569972, -795297, 45204, 247284, -897181, -1664539, -907621, -476654, 1497522, 3669454, 3100350, 2579924, 3105851, 3395155, 2589297, 480263, -1118208, -712504, -160851, -402926, -577929, -1119471, -1080115, -118423, 1427855, 1672689, 112812, -1287768]
9435a287768j193742j88015m84179n03159J217300R82880p39366R8650J846519
9426b50880K025074J144028j42392N63774J316310K67332J027363K92900j424098
9417D819411k052629j743246j426134M39725L57460o33006q97176n06807J650306
9408G904K056287P43757m62740p21875j740609k233052j789364j25944L7911k11634
9398d439359N44553Q52473P11094J246321J795080J371693o65382k169679m96127
9389a249333J95676j406981n93110J452996J529138J652497R39424p25343o62279
9380A132685j80040j18192l14664K05726m86209j07024m73728k096191j643719
9371d081356r13364O56227K309229K350996N49400j654889n94705j83990j742565
$$ y = [-1287768, -2481510, -2669525, -3153704, -3656863, -2439563, -1456683, -2196049, -2097399, -250880, 1774194, 2918222, 2775830, 3339604, 4655914, 4923246, 5950609, 6243509, 4819411, 2766782, 1023536, -402598, 37127, 394587, -238419, -1135595, -1642402, 7904, 2064191, 2807948, 2345208, 1623333, -117276, -2350328, -4139692, -4265636, -4227725, -4439359, -3894806, -3042333, -2331239, -1084918, 710162, 2081855, 1416473, -753206, -1249333, -1053657, -2460638, -3053748, -1600752, -71614, 1580883, 2520307, 1794964, 1132685, 952645, 834453, 519789, 725515, 239306, 132282, -341446, -2437637, -4081356, -4994720, -4338493, -2029264, 321732, 871132, -783757, -1378462, -1562452, -3305017]
9362c305017j220127N15538L04718j027581O52100K022232P91859j418315j650954
9353d335547J72183J191404M88237j18027r79820M98986K187727J019379m39760
9344c15238j600957p75208J110646J787328J764412L19401j268016L337L61325
9335A387030K61059p70141o49158j113600j522169p58133n18538Q78529K50200
9326b554921j23064O67414j89397r41130M18130J128286N72323J430135j8050
9317C89726j442088j380569K79708J573712J041922R74110j297261j222409P34319
9308c48830O70016l33297l12997Q98078K268522J35794p16343j4586n3495k86423
9298A906439j243748l40161R61514J758409L02481o47813m69862o73784j207833
$$ y = [-3305017, -4525144, -4009606, -3704888, -4732469, -4080369, -2058137, -1266278, -2684593, -4335547, -4163364, -2971960, -2483723, -2601750, -3581570, -3082584, -894857, 124522, -315238, -1916195, -2691403, -1580757, 206571, 1970983, 2290384, 1022368, 1025705, 1387030, 1648089, 877948, 228790, -884810, -2406979, -3165112, -3683650, -2805121, -2554921, -2677985, -2010571, -2199968, -3141098, -2722968, -1594682, -1022359, 407776, 389726, -1052362, -2432931, -2153223, -579511, 462411, 1436521, 139260, -1083149, -348830, 321186, -12111, -325108, 572970, 2841492, 2977286, 2260943, 2246357, 2192862, 1906439, 662691, 322530, 1284044, 3042453, 3344934, 2697121, 2227259, 1553475, 345642]
9289C45642j844673p64307Q00285Q37503o13315q82434R38828J439185Q17437
9280A074151J395406M93941q65661m86989q71125j460017k51728k19238R5255
9271a096005j221987j785335n6953K118574K999594L70829j564364n16353O86395
9262f5605j2505o46227m2123q50212j857044K06522N15635p55747R69951J073060
9252a464295K2604n4264K64887P05299R24727p16839j254349k53412j13431p70929
9242b710002j002405J788175K280923J31089l29299O47804J368416k64169n22355
9233A388177n95350j404033j519170q1636J812911K144927O34867l70135j806490
9224B04068k225804p68661K85248K636m63498P25972R38509P13784J687911J542369
$$ y = [345642, -1499031, -2263338, -1463053, -625550, -1238865, -2121299, -1182471, 256714, 1074151, 2469557, 2963498, 2097837, 1610848, 739723, -720294, -972022, -1191260, -1096005, -2317992, -4103327, -4160280, -2041706, 957888, 1328717, -235647, -752000, -65605, -78110, -724337, -766460, -1616672, -3473716, -3267194, -2751559, -3507306, -2537355, -1464295, -1441691, -1495955, -1231068, -525769, 398958, -317881, -1572230, -1825642, -1939073, -2710002, -3712407, -1924232, 356691, 487780, 158481, 806285, 2174701, 1910532, 1388177, 792827, -611206, -2130376, -2212012, -399101, 1745826, 2380693, 2010558, 204068, -2021736, -2790397, -2505149, -2502513, -2966011, -2240039, -1301530, -587746, 1100165, 2642534]
9214B642534j366746l791933j744614K18260m51051K15243J651159J944202K567407
9205A884461l98992k273912j264742N78946J731581M12547l66118l54824M66706
9196D15653r70449j356763j73119K175209J905615R74464N84665M67648M35529
9187D458452r17364j784640j626776n3877R51918k104676j683681J355611J651233
9178B46200J345014O77366o05195j702650j663377P34846J851852P430L86698
9169A278184J835100k71664j622593j94456O56032Q95115J523707Q29117k83071
9160D645471j20637j201201j244776M94529k81748j640589j34153P97838Q4775
9151A399509o69890j950332k56180P90860J02776K30321k82891m63371l96209
$$ y = [2642534, 1275788, -2516145, -4260759, -4042499, -4493550, -4278307, -2627148, -682946, 1884461, 1485469, -788443, -2053185, -1474239, 257342, 669889, 303771, -51053, 415653, -554796, -1911559, -2084678, 90531, 1996146, 2970610, 3555275, 4022923, 4458452, 3541088, 1756448, 129672, 75795, 1027713, -1076963, -2760644, -1405033, 246200, 1591214, 2268580, 1663385, -39265, -1702642, -967796, 884056, 891486, 1278184, 3113284, 2841620, 1219027, 1024571, 1680603, 2575718, 4099425, 4928542, 4645471, 4524834, 3323633, 2078857, 2573386, 2291638, 651049, 516896, 1314734, 1399509, 729619, -1220713, -1476893, -686033, -583257, -352936, -635827, -1099198, -1495407]
9142a495407K47325K382044J398823M7240r53040r47810r64737k32875O5716q31367
9132a284088P45843J435238P08018L43117K7092O07539J24856k299617k894225
9123b486227l602J097633P96793R07663L69877L68741r27131j510146m75348k77187
9113b138934j078458Q71543L001454J99218j170004P75766J568836l47641p51242
9104I30538M47462n50977n54249j324937k319485k04448J718150J045085N50759
9095b62102Q01110j120707r11394K95151n9006O07497K090231J127952Q55445
9086C424177q22075k296845j473841N7701m17582m96574M00605Q28319M12695
9077c83420J4543K76780m64049M7625J542959M64645O80311J169551o18965o67846
$$ y = [-1495407, -1248082, 1133962, 2532785, 2580025, 1626985, 679175, -285562, -518437, -452721, -1284088, -538245, 896993, 1605011, 1948128, 1975220, 2582759, 2707615, 407998, -2486227, -2489829, -1392196, -595403, 312260, 682137, 1050878, 123747, -1386399, -1861747, -2138934, -3217392, -2345849, 655605, 854823, -315181, 460585, 2029421, 1681780, 930538, 1378000, 827023, 272774, -1052163, -3371648, -3576096, -1857946, -812861, -262102, 539008, -581699, -1493093, -1197942, -1256948, -649451, 1440780, 2568732, 3424177, 2602102, 305257, -1168584, -1110883, -1528465, -2025039, -1624434, -796115, -383420, -368877, -92097, -556146, -508521, 1034438, 1499083, 2179394, 3348945, 2729980, 2062134]
9067B062134J14012Q99940K03087j095746j851779k207662k452618j54432J816542
9058b666522K142937J070495L05731m20519O01976K46098j034643p21721J138835
9049F62667n23082l53300K872020L245330n02769k069482j5535P0900m69038j412869
9039A504842j113863j940498j389370L52891J141546j0349O69039O99016k37188
9030c23934l07631j213187o91514l13310k34616k5111J28390O44796O79258n75516
9020b232375o12398M26937O52984N14800J510345L26139o98554l33114m63790
9011i09026K02739N66846J458175P46904p47698r34316j340399n19927K88875
9002a187827n67255l85422J550249J145826M82863j71214l35310K71373n98825
$$ y = [2062134, 2176146, 3076086, 3279173, 2183427, 331648, -1876014, -4328632, -4483064, -2666522, -523585, 546910, 852641, 432122, 1034098, 1280196, 245553, -476168, 662667, 139585, -213715, 2658305, 5903635, 5400866, 3331384, 3315849, 3386749, 2917711, 1504842, 390979, -1549519, -2938889, -2585998, -1444452, -1454801, -785762, -86746, -323934, -631565, -1844752, -2536266, -2849576, -3084192, -3109303, -2980913, -2336117, -1656859, -2232375, -2844773, -2417836, -1764852, -1250052, 260293, 586432, -112122, -445236, -909026, -706287, -139441, 1318734, 2065638, 1317940, 383624, -956775, -1476702, -1187827, -1755082, -2140504, -590255, 555571, 1038434, 867220, 531910, 803283, 204458]
8993B04458q34920K71053J049924j353090j893691J35664O3443r45133o76170
8984c978462J578712J556615K69341R92034O97340L45213k13646k023076k603086
8975c379015j114158J708937K929328K018683M63900j637930k756193o56246M38445
8966a984249J591761J407910J745005j690473l275967k261927J1982J372798J647738
8957a435422J179968J283531J543772J694621l00391j705439q6838k28338l84499
8948A560965p83248q23572o60177k77150J037776K167511n8257j587884k681355
8939b105391j687942o30853r95156Q12581J543077k4378k98588J313581K287614
8930B14545Q9181L01081P60051J41634j691302k313650j135855J608334K568196
$$ y = [204458, -630462, -359409, 690515, -662575, -2556266, -2420602, -2357159, -3302292, -3978462, -2399750, -843135, -573794, 418240, 1115580, 1460793, 1247147, -775929, -3379015, -4493173, -2784236, 145092, 2163775, 2627675, 989745, -1766448, -2422694, -1984249, -392488, 1015422, 2760427, 1069954, -2206013, -4467940, -4455958, -3083160, -1435422, -255454, 1028077, 2571849, 4266470, 3966079, 2260640, 2173802, 1945464, 1560965, 777717, -45855, -706032, -983182, 54594, 2222105, 2163848, 575964, -2105391, -3793333, -4424186, -5419342, -4606761, -3063684, -3088062, -3386650, -2073069, 214545, 303726, 604807, 1364858, 1506492, -184810, -2498460, -3634315, -2025981, 542215]
8921E42215j09299j23897K78474j78781j430709p61051P12396J278844o58919
8912d50727k561512n52020j18059Q62268K567570J997550p57697n94071K19878
8903F13180o2764l36950q11728j495004r80148R71123q55011l74196M63831m56560
8893c324227l97041n04862O60413Q66597R53557m71067j139901m93749K65431
8884c584849M88048J673652j012396j156481R72718J232839J008566J563723J726639
8875B912459J064417n0153r93036j444817j682758p78307l4043P33896Q65642
8866E93300k41310k02282q08057l70707n13017q32720J264860K537525J150934
8857B578526l79127j48369L51028K041213R06276L01077K42189M65595k86562
$$ y = [542215, 432916, 309019, 587493, 408712, -1021997, -1783048, -1070652, 208192, -450727, -3012239, -3564259, -3682318, -2820050, -252480, 1745070, 987373, 393302, 613180, 550416, 213466, -598262, -2093266, -3073414, -2102291, -2957302, -3331498, -2867667, -3324227, -3721268, -4226130, -3565717, -2699120, -1745563, -2216630, -3356531, -3850280, -3584849, -3096801, -1423149, -2435545, -3592026, -2619308, -1386469, -377903, 1185820, 2912459, 3976876, 3926723, 2933687, 1488870, -193888, -972195, -1006238, -272342, 593300, 351990, 149708, -658349, -1029056, -1542073, -2374793, -1109933, 1427592, 2578526, 2199399, 2051030, 2402058, 4443271, 5349547, 5650624, 5892813, 6358408, 6071846]
8848F071846k98081L24866J015743p76141l130805j081835J147915r8676m34275
8839B740557l58991j50588M55306N60094m66358r68024j240103p14607j04897
8830b47611m4173M91907R83607K71641j415100j918692j39073J437478J597396
8821A017380R41727k39020j380095k021244r86317J120348J611651J240428M79863
8812A784721J40265l67615n75273q63439j010447k02616J88226k74837r57488
8803b138503J075644J250163J490194J113307k399041j592717n52387R45232J175361
8794C67253J56680J220998J109292k89570K34700M63077j81015r13837p60708
8785A406870j44008k93186m07984O44632K89269p33970n75367r20922r85142k917378
$$ y = [6071846, 5773765, 6098631, 7114374, 6338233, 3207428, 2125593, 3273508, 3174832, 2740557, 2381566, 2230978, 2686284, 3246378, 2780020, 1811996, 571893, -142714, -247611, -291784, 200123, 1183730, 1455371, 40271, -1878421, -2017494, -580016, 1017380, 1959107, 1720087, 339992, -1681252, -2667569, -1547221, 64430, 1304858, 1784721, 1924986, 1557371, 982098, 118659, -891788, -1094404, -906178, -1181015, -2138503, -1062859, 187304, 1677498, 2790805, 391764, -1200953, -1753340, -808108, 367253, 523933, 1744931, 2854223, 2564653, 2799353, 3262430, 3081415, 2167578, 1406870, 1262862, 969676, 561692, 1206324, 1495593, 761623, 186256, -734666, -1719808, -4637186]
8775d637186o53723J279598Q68075N66055J428101J292076o53942p74175p07721
8766a992842O2884K751146K136640j836908k011254O45609N82243j55153o69573
8757d87208J438961J739896J697459J039723r68128L84042J58939j168504j15380
8748C719800K60687q3426Q20786r42249j743746j929244j266445j108186j111461
8739c383484j223658P13540J288084P20060L46200R19137J297789q80559j495992
8730a698883R56188K803771p24735j482690j440418j459626j31947M38948K149692
8721e89700Q99939j209568J80714m11428j69652O60324n13167l20779k027376
8712c500693L21876K395289N00133m68066q7098J94079j99075r62514k28820M42388
$$ y = [-4637186, -5290909, -4011311, -3143236, -2577181, -1149080, 142996, -510946, -1285121, -1992842, -1929958, 821188, 2957828, 1120920, -890334, -244725, 337518, 182365, -487208, 951753, 2691649, 4389108, 5428831, 4460703, 4844745, 5003684, 3835180, 3719800, 3980487, 3897061, 4717847, 3775598, 2031852, 102608, -1163837, -2272023, -3383484, -4607142, -3893602, -2605518, -1885458, -1539258, -620121, 677668, -202891, -1698883, -742695, 2061076, 1336341, -146349, -1586767, -3046393, -3178340, -2739392, -589700, 310239, -899329, -718615, -1130043, -1299695, -639371, -1152538, -1473317, -3500693, -3178817, -783528, -283395, -751461, -838559, -644480, -843555, -1806069, -2034889, -1592501]
8702a592501R05956K88826j11659M79408n87977j037027q89703n57127l01471
8693c403275K30058k37515k87487r64491j60826J583332P71033N61229P37091
8684a170851j888914q3809K014972L80656J00456P04077R81568P17999R97158
8675B753312K55166l159179l123077j853686j74781J199269j060862j671561M50229
8666f385170J721123Q48682N38933J041633J043190K582675J404817j272337k742128
8657a218582r61500N05905J81437N32085M29100O53044k235591j668474K013223
8648a769353J246947L28522k96452R77598J786284P36872M64873j151011j320987
8639A003293j06567n1151K64852J799716J169014j636607j818302n45102l79641
$$ y = [-1592501, -686545, -397719, -509378, -29970, -617947, -1654974, -2544677, -3101804, -3403275, -3173217, -3410732, -3698219, -4662710, -4823536, -3240204, -2469171, -1907942, -1170851, -3059765, -3143574, -1128602, -747946, -647490, 56587, 1038155, 1756154, 2753312, 3008478, -150701, -3273778, -5127464, -5302245, -4102976, -5163838, -6835399, -6385170, -4664047, -3815365, -3276432, -2234799, -1191609, 1391066, 2795883, 1523546, -1218582, -2180082, -1674177, -1492740, -960655, -531555, 121489, -2114102, -3782576, -1769353, -522406, -193884, -490336, 487262, 2273546, 3010418, 3475291, 2324280, 1003293, 896726, 845575, 1110427, 2910143, 4079157, 2442550, 624248, 79146, -300495]
8630c00495k25348k8689N67227m12434j551489q24964J78281J718618R17089l79213
8620c41417l22001L37539l47053p12268m41064n69920j45005J27269K51908k82445
8610b444457L83583O78313J335048n6584r21417p57504K94047J89544r187Q6642
8600a221972J58482J254568M4341p66504J335458K773305J62862j643734l11160
8591A785646j255560j226133K38950q23235o97752j383008l83678r1902L92495
8582c444177J74537J52395M56981J60524M77840L67951m96553K10421J758738
8573a81343J093510J495445P32660k246506k020965r02957Q65072J906614Q39305
8564A580835j64936m52822n29003j99306k003712k466241N09020J544425J761950
$$ y = [-300495, -525843, -554532, 12695, -399739, -1951228, -2776192, -2597911, -879293, 37796, -341417, -663418, -325879, -672932, -1385200, -1826264, -2396184, -2541189, -2413920, -2162012, -2444457, -2060874, -1382561, -47513, -104097, -1025514, -1783018, -1488971, -1299427, -1308614, -1221972, -1063490, 191078, 235419, -531085, 804373, 3577678, 3740540, 2096806, 1785646, 530086, -696047, -457097, -1280332, -1978084, -3361092, -3744770, -3836672, -3444177, -3269640, -3117245, -2660264, -2499740, -2021900, -1653949, -2150502, -1940081, -181343, 912167, 2407612, 3140272, 893766, -1127199, -2030156, -1165084, 741530, 1580835, 1415899, 963077, 434074, 234768, -1768944, -4235185, -3726165, -2181740, -419790]
8555d19790L81596j0788L04927o08094r74730j211849q9008J144903J638650J232672
8545A388489K0171j367784j085488M85353K670790P11113k221498j596441j257380
8536b252675L97894L47245N25578J320842M83504J30147J48042k45779K42383
8527A097181K67169n82627j712847j075962J65442L14560l5110K43749n80180
8518a898625j99181m09355q82309K43227J793680J521272o88253p01398L74294
8509h46648J271300N74655o68062K37013J367708J880958Q53951k17824r02054
8500C550997l234473k351740K95810Q37965M07640j100272p97146J790576Q82159
8491B81516j202695k59518M33761J206375J435614J88624j28627l67318l74059
$$ y = [-419790, -38194, -48982, 255945, -352149, -1326879, -2538728, -2627736, -1482833, 155817, 1388489, 1408660, 40876, -1044612, -559259, 2111531, 2822644, 601146, -995295, -2252675, -1854781, -1507536, -981958, 338884, 822388, 952535, 1100577, 854798, 1097181, 1364350, 781723, -931124, -2007086, -1841644, -1527084, -1562194, -1318445, -1898625, -2097806, -2507161, -3389470, -3146243, -1352563, 168709, -519544, -1220942, -846648, 424652, 999307, 331245, 568258, 1935966, 3816924, 4670875, 4453051, 3550997, 316524, -2035216, -1739406, -901441, -493801, -1594073, -2391219, -600643, 281516, -921179, -1180697, -746936, 459439, 1895053, 2083677, 1955050, 1587732, 1213673]
8482A213673L75330J95051j180096o29448J563827J209280n76338J91987j203522
8473A159744j325404l19192n7929K894380K666361j222020k81860J457139l20132
8464D651087k877527k348425p03629p04366m12987L20853P81970M58194J59844
8455f74986R59764N65669j379758j365678J260638J691118k06886l72636j981832
8446a504587k183238m90134K203116K761000Q35405q58026j017336n04505M53122
8437c05183N93143K1522o14785q2011J353428J904177l88071j110796N17493R60918
8427B849835J0994k162421k267375j839741q62779Q74400K463767P80418p87692
8418i40594j006189j823740j489020l6409J819492K142055R13356j51144J309816
$$ y = [1213673, 1589003, 1784054, 603958, -25490, 1538337, 2747617, 2171279, 2363266, 1159744, -165660, -484852, -542781, 2351599, 5017960, 3795940, 3514080, 4971219, 4651087, 1773560, -574865, -1278494, -1982860, -2395847, -2074994, -1293024, -834830, -674986, 284778, 850447, -529311, -1894989, -634351, 1056767, 849881, 477245, -1504587, -3687825, -4177959, -1974843, 786157, 1621562, 763536, -253800, -758305, -305183, 287960, 309482, -305303, -387314, 966114, 2870291, 2482220, 1371424, 1888917, 2849835, 2860829, 698408, -1568967, -3408708, -4271487, -3397087, -933320, -152902, -940594, -1946783, -3770523, -5259543, -5295952, -3476460, -1334405, -421049, -572193, 737623]
8409G37623J359620o5010m16378o2987n36048j243937j62599M3226J497104K956029
8399D106643J675640q38590j203383m88548m32890j96223r0753l81608n29838
8390A620450k009107k064343o0993J32753M32926K075664J487234o28999j247978
8381b62393q13086K406075K497924j67670L1366j182092k267081j112231p07353
8372a576541J637164J385007o24053p07120N02611K13819j55860r25779n62371
8363h13123P54829K31860R19159Q33711J22607N17978k27851m65324m33812q91346
8353E48688j589402n47104Q62086P54297j58828p39797j070730k54789O73683
8344a521896J101424N06741L59033J42632O84872J124755M88271K45221N69083
$$ y = [737623, 2097243, 2032233, 1615855, 1552868, 1016820, -227117, -389716, -346490, 1150614, 4106643, 5782283, 4943693, 3740310, 3251762, 2818872, 2622649, 2531896, 2150288, 1620450, -388657, -2453000, -2513993, -2381240, -1948314, 127350, 1614584, 985585, -262393, -1075479, 1330596, 3828520, 3660850, 3692216, 2510124, 243043, -869188, -1576541, 60623, 1445630, 821577, 114457, 617068, 830887, 675027, -250752, -813123, -58294, 173566, 1092725, 1926436, 2049043, 2567021, 2339170, 1873846, 1440034, 548688, -1040714, -1587818, -725732, 28565, -130263, -870060, -1940790, -2195579, -1521896, -420472, 86269, 445302, 587934, 1272806, 2397561, 2885832, 3131053, 3700136]
8335C700136l88594k025935r44614l15703r3831K07220J26808k52466q79382p06458
8325a572819o86666O25177P37178q15377m73704L27733L60003J154659L69510
8316B5694J625033J43141j902826j211737j232571J116746O52871K26969L53743
8307b02937j405599m87781O07323k116150j256039J259719N95243O76002J349901
8298i80318J124174J208585J392740k58180p73937j247159j817578k021395j922783
8289e295851J650608P31809j06442O54113N45602J093888K422122K357537J347680
8280E401066k08623j268408j996664k400773r64316N53354R81337K80630j883359
8271a505756m26954J833404R50591j033507n75778j170482j485485M47099J940173
$$ y = [3700136, 3311542, 1285607, 340993, 25290, -68541, 138679, 265487, 13021, -866361, -1572819, -2259485, -1634308, -897130, -1712507, -2186211, -1858478, -1498475, -343816, 25694, 1650727, 1793868, -108958, -1320695, -2553266, -1436520, -783649, -556680, -202937, -1608536, -2096317, -1488994, -3605144, -4861183, -3601464, -3006221, -2330219, -980318, 143856, 1352441, 2745181, 2487001, 1713064, 465905, -1351673, -3373068, -5295851, -3645243, -2913434, -3019876, -2365763, -1820161, -726273, 1695849, 4053386, 5401066, 5192443, 3924035, 1927371, -473402, -1437718, -884364, 96973, 377603, -1505756, -1932710, -99306, 851285, -182222, -758000, -1928482, -3413967, -2966868, -1026695]
8262a026695L5679n97404R51446P78620k20089j118037j207883N28881R06871
8253i68611r1407Q30077K098960J528129p29328j783935P40000Q24491j569829
8244H78547j682868O2161J74281K28646J088228o60261Q7174o2572k45004J724127
8234A592459J911701M90418K83669K73344j187170j167574j86207P74642M72814
8225C258096N88827j077108k492707j02010m00570M73630J197378o43397l37848
8216D64291J973046N88532j342517o29043N31681O97449J480852J133127m31845
8207D465573o81837l52281j267476k82820L3482q98217j488695l33061M23060
8198c82272J12592j31471n21275J226486J274688L18806J31560J12212M72053
$$ y = [-1026695, -991016, -1588420, -636974, 141646, -78443, -1196480, -2404363, -1875482, -968611, -1060018, -229941, 1869019, 3397148, 2667820, 883885, 1623885, 2448376, 878547, -804321, -742160, -567879, -339233, 748995, 88734, 175908, 113336, -131668, 1592459, 3504160, 3994578, 4278247, 4551591, 3364421, 2196847, 2010640, 2785282, 3258096, 3846923, 2769815, 277108, 175098, -225472, 248158, 1445536, 802139, 464291, 2437337, 3025869, 1683352, 1054309, 1585990, 2283439, 3764291, 4897418, 4465573, 3783736, 3431455, 2163979, 1881159, 1914641, 1016424, -472271, -805332, -382272, -269680, -401151, -922426, 304060, 1578748, 1897554, 2029114, 2141326, 2613379]
8189B613379q84020j201975Q43496K220581Q92561k05237l50975j790187j497383
8180F40240L22460o37522j537908m81664j09908J01750J001303J972679J525212
8171B796642R73092Q619K60840j37146j067281j122535k21392J167691J297482
8162C956012j77543r38384O60203J298885m24079j492033j372080j692645l34140
8153e15804l23072r04144o75526J54791J595504J797466m89069p88275k77226
8144d25355k79466j92782P72013J013926J239554P11485J123373J415193j508732
8135C869209j670405Q4726M64168o22784j501921n61164L95815Q05374n48334
8126G14684k82017j037033r51228j022534l67190Q78977K367521J394169M96641
$$ y = [2613379, 1729359, 527384, 1370880, 3591461, 4484022, 4278785, 3927810, 2137623, 640240, 962700, 325178, -1212730, -1694394, -1804302, -1702552, -701249, 1271430, 2796642, 3769734, 3778353, 4039193, 3902047, 2834766, 1712231, 1490839, 2658530, 3956012, 3778469, 2840085, 3500288, 4799173, 4375094, 2883061, 1510981, -181664, -515804, -838876, -1743020, -2418546, -2263755, -668251, 1129215, 640146, -148129, -425355, -704821, -897603, -125590, 888336, 2127890, 2839375, 3962748, 5377941, 3869209, 2198804, 2283530, 2747698, 2124914, 622993, 61829, 457644, 1263018, 714684, 432667, -604366, -1555594, -2578128, -2945318, -2066341, 301180, 1695349, 2191990]
8117B191990L679618K666803o3049k264072j267423m33745M98992K25501j74496
8108E060119j013366l36787k7535L1486j883463k369211j389715J197186J008209
8099B76923r68650j469349p00010J237651L289121r8572j748532Q6661R97121
8090I02364J153961J71516q73015j00901P29986R19953R52019K19798N09534J577058
8080F162273J507105L59028j297498k224782k332906j864440m32444J63312m0362
8071g14J672976J330110L34139K454909K174279R61238k17301k014138k592437
8062D103061j066515p41341q72129l20056J439058J505568j769726j784225K65491
8053G59186P08597O37151j54051R36195k4687R77099J200258M87428l2832j01842
$$ y = [2191990, 5871608, 8538411, 8475362, 6211290, 4943867, 4510122, 5009114, 5234615, 5060119, 4046753, 3709966, 3682431, 3713917, 1830454, -538757, -1928472, -731286, 276923, -691727, -2161076, -2861086, -1623435, 1665686, 1567114, -181418, -94757, 902364, 2056325, 2227841, 1354826, 1253925, 1983911, 2903864, 3855883, 4075681, 4585215, 6162273, 7669378, 8028406, 6730908, 4506126, 2173220, 308780, -123664, 39648, -714, 1672262, 3002372, 3336511, 5791420, 7965699, 8926937, 8709636, 6695498, 4103061, 3036546, 2295205, 1423076, 1103020, 2542078, 4047646, 2277920, 493695, 759186, 1467783, 2104934, 1950883, 2887078, 2862391, 3839490, 5039748, 5527176, 5494344, 5392502]
8043E392502M61042o91765j144848N39716O64356l75661K22832k73307J22301
8034D917168J485873J937095N07312r49820j642167q82882L35932j91138q87415
8025D629958N72437J096520r1537r98456j81819Q83608J290058J220135J923172
8016A0344076J665864K63683k51491K51241m66636j311523j838876Q67398L752075
8007A3275811L950853J925664Q64210J841023L635032M014531L830310M801656
7999C8139090N936402P402052Q338929P422160N001465J822629l234646l024946
7991F7803135k969207n976475o562280o575556n389668m479226m716113m030433
7983B7104177l579921k444794k014046m85981q27400j520778O13778K759502R18088
$$ y = [5392502, 5853544, 5161779, 4016931, 4556647, 5221003, 4845342, 5068174, 4794867, 4917168, 6403041, 8340136, 8847448, 7897628, 6255461, 5372579, 5708511, 5517373, 4629958, 5202395, 6298915, 6207378, 5208922, 5027103, 5910711, 7200769, 8420904, 10344076, 12009940, 12273623, 12022132, 12273373, 11806737, 10495214, 8656338, 9523736, 13275811, 17226664, 19152328, 20016538, 21857561, 25492593, 29507124, 33337434, 38139090, 44075492, 51477544, 59816473, 67238633, 72240098, 74062727, 70828081, 67803135, 64833928, 58857453, 52295173, 45719617, 40329949, 35850723, 31134610, 27104177, 23524256, 21079462, 19065416, 18579435, 17752035, 16231257, 16845035, 19604537, 20522625]
7974B0522625O60527l06038l90714o71582j658493q29101J57804p41870L0366
7965A6773524N40417k31376j341699j908143j168130k51863J295697K440969K490814
7956A8640210K228247R25306J898922L255686M847490N762104M498186N033969
7948D7090120O543281P269316R962708J1631061J2326911J6321280K0646404K1591216
7940A53382297K1903521K2097534J6499229P527421k755553j2560391j8714102
7933A87379956k3627883k3761695k1100887j9145614j5344814j2200795r898730
7926F2299538q027364m417228l838091m389675l878078j463384R00243K61572
7918C7447533m0041P13752O63954k75273n8017N93379o72754j678771j598854
$$ y = [20522625, 21183152, 20877114, 20486400, 19814818, 18156325, 17327224, 17485028, 16743158, 16773524, 17313941, 17082565, 15740866, 13832723, 12664593, 12412730, 13708427, 16149396, 18640210, 20868457, 21793763, 23692685, 26948371, 31795861, 37557965, 42056151, 47090120, 53633401, 60902717, 70865425, 82496486, 94823397, 111144677, 131791081, 153382297, 175285818, 197383352, 213882581, 221410002, 218654449, 206094058, 187379956, 163752073, 139990378, 118889491, 99743877, 84399063, 72198268, 62299538, 54272174, 49854946, 46016855, 41627180, 37749102, 36285718, 37185961, 37447533, 37407492, 38121244, 38785198, 38509925, 38451908, 39045287, 38372533, 36693762, 35094908]
7909C5094908n19545j127804j471994p67848J94188P59200K300009K843928K828144
7900D0133186K004175J937729L700122L716580L834727O024820P322807P660125
7892G6334271Q880294J2186976J5391431J8777848K2573042K7955166L5525919
7885B17624947M1476342M4333988M6086010M2644501L1867497J5555534n064873
7878D34523946k3647467l8431400m6975251m7754907m4711714l9502147l2018793
7871A61482267k5640623k0431131j5440833j1181981q652935o755697o359994
7864F7019073m620418k008705j771091j36667K264695P51666l62753k76097j570583
7855E9289120k497245K63244r77127l370866k683890k954411k647465o86386K022601
$$ y = [35094908, 34575363, 33447559, 31975565, 31207717, 31401905, 32161105, 34461114, 37305042, 40133186, 42137361, 44075090, 47775212, 51491792, 55326519, 61351339, 68674146, 76334271, 85214565, 97401541, 112792972, 131570820, 154143862, 182099028, 217624947, 259101289, 303435277, 349521287, 392165788, 424033285, 439588819, 434523946, 410876479, 372445079, 325469828, 277714921, 233003207, 193501060, 161482267, 135841644, 115410513, 99969680, 88787699, 80134764, 73379067, 67019073, 62398655, 60389950, 58618859, 58482192, 60746887, 61498553, 61135800, 60859703, 59289120, 56791875, 57055119, 56077992, 52707126, 50023236, 47068825, 44421360, 43734974, 45757575]
7846D5757575L422094M051426J572469K95355J792857J757399K436710N172769
7838F6258654O608732P748048R501267J0555210J2671060J7259102K2420959K7316301
7830A80339333L3851580M1072222M7984925N4856435N5334816N1371952L8410920
7823E03222183J6665807q688737l1118365m7702440n5336765n6494019n5149644
7816B65398020m6825888l7405243l0778244k3449876j6627465j1915919r256932
7809H9138453q153949o507987n365028k713758k829124k877791j076070j404005
7801E8210741k486522l831794m452255k049954j689186k285033m34151K56056
7793D1237902k077782j509551O56706J815763K094215L770398K896201N8790J735376
$$ y = [45757575, 49179669, 53231095, 54803564, 55098919, 56891776, 58649175, 61085885, 66258654, 72867386, 80615434, 90116701, 100671911, 113342971, 130602073, 153023032, 180339333, 214190913, 255263135, 303248060, 358104495, 413439311, 464811263, 503222183, 519887990, 511199253, 480080888, 432378448, 377041683, 320547664, 265398020, 218572132, 181166889, 150388645, 126938769, 110311304, 98395385, 89138453, 80984504, 74476517, 69111489, 66397731, 63568607, 60690816, 59614746, 58210741, 55724219, 51892425, 47440170, 45390216, 43701030, 41415997, 40981846, 41237902, 39160120, 37650569, 38307275, 40123038, 42217253, 45987651, 48883852, 48942642, 50678018]
7784E0678018K507254L654047N333074O928093P214331P706114J0386287J3216159
7776A07623377J6042483J8570037K2870291K7537652L3509047M0653470M4123190
7769C10929547M4759867M1024693L0410004J4130144o829270k7266795m0445984
7762C66712206m7620676m7729318m3410347l7948636l2221158k5570026j9983182
7755A12228863j5708763j0732545o377840o411171n307018l333866k845168Q7887
7747F1600379K597165K367110L273496M745004N207382M601459L953679K228399
7739I0574073j298421n648253p525548p276971p793316o253412l874123k404812
7731D8499217k075785m03654n05621j343082j061041n90725N4857k86101J013327
$$ y = [50678018, 53185272, 56839319, 62172393, 69100486, 76314817, 84020931, 94407218, 107623377, 123665860, 142235897, 165106188, 192643840, 226152887, 266806357, 310929547, 355689414, 396714107, 427124111, 441254255, 434424985, 407158190, 366712206, 319091530, 271362212, 227951865, 190003229, 157782071, 132212045, 112228863, 96520100, 85787555, 79409715, 72998544, 67691526, 64357660, 61512492, 61600379, 64197544, 66564654, 69838150, 74583154, 79790536, 84391995, 88345674, 90574073, 89275652, 83627399, 76101851, 68824880, 61031564, 54778152, 50904029, 48499217, 46423432, 46019778, 45514157, 44171075, 43110034, 42519309, 42574166, 42288065, 43301392]
7722D3301392L875708O476248Q213374Q428768P776686J0877552J4950284J7161635
7714A21061647K0053764K1171620K1477630K0683726J4235078M782967n009481
7707B18456951j3395737j9617293k3616187k3933491k1858622j9709917j7211296
7700G9114408j1894686q954974q929951r053766n393344l468420l263848j993155
7692B6162264l318860k975700j564826j572271j063727N10369J9754j833052j409486
7683A2954465j14047J185787P21734k77572j278734m68263j216794j812318j104003
7674H590255J60687P78439J723922L22828J279829K101947J950285J818359R59253
7665A9685804k19615k88881J891091J998311L779848N388337N612026N054667
$$ y = [43301392, 47177100, 53653348, 61866722, 70295490, 78072176, 88949728, 103900012, 121061647, 141115411, 162287031, 183764661, 204448387, 218683465, 223466432, 218456951, 205061214, 185443921, 161827734, 137894243, 116035621, 96325704, 79114408, 67219722, 58264748, 49334797, 40281031, 34887687, 31419267, 28155419, 26162264, 22843404, 19867704, 18302878, 16730607, 15666880, 16177249, 16197003, 14363951, 12954465, 12840418, 14026205, 14747939, 14470367, 13191633, 12723370, 11506576, 9694258, 8590255, 8750942, 9529381, 11253303, 11576131, 12855960, 14957907, 16908192, 18726551, 19685804, 19466189, 19177308, 21068399, 23066710, 26846558, 32234895, 37846921, 42901588]
7657D2901588N973922P198979P126554N348490L107050o14281k354126k748258
7649F5939918m542621o854364p232943o351728p163086o166881l655037l516677
7641B0456581n945501m276868r17452P7215O89301P55347j361070l77449j71498
7632H928606j421160k04166m00809j140537j67527L25729P48253O40437k3085
7623G285741j009423K53195j56140n59669q90957j030933m79169p40871N54347
7614C226121J389906l72476j500815j791569J70532J537837p4211J167971N38118
7605D291414M40574J051056K06110j247689j890643J27155K489885P00663O8115
7596F236640K71971K78719q57245j669195J15503k52448j450452j332197l36221
$$ y = [42901588, 48875510, 56074489, 63201043, 68549533, 71656583, 71042302, 68688176, 65939918, 61397297, 54542933, 47309990, 40958262, 33795176, 27628295, 23973258, 20456581, 14511080, 10234212, 9316760, 9393975, 10083276, 10838623, 9477553, 9100104, 8928606, 7507446, 7303280, 6902471, 5761934, 5594407, 5920136, 6668389, 7308826, 7285741, 6276318, 6529513, 6373373, 5813704, 4922747, 3891814, 3412645, 2671774, 3226121, 4616027, 4243551, 2742736, 951167, 1121699, 2659536, 2585325, 3753296, 4291414, 4731988, 5783044, 5989154, 4741465, 2850822, 2977977, 5467862, 6168525, 6236640, 6508611, 6787330, 5930085, 4260890, 4376393, 4123945, 2673493, 1341296, 1005075]
7587A005075R42547Q05478m82765m23592r0187o27753j997964j748994J072319
7578a545836J959144J354519O82159m19355j591675j255894n43294l09662O20895
7569a048999O61010n99974N01628J366102J650376J543998J264977K23224j912769
7560C649573p58297K162168L72099K78970L78040L53144o33544r89516K19154
7551E031791R97803J229503J926761j24566p49476N5137O00459j227125n51955
7542G188332J489544J120152j148956r46084M31361N45093m625j658370j244434
7533E772013J368713K085115L507252K851614K029126J642927J661497K761306
7525B3679563K498127M221111O842339Q273327Q226265M964673P20067k346771
$$ y = [1005075, 1947622, 2753100, 2270335, 1846743, 1756556, 1128803, -869161, -2618155, -1545836, 413308, 1767827, 2449986, 2030631, 438956, -816938, -1360232, -1669894, -1048999, -387989, -987963, -486335, 879767, 2530143, 4074141, 5339118, 5562342, 3649573, 2891276, 5053444, 5425543, 5704513, 6082553, 6435697, 5802153, 4812637, 5031791, 6029594, 7259097, 9185858, 9061292, 8311816, 8366953, 8967412, 7740287, 7188332, 8677876, 9798028, 8649072, 7702988, 8134349, 8679442, 8674817, 7016447, 5772013, 7140726, 9225841, 12733093, 15584707, 17613833, 19256760, 20918257, 23679563, 26177690, 30398801, 37241140, 45514467, 53740732, 58705405, 59425472, 57078701]
7517E7078701n574615o982772p002842n261355m538059m053232m042585l187282
7509A6435959j480254r86208l185345l123672p43918N74070J40064J431005j726039
7500G335662j719521O63686J064101J631302j546310k788301j429598l52346r44486
7491A914189L62968p15154j717886M6950l88522r4423Q81571o71944j437058J075904
7481g43405J404791Q72999J145299R70284Q88501n65403J78665m89510j891654
7472A770567q20J473856R18841Q58690j11099r03554p05241p66187p67378n41066
7462A226609k19545p73164J88101j36117l82958J266196J885022p9973j639699
7453A334472q79257J684428J895682p73706k010594o93535J226525P73484p24089
$$ y = [57078701, 51504086, 44521314, 37518472, 32257117, 27719058, 23665826, 19623241, 16435959, 14955705, 13969497, 10784152, 7660480, 6916562, 7490632, 7630696, 9061701, 7335662, 5616141, 6279827, 7343928, 8975230, 7428920, 4640619, 3211021, 2858675, 1914189, 2277157, 1562003, -155883, -108933, -497455, -591878, 289693, -382251, -1819309, -743405, 661386, 1534385, 2679684, 3649968, 4538469, 3973066, 4151731, 3662221, 1770567, 1769747, 3243603, 4162444, 5021134, 4910035, 4006481, 3301240, 2535053, 1767675, 1226609, 1007064, 233900, 422001, 285884, -97074, 1169122, 3054144, 2974171, 1334472, 455215, 2139643, 4035325, 3261619, 1251025, 557490, 1784015, 2557499, 1833410]
7444A833410j794403k109795o10479L2630J192153J672088J244887J150349O00500
7435C211340n25428m72622j281804j633769j177976l8369J201179R57693j430004
7426a189760l20466J039752J202504K60565o61609j295187q1704O90528Q42532
7417D87155J35724K23905J035328o04002m79482O12572N68577M88892q91137j330107
7407B47425j672822j656501j069520L40783K174441K096899N67655M47996k56554
7398A219802l18714k90141p96275l18969k051825j197044J929573J195949j42909
7389g70553k53717j262419q11813r51923m91042N73702J766437J844513K466707
7380B109892J804894J648787J93286j481333n29542j250404k78898j34319k352696
$$ y = [1833410, 39007, -2070788, -2681267, -2648637, -1456484, 215604, 1460491, 2610840, 3211340, 2685912, 2213290, 931486, -702283, -1880259, -1918628, -717449, 240244, -1189760, -1510226, -470474, 732030, 992595, 330986, -964201, -1045905, -355377, 487155, 622879, 846784, 1882112, 1278110, 798628, 1411200, 1979777, 2468669, 1577532, 247425, -1425397, -3081898, -4151418, -3810635, -1636194, 460705, 1028360, 1476356, 1219802, 901088, 610947, -185328, -504297, -2556122, -3753166, -1823593, -627644, -770553, -1024270, -2286689, -3098502, -4050425, -4541467, -3967765, -2201328, -356815, 2109892, 3914786, 5563573, 5756859, 4275526, 3745984, 2495580, 2216682, 2082363, -270333]
7371b70333k159733m62261P68477L373891L245491j83216k33242J988688O02705
7362F670467m99203j11562j429570j335703Q2690j97806r89116K24281j82661
7353B231817k262837j277973l01250r09931r2269k84184J045750R48274o57958
7344a560561J82083K82112J01720J495940m78234j021611J098582J398562o69635
7335H28958o08902l70498o07503O10840l38224o71133j349058j690743Q91174
7326c305089J951191J365600j319878p78123J854711K652646L41239j691639l88022
7317F82636J0610J182471R11635j002027j827140J37420l79661j030458P71815
7308e42699J462871K097097O78534k435592k346859q76049R22413J479456M98837
$$ y = [-270333, -2430066, -2892327, -2123850, 1250041, 4495532, 4312316, 4079074, 6067762, 6670467, 6171264, 6059702, 4630132, 3294429, 3377119, 3179313, 2190197, 2414478, 2231817, -31020, -1308993, -1610243, -2520174, -2612443, -2896627, -1850877, -902603, -1560561, -1378478, -1096366, -994646, 501294, 23060, -998551, 100031, 1498593, 828958, 220056, -150442, -757945, -147105, -485329, -1156462, -2505520, -4196263, -3305089, -1353898, 11702, -1308176, -2086299, -231588, 2421058, 2762297, 1070658, 682636, 693246, 1875717, 2787352, 1785325, -41815, 95605, -284056, -1314514, -542699, 920172, 3017269, 3695803, 1260211, -1086648, -1962697, -1040284, 439172, 938009]
7299I38009R1843j293969j243901k01681r88498M89090J155034P3247K58106J393314
7289F70594J230704m95110p25130Q27041O12874j001166j207002p77910r13006
7280a778111P72291J072148K03957N58688K70893j554233l21233J246254J006376
7271A477030O1031k006728j295076M25363M74111N95282p99860N8343J469961
7262D59457M13333j13784K28799l22248m27979N72429l55312L31967J550702M30123
7252B767487n54755j195124r74647Q28740L92775n38951m42811j05423k12266
7243c4975l47507k3452M87268K857363K046107m74630r46724j822461m70338j223220
7233D7431j037678k870J86886k71027J435718J479681L45835m57154M33688O94963
$$ y = [938009, 1029852, -264117, -1508018, -1709699, -2698197, -2209107, -1054073, -980826, -722720, 670594, 1901298, 1406188, 681058, 1508099, 2120973, 1119807, -87195, -865105, -1778111, -1005820, 66328, 270285, 828973, 1099866, -454367, -775600, 470654, 1477030, 1538061, -468667, -1763743, -1338380, -864269, -268987, -1068847, -1010504, 459457, 872790, 759006, 987805, 665557, 237578, 810007, 454695, 786662, 2337364, 2767487, 2212732, 1017608, 42961, 871701, 1264476, 725525, 282714, 177291, -34975, -382482, -405934, 81334, 2938697, 4984804, 4510174, 3563450, 1740989, 1270651, 47431, -990247, -993117, -806231, -1077258, 358460, 1838141, 2183976, 1726822, 2160510, 2855473]
7223B855473r12676j650185P8817J852661J516087o40446j205040P8152O61935
7214B634778m4770o8645j944094n26193J754742M12346j253564r58621n91931
7205e85952r38907j239102j420705l63440n79792j276094N74767J981553K078148
7196a769524K296045K652284J850939n09075k203857j043174R4379q12836j187110
7187f31929o66509K54367N52282l1434n78387m75485J68563Q59392K15732k75059
7177f08467j005013j910246P1768J173389J032453P82853J126951N06342k70577
7168H99453O86342J19904l37504l96549Q824j519105q8777J958296J803883J237337
7158D372104o05317m59311m19723k29082p98515j961567j752507J60297J092543
$$ y = [2855473, 1942797, 292612, 371429, 2224090, 3740177, 3099731, 1894691, 1972843, 2634778, 2590008, 2521363, 577269, 51076, 1805818, 2218164, 964600, 5979, -585952, -1524859, -2763961, -4184666, -4548106, -5127898, -6403992, -5829225, -3847672, -1769524, 526521, 3178805, 5029744, 4520669, 2316812, 1273638, 1368017, 555181, -631929, -1298438, -1044071, -491789, -523223, -1101610, -1577095, -1408532, -549140, -333408, -608467, -1613480, -3523726, -3451958, -2278569, -1246116, -463263, 663688, 1170030, 899453, 1585795, 1705699, 1368195, 971646, 980470, -538635, -627412, 1330884, 3134767, 4372104, 3766787, 3307476, 2887753, 2658671, 1860156, -101411, -1853918, -1693621, -601078]
7149f01078L14601J085179J017664O24910n38109j254974q60699O65995O11663
7140A065152J330749O61960j112171j210123J788437J464662K35730m47530m99409
7131C277457r59323k0444N35765J08242j176331j165844j839715l86620J375286
7122b51527P0058j029317N34182l18173k98930J021287K2676j216804m77486J189141
7112g54893Q17875k27923j047514l24282J062163K733029N43807J27610J948642
7103D878514J118822n18850k25386N38350l04130j127443k99061L6431j522621
7094B574626n49362N55275L54681R06758J4492j509428k348722j613753P2029
7085a543404J851090J383733J392484R09396p79889j936146j327324M19955J404181
$$ y = [-601078, -286477, 798702, 1816366, 2441276, 1903167, 648193, -212506, 453489, 1065152, 2395901, 3057861, 1945690, 735567, 2524004, 3988666, 4224396, 3776866, 3277457, 2318134, 2297690, 2833455, 2941697, 1765366, 599522, -1240193, -1626813, -251527, -181469, -1210786, -676604, -994777, -1293707, -272420, -249744, -1466548, -1944034, -754893, 62982, -164941, -1212455, -1536737, -474574, 2258455, 2802262, 2929872, 4878514, 5997336, 5478486, 5253100, 5791450, 5487320, 4359877, 4060816, 4097247, 2574626, 2025264, 2580539, 2935220, 3841978, 3856470, 2347042, -1680, -1615433, -1543404, 307686, 1691419, 3083903, 3993299, 3213410, 1277264, -50060, 369895, 1774076]
7076A774076K16058k393227j159709J141184J218141o63653p86553K241236J640724
7067C228277n83731j213403L2406J93721l82876K46707k91433l04493J026508
7058A951683j65082n23394j512112k597322j550738N61375J881906K294290J582396
7049A923002O57036j9569j387007j231804K17162J122982p59579l38109l71686
7040a87572j703470K95989J721068M18570O18903j89852n94541K223204J913956
7031D516255r80738j336839j253429j017713R67498Q47816j235871Q4811O64211
7022A256001j084764j048220m15602J54592N93229k97591l17174J067254J778208
7013A685933J008852j124766j340505k01145Q95310J437231n3375j257526r98406
$$ y = [1774076, 1990134, -403093, -1562802, -421618, 796523, 132870, -653683, 1587553, 3228277, 2644546, 1431143, 1463549, 1657270, 1274394, 1521101, 1229668, 925175, 1951683, 1786601, 1263207, -248905, -2846227, -4396965, -3835590, -1953684, 340606, 1923002, 2580038, 2560469, 1173462, -58342, 158820, 1281802, 522223, 184114, -187572, -1891042, -1595053, 126015, 544585, 1163488, 973636, 379095, 2602299, 4516255, 3535517, 2198678, 945249, -72464, 895034, 1742850, 506979, 591790, 1256001, 171237, -876983, -1292585, -1137993, -544764, -842355, -1159529, -92275, 1685933, 2694785, 1570019, 229514, 28369, 923679, 2360910, 2307535, 1050009, 51603]
7004E1603j583335j2561Q3790N11497J860886J717687O2848n29462O70949J139859
6994C973761J076903k00473j569906j308293M27798J606974R86288J953936K11941
6985G158929j656891o44255n76344k186883j779795K11628J103234L64204o69950
6976A323877n92852N13203m40976o34912l76708J5374p14738J52428J774417N47634
6966A566747L50132P44031q3934P99821M43551j547687j288583q94768J95268
6957B84578J246249R47268q70430k49267q11597j568964l69504j26530J147153
6948c71044L712491K60313j433785l48505J119578P82029j670642k726381k993858
6939c669804L99619L746430J456504q90469j328396q46304k56644M38377R65205
$$ y = [51603, -1531732, -1544293, -1460503, -949006, 911880, 2629567, 2692415, 2162953, 2833902, 3973761, 5050664, 4850191, 3280285, 1971992, 2399790, 4006764, 4993052, 6946988, 7158929, 5502038, 4857783, 4281439, 2094556, 314761, 526389, 1629623, 1993827, 1323877, 731025, 1244228, 803252, 168340, -208368, -192994, -907732, -755304, 1019113, 1566747, 1916879, 2660910, 2576976, 3376797, 3820348, 2272661, 984078, 89310, 284578, 1530827, 2478095, 1607665, 1358398, 546801, -1022163, -1391667, -1518197, -371044, 3341447, 3601760, 2167975, 1819470, 2939048, 3721077, 2050435, -675946, -3669804, -3270185, 476245, 1932749, 1042280, -286116, -1132420, -1389064, -950687, 14518]
6930A4518p10847q60434M53097O33003P75621P49199N33906j408195r93075R57609
6920A44402l61049L6154Q64383P71280j6593m89182l69949M57994J261163M8016
6910B346619R59670J156778K89887n81523l200410j537666J55849n85852r31574
6901a928222l22141J085208J103251P41775m63679r60375l38236J042817l88723
6892d28325K88714R66235k03618k40329K309346J864240j606611n13418J343872
6883C780106M70826R6975k15772j051317m8254L03191m0844j731835k606191k489902
6873c533017m89570l556J037609J752106N17341j575180l60359n98445j154338
6864d407409M56329L05547Q1158L72246P44084J736812J973843K315510J319238
$$ y = [14518, -696329, -1556763, -1103666, -470663, 304958, 1054157, 1588063, 179868, -813207, 144402, -216647, -180493, 683890, 1455170, 1438577, 949395, 579446, 1037440, 2298603, 2346619, 3306289, 4463067, 4752954, 4171431, 971021, -566645, -410796, -996648, -1928222, -2250363, -1165155, -61904, 679871, 216192, -744183, -1082419, -39602, -428325, -139611, 826624, 623006, 382677, 2692023, 4556263, 2949652, 2436234, 3780106, 4250932, 4347907, 4132135, 3080818, 3032564, 3335755, 3294911, 1563076, -1043115, -3533017, -4022587, -4026143, -2988534, -1236428, -719087, -2294267, -2654626, -3253071, -4407409, -3951080, -3645533, -3564375, -3192129, -2448045, -711233, 1262610, 3578120, 4897358]
6855D897358j766204l428145k714827J32995J579226Q98749l264j789900k015727
6846d209739l0858J171359K90423j526369q94881J148770K065034J385206J02108
6837d98947n51754j516605n55889j05168l50418Q09196k01015r90588K86603N59510
6827c115075J932636k92972j383286L2688J709447J382569P85973Q18937J92364
6818B063281L51550J50874J34645j230693j898871j08220O58584r07296l02490
6809a088636N44433j074220O96055O38759l97908n6468j593792j277136k28939
6800c837852J026479J114287R28101j85807n97240J722638J461835L66626q50298
6791A148769j820911K54281L2026q86155j40129O97518M74369j491088j561531
$$ y = [4897358, 3131154, -296991, -3011818, -2878823, -1299597, -400848, -404112, -2194012, -4209739, -4240597, -3069238, -2778815, -4305184, -5200065, -4051295, -1986261, -601055, -498947, -1050701, -2567306, -3123195, -3228363, -3578781, -2769585, -2970600, -3961188, -3674585, -3115075, -1182439, -1475411, -2858697, -2826009, -1116562, 266007, 1051980, 1870917, 2063281, 2414831, 2565705, 2700350, 1469657, -429214, -537434, 121150, -786146, -1088636, -544203, -1618423, -922368, -283609, -681517, -737985, -2331777, -3608913, -3837852, -2811373, -1697086, -768985, -954792, -1552032, 170606, 1632441, 1999067, 1148769, -672142, -417861, -385835, -1271990, -1412119, -714601, -240232, -1731320, -3292851]
6782c292851L06690p14089n20887J650959J192480J188368N71452r45655j219545
6773a783078j436865k44871J048047J598712K072529J392201o80543j957652j743074
6764a734594n05918R10216J122910P55054M00673n97481K32830n12843n31705
6755d60858J544793O80370p40199n78220m91674J01405m0034k71828J426555K477170
6745C647480R34954m00526K024O31935J75537j09071j426819m23063p37633j071627
6735A223191r37942o72861j315019k188681k33630J353583J866329J397191R40794
6726A432955P41077K43530N12277p72862k127214k959393k88966K065481m660
6717a157775J79177m2005m68560j91966P19671R74718Q7Q79490m36171k698826
$$ y = [-3292851, -2986161, -3700250, -4221137, -2570178, -1377698, -189330, 382122, -563533, -1783078, -3219943, -3464814, -2416767, -818055, 1254474, 2646675, 1966132, 8480, -1734594, -2240512, -1330296, -207386, 547668, 948341, 350860, 583690, 70847, -460858, 1083935, 1764305, 1024106, 445886, -45788, 55617, 15583, -256245, 1170310, 3647480, 4582434, 4181908, 4183932, 4815867, 4991404, 4882333, 3455514, 3032451, 2294818, 1223191, 285249, -387612, -1702631, -3891312, -4124942, -2771359, -905030, 492161, 1432955, 2174032, 2417562, 2929839, 2156977, 29763, -2929630, -3218596, -1153115, -1157775, -978598, -1020603, -1489163, -1681129, -961458, 13260, 13347, 892837, 456666, -2242160]
6707b242160K42840J291372N50540l46583j92722J059518k137779j930222Q45465
6698b859731J507810K507339K559002P66557q86165j289269r21011J37532J102318
6689B624382j294036o90700M60359N63297o93795n71601j01806j193717j48375
6680a045992r9992m19955J299363l07764j693586l67324N57752R94042Q63200
6671b20256R87834K014657J131125j23782q94022r7789J501108r99297k229087
6662A070491J76435J391529N54980m95331j878263j319827k97708P52283J088875
6653A043464n49687j411850O02251k24206p93368j335221j036982J843260J676359
6644a85980R38263Q64125j14897J134227J692486L02473p6892n44204O48897J68092
$$ y = [-2242160, -1999320, -707948, -157408, -503991, -696713, 362805, -1774974, -3705196, -2859731, -1351921, 1155418, 3714420, 4480977, 3594812, 2305543, 1384532, 1522064, 2624382, 1330346, 639646, 1100005, 1663302, 969507, 397906, 296100, -897617, -1045992, -1145984, -1565939, -266576, -574340, -2267926, -2635250, -2077498, -1083456, -220256, 767578, 2782235, 3913360, 3789578, 2895556, 2797767, 4298875, 3299578, 1070491, 1246926, 2638455, 3193435, 2698104, 819841, -499986, -797694, -45411, 1043464, 493777, -918073, -315822, -540028, -1333396, -2668617, -3705599, -1862339, -185980, 752283, 1616408, 1501511, 2635738, 4328224, 4630697, 4553805, 4009601, 4658498, 4826590]
6634D826590r38113j112266n20223q3721L30582j483951r52831J030961j58485
6625I38543j846696j477733J21495k48886n41862l38668N60046J896617r92272
6616a929416k037345q72534q69566k57497Q11655R43700K19887j016439p27286
6607e734841J283480J769916J016576J679979J182936j363064j512984j378245
6599c056247j218478n78660j45120j59525o2613P38348R70229J524185K710972
6590G23091K611344J473062q13860j104252j24533r35396j858339j916569m98268
6581b443720J027610J860896j09077k254213k499056j205764J023467J257190
6573c342667J984109J592158q39132O18672K481450P05517j392742k762561n16701
$$ y = [4826590, 3888477, 2776211, 2255988, 2172267, 2502849, 1018898, 66067, 1097028, 938543, -908153, -2385886, -2264391, -2513277, -3055139, -3393807, -2833761, -937144, -1929416, -3966761, -4839295, -5708861, -5966358, -5154703, -4211003, -3991116, -5007555, -5734841, -4451361, -2681445, -1664869, 15110, 1198046, -165018, -1678002, -3056247, -4274725, -4853385, -4998505, -5158030, -5220643, -4482295, -3512066, -1987881, 723091, 3334435, 4807497, 3993637, 2889385, 2764852, 1829456, -28883, -1945452, -2443720, -1416110, 444786, 335709, -1918504, -4417560, -5623324, -4599857, -3342667, -1358558, 233600, -605532, 13140, 2494590, 3200107, 1807365, -955196, -1471897]
6564a471897J636073J976165j062356k102993q37229N02598P9150J167072k89886
6555d03303r75816J153937R71833k45712o89441J81010L93401p2264K60169k58403
6545C15411K69143J549740L057502N95855n61502p06582j452714k579245l709541
6536c221933j155194J700609J756686j00143q2827P89169Q45937J40104j880196
6527a207788R5495N69446o2859J54689j843819k154351J175600J993486J598049
6518C17948J508577J209970j08741j543893o42864n6396J520827L79761k63368
6509B321821J406436J783713q76164k745797j183315J414913Q27878m91847j175389
6500A282249q04812j6378O73986O18476m75457j687818j627825Q7854q351K0988
$$ y = [-1471897, 164176, 2140341, 1077985, -1025008, -1862237, -1359639, -1280489, -113417, -403303, -1379119, -225182, 746651, 500939, -188502, -7492, 385909, 313645, 573814, 315411, 584554, 2134294, 5191796, 5787651, 5226149, 4519567, 3066853, 487608, -3221933, -4377127, -2676518, -919832, -1019975, -1102802, -313633, 532304, 672408, -1207788, -1112293, -542847, -605706, -451017, -2294836, -4449187, -3273587, -1280101, 317948, 1826525, 3036495, 2927754, 1383861, 740997, 684601, 2205428, 2585189, 2321821, 3728257, 5511970, 4635806, 1890009, 706694, 2121607, 2949485, 2457638, 1282249, 477437, 461059, 1135045, 1753521, 1278064, -409754, -2037579, -1949725, -1958076, -1937088]
6490a937088L01159R21580O26415p12244p43239L173k39021M39561Q13758J508250
6480I82304J842032O1986q27865j784052j89287Q13518q77721Q9445m40421j139996
6470a470057P00020P17347J333317J974677r8567j822511j121233q3628J10186
6461B39551J34693J199788J134613m85813m47314p33296j346384j256030p98839
6452b359031J990749L233069R02631k035790j213247j132528j529297l59481J305085
6443a197840m19221n02839R83627J428150J427872N5462k46188J12666k65066
6434A376623p90844k255399j259379k22453L24237J177911J523495R45553m0942
6425G78802r83830n48950J466782J102717q8976j117963j331776l52191P17965
$$ y = [-1937088, -1635929, -714349, -87934, -800178, -1543417, -1540244, -1779265, -1339704, -525946, 982304, 2824336, 2886322, 2058457, 274405, 85118, 898636, 20915, 110360, -330061, -1470057, -770037, -52690, 1280627, 3255304, 3156737, 1334226, 212993, 129365, 239551, 374244, 1574032, 2708645, 2222832, 1775518, 1042222, -304162, -1560192, -2359031, -368282, 2864787, 3767418, 1731628, 518381, -614147, -2143444, -2502925, -1197840, -1617061, -2119900, -1136273, 291877, 1719749, 1775211, 1529023, 1641689, 1376623, 585779, -1669620, -2928999, -3151452, -2827215, -1649304, -125809, 819744, 778802, -205028, -753978, 712804, 1815521, 1726545, 608582, -723194, -1075385, -357420]
6416c57420Q87162J305887R61460r40762j825147J12346Q3240p30982n47289K148318
6406A096813J978701m26063j91070J016685m58927j232732j361774l48740K93991
6397C66884k02981N49085J358812J013175q69869j100551j022517r35830j094462
6388a938254j325505J377856K161040k81555j35777K36077M75896J64349k33192
6379E00935k37113l66621J327017O12458k86821J4028j187491j839810k15208
6370a678626J104961J432310O49366L16241Q7451m54878j257588J65884R3259
6361D58380n05570k79811m91104N69299l2886L40352P64565J000525J841990J189518
6351D855258m37025j525699m51757n2482j260946j625248j207563p02663l78927
$$ y = [-357420, 529742, 1835629, 2797089, 1856327, 31180, 143526, 226766, -504216, -1051505, 1096813, 3075514, 2649451, 2458381, 3475066, 3016139, 1783407, 421633, 72893, 366884, 163903, 712988, 2071800, 3084975, 2215106, 1114555, 92038, -843792, -1938254, -3263759, -1885903, 275137, -6418, -142195, 93882, 569778, 734127, 500935, 263822, -102799, 1224218, 1836676, 1549855, 1563883, 376392, -1463418, -1678626, -573665, 858645, 1508011, 1824252, 1911703, 1456825, 199237, 365121, 458380, -47190, -327001, -818105, -248806, -281692, 58660, 823225, 1823750, 3665740, 4855258, 4418233, 2892534, 2440777, 2388295, 1127349, -497899, -1705462, -2408125, -2787052]
6342b787052j37999P77586Q25942k86811j22079K05074o15095k10607P23113l14158
6332a942086k94705J411425J246296j99136j446845q42287N35781R79573J191339
6323F39355L80759j230443j100427N13081n95624o39927k94451L98256J418701
6314e10720R06337j421042j049211l35005N19946L03704j649392k41898J581122
6305a896159K568588J603574j279077q45758k16089N34164J437393j019424o08210
6296B79002L03954J89444n32880n27271J341855R13951k69340j090103j130756
6287e22144r09343r14842R45993J103236j930473j888067L85858K817121J609912
6278F97251k42412n11725o9468M88984n98933j9703o29693j040142J59435r47798
$$ y = [-2787052, -2925051, -2147465, -1321523, -1608334, -1730413, -1525339, -2140434, -2351041, -1627928, -1942086, -2236791, -825366, 420930, 221794, -1225051, -2067338, -1531557, -551984, 639355, 1020114, -210329, -1310756, -797675, -1393299, -2033226, -2327677, -1929421, -510720, 395617, -1025425, -2074636, -2409641, -1889695, -1585991, -3235383, -3477281, -1896159, 672429, 2276003, 996926, 151168, -64921, 469243, 1906636, 887212, 279002, 582956, 772400, 239520, -287751, 1054104, 1968055, 1698715, 608612, -522144, -1431487, -2346329, -1400336, -297100, -2227573, -4115640, -3729782, -912661, 697251, 454839, -56886, -126354, 362630, -236303, -256006, -885699, -1925841, -1766406, -2714204]
6268b714204L78531P74295Q05474k08916p57082J820651M62699j249391n82397
6259a270340j766182R5189Q61863J075499P91335J33572o48491k3169o81266j81266
6249a613256j65940j049584K83644N90571q67211m75397N79505J214249P89224
6240g14195l43076j624291Q60417L926973Q23166o85981j983004j526440N87443
6231f78988N03485J15900J72225k84208l38059n30808J085000J204385j143875
6222A05057r90156J47351k98223o33588J88828K937148J992388N50494p33217
6213C266082j747466q10960m69702q50476k29872p94590j408176K86055J348029
6204a411076J615732N12205L30988m83787J292839O52731j074633L59878J234301
$$ y = [-2714204, -2335673, -1561378, -755904, -964820, -1721902, 98749, 561448, -687943, -1270340, -3036522, -2941333, -2079470, -1003971, -212636, -79064, -727555, -750724, -1431990, -1613256, -1779196, -2828780, -2545136, -1954565, -2821776, -3297173, -2717668, -1503419, -714195, -1057271, -2681562, -1821145, 2105828, 2928994, 2243013, 260009, -1266431, -678988, -175503, -59603, 112622, -171586, -509645, -1040453, 44547, 1248932, 105057, -885099, -737748, -1035971, -1669559, -1480731, 1456417, 3448805, 3999299, 3266082, 1518616, 707656, 237954, -612522, -842394, -1636984, -3045160, -2759105, -1411076, 204656, 716861, 1047849, 564062, 1856901, 2509632, 1434999, 1794877, 3029178]
6195C029178j98400n56926P57207k24231k071741j313985K129614J875134J57816
6186C583666p03739q36032j393721p32842n3832N78552J14162k594427k347716
6177d385929r34158K72786R87111P6576O08086K7176L7213J521938J659540k325
6167a31986O35552M89207L78238K2838k156323l345924j282016K58361Q64699
6158d267354P95747l11971j30498n68021Q84185J770412P06895J104113q28767
6149h45259j871127j359882K0678J759749J313985J444642R73545k20842k6906
6140A188583N03498N86959O63057J94486R10328M1844k421298k040937n52904
6131i26384j120302r68225P1952K471263K752972J284627N53493o007j216481
$$ y = [3029178, 2830778, 2273852, 3031059, 2806828, 735087, -578898, 1550716, 3425850, 3583666, 2879927, 2043895, 650174, -82668, -136500, 442052, 556214, -2038213, -4385929, -5320087, -5047301, -4060190, -3983614, -3375528, -3348352, -3311139, -1789201, -129661, -131986, 503566, 992773, 1371011, 1393849, -762474, -4108398, -5390414, -5132053, -4267354, -3471607, -3783578, -3914076, -4482097, -3597912, -1827500, -1120605, -16492, -845259, -2716386, -4076268, -4055590, -2295841, -981856, 462786, 1436331, 1215489, 1188583, 1692081, 2279040, 2942097, 3136583, 4046911, 4088755, 1667457, -373480, -926384, -2046686, -3014911, -2942959, -471696, 2281276, 3565903, 4119396, 4113389, 2896908]
6122B896908l069663j622297P35709J270556R28241N63610k64498k97122O30775
6113A772219K040563J287021j766851k978489j119913K198037R26775L83909L44733
6104C088004o35731L4255r98347n79177k137100j894012O97504J529004J851122
6095I55522J155148J024096J119838P35209P84850N48865q91113k050632j255279
6086B126504J43682o3016j12424l61979r50126R01255K428644p2526k585426k937501
6076a482913p80094L73378P20385P16416J2444q84229r96369j54500K81500J215510
6066i78472R05485j43705P05155M12632l03063j17958n38590q58399r68674o07635
6056b493224R1707O93958Q24219O88014R93737M3073j146076K04879l40621r58886
$$ y = [2896908, -172755, -1795052, -1059343, 211213, 1139454, 1703064, 1438566, 1141444, 1772219, 3812782, 5099803, 3332952, 354463, -765450, 1432587, 2359362, 2743271, 3088004, 2452273, 2486528, 1488181, 909004, -1228096, -3122108, -2424604, -895600, 955522, 2110670, 3134766, 4254604, 4989813, 5774663, 6323528, 5432415, 3381783, 2126504, 2270186, 2207170, 2094746, 1732767, 782641, 1683896, 4112540, 4040014, 1454588, -1482913, -2263007, -1889629, -1169244, -452828, -440384, -1324613, -2320982, -2475482, -2193982, -978472, -72987, -216692, 488463, 901095, 598032, 480074, -58516, -916915, -1885589, -2493224, -2401517, -1707559, -883340, -195326, 798411, 841484, -304592, -99713, -440334, -1399220]
6046a399220j039648j632114j766987m14277R02969J503674J233094J67730Q40008
6037a604771k15581k01400P41376k85775j629247p74838n67884J09512J498711
6028b929897Q06677O6606p05973N29940R78956R62121P82076O6671J12292J648804
6018B318273K6319j317512j416965k316685j672754J009359K896582J668241k31916
6009I62942m67222J391239J25939p74753N91187R57161j163134l057023q39552
6000b273216J778693M46103j305810k29932l24575M26057M30379j90341k14073
5991a456715J75201P61225L48801j965329j429176J497304k75843p37563l69475
5982c451570n2557J280576J282486J897635J346403k67250j11473K11351r94700
$$ y = [-1399220, -2438868, -4070982, -5837969, -6252246, -5349277, -3845603, -2612509, -2444779, -1604771, -1820352, -2021752, -1280376, -1566151, -3195398, -3970236, -4538120, -4428608, -2929897, -2123220, -2056614, -2762587, -2232647, -1253691, -291570, 490506, 557177, 669469, 2318273, 2344592, 1027080, -389885, -2706570, -4379324, -3369965, -473383, 1194858, 962942, 495720, 1886959, 2012898, 1238145, 1829332, 2786493, 1623359, -1433664, -2273216, -494523, -48420, -1354230, -1584162, -1908737, -1482680, -1052301, -1242642, -1456715, -1281514, -520289, -171488, -2136817, -3565993, -2068689, -2344532, -3082095, -3451570, -3504127, -2223551, -941065, 956570, 2302973, 2035723, 1924250, 2135601, 1140901]
5973A140901j361304r78738j253260r87096j055211N57062P51337N84370R66750
5964a635189j209228J06955J062798N66056J861025J826737p18927j438674N31483
5955I53036Q45284N01916N53155N25696q31712r39755M55164l56208m18031o24677
5945F63868k048652j833723R12179L357149K042911m92039o90020J25887j77902
5936A859658M4488J138355J57445n66225j117742j207763j720564j528878n66248
5927c507474N79235J460403J559232K27959L77967K43299R4564J86777K77677
5918A499639O78744K41770j400080n32907J200411l22024j329379j316411q31083
5909b111320o80379l23024O8475n09428r95646M47449K50359N12712K14632m13430
$$ y = [1140901, -220403, -1199141, -2452401, -3439497, -4494708, -3937646, -3186309, -2601939, -1635189, -2844417, -2737462, -1674664, -1108608, 752417, 2579154, 1860227, 421553, 953036, 1798320, 2300236, 2853391, 3379087, 2547375, 1607620, 2062784, 1706576, 1288545, 663868, -1384784, -3218507, -2306328, 1050821, 3093732, 2601693, 1911673, 2037560, 1859658, 1904146, 3042501, 3199946, 2633721, 1515979, 308216, -1412348, -2941226, -3507474, -2928239, -1467836, 91396, 319355, 697322, 940621, 1035185, 1221962, 1499639, 2178383, 2420153, 1020073, 487166, 1687577, 1365553, 36174, -1280237, -2111320, -2791699, -3114723, -3046248, -3555676, -4551322, -4103873, -3853514, -3340802, -3126170, -3539600]
5899c539600l51308L46045J076755J073658K22239K37083J511834J547880p34620
5890A389966k766358j978540p72473R70125J962986O12646j467724j988181j635532
5881e673085J53298J888753K576253Q29142o0385P05637R91802j562179k098176
5872b248940L94603L36306j39308L18935P36573j13267j120799r06911l93702
5863c136510M75908J014750O78275l63833k246503q17649R34236J085964M59917
5854a915445J146171K449671K245489R61332J9321m46639o90797j71521L52343
5845C949925l20785j158555m69701j746610j310988k81085J77609M09887j65513
5836i15816R0956J111562J589178L77410p31583j383940J328667J634160j471920
$$ y = [-3539600, -3890908, -3544863, -2468108, -1394450, -1172211, -935128, 576706, 2124586, 1389966, -1376392, -3354932, -4127405, -3157280, -1194294, -581648, -2049372, -4037553, -5673085, -5519787, -3631034, -1054781, -225639, -286024, 419613, 1411415, -150764, -2248940, -1854337, -1518031, -1657339, -1338404, -601831, -715098, -1835897, -2742808, -3136510, -2660602, -1645852, -967577, -1331410, -3577913, -4395562, -3461326, -2375362, -1915445, -769274, 1680397, 3925886, 4887218, 4906539, 4459900, 3769103, 3597582, 3949925, 3629140, 2470585, 2000884, 254274, -1056714, -1337799, -1160190, -750303, -915816, -824860, 286702, 1875880, 2253290, 1521707, 137767, 1466434, 3100594, 1628674]
5827A628674j545694P5843q08880o71346k20496p06726j456758k39526K010042
5818a934867J793361m56683j345583j367013j59179J990985M71448r82236L45990
5809a643777J131516J693906n70228j397453j57470k46405m43638j37884Q66781
5800i04652J284426j89506m52389l91339L14411Q47963o2668j614022j08618L089078
5790A812684R48092k56251L27189P35947R5739m90079j391210j641821n37043
5781c96753k33064j502367m89836J878507J966721r47330k502820k44102N72340
5772a898704K79269J239194J550943m50489m77964K34293J873245J813579J83074
5763D346440j611540j435194k339519j752047O44133J625025R25652o86283j603465
$$ y = [1628674, 82980, 158823, -650057, -1321403, -1541899, -2248625, -3705383, -3944909, -1934867, -141506, -598189, -1943772, -3310785, -3469964, -1478979, -1007531, -1989767, -1643777, -512261, 1181645, 611417, -786036, -943506, -1189911, -1633549, -1771433, -904652, 379774, 190268, -262121, -653460, -339049, 508914, 446246, -1167776, -1276394, 1812684, 2760776, 2504525, 2831714, 3567661, 3663400, 3173321, 1782111, 140290, -396753, -629817, -2132184, -2622020, -743513, 1223208, 275878, -2226942, -2471044, -1898704, -1619435, -380241, 1170702, 720213, 242249, 476542, 2349787, 4163366, 4346440, 2734900, 1299706, -1039813, -2791860, -2147727, -522702, 402950, -283333, -1886798]
5754a886798l74575n74867n18511P24666L124783M482880J553572j498287j970477
5745C062386L58666L391717M55819k355281j806084n69357O40411k30711j214617
5736A732949k162360j037223k73428l78695J404697J146637r34140p64246P55063
5727e10746J538105L42402p60830j93581J99802n60040J11584n387O33163P68523
5717A562995o00471q55836J027647M40868j964184j656038r25803K67975J052679
5708a650168q8361M55239m76584j1654J242257K892255J928389k62981m68355
5699C560037n86976r79905p49970R64105n39649r54958p29378k87778Q68979k71534
5689B92973j756809j692723K652P78766o10980R86878J006918L35000J768905
$$ y = [-1886798, -2261373, -2836240, -3354751, -2630085, 494698, 4977578, 6531150, 5032863, 3062386, 3421052, 6812769, 7268588, 4913307, 3107223, 2537866, 3178277, 2947566, 1732949, -429411, -1466634, -1740062, -2118757, -714060, 432577, -501563, -1265809, -510746, 1027359, 1369761, 608931, 415350, 615152, 55112, 166696, 161309, 794472, 1562995, 962524, 106688, 1134335, 1575203, -388981, -2045019, -2970822, -2702847, -1650168, -1738529, -1283290, -1759874, -1771528, -529271, 2362984, 4291373, 4028392, 3560037, 2973061, 1993156, 1243186, 2207291, 1667642, 712684, -16694, -304472, 564507, 292973, -1463836, -3156559, -3153907, -2375141, -2986121, -1999243, -992325, -657325, 1111580]
5680A111580J939945Q41934j27240o95462m46407j108180j484999M37705N15153
5671I84029k07556j165369j037742l7927k5730L35204J977841R97836J36793J116534
5661C073913Q21695j609673j759066n92629j048359j126009J013414K75137K8566
5652i23011J161636J403209O59403n10046j52820P82839J225460k53362l99061
5643B994247j603169k554834P34687J554363k4621Q40584J798643l14567j315932
5634B109401j24424K48409j461260j850032j309878L5167q01010r80930m59143
5625d593700r39101J165781J554206L058477K783082L51064q6386J031336J065847
5616E390606M18803J18012j563581k587801j239059K36843J49868Q34315R7726
$$ y = [1111580, 3051525, 3893459, 3766219, 3070757, 2624350, 1516170, 31171, 468876, 984029, 776473, -388896, -1426638, -1464565, -1490295, -1155091, 822750, 1820586, 1957379, 3073913, 3895608, 2285935, 526869, -65760, -1114119, -2240128, -1226714, -951577, -923011, 238625, 1641834, 2301237, 1791191, 1638371, 2421210, 3646670, 3393308, 2994247, 1391078, -1163756, -429069, 1125294, 1100673, 1941257, 3739900, 3425333, 2109401, 1984977, 2233386, 772126, -1077906, -2387784, -2352617, -3153627, -4134557, -4593700, -5532801, -4367020, -2812814, 245663, 3028745, 3379809, 3293423, 4324759, 5390606, 5809409, 5927421, 4363840, 1776039, 536980, 773823, 923691, 1758006, 1855732]
5607A855732J10047K53875q56318J29015J300136L75148j475627j024113j51600
5598E16295n50182J035458p0381o69575M58984l88043j060553j091719o87837
5589b507553L53467N76201P07622m5764k037504o21720K53740P39069J880422
5580g02020J788594M14449p36540j125720k9338J399050q578o62588P2312j497491
5570a087870j825515j047692M26700Q05105O02356K211993J516734r92891p4937
5561E33983j83013j163935k199644n16163Q26587R52162O60440J192328M30914
5552E33659j91059J032271J111421K84486r99512k158234k589767o60166l74477
5543d011378j103376J154293J066142j569761k263739N56744L3592R59531K372097
$$ y = [1855732, 1965779, 2219654, 1363336, 1492351, 2792487, 3167635, 1692008, 667895, 516295, -33887, 1001571, 931190, 261615, 720599, 332556, -727997, -1819716, -2507553, -2154086, -1577885, -870263, -916027, -2953531, -3575251, -3321511, -2582442, -702020, 1086574, 1501023, 764483, -361237, -390575, 1008475, 999897, 337309, 409621, -1087870, -2913385, -3961077, -3534377, -2729272, -2126916, 85077, 1601811, 608920, 533983, 350970, -812965, -3012609, -3528772, -2702185, -1750023, -1089583, 102745, 533659, 342600, 1374871, 2486292, 2770778, 1771266, -386968, -2976735, -3636901, -4011378, -5114754, -3960461, -2894319, -4464080, -6727819, -6171075, -6137483, -5177952, -2805855]
5534b805855J080164J393722J68372o98901j407729p13635O54898K323266J099438
5525A093740j235789k276049k178024j120957L03035K14883q52802m04164l34360
5516f790487j53979J152918R29672J121128J074700J983990J693118J00365R30394
5507B041819M49471j05227l5793n86634j740027k416999l78992l11178N927J476402
5497a601231K659260K303925P74430j330211k251880P24387o36977n56455m05500
5488c20252m78800Q66989L27981j575402k234574Q0362K820081K454892O13047
5479B554324j99919O84734K021555J74815j604441k178090j225742K22429N81145
5470A030810l13292J45273J892038J179443j098471j450456j503683Q44064J822700
$$ y = [-2805855, -1725691, -331969, -163597, -862498, -2270227, -2983862, -2328964, -5698, 1093740, -142049, -2418098, -4596122, -5717079, -5414044, -5199161, -6051963, -6456127, -6790487, -6944466, -5791548, -4861876, -3740748, -2666048, -682058, 1011060, 1111425, 2041819, 2491290, 2386063, 2350270, 1763636, 23609, -2393390, -2772382, -3083560, -3077633, -1601231, 1058029, 3361954, 4136384, 2806173, 554293, 1278680, 641703, 85248, -320252, -799052, 67937, 395918, -1179484, -3414058, -3333696, -513615, 1941277, 2554324, 2354405, 3039139, 5060694, 5235509, 3631068, 1452978, 227236, 449665, 1030810, 717518, 862791, 2754829, 3934272, 2835801, 1385345, -118338, 725726, 2548426]
5461B548426J280113K570506J523046n63981j709132j559832M00601J40488m30179
5452D200056m60696j952655k469916m70284m78364m09911j60136M59801J498932
5443b43173K454335J293278P56760j256648j376396J168860N12258o64564l81157
5434B263553q94215j045108j220065j167954m40481q8379p63899L84709J698914
5425a272925k14814k03106K62396R13324K158473J584941j766798k595378r08098
5416b041985P2597K22589l01484R36585K53209R42558K753449J737014L97870
5407D972402M9256j47760j770353k276369k12729L43811o47149j15861L4809M28154
5397F58211J164350J87313P52344J450562L62457r89631j934847k675329k832169
$$ y = [2548426, 3828539, 6399045, 7922091, 7358110, 5648978, 4089146, 4489747, 4630235, 4200056, 3739360, 1786705, -683211, -1153495, -1631859, -2041770, -2201906, -1742105, -243173, 2211162, 3504440, 4261200, 3004552, 1628156, 2797016, 3309274, 2644710, 2263553, 1369338, 324230, -895835, -2063789, -2504270, -2592649, -3356548, -2971839, -1272925, -1487739, -1690845, -1428449, -515125, 1643348, 3228289, 1461491, -1133887, -2041985, -1969388, -1746799, -2048283, -1111698, -858489, 84069, 2837518, 4574532, 4972402, 5021658, 4873898, 3103545, 827176, 614447, 958258, 311109, 195248, 230057, 658211, 1822561, 2009874, 2762218, 4212780, 4575237, 3585606, 1650759, -1024570, -3856739]
5388c856739P54487J893189Q44966R91248o33729j190358N90828n70771m49285
5379a626164Q00277j11673r60735M60532J947383K087073l38110k373024j091468
5370a205909p34624j245870l08393M69033K368496J725000n49415j08616O99301
5361A109003N20585M25612j067597j25676O85874O55777k61949k075593n89726
5352g23690k60315L64962R32565k23229q47327k010726k478993k27400J341205
5343d132948R05526J980172R72304J904119K393582N65186r30140j424050Q9082
5334B322833L02714M55830j67983j670278j866610j097164Q00074J095109l35934
5325a61409q95674j112649J063899J886824Q25224p51695j365909k340943q65600
$$ y = [-3856739, -3102252, -1209063, -364097, 627151, -6578, -1196936, -606108, -1176879, -1626164, -825887, -937560, -1898295, -1437763, 509620, 2596693, 2258583, -114441, -1205909, -1940533, -3186403, -3494796, -3025763, -657267, 1067733, 518318, 409702, 1109003, 1629588, 2055200, 987603, 861927, 1547801, 2203578, 1941629, -133964, -723690, -984005, -619043, 313522, 90293, -757034, -2767760, -5246753, -5474153, -4132948, -3227422, -1247250, -274946, 1629173, 4022755, 4587941, 3657801, 2233751, 2322833, 2625547, 3081377, 2913394, 1243116, -623494, -1720658, -920584, 174525, -161409, -1057083, -2169732, -1105833, 780991, 1606215, 854520, -511389, -2852332, -3717932]
5316c717932O83574K220477J627340K26350k30321j150990j26565J645358K895516
5307D072807J184561j123224r14249j31448r5853k8010m74613l77282n83069p16710
5297H12910K95106N01113o65283o09583k78031j57064O03992K990932J856056
5288E350148j419164j772466k225797k054740j269993m45917N91714J799881K647413
5279A201079P56486l26650l15617L8224M21142q93183o43471l63131j071516Q7575
5269a109062J306648Q99727O37451j99816o97644j060910n41811Q04638O48566
5260F87787K115756K032638K26802j085197j735191j129741j452674j558369J071056
5251h27133K666587p910j225622p90970j380781j079311m17090o83849o87622
$$ y = [-3717932, -3034358, -813881, 813459, 1039809, 809488, -341502, -468067, 1177291, 4072807, 5257368, 4134144, 3219895, 3088447, 2992594, 2964584, 2489971, 2112689, 1529620, 812910, 1108016, 1609129, 943846, 334263, 56232, -100832, 503160, 3494092, 5350148, 3930984, 2158518, -67279, -2122019, -3392012, -3837929, -3246215, -1446334, 1201079, 1957565, 1630915, 1315298, 1353522, 1774664, 881481, 238010, -125121, -1196637, -1109062, 197586, 1097313, 1734764, 1534948, 837304, -223606, -765417, 39221, 687787, 2803543, 4836181, 5062983, 3977786, 2242595, 1112854, -339820, -1898189, -827133, 1839454, 1831544, 605922, -185048, -1565829, -2645140, -3062230, -3746079, -4433701]
5242d433701J181427L35095k468830j036725Q27280J874673J227949R35192J527845
5233b9795p85767o77461m80542q99149O0746J803558K059178q04669k05407P95021
5223H35713P50742J523636m45086j583618O96784P89205Q6585l42303k027424
5214B84234k623579j70330M95366j10310K73027K96008R44560J747577J646988
5205B783541M13510j010246p36949r1825j17359o98956j259629L61029L92715
5196C5831l49227L2518M56742M1803k41713j19602P63238J451096J77023m05656
5186A842053o55938j64712k47331k35129k78587n98750K76835j001204k379904
5177c442667j920277l73701K923135K403600M27648q37261q79363K32698N84369
$$ y = [-4433701, -3252274, -2917179, -5386009, -6422734, -5595454, -3720781, -2492832, -1557640, -29795, -815562, -1493023, -1973565, -2872714, -2811968, -1008410, 1050768, 246099, 40692, 835713, 1586455, 3110091, 2665005, 1081387, 1778171, 2567376, 2653961, 2311658, 284234, -2339345, -2509675, -2014309, -2124619, -1851592, -1555584, -611024, 1136553, 2783541, 3197051, 2186805, 1449856, 1358031, 1240672, 541716, -717913, -356884, 35831, -313396, -280878, 175864, 217667, -24046, -143648, 619590, 2070686, 2247709, 1842053, 1186115, 1021403, 774072, 538943, 260356, -338394, -61559, -1062763, -3442667, -5362944, -5736645, -2813510, -409910, 17738, -819523, -1698886, -1466188, -881819]
5168h81819J736852M48682k415989r26298P92681O84439j12316j720903j7768
5159b412439P72880J917921J442620k89523J672695J126675q56519q30405m69294
5150B074611k11230j517334q01388j308492k014355j378305k26693n89j4764Q98169
5140d500370K000588K138664L29019m82757k04943l74846O99387J583423N45405
5131A733570o6545k63141r69044L57618M31653n27697L90212M90821J334816J177886
5121D090149o51831j586589n55533N00882J225028j06428j484750k439029j143931
5112b152032M67702J042188K108805J443296n92331j377741o69945l20945j430664
5103a481667j959705M98426J456540m93885j016960k324974j127461J921833J698619
$$ y = [-881819, 855033, 1303715, -1112274, -2038572, -1245891, -561452, -673768, -2394671, -2412439, -1639559, 278362, 1720982, 1431459, 3104154, 4230829, 3374310, 2543905, 2074611, 1863381, 346047, -455341, -1763833, -3778188, -5156493, -5383186, -5383775, -5398539, -4500370, -2499782, -361118, -32099, -514856, -719799, -1094645, -395258, 1188165, 1733570, 1667025, 1403884, 434840, 792458, 1224111, 696414, 1086626, 1577447, 2912263, 4090149, 3438318, 1851729, 1296196, 1797078, 3022106, 2915678, 1430928, -1008101, -2152032, -1684330, -642142, 1466663, 2909959, 2317628, 939887, 269942, -51003, -1481667, -3441372, -2942946, -1486406, -1980291, -2997251, -5322225, -6449686, -4527853, -2829234]
$$ [...]
##END NTUPLES=NMR SPECTRUM
##END=
