##TITLE=C13_PHDE3005
 CDCl3,650 sc

 30.4.2019
##JCAMPDX= 6.0         $$ Bruker NMR JCAMP-DX V2.0
##DATA TYPE= NMR SPECTRUM
##DATA CLASS= NTUPLES
##ORIGIN= UXNMR, Bruker Analytische Messtechnik GmbH
##OWNER= root
$$ XWIN-NMR		Version 3.5
$$ Tue Apr 30 15:25:11 2019 Russian Standard Time (UT+4h)  she@DPX200
##.OBSERVE FREQUENCY= 50.3278965144739
##.OBSERVE NUCLEUS= ^13C
##.ACQUISITION MODE= SIMULTANEOUS
##.ACQUISITION SCHEME= undefined
##.AVERAGES= 650
##.DIGITISER RES= 17
##SPECTROMETER/DATA SYSTEM= spect
##.PULSE SEQUENCE= zgpg30
##.SOLVENT NAME= CDCl3
##.SHIFT REFERENCE= (INTERNAL, CDCl3, 0, 225.262)
##AUDIT TRAIL= $$ (NUMBER, WHEN, WHO, WHERE, WHAT)
$$ ##TITLE= Audit trail, XWIN-NMR		Version 3.5
$$ ##JCAMPDX= 5.01
$$ ##ORIGIN= Bruker BioSpin GmbH
$$ ##OWNER= she
$$ F:/spectra/data/she/nmr/c13/1/pdata/1/auditp.txt
$$ ##AUDIT TRAIL=  $$ (NUMBER, WHEN, WHO, WHERE, WHAT)
(   1,<2019-04-30 15:24:08.50 +0400>,<she>,<DPX200>,
      <created by zg, POWCHK disabled, PULCHK disabled
       terminated by command 'halt'
       configuration hash MD5:
       00 E9 B6 7A A2 85 ED C7 34 08 36 98 17 FE 4E 26
       data hash MD5: 32K
       B7 88 DC 66 EB D6 0E 5F D0 64 95 54 8F 5E 9E 3D>)
(   2,<2019-04-30 15:24:10.04 +0400>,<she>,<DPX200>,
      <Start of raw data processing
       efp BC_mod = 2 LB = 1 FT_mod = 6 PKNL = 1 PHC0 = -375.5768 PHC1 = 22.80641 SI = 32K 
       data hash MD5: 32K
       5A 71 5A DD 74 6C 8D 02 B3 5F 9C 2A 36 C3 11 DE>)
(   3,<2019-04-30 15:24:12.81 +0400>,<she>,<DPX200>,
      <abs ABSG = 5 
       data hash MD5: 32K
       60 98 57 69 16 26 37 DC 19 9B DB BB 75 FC A4 09>)
(   4,<2019-04-30 15:24:28.89 +0400>,<she>,<DPX200>,
      <pk PHC0 = -0.2173301 PHC1 = 5 
       data hash MD5: 32K
       7B BE EC E1 A3 47 C0 68 3B EA FC E8 07 5C 71 EC>)
(   5,<2019-04-30 15:24:31.50 +0400>,<she>,<DPX200>,
      <abs ABSG = 5 
       data hash MD5: 32K
       7C 01 88 F5 51 D7 BF 63 A5 9C 21 9C 1C A3 CE B4>)
$$ ##END=
$$ 
$$ hash MD5
$$ A2 F9 2F A6 F5 D5 D1 08 F3 88 C1 34 E9 04 1B F3
##$RELAX= 
##$RELAX= 
##$RELAX= 
##$RELAX= 
##$RELAX= 
##$RELAX= 
##$RELAX= 
##$RELAX= 
$$ Bruker specific parameters
$$ --------------------------
##$DU= <F:/spectra>
##$EXPNO= 1
##$NAME= <c13>
##$PROCNO= 1
##$TYPE= <nmr>
##$USER= <she>
##$AMP= (0..31)
100 100 100 100 100 100 100 100 100 100 100 100 100 100 100 100 100 100 
100 100 100 100 100 100 100 100 100 100 100 100 100 100 
##$AQSEQ= 0
##$AQ_mod= 1
##$AUNM= <au_zg>
##$AUTOPOS= <>
##$BF1= 50.322709
##$BF2= 200.13
##$BF3= 50.322709
##$BF4= 500.13
##$BF5= 500.13
##$BF6= 500.13
##$BF7= 500.13
##$BF8= 500.13
##$BYTORDA= 1
##$CFDGTYP= 0
##$CFRGTYP= 5
##$CHEMSTR= <none>
##$CNST= (0..31)
1 1 145 1 1 1 1 1 1 1 1 1 1 1 1 1 1 1 1 1 1 1 1 1 1 1 1 1 1 1 1 1 
##$CPDPRG= <waltz16>
##$CPDPRG1= <>
##$CPDPRG2= <waltz16>
##$CPDPRG3= <>
##$CPDPRG4= <mlev>
##$CPDPRG5= <mlev>
##$CPDPRG6= <mlev>
##$CPDPRG7= <mlev>
##$CPDPRG8= <mlev>
##$CPDPRGB= <>
##$CPDPRGT= <>
##$D= (0..31)
$$ [...]
##$SUBNAM4= <"">
##$SUBNAM5= <"">
##$SUBNAM6= <"">
##$SUBNAM7= <"">
##$SUBNAM8= <"">
##$SUBNAM9= <"">
##$SW= 239.972172938263
##$SWIBOX= (0..15)
0 1 3 0 0 0 0 0 0 0 0 0 0 0 0 0 
##$SW_h= 12077.2946859903
##$TD= 32768
##$TD0= 1
##$TE= 0
##$TE2= 300
##$TE3= 300
##$TEG= 300
##$TL= (0..7)
120 120 120 120 120 120 120 120 
##$TP= (0..7)
150 150 150 150 150 150 150 150 
##$TP07= 0
##$TPNAME0= <>
##$TPNAME1= <>
##$TPNAME2= <>
##$TPNAME3= <>
##$TPNAME4= <>
##$TPNAME5= <>
##$TPNAME6= <>
##$TPNAME7= <>
##$TPOAL= (0..7)
0.5 0.5 0.5 0.5 0.5 0.5 0.5 0.5 
##$TPOFFS= (0..7)
0 0 0 0 0 0 0 0 
##$TUNHIN= 0
##$TUNHOUT= 0
##$TUNXOUT= 0
##$USERA1= <user>
##$USERA2= <user>
##$USERA3= <user>
##$USERA4= <user>
##$USERA5= <user>
##$V9= 5
##$VALIST= <valist>
##$VCLIST= <CCCCCCCCCCCCCCC>
##$VD= 0
##$VDLIST= <DDDDDDDDDDDDDDD>
##$VPLIST= <PPPPPPPPPPPPPPP>
##$VTLIST= <TTTTTTTTTTTTTTT>
##$WBST= 1024
##$WBSW= 4
##$XGAIN= (0..3)
0 0 0 0 
##$XL= 0
##$YL= 0
##$YMAX_a= 3959475
##$YMIN_a= -959129
##$ZGOPTNS= <>
##$ZL1= 120
##$ZL2= 120
##$ZL3= 120
##$ZL4= 120
##$ABSF1= 225.2625
##$ABSF2= -14.73494
##$ABSG= 5
##$ABSL= 3
##$ALPHA= 0
##$AQORDER= 0
##$ASSFAC= 0
##$ASSFACI= 0
##$ASSFACX= 0
##$ASSWID= 0
##$AUNMP= <proc_1d>
##$AZFE= 0.1
##$AZFW= 0.5
##$BCFW= 0
##$BC_mod= 2
##$BYTORDP= 0
##$COROFFS= 0
##$CY= -3
##$DATMOD= 1
##$DC= 0
##$DFILT= <>
##$DTYPP= 0
##$F1P= 0
##$F2P= 0
##$FCOR= 0.5
##$FTSIZE= 32768
##$FT_mod= 6
##$GAMMA= 0
##$GB= 0
##$INTBC= 1
##$INTSCL= 4.134877e-10
##$ISEN= 128
##$LB= 1
##$LEV0= 0
##$LPBIN= 0
##$MAXI= 10000
##$MC2= 0
##$MEAN= 0
##$ME_mod= 0
##$MI= 0.1934396
##$NCOEF= 0
##$NC_proc= -3
##$NLEV= 6
##$NOISF1= 120.0001
##$NOISF2= 80.00006
##$NSP= 0
##$NTH_PI= 0
##$NZP= 0
##$OFFSET= 225.2625
##$PC= 1.4
##$PHC0= -375.7941
##$PHC1= 27.80641
##$PH_mod= 1
##$PKNL= yes
##$PPARMOD= 0
##$PSCAL= 0
##$PSIGN= 0
##$REVERSE= no
##$SF= 50.3225993700027
##$SI= 32768
##$SIGF1= 140
##$SIGF2= 120
##$SINO= 11.81781
##$SIOLD= 32768
##$SREGLST= <13C.CDCl3>
##$SSB= 0
##$STSI= 32768
##$STSR= 0
##$SW_p= 12077.2946859903
##$SYMM= 0
##$S_DEV= 0
##$TDeff= 32768
##$TDoff= 0
##$TI= <>
##$TILT= no
##$TM1= 0
##$TM2= 0
##$TOPLEV= 0
##$USERP1= <user>
##$USERP2= <user>
##$USERP3= <user>
##$USERP4= <user>
##$USERP5= <user>
##$WDW= 1
##$XDIM= 32768
##$YMAX_p= 506238098
##$YMIN_p= -15455666
$$ End of Bruker specific parameters
$$ ---------------------------------
##NTUPLES= NMR SPECTRUM
##VAR_NAME=  FREQUENCY,     SPECTRUM/REAL,   SPECTRUM/IMAG
##SYMBOL=    X,             R,               I
##VAR_TYPE=  INDEPENDENT,   DEPENDENT,       DEPENDENT
##VAR_FORM=  AFFN,          ASDF,            ASDF
##VAR_DIM=   32768,         32768,           32768
##UNITS=     HZ,            ARBITRARY UNITS, ARBITRARY UNITS
##FACTOR=    0.368581032318806, 1,           1
##FIRST=     11335.7943870128, 0,            0
##LAST=      -741.500298977453, 0,           0
##MIN=       -741.500298977453, -15455666,   0
##MAX=       11335.7943870128, 506238098,    0
$$ Real data points
##PAGE= N=1
##DATA TABLE= (X++(R..R)), XYDATA
$$ [...]
$$ plain form
22546 -7284962 -5216529 -3605543 -2233781 -3156741 -6155027 -6148104 -2988906 715231 2494169
22537 2494169 2218227 1396610 1273172 2091869 1915320 -729045 -2019212 -110850 1554756
22528 1554756 188733 -972735 -2071209 -4204664 -5884591 -4441643 -2409867 -175660
22520 -175660 799434 1574327 1948141 600538 -832655 -2014329 -116130 823742 1364482
22511 1364482 3490327 4224400 3797793 3466131 819494 -1304174 -2639124 -2172674 -912148
22502 -912148 584381 502293 -259988 -610326 741260 3219616 2476408 -300028 -566861
22493 -566861 1172620 2159502 1787010 543223 585705 -75776 271697 416890 241786
22484 241786 2201815 1585336 992904 981653 -1057385 -1631915 -559162 -184284 -962175
$$ packed form
22546g284962K068433J610986J371762r22960k998286O923L159198L704137J778938
22537B494169k75942q21617j23438Q18697j76549k644365j290167J908362J665606
22528A554756j366023j161468j098474k133455j679927J442948K031776K234207
22520a75660R75094P74893L73814j347603j433193j181674J898199R39872N40740
22511A364482K125845P34073m26607l31662k646637k123668j334950M66450J260526
22502i12148J496529q2088p62281l50338J351586K478356p43208k776436k66833
22493e66861J739481R86882l72492j243787M2482o61481L47473J45193j75104
22484B41786J960029o16479n92432j1251k039038n74530J072753L74878p77891
$$ plain form
22475 -962175 48723 381006 364899 1170740 1816926 2903518 2656153 3572389 3518638 2714402
22465 2714402 2876025 1733708 -401403 -1378364 -2850600 -2518808 -2172238 -2296358 -249837
22456 -249837 2530590 4293414 6578028 7700886 7416152 5894427 4551112 4652215 7366253
22447 7366253 7257410 4285770 3343240 3958324 1131551 -1089468 719895 674321 -2544928
22438 -2544928 -4892522 -3443676 -3241139 -3999663 -3197203 -3014157 -2180613 -1914731 -1717279
22429 -1717279 -2309537 -2904110 -3408811 -3124673 -1585505 1356273 4339906 5324757 5222376
22420 5222376 4066295 1425353 -2254664 -3177246 -787432 2199731 2602703 2109490 1028985
22411 1028985 -254082 238748 1246774 1571805 685259 247802 -493653 -939624 -835704
$$ packed form
22475i62175J010898L32283j6107Q05841O46186J086592k47365R16236n3751q04236
22465B714402J61623j142317k135111r76961j472236L31792L46570j24120K046521
22456b49837K780427J762824K284614J122858k84734j521725j343315J01103K714038
22447G366253j08843k971640r42530O15084k826773k221019J809363m5574l219249
22438b544928k347594J448846K02537p58524Q02460J83046Q33544K65882J97452
22429a717279n92258n94573n04701K84138J539168K941778K983633R84851j02381
22420E222376j156081k640942l680017r22582K389814K987163M02972m93213j080505
22411A028985j283067M92830J008026L25031q86546m37457p41455m45971J03920
$$ plain form
22402 -835704 942285 1694743 77217 -394263 2295792 6337244 6834629 5888906 4347026
22393 4347026 3151136 2529606 2621001 3465303 1486923 -1305302 -1172129 -2588145 -4295256
22384 -4295256 -4905446 -5499139 -5425590 -4568127 -3894820 -3667109 -3702562 -2761316 -3239227 -3574786
22374 -3574786 -629030 1297195 235472 -2164878 -4276427 -4167030 -3985842 -4611230 -4304658
22365 -4304658 -3153047 -4159052 -7679342 -6342874 -4254072 -2256868 -1154307 -2202319
22357 -2202319 -745012 575331 -925525 -1238575 652483 1687312 1812502 65890
22349 65890 -1166465 -1665546 -1299305 -1405512 -2270092 -2140487 -185324 2807498 3104493
22340 3104493 2250019 1818474 1377220 -116098 -2187825 -4232744 -6034736 -6757068 -7589712
$$ packed form
22402h35704J777989P52458j617526m71480K690055M041452M97385r45723j541880
22393D347026j195890o21530R1395Q44302j978380k792225J33173j416016j707111
22384d295256o10190n93693P3549Q57463O73307K27711l5453R41246m77911l35559
22374c574786K945756J926225j061723k400350k111549J09397J81188o25388L06572
22365d304658J151611j006005l520290J336468K088802J997204J102561j048012
22357b202319J457307J320343j500856l13050J891058J034829J25190j746612
22349F5890j232355m99081L66241j06207q64580J29605J955163K992822K96995
22340C104493q54474m31545m41254j493318k071727k044919j801992p22332q32644
$$ plain form
22331 -7589712 -6626214 -5222719 -4955193 -4677424 -4421731 -5663545 -4552372 -2004623 365746
22322 365746 2290531 3146796 3514085 3523124 5126042 4317015 2297679 -64845 -1298165
22313 -1298165 -2739244 -4630409 -5448918 -6234237 -6270152 -2603898 -1898957 -3608598 -2253330
22304 -2253330 -487144 968866 855482 -896124 -3639042 -4888394 -4207101 -2213218
22296 -2213218 -2023723 -3811239 -3533837 -1781363 -235254 -264182 236870 1202631 2590562
22287 2590562 4626960 5165072 5399360 4856478 3524691 762745 -1161411 -1581861 -996063
22278 -996063 -558805 -882917 -2510095 -3251694 -1831853 -2747375 -3904298 -2181731 670258
22269 670258 873540 263355 -1098964 -2657234 -1443266 -446237 -366790 3122013 5790531
$$ packed form
22331g589712R63498J403495K67526K77769K55693j241814J111173K547749K370369
22322C65746J924785Q56265L67289R039J602918q09027k019336k362524j233320
22313a298165j441079j891165q18509p85319l5915L666254P04941j709641J355268
22304b253330J766186J456010j13384j751606k742918j249352O81293J993883
22296b213218J89495j787516K77402J752474J546109k8928N01052R65761J387931
22287B590562K036398N38112K34288n42882j331787k761946j924156m20450N85798
22278i96063M37258l24112j627178p41599J419841r15522j156923J722567K851989
22269F70258K03282o10185j362319j558270J213968R97029P9447L488803K668518
$$ plain form
22260 5790531 4776776 2617704 495326 -596218 -287464 814613 -152157 -319358 -963765
22251 -963765 -2097739 -863550 1942916 1977604 -763918 389666 2444898 2160551 1280116
22242 1280116 711647 -418481 -3979859 -3616472 32494 1296586 700739 -1005703 -851988
22233 -851988 1215322 1351433 -1640800 -5022015 -6421046 -5811347 -4877495 -3631814 -2340834
22224 -2340834 -1751614 1346904 3686479 4154148 4920767 5310719 5539804 3390065 1995001
22215 1995001 1701857 -723958 -1954181 -2236174 -3537100 -4131219 -4110769 -4023473 -3676805
22206 -3676805 -108558 3301726 3156729 2334174 116292 -861402 -1012250 -874759 -2111357
22197 -2111357 -3385832 -4047272 -4685671 -2936792 -2454960 -3934492 -3466566 -1991125 -1736843
$$ packed form
22260E790531j013755k159072k122378j091544L08754J102077r66770j67201o44407
22251i63765j133974J234189K806466L4688k741522J153584K055232k84347q80435
22242A280116n68469j130128l561378L63387L648966J264092n95847j706442J53715
22233h51988K067310J36111k992233l381215j399031O09699R33852J245681J290980
22224b340834N89220L098518K339575M67669P66619L89952K29085k149739j395064
22215A995001k93144k425815j230223k81993j300926n94119K0450Q7296L46668
22206c676805L568247L410284j44997q22555k217882r77694j50848J37491j236598
22197b111357j274475o61440o38399J748879M81832j479532M67926J475441K54282
$$ plain form
22188 -1736843 110713 4107030 5490143 2271868 -1032157 -2912610 -3418268 -1769369
22180 -1769369 -2090485 -1466668 727206 2399239 4730275 3792349 580519 506976 723666
22171 723666 -691887 -2145407 -1199474 -1706623 -2622743 -2717459 -1995403 -297219 -1455719
22162 -1455719 -1881974 -1956698 -2160829 -1017906 1089564 3902904 4834210 5465043 7753720
22153 7753720 8809663 7014883 6238201 6581104 6307546 4426417 3346768 3351727 3024634
22144 3024634 2928720 5356533 8683550 10845436 10334746 7717254 4108574 -433372 -2685589
22135 -2685589 -593003 2537217 3264400 3038756 1895363 877512 1332290 2476722 2268978
22126 2268978 1538922 1093858 -924401 -3171539 -3891839 -869837 -363015 -3212931 -3880079
$$ packed form
22188a736843J847556L996317J383113l218275l304025j880453n05658J648899
22180a769369l21116O23817K193874J672033K331036r37926l211830p3543K16690
22171G23666j415553j453520R45933n07149r16120r4716P22056J698184j158500
22162a455719m26255p4724k04131J142923K107470K813340R31306O30833K288677
22153G753720J055943j794780p76682L42903k73558j881129j079649M959l27093
22144C024634r5914K427813L327017K161886n10690k617492l608680m541946k252217
22135b685589K092586L130220P27183k25644j143393j017851M54778J144432k07744
22126B268978p30056m45064k018259k247138p20300L022002N06822k849916o67148
$$ plain form
22117 -3880079 -2010979 1924291 5573335 3942873 1578866 2006514 3549598 6082474
22109 6082474 7335462 7671161 5921765 2868935 2106910 2212826 1975082 542832 -1588807
22100 -1588807 -3512375 -3222900 -876999 -105725 -1053501 -612520 1572169 2185647 1834251
22091 1834251 1310754 1664291 1411243 1277351 906140 -1103524 140863 2585790 3072868
22082 3072868 3374538 2665825 770787 -382366 52338 -1209300 -2080427 -2312333 -2160876
22073 -2160876 -553895 198388 2033261 1402974 -212580 -2240574 -4940378 -6842937
22065 -6842937 -5731421 -3118561 -2386972 -3384950 -3806127 -1537232 1221645 2473213 831226
22056 831226 -1916667 -4130262 -4109876 -2695243 -2332180 -86230 1046184 85387 -841418
$$ packed form
22117c880079J869100L935270L649044j630462k364007M27648J543084K532876
22109F082474J252988L35699j749396l052830p62025J05916k37744j432250k131639
22100a588807j923568K89475K345901P71274r47776M40981K184689O13478l51396
22091A834251n23497L53537k53048j33892l71211k009664J244387K444927M87078
22082C072868L01670p08713j895038j153153M34704j261638q71127k31906J51457
22073b160876J606981P52283J834873o30287j615554k027994k699804j902559
22065f842937J111516K612860P31589r97978m21177K268895K758877J251568j641987
22056H31226k747893k213595K0386J414633L63063K245950J132414r60797r26805
$$ plain form
22047 -841418 -568450 1572860 3233346 4726093 3291640 -54243 -1738766 -2366556 -1692055
22038 -1692055 -914573 -736899 -1030082 -547122 2555028 2665761 1234940 329972 1799205
22029 1799205 2695358 1898596 2333189 1749797 813383 1072904 2199749 2122644 1580890
22020 1580890 808793 -913985 -3322082 -4048520 -2457312 -344857 1023365 168490 -3154014
22011 -3154014 -6902318 -7006745 -7504157 -9034568 -10732377 -10545129 -9186032 -6961436 -3419737
22002 -3419737 -359223 1863781 2897727 1238630 -76211 -487084 -614221 -27774 2819627
21993 2819627 2961310 865258 1131068 783168 522517 1228203 3625922 5522605 3927778
21984 3927778 1517189 1978875 2308910 1056979 -1595849 -3973197 -2932776 -2607012 -1269043
$$ packed form
22047h41418K72968K141310J660486J492747j434453l345883j684523o27790O74501
22038a692055P77482J77674k93183M82960L102150J10733j430821r04968J469233
22029A799205Q96153p96762M34593n83392r36414K59521J126845p7105n41754
22020A580890p72097j722778k408097p26438J591208K112455J368222q54875l322504
22011c154014l748304j04427m97412j530411j697809J87248J359097K224596L541699
22002c419737L060514K223004J033946j659097j314841m10873j27137N86447K847401
21993B819627J41683k096052K65810l47900k60651P05686K397719J896683j594827
21984C927778k410589M61686L30035j251931k652828k377348J040421L25764J337969
$$ plain form
21975 -1269043 30683 -629286 -2715518 -3613850 -3096246 -1528342 -1576181 -4302193 -6516072
21966 -6516072 -6833041 -5963351 -4406000 -6155597 -8020836 -5264116 -2007707 893935
21958 893935 1958957 3212512 4456928 2194375 20834 620416 1109106 2844079 6009254
21949 6009254 4595549 2133715 2278259 2521704 1329892 1014566 1820063 729838 -1681158
21940 -1681158 -2269681 -1883329 -402219 -1128253 -2629690 -2845242 -2838787 -2919755 -3422155 -2859970
21930 -2859970 -3170564 -1194575 1379282 586906 302450 -2183433 -6193557 -5462357 -3282883
21921 -3282883 -289016 340389 -1699018 -3081076 -3064812 -2029308 -1362356 -1428398 -1875129
21912 -1875129 -2475939 -1887788 -555513 -325702 374901 2479890 4885379 6290660 5807899
$$ packed form
21975a269043J299726o59969k086232q98332N17604J567904m7839k726012k213879
21966f516072l16969Q69690J557351j749597j865239K756720L256409K901642
21958H93935J065022J253555J244416k262553k173541N99582M88690J734973L165175
21949F009254j413705k461834J44544K43445j191812l15326Q05497j090225k410996
21940a681158n88523L86352J481110p26034j501437k15552O455q0968n02400N62185
21930b859970l10594J975989K573857p92376k84456k485883m010124P31200K179474
21921c282883K993867O29405k039407j382058J6264J035504O66952o6042m46731
21912a875129o00810N88151J332275K29811P00603K104989K405489J405281m82761
$$ plain form
21903 5807899 4986631 4169972 2482412 903896 567585 1071953 1086633 -408360 -3023915
21894 -3023915 -3230564 1061466 4084637 6199996 7553667 7192295 7142544 5374271 1358202
21885 1358202 -1958793 -1245955 -98538 -2462026 -4368567 -3706438 -2103875 -1796420 -3027981
21876 -3027981 -2133434 -3074453 -1989247 -64566 572962 314946 -440703 -2312698 -2372950
21867 -2372950 -1871422 -2869803 -3944692 -6089140 -5727790 -4297123 -4241168 -4444311 -5100986
21858 -5100986 -5788958 -5353888 -3894291 -2933879 -3378376 -2795876 -3339548 -3990294 -3492754
21849 -3492754 -2664128 -3806681 -3211590 -742547 285799 771276 -1954101 -3609695 -2189664
21840 -2189664 -1985154 -2499298 -2385740 -1864922 -693375 -1122512 -2074661 -2164900 -1486516
$$ packed form
21903E807899q21268q16659j687560j578516l36311N04368J4680j494993k615555
21894c023915k06649M292030L023171K115359J353671l61372m9751j768273m016069
21885A358202l316995P12838J147417k363488j906541O62129J602563L07455j231561
21876c027981Q94547r41019J085206J924681O37528k58016p55649j871995o0252
21867b372950N01528r98381j074889k144448L61350J430667N5955k03143o56675
21858e100986o87972M35070J459597R60412m44497N82500n43672o50746M97540
21849c492754Q28626j142553N95091K469043J028346M85477k725377j655594J420031
21840b189664K04510n14144J13558N20818J171547m29137r52149r0239O78384
$$ plain form
21831 -1486516 -2673227 -3554254 -1415622 2577369 3350372 1696686 2541121 1687703 1191500
21822 1191500 2525590 2313707 886321 -656776 -5032072 -8938173 -9288014 -5483257
21814 -5483257 -2381701 -472570 294529 -2441625 -2464685 -1481691 -4212639 -7370489 -8368018
21805 -8368018 -9109303 -9807384 -9883558 -9717299 -8163154 -6510475 -6306906 -6340824 -4385009
21796 -4385009 -2607277 -2021660 -1053978 -177391 -1530184 -4584438 -6863811 -6367270 -7246574
21787 -7246574 -9027064 -7647566 -2910692 1408089 1544842 284335 1492874 2534915
21779 2534915 4072609 3903901 1847874 -124040 -1134350 -2411321 -2794038 -1341993
21771 -1341993 -223690 -77221 -1969686 -4011530 -2338584 -1368532 -1988785 -2565673 -486803
$$ packed form
21831a486516j186711q81027K138632L992991P73003j653686Q44435q53418m96203
21822A191500J334090k11883j427386j543097m375296l906101l49841L804757
21814e483257L101556J909131P67099k736154k3060R82994k730948l157850r97529
21805h368018p41285o98081p6174J66259J554145J652679K03569l3918J955815
21796d385009J777732N85617R67682Q76587j352793l054254k279373M96541q79304
21787g246574j780490J379498M736874M318781J36753j260507J208539J042041
21779B534915J537694j68708k056027j971914j010310j276971l82717J452045
21771a341993J118303J46469j892465k041844J672946R70052o20253n76888K078870
$$ plain form
21762 -486803 899652 -2034355 -4463086 -4116618 -3756594 -3224502 152475 2575187 2917114
21753 2917114 2615261 1284648 671853 1727950 2188220 3747724 4859325 3931570 1648279
21744 1648279 24901 -178836 -641619 -1035978 -2555407 -4047279 -1591939 -1926442 -5836317
21735 -5836317 -6943440 -2980580 -821146 -405483 -31807 1219944 1773210 186043 -827094
21726 -827094 644468 3612599 2602856 -1377142 -4106764 -3561413 -1705824 -2423372 -2903340
21717 -2903340 -1141343 -551921 -496625 584249 1914663 2232420 1283641 -1556753 -2204705
21708 -2204705 -1496833 -1435007 -1552573 -1237623 1758496 5713138 5837722 4796790 3715259
21699 3715259 1408902 -1561097 -4632413 -5331139 -4966759 -5059594 -3791758 -2474658 -1423821
$$ packed form
21762d86803J386455k934007k428731L46468L60024N32092L376977K422712L41927
21753B917114l01853j330613o12795J056097M60270J559504J111601r27755k283291
21744A648279j623378k03737m62783l94359j519429j491872K455340l34503l909875
21735e836317j107123L962860K159434M15663L73676J251751N53266j587167j013137
21726h27094J471562K968131j009743l979998k729622N45351J855589p17548m79968
21717b903340J761997N89422N5296J080874J330414L17757r48779k840394o47952
21708b204705P07872O1826j17566L14950K996119L954642J24584j040932j081531
21699C715259k306357k969999l071316o98726L64380r2835J267836J317100J050837
$$ plain form
21690 -1423821 -924057 -1190539 -3373928 -4872736 -4200694 -3285643 -1387337 326136 -539369
21681 -539369 -2050275 -2054107 -2701269 -2454205 -1269959 514700 1659443 1274042 916557
21672 916557 1136956 1943331 2146207 1790357 -773994 -2257192 -2279788 -1495304 -1555504 -1762570
21662 -1762570 -342602 1451847 1150994 399228 1165836 2314773 3381623 4386701 3585229
21653 3585229 1702544 406918 -565210 -1180531 -3111903 -7331227 -8888297 -9634833 -9177375
21644 -9177375 -7391069 -6047471 -5969125 -5648608 -4667134 -2975412 -2791798 -4153485 -3038218
21635 -3038218 -1140058 29296 1184231 631809 -888723 -1203197 450988 736280 -699830
21626 -699830 -516882 219968 7796 -1507484 -3265552 -713429 4001563 5741984 4602164
$$ packed form
21690a423821M99764k66482k183389j498808O72042R15051J898306J713473q65505
21681e39369j510906l832o47162K47064J184246J784659J144743l85401l57485
21672I16557K20399Q06375K02876l55850k564351j483198k2596P84484o0200k07066
21662a762570J419968J794449l00853p51766P66608J148937J066850J005078q01472
21653C585229j882685j295626r72128o15321j931372m219324j557070p46536M57458
21644i177375J786306J343598P8346L20517R81474J691722J83614j361687J115267
21635c038218J898160J169354J154935n52422j520532l14474J654185K85292j436110
21626f99830J82948P36850k12172j515280j758068K552123M714992J740421j139820
$$ plain form
21617 4602164 2437475 3151695 4644493 4684972 4497854 4960184 4106913 932588 -3168934
21608 -3168934 -6866840 -8556120 -7790139 -6242020 -2705229 21522 79632 -579928 727454
21599 727454 2081056 2742162 3026424 2241716 938315 80560 -1196253 -3195769 -5772346
21590 -5772346 -7198287 -7639237 -8221251 -8175194 -7898670 -7951376 -6483516 -2406119 1184614
21581 1184614 1207727 1074863 1819674 1728144 981484 -632156 -2363084 -2848162 -2165655
21572 -2165655 -980752 244867 947502 250093 -604760 1187245 3141731 3414907 962798
21563 962798 -278591 123360 -249174 -1930362 -2728439 -2766579 -2508046 -2809815 -4142064
21554 -4142064 -4504296 -5342649 -4336030 -2516626 -3078431 -5353157 -4920378 -1331704 -643772
$$ packed form
21617D602164k164689P14220J492798M0479j87118M62330q53271l174325m101522
21608c168934l697906j689280P65981J548119L536791K726751N8110o59560J307382
21599G27454J353602O61106K84262p84708j303401q57755j276813j999516k576577
21590e772346j425941m40950n82014M6057K76524n2706J467860M077397L590733
21581A184614K3113j32864P44811r1530p46660j613640j730928m85078O82507
21572b165655J184903J225619P02635o97409q54853J792005J954486K73176k452109
21563I62798j241389M01951l72534j681188p98077l8140K58533l01769j332249
21554d142064l62232q38353J006619J819404n61805k274726M32779L588674O87932
$$ plain form
21545 -643772 -1927470 -2709373 -1400074 2489689 2192475 260407 141425 41599 -1196904
21536 -1196904 -3452688 -5382431 -4056518 -1150112 934088 2637152 3888451 959705
21528 959705 -622068 1137413 1866416 128850 159873 443930 -331723 -2976338 -3503244
21519 -3503244 -4431336 -5502523 -4734318 -3878415 -2826824 -4372492 -4936255 -2941762 -1962789
21510 -1962789 -430144 279597 -1205261 -1789074 234353 774299 -1038921 -2413756 -1702583
21501 -1702583 -2579856 -2202526 -693696 -111228 -854552 51703 -158140 -1290996 -908515
21492 -908515 -206102 924875 5259922 7273918 5409364 1870872 -88007 3350931
21484 3350931 5347437 5382204 2510361 105 976371 1281756 1123936 1132230 69691
$$ packed form
21545f43772j283698p81903J309299L889763k97214j932068j18982r9826j238503
21536a196904k255784j929743J325913K906406K084200J703064J251299k928746
21528I59705j581773J759481P29003j737566L1023K84057p75653k644615n26906
21519c503244r28092j071187P68205Q55903J051591j545668n63763J994493R78973
21510a962789J532645P09741j484858n83813K023427N39946j813220j374835P11173
21501a702583q77273L77330J508830N82468p43324R06255k09843j132856L82481
21492i08515P02413J130977M335047K013996j864554l538492j958879L438938
21484C350931J996506L4767k871843k510256R76266L05385j57820Q294j062539
$$ plain form
21475 69691 -762461 -1239368 -2242427 -3901875 -2810610 -501278 55989 674880 2962942
21466 2962942 3836328 3109374 2169044 420537 79396 1671582 2331065 1283391 -343143
21457 -343143 -3096134 -5329142 -2824771 -1033805 -734785 406888 879638 1113085 2217482
21448 2217482 2838925 3498667 2487805 258103 -1767210 -3054005 -2198423 -349917 -20221
21439 -20221 -1104722 -2143207 -1659158 -1478310 8907 403524 37791 -800986 -748844
21430 -748844 227312 1586680 2398162 2632050 669241 1424988 3706006 5575196 5249173
21421 5249173 3065692 3072603 3854845 5277134 5724772 2694677 -1174717 -631564 1596677
21412 1596677 767038 -560757 317928 2126744 3690676 1650048 -375101 -1017367 -3162524
$$ packed form
21475F9691q32152m76907j003059j659448J091265K309332N57267O18891K288062
21466B962942Q73386p26954r40330j748507l41141J592186O59483j047674j626534
21457c43143k752991k233008K504371J790966K99020J141673M72750K33447J104397
21448B217482O21443O59742j010862k229702k025313j286795Q55582J848506L29696
21439b0221j084501j038485M84049J80848J487217L94617l65733q38777N2142
21430g48844R76156J359368Q11482K33888j962809P55747K281018J869190l26023
21421E249173k183481O911P82242J422289M47638l030095l869394N43153K228241
21412A596677q29639j327795Q78685J808816J563932k040628k025149o42266k145157
$$ plain form
21403 -3162524 -3607881 -2643454 -3802797 -3219957 -420846 688746 -237993 -1989919 -2278450
21394 -2278450 -2166868 -1463396 -2475506 -3599976 -3845419 -1841503 465313 1627848 -168206
21385 -168206 -4477698 -5549663 -2513665 -1262020 -3300137 -3756610 -3774963 -3387152 -3497781
21376 -3497781 -4238981 -4289050 -4180528 -4279802 -2335407 -1186007 463165 2043883 1394903
21367 1394903 -879509 -773677 1256266 3881922 5364273 7485030 9042213 7983130
21359 7983130 5502468 4728231 4414596 3474421 4107538 6063739 6501005 4449014 2574771
21350 2574771 1322921 -962357 -1544481 -1001590 -107341 586060 -648793 -3448406 -4871281
21341 -4871281 -5640715 -5911670 -5391915 -4912148 -3165794 -1170363 -380021 -749734 -1840177
$$ packed form
21403c162524m45357R64427j159343N82840K799111J109592r26739j751926k88531
21394b278450J11582P03472j012110j124470k45443K003916K306816J162535j796054
21385a68206m309492j071965L035998J251645k038117m56473j8353L87811j10629
21376c497781p41200n0069J08522r9274J944395J149400J649172J580718o48980
21367A394903k274412J05832K029943K625656J482351K120757J557183j059083
21359G983130k480662p74237l13635r40175O33117J956201M37266k051991j874243
21350B574771j251850k285278n82124N42891Q94249O93401j234853k799613j422875
21341d871281p69434k70955N19755M79767J746354J995431P90342l69713j090443
$$ plain form
21332 -1840177 -2402438 -427595 560400 -680753 -111659 611939 -320976 -940050 -1070500
21323 -1070500 -2966392 -3335208 -3460360 -3611829 -2430895 -1217251 1380540 2634046 1662287
21314 1662287 1971595 3206868 2538077 49008 -120947 2664795 5522891 7225206 6302443
21305 6302443 4379002 2390208 2758011 4549732 6073114 4564597 2368229 -213585
21297 -213585 -3184215 -2206672 -184018 1091788 1845954 2278983 2867250 1551087 -161162
21288 -161162 -989837 808382 3144454 3050626 985246 973265 1683021 2044126 2034447 3189128
21278 3189128 4636947 5105779 5525014 6615212 4534271 2787630 3380304 4157140 3256887
21269 3256887 2077162 1926488 2513090 3312870 2869297 1189853 -2211812 -3447171 -1445569
$$ packed form
21332a840177n62261J974843R87995j241153N69094P23598r32915o19074j30450
21323a070500j895892l68816j25152j51469J180934J213644K597791J253506r71759
21314A662287L09308J235273o68791k489069j69955K785742K858096J702315r22763
21305F302443j923441j988794L67803J791721J523382j508517k196368k581814
21297b13585k970630R77543K022654J275806P54166M33029N88267j316163j712249
21288a61162q28675J798219K336072r3828k065380j1981P09756L61105r679J154681
21278C189128J447819M68832M19235J090198k080941j746641N92674P76836r00253
21269C256887j179725j50674N86602P99780m43573j679444l401665j235359K001602
$$ plain form
21260 -1445569 -118203 -2522267 -5539835 -3672955 -1062972 -1734853 -2139706 -424271
21252 -424271 1761124 1032634 1321091 2432867 2584171 3235992 3191967 2986675 2844283
21243 2844283 2405373 2886868 2606023 2447892 3437074 2991480 2837709 1940839 1005724
21234 1005724 668342 109674 -501032 -2797380 -4761867 -3524747 -2984313 -4043835 -5399056
21225 -5399056 -7202833 -6871873 -5126608 -3987590 -4368621 -4548853 -2783521 -2049543 36143
21216 36143 2499539 3106481 3556166 3565084 1893994 1763624 1674654 1187262 3193479 4614778
21206 4614778 4915257 4297377 2360786 1947372 959327 -2116569 -3412799 -1455102 1329140
21197 1329140 2929275 1935253 1957261 3536219 3586009 2655310 506924 -1577206 -542609
$$ packed form
21260a445569J327366k404064l017568J866880K609983o71881m04853J715435
21252d24271K185395p28490K88457J111776J51304O51821m4025k05292j42392
21243B844283m38910M81495k80845j58131R89182m45594j53771q96870r35115
21234A005724l37382n58668o10706k296348j964487J237120N40434j059522j355221
21225e399056j803777L30960J745265J139018l81031j80232J765332P33978K085686
21216C6143K463396O06942M49685Q918j671090j30370q8970m87392K006217J421299
21206D614778L00479o17880j936591m13414r88045l075896j296230J957697K784242
21197A329140J600135r94022K2008J578958M9790r30699k148386k084130J034597
$$ plain form
21188 -542609 963947 894381 699421 -1529021 -2577634 -993980 -546917 -1043554 -1218623
21179 -1218623 -2848523 -3307314 -1850952 38035 1121435 2440272 2349078 -94450 -1583063
21170 -1583063 -1273694 646234 1795445 2068258 2000129 558210 -1102615 -3224638 -3297447
21161 -3297447 -3442094 -5118433 -4535869 -5575104 -5460286 -3692269 -2442367 -79573 997746
21152 997746 -2287678 -4047468 -2512431 -463348 -68808 723893 3399374 5128670 6324109
21143 6324109 5091559 5555158 6844017 5890018 4971061 5153185 3037820 872119 -1080315
21134 -1080315 -975327 226070 -150540 513580 1366533 1257930 1895216 1504641 601480
21125 601480 790515 -35042 690462 2162166 2306825 1946431 3155114 3529898 3786972
$$ packed form
21188e42609J506556o9566j94960k228442j048613J583654M47063m96637j75069
21179a218623j629900m58791J456362J888987J083400J318837r1194k443528j488613
21170a583063L09369J919928J149211K72813o8129j441919j660825k122023p2809
21161c297447j44647j676339N82564j039235J14818J768017J249902K362794J077319
21152I97746l285424j759790J535037K049083L94540P92701K675481J729296J195439
21143F324109j232550M63599J288859r53999r18957J82124k115365k165701j952434
21134a080315J04988J201397l76610O64120Q52953j08603O37286l90575r03161
21125F01480J89035q25557P25504J471704J44659l60394J208683L74784K57074
$$ plain form
21116 3786972 4432351 2473496 396606 533354 913086 1907401 2990175 1879662 1534465
21107 1534465 3396540 4166626 2232454 3492538 5040593 4008810 4460371 3106868
21099 3106868 -93736 -1288516 -1855510 745395 3571045 5728761 7050373 7040426 6795059
21090 6795059 3944813 -266218 -515359 656248 2121448 3265146 2698610 2353890 4871976
21081 4871976 7384935 6323596 4007423 2191197 -1996674 -6477390 -7246135 -7461412
21073 -7461412 -7425570 -5244718 -3214140 -2897468 -2006378 -2573753 -2948202 -3517745 -4008156
21064 -4008156 -3481076 -3504971 -3058321 -1325451 534972 -1544286 -4192722 -3293517 -2228888
21055 -2228888 -718736 2656080 4760275 3070238 93783 -550276 -1068859 -1711008 -1580527
$$ packed form
21116C786972O45379j958855k076890J36748L79732R94315J082774j110513l45197
21107A534465J862075P70086j934172J260084J548055j031783M51561j353503
21099C106868l200604j194780n66994K600905K825650K157716J321612r947k45367
21090F795059k850246m211031k49141J171607J465200J143698n66536l44720K518086
21081D871976K512959j061339k316173j816226m187871m480716p68745k15277
21073g461412L5842K180852K030578L16672Q91090n67375l74449n69543m90411
21064d008156N27080k3895M46650J732870J860423k079258k648436Q99205J064629
21055b228888J510152L374816K104195j690037k976455o44059n18583o42149J30481
$$ plain form
21046 -1580527 -1372215 -225894 313524 -912663 51796 261715 -2088292 -2333213 -2245168
21037 -2245168 -3110975 -1726900 -399880 1576763 -94233 -2637787 -2146476 -1476323 -145925
21028 -145925 -125256 -674273 -820794 339002 1638220 2498041 1368135 2153365 4315900
21019 4315900 5313397 4353747 1825386 -986843 -2858931 -2505508 -67154 349094 -44872
21010 -44872 1556709 3025835 3582825 3179146 1633382 484484 -446174 -1868040 -2223058
21001 -2223058 -994500 2244447 4225226 3399110 2896829 4113243 5487318 6225307 6699155
20992 6699155 6159615 5805561 6387333 6819523 5099980 2741853 2307173 2869826 1830332
20983 1830332 -345365 -1351353 -1359942 -742445 -1833561 -2307811 -1020685 172512 1882294
$$ packed form
21046a580527K08312J146321N39418j226187R64459K09919k350007k44921Q8045
21037b245168q65807J384075J327020J976643j670996k543554M91311O70153J330398
21028a45925K0669n49017j46521J159796J299218Q59821j129906P85230K162535
21019D315900R97497r59650k528361k812229j872088L53423K438354M16248l93966
21010d4872J601581J469126N56990m03679j545764j148898r30658j421866l55018
21001b223058J228558L238947J980779q26116n02281J216414J374075P37989M73848
20992F699155n39540l54054N81772M32190j719543k358127m34680N62653j039494
20983A830332k175697j005988q589O17497j091116m74250J287126J193197J709782
$$ plain form
20974 1882294 2925408 1057116 -208071 -2873453 -4180835 -4120332 -3703290 -637563 3034743
20965 3034743 4866290 4836268 3844818 2545325 1961227 292765 -1017903 -1451243 -699065
20956 -699065 586027 1257699 2215938 2963466 2973724 1879156 -774662 -2192949 -1282725
20947 -1282725 1346450 2706551 3382937 5359714 5737677 4815049 4573815 4822724 4379250
20938 4379250 2091556 2409362 3989515 3239817 2252612 2580827 3898881 4391286 4387332
20929 4387332 4996921 5378785 7146584 7933507 7755673 6259241 5708034 3263399 1939525
20920 1939525 3889202 3519116 2232702 1354488 1951992 2948727 2130317 2677320 2890463
20911 2890463 478104 -1404873 -224954 2130245 2491564 1175528 2714939 5711463
$$ packed form
20974A882294J043114j868292j265187k665382j307382O0503M17042L065727L672306
20965C034743J831547l0022r91450j299493n84098j668462j310668m33340P52178
20956f99065J285092O71672R58239P47528J0258j094568k653818j418287R10224
20947a282725K629175J360101O76386J976777L77963r22628k41234K48909m43474
20938D379250k287694L17806J580153p49698r87205L28215J318054M92405l954
20929D387332O09589L81864J767799P86923j77834j496432n51207k444635j323874
20920A939525J949677l70086j286414q78214N97504R96735q18410N47003K13143
20911B890463k412359j882977J179919K355199L61319j316036J539411K996524
$$ plain form
20903 5711463 7017453 8128089 9043738 11015656 10373427 8365189 8117010 8634876 8276530
20894 8276530 6439272 7320463 8554403 7029678 3979812 1376932 2914859 5215947
20886 5215947 5601447 5883790 7788736 8971589 8617887 7433420 5067958 5136662 7845161
20877 7845161 11174779 12319102 11964624 11373538 10538781 12077286 13898689 16238871 19658347
20868 19658347 20679472 22421651 26130863 32008343 40131395 49768035 63204700 82974330
20860 82974330 112299376 147730923 184578044 196967922 173306851 135234893 101136522
20853 101136522 75931216 55041871 37266335 26382670 19707791 15041257 12679335
20846 12679335 10348228 8766996 9868228 8977042 5817639 4693854 5213571 6943140
$$ packed form
20903E711463J305990J110636R15649J971918o42229k008238k48179N17866l58346
20894H276530j837258Q81191J233940j524725l049866k602880J537927K301088
20886E215947L85500K82343J904946J182853l53702j184467k365462O8704K708499
20877G845161L329618J144323l54478n91086q34757J538505J821403K340182L419476
20868A9658347J021125J742179L709212N877480Q123052R636640J3436665J9769630
20860H2974330K9325046L5431547L6847121J2389878k3661071l8071958l4098371
20853A01136522k5205306k0889345j7775536j0883665o674879m666534k361922
20846A2679335k331107j581232J101232q91186l159403j123785N19717J729569
$$ plain form
20838 6943140 9577298 9772247 7225668 4266574 1006897 679022 1608463 1777068 3458382
20829 3458382 4707303 5908573 6119778 4570606 5207569 6009770 4119019 1637847 -1231887
20820 -1231887 -1874575 -1323977 -188674 -4592 743173 2777134 2545356 -971299 -4047325
20811 -4047325 -4042981 -823726 660482 -321128 -1833211 387106 4021946 4837503 6732844
20802 6732844 8901103 10326857 9378904 7348998 6469486 5362762 5852632 7701869 10009180
20793 10009180 8959532 5251159 3634989 3500694 4632293 7037699 7330113 6339966
20785 6339966 5606189 4697086 4135657 3281508 5070560 4743034 1851663 -182232 844968
20776 844968 3751715 3905473 1008444 -497915 -236604 -1543260 -2480375 -1502199 -2111532
$$ packed form
20838F943140K634158J94949k546579k959094l259677l27875R29441J68605J681314
20829C458382J248921J201270K11205j549172O36963Q02201j890751k481172k869734
20820a231887o42688N50598J135303J84082P47765K033961k31778l516655l076026
20811d047325M344L219255J484208r81610j512083K220317L634840Q15557J895341
20802F732844K168259J425754r47953k029906q79512j106724M89870J849237K307311
20793A0009180j049648l708373j616170j34295J131599K405406K92414r90147
20785F339966p33777r09103n61429q54149J789052l27526k891371k033895J027200
20776H44968K906747J53758k897029j506359K61311j306656r37115R78176o09333
$$ plain form
20767 -2111532 -2311174 -1242794 58919 307149 971120 1037648 -108953 -533299 -2697565
20758 -2697565 -3728512 -2107567 172661 -389423 -848140 -2061512 -4099658 -5557450
20750 -5557450 -5179096 -2754768 -1014579 -2070237 -3834501 -1976419 -777397 178267
20742 178267 346301 -375146 728517 1378885 1239520 3203413 3743795 3522836 1041048
20733 1041048 446833 2064672 1158700 692789 437220 -1260131 -385040 1963564 3566817
20724 3566817 5472655 7406330 4497257 736005 -1041304 -301637 3309074 6868646
20716 6868646 7160636 4580221 2299409 1508192 451275 -365409 -585920 -194822 -595818
20707 -595818 -138684 314814 425166 57325 -19454 1133408 1676227 2183899 1119417
$$ packed form
20767b111532j99642J068380J301713K48230O63971O6528j146601m24346k164266
20758b697565j030947J620945K280228n62084m58717j213372k038146j457792
20750e557450L78354K424328J740189j055658j764264J858082J199022R55664
20742A78267J68034p21447J103663O50368j39365J963893N40382k20959k481788
20733A041048n94215J617839r05972m65911k55569j697351Q75091K348604J603253
20724C566817J905838J933675k909073l761252j777309P39667L610711L559572
20716F868646K91990k580415k280812p91217j056917q16684k20511L91098m00996
20707e95818M57134M53498J10352l67841p6779J152862N42819N07672j064482
$$ plain form
20698 1119417 -646337 -1358594 -994176 -1727881 -1908629 -1297344 -2546445 -3613891 -3671860
20689 -3671860 -3881981 -2580232 -727298 1631265 3834344 4766582 3957858 2887697 1664193
20680 1664193 345697 -354793 350667 -2181568 -5317144 -5886824 -5556700 -5016840 -4756900
20671 -4756900 -3327334 -1536150 841457 1948119 1756658 896220 -2852469 -5444248
20663 -5444248 -8035704 -8316454 -3342611 531938 1721585 1907883 28462 -1614424
20655 -1614424 -1648333 -683600 -1506938 -2491462 -397462 1892750 1940994 661013 -1807111
20646 -1807111 -1678485 336397 417511 519207 1516976 2814095 1390941 1407994 1333869
20637 1333869 -1032919 -2803133 -2296235 -303839 3014770 6685380 7758427 5808934
$$ packed form
20698A119417j765754p12257L64418p33705j80748O11285j249101j067446n7969
20689c671860k10121J301749J852934K358563K203079R32238q08724j070161j223504
20680A664193j318496p00490P05460k532235l135576n69680L30124N39860K59940
20671d756900J429566J791184K377607J106662j91461q60438l748689k591779
20663e444248k591456k80750M973843L874549J189647J86298j879421j642886
20655a614424l3909R64733q23338r84524K094000K290212M8244j279981k468124
20646a807111J28626K014882Q1114J01696R97769J297119j423154J7053p4125
20637A333869k366788j770214N06898J992396L318609L670610J073047j949493
$$ plain form
20629 5808934 5136798 2557141 -3662590 -6852242 -4851578 -3431466 -1756896 1434237
20621 1434237 1899486 1007989 -1387385 -1674771 -119675 -2060936 -3744845 -5042263 -4857540
20612 -4857540 -3123175 -1002232 1086757 1924138 572588 -509983 -457592 -316980 -787146
20603 -787146 -581144 -1592391 -4409490 -6053203 -6806228 -5730443 -2478980 220733 1890336
20594 1890336 2027025 1562825 158397 -1856267 -521710 1135857 656109 2066107 5330182
20585 5330182 6357936 4624504 2282410 1922050 3130703 3956623 2639179 3176616 3006456
20576 3006456 1245257 -779553 -306027 -173954 1005134 3521605 2443142 299475
20568 299475 1785776 5161636 5288245 2788555 -106591 1108177 2809705 2595728 2602658
$$ packed form
20629E808934o72136k579657o219731l189652K000664J420112J674570L191133
20621A434237M65249q91497k395374k87386J555096j941261j683909j297418J84723
20612d857540J734365K120943K088989Q37381j351550j082571N2391J40612m70166
20603g87146K06002j011247k817099j643713p53025J075785L251463K699713J669603
20594A890336J36689m64200j404428k014664J334557J657567m79748J409998L264075
20585E330182J027754j733432k342094l60360J208653Q25920j317444N37437j70160
20576C006456j761199k024810M73526J32073J179088K516471j078463k143667
20568B99475J486301L375860J26609k499690k895146J214768J701528k13977O930
$$ plain form
20559 2602658 4209159 4446186 2303138 840019 767580 -120750 -1341307 -343856 -629360
20550 -629360 136062 975520 3614556 5496948 5059111 4164588 2947552 1058379 494659
20541 494659 -484655 -4615835 -5885059 -4129313 -2303337 -1279986 970460 2378109
20533 2378109 3051055 4326871 4097792 3428357 3297422 4851442 4316756 5159270 6253096
20524 6253096 5934536 3413632 -5379 -1819010 -2227555 -1419328 -2141532 -3524946 -3379411
20515 -3379411 -2635712 -3352260 -3881214 -3907511 -5046342 -6852804 -5991292 -5197299 -3649844
20506 -3649844 -2159078 -584940 -730177 456809 1946683 -881010 -3713819 -3041194
20498 -3041194 -1883959 -677819 599661 1220458 3587327 5171033 3131515 1758422
$$ packed form
20559B602658J606501K37027k143048j463119p2439q88330j220557R97451k85504
20550f29360P65422Q39458K639036J882392m37837q94523j217036j889173n63720
20541D94659r79314m131180j269224J755746J825976J023351K250446J407649
20533B378109O72946J275816k29079o69435j30935J554020n34686Q42514J093826
20524F253096l18560k520904l419011j813631m08545Q08227p22204j383414J45535
20515c379411P43699p16548n28954k6297j138831j806462Q61512P93993J547455
20506c649844J490766J574138j45237J186986J489874k827693k832809O72625
20498c041194J157235J206140J277480O20797K366869J583706k039518j373093
$$ plain form
20490 1758422 4012466 5267052 4934161 4849307 4072641 1759810 -476677 -900683 -878291
20481 -878291 -525603 -369855 -88517 775468 -821499 -225411 2634266 2826726 982823
20472 982823 -431200 -1578470 -2217050 -1024571 977252 1283133 -1290487 -2514862 -4281548
20463 -4281548 -5621562 -4418251 -2851441 -1766406 -2313461 -1110434 593856 -176426
20455 -176426 -878940 336356 32370 -959729 -2819469 -4182410 -4466987 -3790516 -2828615
20446 -2828615 -2843517 -2759952 -3518931 -4960253 -5518832 -3989025 -1372471 556167 1335047
20437 1335047 1862344 489881 -2449065 -4561673 -3571636 471848 4661517 5483721 3187530
20428 3187530 724261 -956151 -289004 -1005314 -2176763 -1520390 -1038305 1324696 2239952
$$ packed form
20490A758422K254044J254586l32891q4854p76666k312831k236487m24006K2392
20481h78291L52688J55748K81338Q63985j596967N96088K859677J92460j843903
20472I82823j414023j147270o38580J192479K001823L05881k573620j224375j766686
20463d281548j340014J203311J566810J085035n47055J203027J704290p70282
20455a76426p02514J215296l03986r92099j859740j362941k84577O76471R61901
20446b828615j4902Q3565p58979j441322n58579J529807K616554J928638P78880
20437A335047N27297j372463k938946k112608R90037M043484M189669Q22204k296191
20428C187530k463269j680412O67147p16310j171449O56373M82085K363001R15256
$$ plain form
20419 2239952 1742121 1995361 2392495 2064293 1279984 2165681 3105731 5036044 7932970
20410 7932970 6486964 1703634 -1104326 -1136865 69352 320607 1259033 3926895 4398673
20401 4398673 2251377 652130 1967160 3175965 1808227 3227595 4903912 2888241
20393 2888241 -1400214 -2962644 -1654749 113167 1755763 1251113 -235133 1589319
20385 1589319 4275376 3563617 892123 887385 2127805 -322245 -2226195 -1268023 -1300811
20376 -1300811 -1870834 -464327 1662576 1534287 3203161 4110370 4689542 5362588 2233442
20367 2233442 -573555 -3986340 -5914838 -4436435 670389 5554656 7121241 6749430
20359 6749430 5238296 3499014 3181028 3485350 3930644 2903594 -32898 -2253464 -2088877
$$ packed form
20419B239952m97831K53240L97134l28202p84309Q85697R40050J930313K896926
20410G932970j446006m783330k807960l2539J206217K51255R38426K667862M71778
20401D398673k147296j599247J315030J208805j367738J419368J676317k015671
20393B888241m288455j562430J307895J767916J642596n04650j486246J824452
20385A589319K686057p11759k671494m738J240420k450050j903950R58172l2788
20376a300811n70023J406507K126903j28289J668874R07209N79172O73046l129146
20367B233442k806997l412785j928498J478403N106824M884267J566585l71811
20359F749430j511134j739282l17986L04322M45294j027050k936492k220566J64587
$$ plain form
20350 -2088877 -779688 992030 4414170 5340490 5682719 4748847 4084818 4912807 5397091
20341 5397091 7147684 9311587 8532657 5737593 1820769 1692807 4206111 3626948 759913
20332 759913 -480866 1618329 2779112 3836781 4355357 4559558 3950136 2391730 2511858
20323 2511858 3822280 5232030 4432785 1632258 -1324173 -1017659 1567397 2657219
20315 2657219 3093263 3380772 3920273 2839973 1167004 -109371 827218 1916127 3521416
20306 3521416 3728880 2068036 53060 -2029340 -3105311 -1546289 637352 3025709
20298 3025709 5217069 5545610 4097268 4364339 4319938 2787174 -168781 -1939135 -41730
20289 -41730 1613967 2546352 2549199 2565402 1605836 1437439 2201592 1233403 487825 1714083
$$ packed form
20350b088877J309189J771718L422140R26320L42229r33872o64029Q27989M84284
20341E397091J750593K163903p78930k795064l916824j27962K513304n79163k867035
20332G59913j240779K099195J160783J057669N18576K04201o09422j558406J20128
20323B511858J310422J409750p99245k800527k956431L06514K585056J089822
20315B657219M36044K87509N39501j080300j672969j276375R36589J088909J605289
20306C521416K07464j660844k014976k082400j075971J559022K183641K388357
20298C025709K191360L28541j448342K67071m4401j532764k955955j770354J897405
20289d1730J655697R32385K847J6203r59566j68397P64153r68189p45578J226258
$$ plain form
20279 1714083 2601350 2609226 1363878 937551 708262 -789576 -3214375 -2625457 -682070
20270 -682070 -496132 -939094 615323 1955519 3054209 3185122 2974817 3092245 4127639
20261 4127639 5380368 3436964 1151677 804931 2375546 3207238 1862752 -1962299
20253 -1962299 -4223740 -4545639 -4751204 -1790493 1470627 1360543 467792 -165871 -1998504
20244 -1998504 -3203431 -1990516 347178 2626823 3891551 2571561 407587 -1487561
20236 -1487561 -2831333 -4070246 -6531294 -6347863 -5891491 -6661747 -7055432 -2910842 1573251
20227 1573251 1045416 -2668101 -3548850 -1308369 -986830 -1327170 -771735 132408 588195
20218 588195 398336 -3268450 -3140523 -822367 -393454 -2459247 -2536275 41637 1380758
$$ packed form
20279A714083Q87267P876j245348m26327k29289j497838k424799N88918J943387
20270f82070J85938m42962J554417J340196J098690J30913k10305J17428J035394
20261D127639J252729j943404k285287l46746J570615Q31692j344486l825051
20253a962299k261441l21899k05565K960711L261120j10084q92751o33663j832633
20244a998504j204927J212915K337694K279645J264728j319990k163974j895148
20236a487561j343772j238913k461048J83431M56372p70256l93685M144590M484093
20227A573251n27835l713517q80749K240481L21539l40340N55435R04143M55787
20218E88195j89859l666786J27927K318156M28913k065793p7028K577912J339121
$$ plain form
20209 1380758 2696991 2781355 2779659 3076278 2499096 843583 -1819481 -4139870 -4968275
20200 -4968275 -3836451 5984 3128649 4664898 5599140 6379065 7932468 6552555
20192 6552555 4404224 4901689 5378362 5002945 5915489 4810047 1183862 -1770018 -3641175
20183 -3641175 -2709324 -1701195 -1054022 -3459100 -5293151 -4915933 -6022364 -6461565 -5382560
20174 -5382560 -6173876 -5043285 -2534040 -10353 781372 -264707 -410133 916318 2429847
20165 2429847 1887587 391876 -1725234 -2789183 -1243466 -748974 -324357 1397770 2735771
20156 2735771 1341009 -1675800 -3671044 -1451503 1163427 4927363 8999009 8483904
20148 8483904 6226060 5560181 5101788 4550525 3929383 3739187 1118659 -703327 -2362633
$$ packed form
20209A380758J316233Q4364j696K96619n77182j655513k663064k320389q28405
20200d968275J131824L842435L122665J536249R34242P79925J553403j379913
20192F552555k148331M97465M76673l75417R12544j105442l626185k953880j871157
20183c641175R31851J008129O47173k405078j834051L77218j106431m39201J079005
20174e382560p91316J130591K509245K523687P91725j046079j45426J326451J513529
20165B429847n42260j495711k117110j063949J545717M94492M24617J722127J338001
20156B735771j394762l016809j995244K219541K614930L763936M071646n15105
20148H483904k257844o65879m58393n51263o21142j90196k620528j821986j659306
$$ plain form
20139 -2362633 -2821759 162048 2914036 3886092 3928965 4460656 5665202 5549075 3040417
20130 3040417 1866584 580047 -1711426 -4446741 -6935520 -5488529 -2097414 575147
20122 575147 3386354 4930203 3705005 1976012 3065657 5111279 6371716 6090992
20114 6090992 5940543 7468702 9109704 9238266 8784796 7247113 4296492 4554620 4149458
20105 4149458 1747182 -2052265 -3050316 -3602992 -4829958 -5819886 -5744624 -4623242 -2420270
20096 -2420270 778893 1608665 1733981 1413478 -417637 -1741776 -2189958 -1337336 1006758
20087 1006758 3859847 4979041 3109740 533913 50976 1866779 1656177 2154013 3761784
20078 3761784 2974701 1185387 1144603 444876 -1799038 -3372544 -2927166 -3623616 -3431697
$$ packed form
20139b362633m59126K983807K751988R72056M2873N31691J204546j16127k508658
20130C040417j173833j286537k291473k735315k488779J446991L391115K672561
20122E75147K811207J543849j225198j728993J089645K045622J260437k80724
20114F090992j50449J528159J641002J28562m53470j537683k950621K58128m05162
20105D149458k402276l799447r98051n52676j226966r89928P5262J121382K202972
20096b420270L199163Q29772J25316l20503j831115j324139m48182Q52622K344094
20087A006758K853089J119194j869301k575827m82937J815803k10602M97836J607771
20078C761784p87083j789314m0784o99727k243914j573506M45378o96450J91919
$$ plain form
20069 -3431697 -2247917 -1006606 -253357 442904 759175 -1103911 -2209691 -1348689 -2375275
20060 -2375275 -1680504 -503224 -995399 -1732395 -2535606 -2792836 -2681962 565471 5060127
20051 5060127 7558003 8162608 9213243 9782493 7680197 6300828 6422956 7037805 5583641
20042 5583641 5059000 5080151 3986930 3141843 3553496 4513455 4767056 4531369 3965098
20033 3965098 2942595 1002731 -439731 649498 1230515 390177 -1987646 -2973038 -1333639
20024 -1333639 -382952 -774559 767779 966861 1215247 1297825 875976 3432044 5518458
20015 5518458 5547856 5880815 5538717 2453118 1228110 212056 -539515 -1239880 -448225
20006 -448225 718174 846236 1370406 2934162 5884500 5787052 4594614 2955840 1841963
$$ packed form
20069c431697J183780J241311P53249O96261L16271j863086j105780Q61002j026586
20060b375275O94771J177280m92175p36996q03211k57230J10874L247433M494656
20051E060127K497876O04605J050635N69250k102296j379369J22128O14849j454164
20042E583641n24641K1151j093221q45087M11653R59959K53601k35687n66271
20033C965098j022503j939864j442462J089229N81017q40338k377823r85392J639399
20024a333639R50687l91607J542338J99082K48386Q2578m21849K556068K086414
20015E518458K9398L32959l42098l085599j225008j016054p51571p00365P91655
20006d48225J166399J28062N24170J563756K950338r7448j192438j638774j113877
$$ plain form
19997 1841963 1284384 -1089751 -2254990 -1035476 -1521800 -439083 2465390 4076361
19989 4076361 2913543 2360429 3271790 4764391 4620605 3716731 4706452 5872853 5270137
19980 5270137 4639210 3903986 5917488 6957218 5321331 4955085 5189532 5791813 4863186
19971 4863186 3760691 5726336 5890044 3753098 1290159 -109354 121481 -182103 -859047
19962 -859047 -612266 717045 1456762 1648328 1688804 2252196 3104748 5483684 7486122
19953 7486122 6975938 7213587 5691306 4268469 4811845 4687884 4266529 6421765 7098702
19944 7098702 6553557 7088408 8577475 11830290 14790536 15674619 17982426 21159490 22311898
19935 22311898 20661419 19202884 20802910 26032369 31404375 35332575 39876915 44172347
$$ packed form
19997A841963n57579k374135j165239J219514m86324J082717K904473J610971
19989D076361j162818n53114R11361J492601j43786r03874R89721J166401o02716
19980E270137o30927p35224K013502J039730j635887l66246K34447O02281r28627
19971D863186j102495J965645J63708k136946k462939j399513K30835l03584o76944
19962h59047K46781J329311P39717J91566M0476N63392Q52552K378936K002438
19953G486122n10184K37649j522281j422837N43376j23961m21355K155236O76937
19944G098702n45145N34851J489067L252815K960246Q84083K307807L177064J152408
19935B2311898j650479j458535J600026N229459N372006L928200M544340M295432
$$ plain form
19927 44172347 53302850 65739621 77691091 92948150 120137134 159402200 216915766
19920 216915766 301106387 406579957 498516234 506238098 447784284 412227742 427683057
19913 427683057 477421188 494871092 419185379 300544518 206104428 143890016 105936333
19906 105936333 80726395 65343681 53184509 44486273 37612578 31797676 28353893
19899 28353893 25690711 23754603 20671128 16482563 13151411 15181990 18686736 21139824
19891 21139824 21406974 20793326 21938568 22838268 25713628 25734783 25848939 25932092 24193446
19882 24193446 21773243 19281471 18556000 19297752 22257913 23775928 21768093 17816882
19874 17816882 15795016 16570817 17250044 19015591 22420581 25133923 27546642 30974559
$$ packed form
19927D4172347R130503J2436771J1951470J5257059K7188984L9265066N7513566
19920B16915766Q4190621J05473570R1936277P721864n8453814l5556542J5455315
19913D27683057M9738131J7449904p5685713j18640861r4440090o2214412l7953683
19906A05936333k5209938j5382714j2159172q698236o873695n814902l443783
19899B8353893k663182j936108l083475m188565l331152K030579L504746K453088
19891B1139824K67150o13648J145242Q99700K875360K1155J14156Q3153j738646
19882B4193446k420203k491772p25471P41752K960161J518015k007835l951211
19874A7816882k021866P75801O79227J765547L404990K713342K412719L427917
$$ plain form
19866 30974559 33160584 36515702 40966684 45826735 54159399 67154607 83013303 102108217
19858 102108217 130477873 172869876 225155103 260789133 248601259 210924713 185242310
19851 185242310 182545644 200975533 236392142 275293240 284181374 253063196 219438585
19844 219438585 203409925 203176762 216583429 235460872 255029581 265544503 258937411
19837 258937411 236581279 211389653 188055100 167983080 152210758 140358417 135892188
19830 135892188 137201590 143701716 156662826 174118591 194942800 218197779 238081466
19823 238081466 248401536 244474885 226104672 200764357 173928057 145179870 117482213
19816 117482213 94160867 77344637 65385288 56173979 51128600 46632533 42412726
$$ packed form
19866C0974559K186025L355118M450982M860051Q332664J2995208J5858696J9094914
19858A02108217K8369656M2392003N2285227L5634030j2187874l7676546k5682403
19851A85242310k696666J8429889L5416609L8901098Q888134l1118178l3624611
19844B19438585j6028660k33163J3406667J8877443J9568709J0514922o607092
19837B58937411k2356132k5191626k3334553k0072020j5772322j1852341m466229
19830A35892188J309402O500126J2961110J7455765K0824209K3254979J9883687
19823B38081466J0320070l926651j8370213k5340315k6836300k8748187k7697657
19816A17482213k3321346j6816230j1959349r211309n045379m496067m219807
$$ plain form
19809 42412726 38617348 33790304 27293600 23100679 23061276 22033415 21695278 20118681
19801 20118681 16247814 12524366 10485129 10096128 8123165 7613717 8266251 8102406 6669735
19792 6669735 5994734 6369217 7960206 7436508 5470871 5485777 5354274 4672047 4213425
19783 4213425 3827769 1336072 815811 2015472 4508426 6309814 5662665 4664281 3990082
19774 3990082 1654390 -293361 -1634316 -36748 2616280 4537608 4325776 215985
19766 215985 -1576049 -759182 -2790598 -3220122 -1360312 -163657 -662953 -1639516 -641647
19757 -641647 943014 1641747 621851 -1790827 -4833484 -6651545 -7274872 -5407001 -4230629
19748 -4230629 -2827420 -1289926 -341031 4726 -638848 -1063027 -2466106 -3444596 -1918666
$$ packed form
19809D2412726l795378m827044o496704m192921l9403j027861l38137j576597
19801B0118681l870867l723448k039237l89001j972963n09448O52534j63845j432671
19792F669735o75001L74483J590989n23698j965637J4906j31503o82227m58622
19783D213425l85656k491697n20261J199661K492954J801388o47149r98384o74199
19774C990082k335692j947751j340955J597568K653028J921328k11832m109791
19766B15985j792034Q16867k031416m29524J859810J196655m99296r76563R97869
19757f41647J584661O98733j019896k412678l042657j818061o23327J867871J176372
19748d230629J403209J537494R48895L45757o43574m24179j403079r78490J525930
$$ plain form
19739 -1918666 442904 252105 -1295003 -387087 1360612 2259362 1606600 41897 569620
19730 569620 2120651 2512365 2586166 2830323 2646217 2856310 3522616 4496227 5335944 6120960
19720 6120960 6777624 7125494 4888307 3589758 4085790 2754035 1227451 -10503 -892706
19711 -892706 -3050801 -4261212 -2807545 -969122 208621 -738958 -1740879 -3901113
19703 -3901113 -5485124 -3086685 -199838 217208 -1580022 -3760670 -5814236 -4877340
19695 -4877340 -2137924 923242 1961946 1845195 96972 281574 -140789 -3252995 -4401945
19686 -4401945 -963853 1936327 1697198 -351726 -4676344 -6741093 -5746276 -3235242
19678 -3235242 -1159829 -888287 -2536693 -4796470 -6174706 -5005306 -1900696 973658
$$ packed form
19739a918666K361570j90799j547108R07916J747699Q98750o52762j564703N27723
19730E69620J551031L91714P3801K44157j84106K10093O66306R73611Q39717P85016
19720F120960O56664L47870k237187j298549M96032j331755j526584j237954q82203
19711h92706k158095j210411J453667J838423J177743r47579j001921k160234
19703c901113j584011K398439K886847M17046j797230k180648k053566R36896
19695d877340K739416L061166J038704j16751j748223J84602m22363l112206j148950
19686d401945L438092K900180k39129k048924m324618k064749R94817K511034
19678c235242K075413K71542j648406k259777j378236J169400L104610K874354
$$ plain form
19670 973658 2128436 1545492 1658897 696358 -2182715 -3268185 -4760172 -6443246 -5831756
19661 -5831756 -3631341 -818259 1812114 2476862 1567200 -1959592 -3981135 -2562331
19653 -2562331 -950718 -54261 -619023 -945190 -2766326 -4073502 -3098226 -2092400 -1503414
19644 -1503414 -2319387 -4331900 -5359278 -6515638 -7963785 -6234324 -2416410 124918
19636 124918 269109 783391 -248028 -1909419 -2239662 -1967604 -2288466 -2132352 -2672095
19627 -2672095 -1392338 -91930 -259253 -986034 -3109458 -1809196 1069254 2962000
19619 2962000 3880299 3508637 2012522 2766619 3435923 667788 -3683708 -4192001 -1667208
19610 -1667208 2064551 4863952 5109839 1266576 -2136733 -5489394 -8017166 -7037989
$$ packed form
19670I73658J154778n82944J13405r62539k879073j085470j491987j683074O11490
19661e831756K200415K813082K630373O64748r09662l526792k021543J418804
19653b562331J611613Q96457n64762l26167j821136j307176R75276J005826N88986
19644a503414q15973k012513j027378j156360j448147J729461L817914K541328
19636A24918J44191N14282j031419j661391l30243K72058l20862J56114n39743
19627b672095J279757J300408j67323p26781k123424J300262K878450J892746
19619B962000R18299l71662j496115P54097O69304k768135m351496n08293K524793
19610a667208L731759K799401K45887l843263l403309l352661k527772R79177
$$ plain form
19602 -7037989 -6714675 -5102856 -3892123 -4324521 -6210005 -7087446 -5969466 -3077169 -3044560
19593 -3044560 -5080416 -6256637 -3390761 103066 1827526 1412836 -4582 1792877
19585 1792877 2580931 1508355 1002448 532565 -1146819 -5064272 -7552583 -5555411 -870086
19576 -870086 3934154 4432388 1715879 1219462 1042324 2072872 6127222 6451556 3420499
19567 3420499 3132894 3326838 4345205 6206231 5703476 3902830 2333461 1912754 1070958
19558 1070958 -335802 337320 577456 -403597 742444 2052626 1331571 -796230 -1522734
19549 -1522734 -1883426 -2863146 -3426953 -1322822 1699623 2919246 1192717 -1826176 -3997766
19540 -3997766 -3957540 -1911771 408351 2804808 2637869 1123663 926376 1611044 2525588
$$ packed form
19602g037989L23314J611819J210733m32398j885484q77441J117980K892297L2609
19593c044560k035856j176221K865876L493827J724460m14690j417418J797459
19585A792877P88054j072576n05907m69883j679384l917453k488311J997172M685325
19576h70086M804240M98234k716509m96417j77138J030548M054350L24334l031057
19567C420499k87605J93944J018367J861026n02755j800646j569369m20707q41796
19558A070958j406760O73122K40136r81053J146041J310182p21055k127801p26504
19549a522734l60692r79720n63807K104131L022445J219623j726529l018893k171590
19540c997766M0226K045769K320122K396457j66939j514206j97287O84668R14544
$$ plain form
19531 2525588 3225226 1901008 161479 -349493 -1293670 -1446806 -1969718 -2238094 -2204119
19522 -2204119 -2609159 -2412074 -2628643 -4713569 -5601074 -5504731 -4255481 -2065094 -2437283
19513 -2437283 -2461953 -1108123 1139771 4709162 4934375 3200089 2078924 -574994 -3428452
19504 -3428452 -4480256 -3658978 -1989910 819172 3046184 3556449 3481427 1032496 -689423
19495 -689423 -1648266 -2489716 -554698 -170941 -574305 1734604 3481397 1842321 879442
19486 879442 -949910 -1374811 776769 2825190 2012100 -150236 -3146865 -5337000 -5369655
19477 -5369655 -5673356 -6574906 -5709871 -4741697 -3453537 -1667599 -1197448 1294554 3542811
19468 3542811 3244519 1774004 1336170 117914 -1482275 -1349042 -744140 -1648778 -1741868
$$ packed form
19531B525588O99638j324218j739529n10972r44177j53136n22912k68376L3975
19522b204119m05040J97085k16569k084926q87505R6343J249250K190387l72189
19513b437283k4670J353830K247894L569391K25213j734286j121165k653918k853458
19504c428452j051804Q21278J669068K809082K227012N10265p5022k448931j721919
19495f89423r58843q41450J935018L83757m03364K308909J746793j639076r62879
19486H79442j829352m24901K151580K048421q13090k162336k996629k190135l2655
19477e369655l03701r01550Q65035R68174J288160J785938M70151K492002K248257
19468C542811k98292j470515m37834j218256j600189J33233O04902r04638r3090
$$ plain form
19459 -1741868 -680347 194256 724248 70370 -4332043 -4088494 -2141671 -3562976 -5805335
19450 -5805335 -6122215 -4217551 -2827515 -1312026 929205 4199281 6863799 7236900
19442 7236900 4695760 -135115 -1477520 -1627739 -2258625 -1968039 -820280 -1749506 1336968
19433 1336968 5076549 6541924 6925005 4346826 1393302 -519252 351251 2754670
19425 2754670 2767729 2518148 2707813 2083933 -200411 -2172227 -4605817 -7043210 -6205682
19416 -6205682 -4384758 -1001348 802936 268592 -233243 -124379 1330724 2558552 1955915
19407 1955915 -392955 -4912913 -6330357 -4033807 -2672712 -3943880 -4295774 -2575713
19399 -2575713 1484207 5320683 5072222 3592618 2725213 2113292 -116431 -2363134 -4004968
$$ packed form
19459a741868J061521Q74603N29992o53878m402413K43549J946823j421305k242359
19450e805335l16880J904664J390036J515489K241231L270076K664518L73101
19442G236900k541140m830875j342405j50219o30886K90586J147759r29226L086474
19433A336968L739581J465375L83081k578179k953524j912554Q70503K403419
19425B754670J3059k49581J89665o23880k284344j971816k433590k437393Q37528
19416f205682J820924L383410J804284n34344n01835J08864J455103J227828o02637
19407A955915k348870m519958j417444K296550J361095j271168l51894J720061
19399b575713M059920L836476k48461j479604q67405o11921k229723k246703j641834
$$ plain form
19390 -4004968 -5575173 -4891224 -2298387 -1289268 -1007346 -2217561 -548446 1334395
19382 1334395 1976490 2500481 -189344 -2498858 -3260407 -2565086 -3693278 -4801372 -5016484
19373 -5016484 -3781261 -317400 3978290 3620449 442028 -442147 -1128738 -3135104 -4275829
19364 -4275829 -3748558 -758678 -345688 -2682329 -5120701 -5599968 -3588551 -1254335 840568
19355 840568 2082536 1535254 -1488133 -2254729 -148916 819052 -495277 -2423380 -3382228
19346 -3382228 -3633058 -3071505 -939415 3160448 4207123 4213567 3093175 433401 -1307910
19337 -1307910 -1915685 -3372840 -3541767 -2488284 -2658425 -3793375 -3867351 -4342525 -4092887
19328 -4092887 -2335022 -2568743 -3340693 -943424 1276376 553104 1718867 3488703 4892257
$$ packed form
19390d004968j570205O83949K592837J009119K81922j210215J669115J882841
19382A334395O42095N23991k689825k309514p61549O95321j128192j108094k15112
19373e016484J235223L463861M295690l57841l178421q84175o86591k006366j140725
19364d275829N27271K989880M12990k336641k438372m79267K011417K334216K094903
19355H40568J241968n47282l023387p66596K105813R67968j314329j928103r58848
19346c382228k50830N61553K132090M099863J046675O444j120392k659774j741311
19337a307910o07775j457155j68927J053483j70141j134950p3976m75174K49638
19328d092887J757865k33721p71950K397269K219800p23272J165763J769836J403554
$$ plain form
19319 4892257 5493894 6429202 5153268 4060345 2384033 1265365 1455149 860384 -67861
19310 -67861 65273 2385682 4759478 4924198 4806954 5025183 3125168 673458 1940380
19301 1940380 4889983 4314967 1739755 -1044091 -512483 1728322 2258774 2760750 2114015
19292 2114015 1709236 2203779 2194822 2855287 1501697 1051001 4021686 6038958 6692870
19283 6692870 6585050 3682259 365540 -90812 469617 -1387333 -3163163 -2860477 -2063730
19274 -2063730 439236 2114072 -298490 -4972996 -6157514 -6893092 -8733589 -5861367
19266 -5861367 -1744137 1325938 3658136 3629876 3306600 2970936 1363911 61605 -370128
19257 -370128 -1567868 -2738498 -1317849 -1675369 -2166956 -404598 1312782 3001681 2025794
$$ packed form
19319D892257O01637R35308j275934j092923j676312j118668J89784n94765r28245
19310f7861J33134K320409K373796J64720j17244K18229j900015k451710J266922
19301A940380K949603n75016k575212k783846N31608K240805N30452N01976o46735
19292B114015m04779M94543q957O60465j353590m50696K970685K017272O53912
19283F692870j07820k902791l316719m56352N60429j856950j775830L02686P96747
19274b063730K502966J674836k412562m674506j184518p35578j840497K872222
19266e861367M117230L070075K332198k8260l23276l35664j607025j302306m31733
19257c70128j197740j170630J420649l57520m91587J762358J717380J688899r75887
$$ plain form
19248 2025794 3620409 5756198 3206740 -455083 -1857804 -2398406 -3107099 -2224196 -1525964
19239 -1525964 -2756241 -4668875 -3839957 -2006340 211635 1692005 2214360 970179
19231 970179 -300126 -165897 630189 -229016 2179256 4073185 2503077 1871217 3754673
19222 3754673 3652680 2206569 1501310 -611529 -3308013 -5565569 -6669527 -5544330
19214 -5544330 -2335652 -1350672 -1993816 -2594109 -3938291 -4249902 -3923540 -971999 1753486
19205 1753486 2051225 823677 1035641 277200 -212945 -333353 -1623181 -1827779 -2002359
19196 -2002359 -4973310 -6640491 -5983070 -6846225 -6170012 -4492845 -3874604 -6848000 -10241948
19187 -10241948 -10563241 -7538637 -3197036 240595 -523027 -2924104 -3583470 -2091741
$$ packed form
19248B025794J594615K135789k549458l661823j402721n40602p08693Q82903O98232
19239a525964j230277j912634Q28918J833617K217975J480370N22355j244181
19231I70179j270305J34229P96086q59205K408272J893929j570108o31860J883456
19222C754673j01993j446111p05259k112839k696484k257556j103958J125197
19214e544330L208678R84980o43144o00293j344182l11611L26362K951541K725485
19205A753486K97739j227548K11964p58441m90145j20408j289828k04598j74580
19196b002359k970951j667181O57421q63155O76213J677167O18241k973396l393948
19187a0241948l21293L024604M341601L437631p63622k401077o59366J491729
$$ plain form
19179 -2091741 -331538 -504066 -1139669 994821 1826189 -823959 -2365626 -3461408 -3808659
19170 -3808659 -5119906 -3891342 -167341 4973346 7399150 5622520 4237832 1104204
19162 1104204 -1587963 -2111671 -1379991 480244 4596799 5938364 3608100 2451114
19154 2451114 2535742 302297 -1698712 -956171 -1684762 -4091966 -4034501 -3070037 -4300083
19145 -4300083 -4183983 -1608586 -1881887 -1073736 621675 50389 -1642308 -1559777 -1600871
19136 -1600871 -4246386 -5332480 -5111137 -5148035 -6353019 -7546243 -7556690 -7198389 -4356560
19127 -4356560 -3001607 -3071380 -1981661 -286428 1546232 448343 -899855 -197109 939249
19118 939249 2167703 2593261 2105606 1466678 3488682 5033253 3726059 2191445 2735051
$$ packed form
19179b091741J760203j72528o35603K134490Q31368k650148j541667j095782l47251
19170c808659j311247J228564L724001N140687K425804j776630j384688l133628
19162A104204k692167n23708P31680J860235M116555J341565k330264j156986
19154B451114Q4628k233445k001009P42541p28591k407204N7465R64464j230046
19145d300083J16100K575397k73301Q08151J695411n71286j692697Q2531m1094
19136a600871k645515j086094K21343l6898j204984j193224j0447L58301K841829
19127d356560J354953o9773J089719J695233J832660j097889j348198P02746J136358
19118I39249J228454M25558m87655o38928K022004J544571j307194j534614N43606
$$ plain form
19109 2735051 4536609 5138161 3067831 -1469726 -3650165 -4272060 -2688113 -370334
19101 -370334 2738935 4078766 2434887 1776444 1479759 -349660 -839329 121929 346963
19092 346963 103546 -1658984 -3911961 -4477413 -3569961 -305343 2821189 4763781 5068763
19083 5068763 3462942 2107700 168050 -1458300 -1068288 -462827 456438 2142476 1630130
19074 1630130 483243 -1712155 -3592828 -4374721 -3179200 -2501577 -3688135 -4739155
19066 -4739155 -5026968 -4166529 -4251872 -3274727 -1795597 -1467227 -1077999 -1488569 -967264
19057 -967264 219336 2298082 2116243 -269532 -2440726 -3805097 -3794938 -4097307 -5096538
19048 -5096538 -5529806 -4247568 -4467553 -4693539 -2116218 -1486155 -2729406 -3368125 -2577506
$$ packed form
19109B735051J801558O01552k070330m537557k180439o21895J583947K317779
19101c70334L109269J339831j643879o58443k96685j829419m89669R61258K25034
19092C46963k43417j762530k252977n65452R07452L264618L126532J942592L04982
19083E068763j605821j355242j939650j626350L90012O05461R19265J686038n12346
19074A630130j146887k195398j880673p81893J195521O77623j186558j051020
19066d739155k87813Q60439q5343R77145J479130L28370L89228m10570N21305
19057i67264J186600K078746j81839k385775k171194j364371J0159l02369r99231
19048e096538m33268J282238k19985k25986K577321O30063j243251o38719P90619
$$ plain form
19039 -2577506 -1972633 -1696679 -2242632 -4477355 -3190113 -168381 785300 866369 -456288
19030 -456288 -2394529 -2291146 -390419 -89435 -341465 832 1252757 1582482 846284
19021 846284 -518859 -2982812 -4583323 -6373021 -4929527 -1435091 361250 571389
19013 571389 991759 3994795 5064936 4620164 4140167 2250949 1031136 -148566 -1323086
19004 -1323086 -1872940 -2052889 -1563758 -2095959 -2211214 -2778750 -4084742 -3802658 -3808640 -3343293
18994 -3343293 -2188270 -2110553 -2052486 -2375097 -3192978 -3483516 -2104454 -137504 1761114
18985 1761114 2318261 2077073 329889 -459981 720752 1481924 2219263 2669758 819794
18976 819794 -1811848 -3520719 -3867005 -2027646 1772441 2797240 853712 -1594776
$$ packed form
19039b577506O04873K75954n45953k234723J287242L021732R53681Q1069j322657
19030d56288j938241J03383J900727L00984k52030L42297J251925L29725p36198
19021H46284j365143k463953j600511j789698J443494L494436J796341K10139
19013E71389M20370L003036J070141m44772m79997j889218j219813j179702j174520
19004a323086n49854j79949M89131n32201j15255n67536j305992K82084n982M65347
18994c343293J155023P7717N8067l22611q17881k90538J379062J966950J898618
18985A761114N57147k41188j747184p89870J180733P61172P37339M50495j849964
18976H19794k631642j708871l46286J839359L800087J024799j943528k448488
$$ plain form
18968 -1594776 -2412044 -991964 1888609 2947596 1308928 -48438 -836602 -171392 2131368
18959 2131368 4249643 4327593 4816820 4378995 3535211 3512669 2728461 538313 -223546
18950 -223546 1711574 3266218 3823056 4474109 7304025 8491107 6116195 3404719 2726813
18941 2726813 1224925 312821 108479 103093 840367 2532229 2853788 1445888 761959
18932 761959 -1258184 -717165 1309580 -866475 -3047047 -5310508 -5291446 -2842298 -2501244
18923 -2501244 -2858754 -1862792 -391754 1693210 4262669 4599247 4583921 5379576 4045561
18914 4045561 561366 -1400236 -2071973 -2337067 -759554 406494 1521985 2435441 760172
18905 760172 -1370240 -3207395 -3792572 -1081906 -1162398 -3605591 -2981199 -4877643 -6793651
$$ packed form
18968a594776q17268J420080K880573J058987j638668j357366p88164O65210K302760
18959B131368K118275P7950M89227m37825q43784k2542p84208k190148p61859
18950b23546J935120J554644N56838O51053K829916J187082k374912k711476o77906
18941B726813j501888r12104k04342n386P37274J691862L21559j407900o83929
18932G61959k020143N41019K026745k176055k180572k263461J9062K449148L41054
18923b501244l57510R95962J471038K084964K569459L36578j5326P95655j334015
18914D045561l484195j961602o71737k65094J577513J166048J115491R13456j675269
18905G60172k130412j837155n85177K710666q0492k443193O24392j896444j916008
$$ plain form
18896 -6793651 -7309724 -7471507 -7297595 -5495769 -3625403 -1016184 1415760 739189 -2384481
18887 -2384481 -4447165 -2733312 -1781804 -1588259 -605826 8308 1883663 3596976 3099543
18878 3099543 1910867 931913 -812850 -1674635 1045210 4527912 7600369 8401557 6431759
18869 6431759 3793167 1539053 -795263 -2309740 -3113920 -3250056 -2626951 -2635669 -2887454
18860 -2887454 -855117 1644288 1112175 -716080 -199675 -375230 -2606149 -3238902 -2505857
18851 -2505857 -1133875 -2437571 -5662229 -6827189 -5455278 -5149792 -4127160 -3854115
18843 -3854115 -5883671 -7989778 -6824889 -4624049 -1349131 1307616 4246280 4693016
18835 4693016 1655478 -542329 -1410955 -1470074 -2162400 -2829242 -1307968 -271961 1182171
$$ packed form
18896f793651n16073j61783J73912J801826J870366K609219K431944o76571l123670
18887b384481k062684J713853R51508J93545R82433O14134J875355J713313m97433
18878C099543j188676r78954j744763q61785K719845L482702L072457Q01188j969798
18869F431759k638592k254114k334316j514477q04180j36136O23105q718k51785
18860b887454K032337K499405n32113j828255N16405j75555k230919o32753P33045
18851b505857J371982j303696l224658j164960J371911L05486J022632K73045
18843c854115k029556k106107J164889K200840L274918K656747K938664M46736
18835D693016l037538k197807q68626n9119o92326o66842J521274J036007J454132
$$ plain form
18826 1182171 2230072 1683194 1435979 1486814 -407912 -2904792 -3270842 -2747803 -2046196
18817 -2046196 -1589128 -1578916 -980776 -120365 303668 655092 2251302 4111689 2663315
18808 2663315 -615184 -1570896 709124 678629 -1418912 -721121 -389489 -1276157 -1217704
18799 -1217704 -1149459 -1376564 -624025 384517 -450744 -1591813 -387419 1320524 1320924
18790 1320924 185445 454646 238029 -1440722 -3474949 -6950595 -7903218 -7490131 -7770124
18781 -7770124 -8821279 -10437687 -5847562 -1496138 -1505234 -1808696 -2052616 -2320118 -1654513
18772 -1654513 -1258012 -391856 1443953 535742 -1703978 -3614618 -6147071 -6082846 -3719975
18763 -3719975 -2203024 -815930 1038283 520210 1510217 4175085 2881299 226393
$$ packed form
18826A182171J047901n46878k47215N0835j894726k496880l66050N23039P01607
18817b046196M57068J0212N98140Q60411M24033L51424J596210J860387j448374
18808B663315l278499r55712K280020l0495k097541O97791L31632q86668N8453
18799a217704O8245k27105P52539J008542q35261j141069J204394J707943M00
18790A320924j135479K69201k16617j678751k034227l475646r52623M13087k79993
18781g770124j051155j616408M590125M351424r096l03462k43920k67502O65605
18772a654513L96501Q66156J835809r08211k239720j910640k532453O4225K362871
18763c719975J516951J387094J854213n18073R90007K664868j293786k654906
$$ plain form
18755 226393 -3220815 -5102962 -4943411 -4288859 -4194271 -2080713 -1075523 -2819441 -2351639
18746 -2351639 -706902 -1003713 -1715038 -1358940 487893 1774497 2101503 1989077 2483696
18737 2483696 2783770 2573502 2517708 1827870 290369 705575 830508 -2882008 -5663843
18728 -5663843 -7811946 -6976880 -3428027 -982489 19226 -303498 -1281200 -1994047 -1053281
18719 -1053281 1443788 2617744 2327876 1480119 1425424 3748950 5501947 4110105 2562483
18710 2562483 2939741 1847855 1607902 1565516 1276342 2812521 4096264 3440910 4074429
18701 4074429 6484475 6936069 7395779 7301696 5826704 3176682 698152 -1794939 -3634167
18692 -3634167 -3085099 -766167 2436506 2791171 2716320 3219375 3702785 2965910 501792
$$ packed form
18755B26393l447208j882147J59551O54552R4588K113558J005190j743918M67802
18746b351639J644737k96811p11325L56098J846833J286604L27006j12426M94619
18737B483696L00074k10268n5794o89838j537501M15206J24933l712516k781835
18728e663843k148103Q35066L548853K445538J001715l22724r77702p12847R40766
18719a053281K497069J173956k89868q47757n4695K323526J752997j391842j547622
18710B562483L77258j091886k39953m2386k89174J536179J283743o55354O33519
18701D074429K410046M51594M59710r4083j474992k650022k478530k493091j839228
18692c634167N49068K318932L202673L54665p4851N03055M83410p36875k464118
$$ plain form
18683 501792 -798273 1336085 4260161 5366317 4307404 473379 -2540421 -1757625
18675 -1757625 -1830564 -3705827 -4001914 -1529128 -1049281 -3429013 -4585488 -4412987 -2754669
18666 -2754669 -1390429 -1672485 -2980803 -4882318 -6639093 -6735223 -4716803 -3630799 -2758717
18657 -2758717 -982228 -199611 -287349 -480454 -1536554 -2247002 -1672334 -1182817 -1206208
18648 -1206208 -1635067 -1383237 1577945 4320281 5709983 4885351 1118493 -1676016 -693003
18639 -693003 2689152 5418329 5966478 4686791 3307780 762118 1783610 5076420
18631 5076420 8327280 9093072 6144692 3599894 4117336 4265430 2395891 1924064 2534396
18622 2534396 3286716 1926053 149107 385117 944774 1001312 432308 1454683 1556105
$$ packed form
18683E01792j300065K134358K924076J106156j058913l834025l013800P82796
18675a757625p2939j875263k96087K472786M79847k379732j156475J72501J658318
18666b754669J364240k82056j308318j901515j756775r6130K018420J086004Q72082
18657b758717J776489P82617q7738j93105j056100p10448N74668M89517k3391
18648a206208m28859K51830K961182K742336J389702q24632l766858k794509R83013
18639f93003L382155K729177N48149j279687j379011k545662J021492L292810
18631E076420L250860P65792k948380k544798N17442J48094j869539m71827O10332
18622B534396P52320j360663j776946K36010N59657N6538n69004J022375J01422
$$ plain form
18613 1556105 460632 -2620724 -5420038 -5069479 -3157581 -1178879 1164356 1715172
18605 1715172 986764 1198885 1888756 3059260 2032702 -197967 -255845 714242 550633
18596 550633 1456671 3155356 3181551 2207275 1872429 972086 761749 448077 511225 2234008
18586 2234008 3004780 1210360 -1240689 -1327240 1121001 5461794 6822042 5661867 3595937
18577 3595937 2727428 3252924 5461213 5432414 2150099 1175275 1177927 284186 -205798 -321459
18567 -321459 -2296693 -3029081 -2090874 -1041095 2693507 3478346 723329 788960 781797
18558 781797 -529426 -1349689 -2923489 -3450679 -2152530 -1851446 -1567610 -2267159 -2345803
18549 -2345803 -1965048 -2469355 -2408447 -2431811 -2482521 -2932315 -3213629 -1248407 112017 -1359400
$$ packed form
18613A556105j095473l081356k799314L50559J911898J978702K343235N50816
18605A715172p28408K12121O89871J170504j026558k230669n7878R70087j63609
18596E50633R06038J698685K6195r74276l34846r00343k10337l13672O3148J722783
18586B234008P70772j794420k451049q6551K448241M340793J360248j160175k065930
18577C595937q68509N25496K208289k8799l282315r74824K652q93741m89984j15661
18567c21459j975234p32388R38207J049779L734602P84839k755017O5631p163
18558G81797j311223q20263j573800n27190J298149L01084K83836o99549p8644
18549b345803L80755n04307O0908k3364n0710m49794k81314J965222J360424j471417
$$ plain form
18539 -1359400 -4318429 -6105820 -5739242 -4772625 -2478534 522362 2114249 3720236
18531 3720236 3488371 1775657 -415149 -2300248 -2645460 93748 4781459 4371317 1021614
18522 1021614 2761074 5390717 4909957 3445666 1759639 1508493 3323403 4110493 3186150
18513 3186150 2015141 651249 -1323913 -2979636 -2978722 -1594831 -1919236 -1718559 -2313710
18504 -2313710 -2020060 -938565 2037550 3072001 -118829 -5224012 -7089398 -5771359
18496 -5771359 -5088709 -5203273 -4321946 -2068493 -908189 277628 2283607 2772036 2967867
18487 2967867 3938479 1019239 -1501598 -44307 1174279 908929 1419840 1214664 1807415
18478 1807415 2140626 661052 844457 2981402 5155860 6878220 7143847 6511215 4917153
$$ packed form
18539a359400k959029j787391L66578R66617K294091L000896J591887J605987
18531C720236k31865j712714k190806j885099l45212K739208M687711m10142l349703
18522A021614J739460K629643m80760j464291j686027k51146J814910P87090r24343
18513C186150j171009j363892j975162j655723R14J383891l24405K00677n95151
18504b313710K93650J081495K976115J034451l190830n105183j865386J318039
18496e771359O82650j14564Q81327K253453J160304J185817K005979M88429J95831
18487B967867R70612k919240k520837J457291J218586k65350N10911k05176N92751
18478A807415L33211j479574J83405K136945K174458J722360K65627o32632j594062
$$ plain form
18469 4917153 2683068 1822830 2208965 902713 765387 875610 -2232607 -2121224 1553670
18460 1553670 4197961 3478586 1559477 2925711 4529780 4376887 2577457 1377214
18452 1377214 913115 -1458446 -5163805 -6891531 -6241576 -6005269 -5545549 -6144222 -6847842
18443 -6847842 -5011313 -2789176 -2276788 -3608414 -5526370 -4512737 -3077000 -3515788
18435 -3515788 -6117177 -5905127 -2108458 257328 -1253191 -2131567 -487314 -986385 -2675534
18426 -2675534 -3104231 -2398169 -1250757 -351906 1399155 1647232 2374963 2026560 1278788
18417 1278788 1517105 -266953 -1202141 -2358347 -4073123 -4805082 -3835065 -3844026 -3140377
18408 -3140377 -250227 595846 152951 536160 263552 -1155964 -3659586 -4723333 -3475046
$$ packed form
18469D917153k234085q60238L86135j306252j37326J10223l108217J11383L674894
18460A553670K644291p19375j919109J366234J604069j52893j799430j200243
18452A377214m64099k371561l705359j727726O49955K36307M59720n98673p03620
18443f847842J836529K222137N12388j331626j917956J013633J435737m38788
18435c515788k601389K12050L796669K365786j510519q78376J644253m99071j689149
18426b675534m28697P06062J147412Q98851J751061K48077P27731l48403p47772
18417A278788K38317j784058r35188j156206j714776p31959R70017q961P03649
18408c140377K890150Q46073m42895L83209k72608j419516k503622j063747J248287
$$ plain form
18399 -3475046 -4320068 -6265031 -5001951 -3382246 -3025189 -4706312 -6201273 -5880227 -5157912
18390 -5157912 -4705170 -5442631 -4463691 -2878162 -1684726 -1688803 -894975 276751 -617587
18381 -617587 910849 1026550 -1597282 -4037441 -3585354 -1991207 75808 724165 1390387
18372 1390387 2450872 4028241 2732507 1733171 1665515 -827725 -3816560 -4984582 -4036814
18363 -4036814 -3272454 -2109567 -1687775 -2451465 -1536273 -1599764 -5934416 -10369490 -9685015
18354 -9685015 -5717976 -4579897 -3669541 -883040 750491 839964 961614 2265841 3362028
18345 3362028 2331860 2481820 3459652 1563223 -1160332 -1559141 -1245036 -1219206 1055888
18336 1055888 1732827 537897 1003027 3137468 6155537 6682361 5201848 2842576 125007
$$ packed form
18399c475046q45022j944963J263080J619705L57057j681123j494961L21046P22315
18390e157912M52742p37461R78940J585529J193436m077P93828J171726q94338
18381f17587J528436J15701k623832k440159M52087J594147K067015O48357O66222
18372A390387J060485J577369j295734r99336o7656k493240k988835j168022R47768
18363d036814P64360J162887M21792p63690R15192o3491m334652m435074O84475
18354i685015L967039J138079R10356K786501J633531Q9473J21650J304227J096187
18345C362028j030168J49960R77832j896429k723555l98809L14105K5830K275094
18336A055888O76939j194930M65130K134441L018069N26824j480513k359272k717569
$$ plain form
18327 125007 -1980866 -1775734 -1066261 441178 2554710 3590458 725442 146079 173321
18318 173321 -283197 1319008 3073441 2229915 3320665 4480727 2613006 2310888 2668609
18309 2668609 605933 -2403008 -4258626 -4407510 -4472410 -3998711 -2422137 -928382 1025432
18300 1025432 2230993 1306172 -1462217 -2820328 -2508973 -1371611 -2232527 -4928868 -5328379
18291 -5328379 -4059984 -5614658 -6684205 -4438601 -1201334 -604650 -2317688 -5010453
18283 -5010453 -5568798 -5518875 -3771459 -2636590 -2988599 -2373242 -405021 -815006 -2614573
18274 -2614573 -2660383 -3704820 -4415486 -983495 2930802 3717461 2797448 1758238 1847953
18265 1847953 1053321 -1606637 -4821560 -6559581 -6498903 -4693816 -2763196 -2433519 -4091422
$$ packed form
18327A25007k105873K05132P09473J507439K113532J035748k865016n79363K7242
18318A73321m56518J602205J754433q43526J090750J160062j867721l02118L57721
18309B668609k062676l008941j855618j48884o4900M73699J576574J493755J953814
18300A025432J205561r24821k768389j358111L11355J137362q60916k696341l99511
18291e328379J268395j554674j069547K245604L237267N96684j713038k692765
18283e010453n58345M9923J747416J134869l52009O15357J968221m09985j799567
18274b614573m5810j044437p10666L431991L914297P86659r20013j039210Q9715
18265A847953p94632k659958l214923j738021O0678J805087J930620L29677j657903
$$ plain form
18256 -4091422 -4860848 -2719214 -868102 1131085 2437461 2305403 1565954 47319 -2365127
18247 -2365127 -3874253 -1484417 2398648 2829884 1210034 -1735113 -3731645 -4014683
18239 -4014683 -2847515 -3358233 -4302288 -4519217 -5036731 -5021297 -4564544 -3530004 -3246470
18230 -3246470 -2866961 -261107 3237145 1535122 -549438 108836 -594900 396308 515674
18221 515674 -287829 -499145 -799067 -2027474 -2541503 -1910139 190697 3907672 5198097
18212 5198097 3139137 1830781 821900 -194882 -1048724 -1435301 -519973 -532324 -1080110
18203 -1080110 -1916502 -2410058 -962329 2009347 3600526 2370685 900778 86873 -130479
18194 -130479 117129 266444 -1140467 -994346 -1422944 -2206709 -2088222 -579741 -122254
$$ packed form
18256d091422p69426K141634J851112J999187J306376j32058p39449j518635k412446
18247b365127j509126K389836L883065M31236j619850k945147j996532k83038
18239d014683J167168n10718r44055k16929n17514J5434M56753J034540K83534
18230c246470L79509K605854L498252j702023k084560O58274p03736R91208J19366
18221E15674q03503k11316k99922j228407n14029O31364K100836L716975J290425
18212E198097k058960j308356j008881j016782q53842l86577R15328j2351n47786
18203a080110q36392m93556J447729K971676J591179j229841j469907q13905k17352
18194a30479K47608J49315j406911J46121m28598p83765J18487J508481M57487
$$ plain form
18185 -122254 -2378204 -4604247 -3276066 -1172754 1695408 6940502 10381131 10115578
18177 10115578 6971819 4358893 3541161 3914715 -23629 -1850901 580974 1546761
18169 1546761 -409307 -1867531 -881581 1386088 2772690 2349310 2462004 579851 -345187
18160 -345187 -186688 1046426 1891633 1887923 359826 -358930 -1089341 -2601925 -1453803
18151 -1453803 672514 2382578 566757 -1596505 -1137321 -1150118 -1574090 -889987 -517030
18142 -517030 195099 1185274 2828507 4696677 6202009 5616765 3493920 666507 -981081
18133 -981081 -4244305 -6339232 -7411862 -7490473 -4643417 -1424674 -2902035 -5264684 -4883390
18124 -4883390 -3598875 -2238803 -1655666 -3502550 -4507247 -3809504 -1244570 314704
$$ packed form
18185a22254k255950k226043J328181K103312K868162N245094L440629k65553
18177A0115578l143759k612926q17732L73554l938344j827272K431875R65787
18169A546761j956068j458224R85950K267669J386602m23380J12694j882153r25038
18160c45187J58499J233114Q45207l710j528097p18756p30411j512584J148122
18151a453803K126317J710064j815821k163262M59184j2797m23972O84103L72957
18142e17030P12129R90175J643233J868170J505332n85244k122845k827413j647588
18133i81081l263224k094927j072630p8611K847056L218743j477361k362649L81294
18124d883390J284515J360072N83137j846884j004697O97743K564934J559274
$$ plain form
18116 314704 -418283 -2438908 -2063729 -143208 1305217 1474079 -1191202 -4426231 -6460633
18107 -6460633 -5265031 -1710462 1804567 3850270 2228270 403699 -1739473 -4251953
18099 -4251953 -4161840 -4255334 -2715052 -1975980 -2691583 -479583 1357891 1431691 2104390
18090 2104390 2540769 1629024 2565896 4081552 3369126 2734004 3810088 4883552 4458751
18081 4458751 2954811 2658509 3098466 2118931 1575909 903367 -1104082 -2627220 -3992182
18072 -3992182 -5199300 -3081551 -1514078 -164423 597931 2799256 3592958 1767026
18064 1767026 952920 350824 341504 -231082 411187 578626 -995775 -1898707 -3289345
18055 -3289345 -2896383 -217829 140467 -323233 456500 2005042 2046968 632969 -1720376
$$ packed form
18116C14704p32987k020625L75179J920521J448425J68862k665281l235029k034402
18107f460633J195602L554569L515029K045703j622000j824571k143172k512480
18099d251953R0113r3494J540282P39072p15603K212000J837474P3800O72699
18090B104390M36379r11745R36872J515656p12426o35122J076084J073464m24801
18081D458751j503940k96302M39957r79535n43022o72542k007449j523138j364962
18072c992182j207118K117749J567473J349655P62354K201325P93702j825932
18064A767026q14106o02096r320n72586O42269J67439j574401r02932j390638
18055c289345L92962K678554L58296m63700P79733J548542M1926j413999k353345
$$ plain form
18046 -1720376 233825 4007169 5697371 2974435 550554 993762 772042 694025 1147609
18037 1147609 386980 -442155 -565467 -1041002 -3536885 -4285991 -2674407 -2222895 -2142245
18028 -2142245 -1072845 577486 -518725 -2325049 -490588 3295064 5042775 5826015
18020 5826015 6059429 3894446 3517259 4432848 2099453 -359269 -470165 376118 1529038
18011 1529038 2125459 391327 -2345325 -2623225 8774 1200062 1864454 3904464 4771893
18002 4771893 5864148 6389989 6994798 6016408 4041447 1562298 -2718118 -5538224 -6263949
17993 -6263949 -4915053 -940319 2975089 1703184 -809023 -2878146 -2915407 -3024333 -5274542
17984 -5274542 -5147139 -5440699 -6999146 -5844534 -3583198 -2580688 -1397818 371347
$$ packed form
18046a720376J954201L773344J690202k722936k423881M43208k21720p8017M53584
18037A147609p60629q29135j23312m75535k495883p49106J611584M51512Q0650
18028b142245J069400J650331j096211j806324J834461L785652J747711P83240
18020E826015K33414k164983l77187R15589k333395k458722j10896Q46283J152920
18011A529038N96421j734132k736652k77900K631999J191288O64392K040010Q67429
18002D771893J092255N25841O04809r78390j974961k479149m280416k820106p25725
17993f263949J348896L974734L915408j271905k512207k069123l7261j08926k250209
17984e274542J27403k93560j558447J154612K261336J002510J182870J769165
$$ plain form
17976 371347 1317503 787597 -919896 -1164567 279928 -438692 -2025744 -3648349 -2413806
17967 -2413806 -1311512 -1708408 -3600555 -4765817 -493448 2760823 1476990 396733
17959 396733 1257070 1511913 -135055 -1899601 -1932207 -962151 851721 1984976 432928
17950 432928 -88938 -252180 -1264912 -549302 558340 1646630 754133 200662 -1172360
17941 -1172360 -3580890 -6074431 -6117667 -5938838 -3989561 -2920544 -4288692 -3863328 -3484602
17932 -3484602 -3343456 -3602384 -3961376 -2460087 -2227835 -2046331 -2267395 -3894980 -2384142
17923 -2384142 -525242 -1124091 -984435 -1897289 -2909686 -2062586 -913884 145372 122865
17914 122865 -2337146 -2537334 -857822 -786309 -2315680 -2053605 -1916148 -2138516 -1841701
$$ packed form
17976C71347R46156n29906j707493k44671J444495p18620j587052j622605J234543
17967b413806J102294l96896j892147j165262M272369L254271j283833j080257
17959C96733Q60337K54843j646968j764546l2606R70056J813872J133255j552048
17950D32928n21866j63242j012732P15610J107642J088290q92497n53471j373022
17941a172360k408530k493541m3236J78829J949277J069017j368148M25364L78726
17932c484602J41146k58928l58992J501289K32252J81504k21064j627585J510838
17923b384142J858900n98849J39656r12854j012397Q47100J148702J059256k2507
17914A22865k460011k00188J679512P1513j529371K62075J37457k22368K96815
$$ plain form
17905 -1841701 -1879384 -1486929 -1084753 -1627254 -1196848 2343655 5580040 5840203 4717054
17896 4717054 2507522 1461387 2753123 3114478 1931757 -662284 -2421908 -3116206
17888 -3116206 -2713855 -2076158 -1347886 -1130436 -880189 78499 -696260 -1355249 -1449093 -1669017
17878 -1669017 327398 3193289 4668096 6170426 7286599 4956939 885510 -2869911
17870 -2869911 -3781937 -2344788 -504682 393160 147912 1371925 1922908 2112944 2959591
17861 2959591 2304775 676536 -1232242 -441127 1044765 1486685 884574 -1397043 -3158148
17852 -3158148 -2854387 222864 3453019 2998362 215690 -2017462 -2152027 -2377641 -504658
17843 -504658 711054 -378068 84849 766765 1161741 1669433 3783423 4840472 5646108
$$ packed form
17905a841701l7683L92455M02176n42501M30406L540503L236385K60163j123149
17896D717054k209532j046135J291736L61355j182721k594041j759624o94298
17888c116206M02351O37697P28272K17450K50247R58688p74759o58989r3844k19924
17878a669017J996415K865891J474807J502330J116173k329660m071429l755421
17870b869911r12026J437149J840106Q97842k45248J224013N50983J90036Q46647
17861B959591o54816j628239j908778P91115J485892M41920o02111k281617j761105
17852c158148L03761L077251L230155m54657k782672k233152j34565k25614J872983
17843e04658J215712j089122M62917O81916L94976N07692K113990J057049Q05636
$$ plain form
17834 5646108 5369678 4380200 4198013 5396269 6638860 6059921 3815127 1172263 1400162
17825 1400162 -378574 -2901648 -3610829 -4350911 -5498310 -6161990 -4605544 -3878728 -4672622
17816 -4672622 -4496219 -4595223 -2384069 1923106 4124574 4632493 4298520 2726320 2637564
17807 2637564 3291006 2716488 2152669 1645025 3553934 2077049 1474129 1780029 624528
17798 624528 1456007 2132396 804581 -2550600 -4093885 -2143650 1286907 -175332 -3698142
17789 -3698142 -4491748 -4974082 -5276900 -4168472 -2878599 -1419371 1134429 2570438 76704
17780 76704 -2674017 -2383154 360848 1280288 2007529 2347853 2451319 3114395 5253271
17771 5253271 5680991 3576522 3180866 2144157 1256521 963307 632977 -2188115 -5407160
$$ packed form
17834E646108k76430r89478j82187J198256J242591n78939k244794k642864K27899
17825A400162j778736k523074p09181p40082j147399o63680J556446P26816p93894
17816d672622J76403r9004K211154M307175K201468N07919l33973j572200q8756
17807B637564O53442n74518n63819n07644J908909j476885o02920L05900j155501
17798F24528Q31479O76389j327815l355181j543285J950235L430557j462239l522810
17789c698142p93606m82334l02818J108428J289873J459228K553800J436009k493734
17780G6704k750721K90863K744002R19440P27241L40324J03466O63076K138876
17771E253271M27720k104469l95656j036709q87636k93214l30330k821092l219045
$$ plain form
17762 -5407160 -4886682 -3637587 -1296151 515393 1188516 734054 2274414 4473726 3973953
17753 3973953 2119662 2153641 2916876 1818401 1195917 2106939 4125482 5015707 3926109
17744 3926109 1246377 702250 -260000 -2155673 -1723369 -750122 -379492 83662 -717349
17735 -717349 -2142615 -1481194 -914075 -1809765 -2265227 -1860926 -2548099 -4765437 -3465814
17726 -3465814 -667944 179407 1111568 2525788 3700696 4366322 1816141 -1240860 -2197972
17717 -2197972 -2725695 -769075 1466780 1739467 865979 -1204368 -1370916 1553860 4481076
17708 4481076 5804893 5561963 5139041 5392005 4978738 6380608 7206553 6038379 3352899
17699 3352899 -190786 -3079448 -3856177 -3523129 -3482461 -3838575 -2995561 -2562746 -711786
$$ packed form
17762e407160N20478J249095K341436J811544O73123m54462J540360K199312m99773
17753C973953j854291L3979P63235j098475o22484R11022K018543Q90225j089598
17744C926109k679732n44127r62250j895673M32304R73247L70630M63154q01011
17735g17349j425266O61421N67119q95690m55462M04301o87173k217338J299623
17726c465814K797870Q47351R32161J414220J174908O65626k550181l057001r57112
17717b197972n27723J956620K235855K72687q73488k070347j66548K924776K927216
17708D481076J323817k42930m22922K52964m13267J401870Q25945j168174k685480
17699C352899l543685k888662p76729L33048M0668l56114Q43014M32815J850960
$$ plain form
17690 -711786 1002132 999177 2197080 2739342 2668857 1147408 -384778 1017176 1702095
17681 1702095 2725219 5457313 5371038 4294663 5588985 7080153 5846395 2639902
17673 2639902 224685 -404761 493975 208233 -1402618 -3070897 -1951981 -1615953 -2227883
17664 -2227883 67766 3459042 4204159 4279988 4926795 4133285 1972731 1970526 4120792
17655 4120792 5885548 5277460 4627524 6112445 7794931 6603354 4946058 2354724
17647 2354724 -1138322 -2578251 -3221054 -2998395 -3436606 -2414532 -1443349 598720 1899560
17638 1899560 1780076 1136363 42128 -2255564 -4601216 -5545138 -3713567 -2067074 -773328
17629 -773328 842718 432323 -1214273 -1907682 -3459198 -4067146 -1823164 -1305882 -705403
$$ packed form
17690g11786J713918k955J197903N42262p0485j521449j532186J401954O84919
17681A702095J023124K732094q6275j076375J294322J491168j233758l206493
17673B639902k415217o29446Q98736k85742j610851j668279J118916L36028o11930
17664b227883K295649L391276P45117P5829O46807p93510k160554k205K150266
17655D120792J764756o08088o49936J484921J682486j191577j657296k591334
17647B354724l493046j439929o42803K22659m38211J022074R71183K042069J300840
17638A899560j19484o43713j094235k297692k345652r43922J831571J646493J293746
17629g73328J616046m10395j646596o93409j551516o07948K243982N17282O00479
$$ plain form
17620 -705403 199576 -865570 -393766 384515 1531953 2866756 2808182 1191872 1932317
17611 1932317 3820823 4082463 1955401 -1249111 -3824424 -4841683 -5447965 -3351526
17603 -3351526 -417564 299371 156166 376638 3330082 4729014 3306067 2355066 908893
17594 908893 -473351 -2158416 -5340657 -6199221 -4628862 -3072322 -2167939 -2009887 -2447183
17585 -2447183 -4160772 -5383381 -6868675 -7852574 -6759556 -4500343 -2315001 -2246881 -5291616
17576 -5291616 -5947058 -4266918 -1835569 -1352816 -3375589 -6261703 -6106372 -3816752 -870038
17567 -870038 1834673 1118550 -2584984 -3979737 -2939076 -2374157 -1380666 -1140972 -976435
17558 -976435 -3048468 -4938127 -4267649 -2112435 -255291 1134394 622437 768865 -2138130
$$ packed form
17620g05403R04979j065146M71804P78281J147438J334803n8574j616310P40445
17611A932317J888506K61640k127062l204512k575313j017259o06282K096439
17603c351526K933962P16935j43205K20472K953444J398932j422947r51001j446173
17594I08893j382244j685065l182241q58564J570359J556540R04383J58052m37296
17585b447183j713589j222609j485294r83899J093018K259213K185342O8120l044735
17576e291616o55442J680140K431349M82753k022773k886114J55331K289620K946714
17567h70038K704711p16123l703534j394753J040661N64919R93491K39694J64537
17558i76435k072033j889659O70478K155214J857144J389685n11957J46428k906995
$$ plain form
17549 -2138130 -6557877 -8295280 -6707042 -4245960 -1678589 837052 1985286 700012
17541 700012 -962097 -346856 -316808 -160820 -1297122 -1660128 -1827404 -3926800 -4734370
17532 -4734370 -4043720 -2219147 -1896643 -2901581 -2833702 -3721766 -5093665 -7001962 -7436788
17523 -7436788 -6936650 -8121711 -10266707 -11476964 -9813899 -7419147 -4572671 -5853046
17515 -5853046 -9559454 -11322706 -11378725 -10369989 -8279761 -4839808 -1263046 -766386 -2590796
17506 -2590796 -1098974 1074728 279360 277702 398754 1014352 -1046025 -3731701 -3850020
17497 -3850020 -2545613 -1007298 -1243754 -2859896 -3581596 -3233630 -3986971 -3567591 -2341087
17488 -2341087 -2023072 -1831112 -2181522 -830293 1973369 5021075 4859345 2669623 1198057
$$ packed form
17549b138130m419747j737403J588238K461082K567371K515641J148234j285274
17541G00012j662109O15241L0048J55988j136302l63006j67276k099396q07570
17532d734370O90650J824573L22504j004938O7879q88064j371899j908297m34826
17523g436788N00138j185061k144996j210257J663065K394752K846476j280375
17515e853046l706408j763252n6019J008736K090228L439953L576762M96660j824410
17506b590796J491822K173702p95368j658J21052O15598k060377k685676j18319
17497c850020J304407J538315k36456j616142p21700L47966p53341M19380J226504
17488b341087L18015J91960l50410J351229K803662L047706j61730k189722j471566
$$ plain form
17479 1198057 1825303 3944912 4255354 2932712 2477749 4535144 5721434 2529155 -1380802
17470 -1380802 -1984996 -26084 3534213 4128534 3040234 1802300 -464561 -1923546
17462 -1923546 -2655396 -2927175 -1077943 482299 2470046 4029911 3344739 2069745 433294
17453 433294 -1879669 -3937804 -3931155 -3767303 -3414320 -3807254 -2439661 -30816 -194588
17444 -194588 -916146 -708409 -1412779 -1534870 -1256175 -1790592 -810462 1839665 2178207
17435 2178207 885781 42963 -1698224 -3596826 -5619000 -7408982 -8836104 -7566151
17427 -7566151 -5288088 -3417685 -2933142 -1774107 183861 916031 2574070 1208278
17419 1208278 -738284 -535813 -2029380 -2812408 -987093 -154601 -2658639 -4470218 -3865086
$$ packed form
17479A198057O27246K119609L10442j322642m54963K057395J186290l192279l909957
17470a380802o04194J958912L560297N94321j088300j237934k266861j458985
17462a923546p31850k71779J849232J560242J987747J559865o85172j274994j636451
17453D33294k312963k058135O649J63852L52983l92934J367593K408845j63772
17444a94588p21558K07737p04370j22091K78695n34417R80130K650127L38542
17435B178207j292426q42818j741187j898602k022174j789982j427122J269953
17427g566151K278063J870403M84543J159035J957968P32170J658039j365792
17419A208278j946562K02471j493567p83028J825315Q32492k504038j811579O05132
$$ plain form
17410 -3865086 -2721315 -1009735 217871 625043 937769 193840 511086 995743 2121928
17401 2121928 3332928 2106357 115866 -365333 -1665457 -3159162 -4933684 -4783708
17393 -4783708 -5164110 -4764274 -3397004 -1727889 -372398 -885911 -2654323 -1976584 -424482
17384 -424482 110983 -572943 -1975960 -2745675 -2658690 -1531201 1357830 2540918 811479
17375 811479 742148 1103196 1896634 3969812 5590519 4396389 2515347 217581 -881391
17366 -881391 -2085203 -3330426 -2957361 -1443736 367217 95929 47985 2824382 4143057
17357 4143057 3102928 3369745 5092952 4098696 1808486 3722593 5684549 4386072
17349 4386072 753587 16493 2860652 4193912 4529778 6472296 7499079 5873793
$$ packed form
17410c865086J143771J711580J227606M07172L12726p43929L17246M84657J126185
17401B121928J211000j226571j990491m81199j300124j493705j774522J49976
17393d783708l80402L99836J367270J669115J355491n13513j768412O77739J552102
17384d24482N35465o83926j403017p69715Q6985J127489K889031J183088j729439
17375H11479o9331L61048P93438K073178J620707j194130j881042k297766j098972
17366h81391j203812j245223L73065J513625J810953k71288m7944K776397J318675
17357D143057j040129K66817J723207r94256k290210J914107J961956j298477
17349D386072l632485p37094K844159J333260L35866J942518J026783j625286
$$ plain form
17341 5873793 4031203 2108376 -2755460 -5520569 -4656581 -3859262 -1656213 1090869
17333 1090869 1076549 -933925 -3646885 -4286264 -2952374 -1596249 -1483579 -2175396 -3398068
17324 -3398068 -3441289 -2648209 -1985089 -2733362 -3158126 -403645 4191842 7149409 6333360
17315 6333360 2553123 -330598 302551 846898 148115 -679836 536366 3174502 2574214
17306 2574214 1662095 2589681 3095042 4146436 2507589 -1145817 -3281641 -1107800 2065414
17297 2065414 3653252 4019621 3679450 3055188 3129470 3922817 2937810 473498 -820777
$$ packed form
17341E873793j842590j922827m863836k765109Q63988P97319K203049K747082
17333A090869j4320k010474k712960o39379J333890J356125J12670o91817j222672
17324c398068m3221P93080O63120p48273m24764K754481M595487K957567q16049
17315F333360l780237k883721O33149N44347o98783q27951J216202K638136o00288
17306B574214r12119R27586N05361J051394j638847l653406k135824K173841L173214
17297B065414J587838L66369l40171o24262P4282P93347r85007k464312j294275
$$ [...]
##END NTUPLES=NMR SPECTRUM
##END=
