##TITLE=C13_LRR-5243
 CDCl3, 22300sc

 13.3.2025
##JCAMPDX= 6.0         $$ Bruker NMR JCAMP-DX V2.0
##DATA TYPE= NMR SPECTRUM
##DATA CLASS= NTUPLES
##ORIGIN= UXNMR, Bruker Analytische Messtechnik GmbH
##OWNER= root
$$ XWIN-NMR		Version 3.5
$$ Fri Mar 14 13:41:23 2025 Russian Standard Time (UT+4h)  she@DPX200
##.OBSERVE FREQUENCY= 50.327896
##.OBSERVE NUCLEUS= ^13C
##.ACQUISITION MODE= SIMULTANEOUS
##.ACQUISITION SCHEME= undefined
##.AVERAGES= 19060
##.DIGITISER RES= 17
##SPECTROMETER/DATA SYSTEM= spect
##.PULSE SEQUENCE= zgpg30
##.SOLVENT NAME= CDCl3
##.SHIFT REFERENCE= (INTERNAL, CDCl3, 0, 222.646)
##AUDIT TRAIL= $$ (NUMBER, WHEN, WHO, WHERE, WHAT)
$$ ##TITLE= Audit trail, XWIN-NMR		Version 3.5
$$ ##JCAMPDX= 5.01
$$ ##ORIGIN= Bruker BioSpin GmbH
$$ ##OWNER= she
$$ F:/spectra/data/she/nmr/c13/1/pdata/1/auditp.txt
$$ ##AUDIT TRAIL=  $$ (NUMBER, WHEN, WHO, WHERE, WHAT)
(   1,<2025-03-14 10:42:38.34 +0400>,<she>,<DPX200>,
      <created by zg, POWCHK disabled, PULCHK disabled
       terminated by command 'halt'
       configuration hash MD5:
       00 E9 B6 7A A2 85 ED C7 34 08 36 98 17 FE 4E 26
       data hash MD5: 32K
       84 00 04 A0 00 2C F0 30 7E 8E C2 AB 2F E0 E4 6C>)
(   2,<2025-03-14 13:39:05.76 +0400>,<she>,<DPX200>,
      <Start of raw data processing
       efp BC_mod = 2 LB = 2 FT_mod = 6 PKNL = 1 PHC0 = -398.1878 PHC1 = 25.08832 SI = 32K 
       data hash MD5: 32K
       33 DB E5 75 1C 33 A1 D2 7F 99 94 6E A8 2C A3 EC>)
(   3,<2025-03-14 13:39:08.35 +0400>,<she>,<DPX200>,
      <abs ABSG = 5 
       data hash MD5: 32K
       75 1A 83 A1 36 55 26 1C 19 01 B6 BA 14 2A 24 2C>)
(   4,<2025-03-14 13:39:29.64 +0400>,<she>,<DPX200>,
      <pk PHC0 = -3.03859 PHC1 = 4.2 
       data hash MD5: 32K
       09 6F 4B 00 AC 72 DF BF 79 A4 35 5C C7 3E 3B 2F>)
(   5,<2025-03-14 13:39:35.28 +0400>,<she>,<DPX200>,
      <abs ABSG = 5 
       data hash MD5: 32K
       0A E9 80 ED 9F E6 A6 50 54 22 F7 72 0C ED 40 F3>)
$$ ##END=
$$ 
$$ hash MD5
$$ 7F 79 79 6E 62 03 D6 9C C4 CD 27 86 34 05 3A 4D
##$RELAX= 
##$RELAX= 
##$RELAX= 
##$RELAX= 
##$RELAX= 
##$RELAX= 
##$RELAX= 
##$RELAX= 
$$ Bruker specific parameters
$$ --------------------------
##$DU= <F:/spectra>
##$EXPNO= 1
##$NAME= <c13>
##$PROCNO= 1
##$TYPE= <nmr>
##$USER= <she>
##$AMP= (0..31)
100 100 100 100 100 100 100 100 100 100 100 100 100 100 100 100 100 100 
100 100 100 100 100 100 100 100 100 100 100 100 100 100 
##$AQSEQ= 0
##$AQ_mod= 1
##$AUNM= <au_zg>
##$AUTOPOS= <>
##$BF1= 50.322709
##$BF2= 200.13
##$BF3= 50.322709
##$BF4= 500.13
##$BF5= 500.13
##$BF6= 500.13
##$BF7= 500.13
##$BF8= 500.13
##$BYTORDA= 1
##$CFDGTYP= 0
##$CFRGTYP= 5
##$CHEMSTR= <none>
##$CNST= (0..31)
1 1 145 1 1 1 1 1 1 1 1 1 1 1 1 1 1 1 1 1 1 1 1 1 1 1 1 1 1 1 1 1 
##$CPDPRG= <waltz16>
##$CPDPRG1= <>
##$CPDPRG2= <waltz16>
##$CPDPRG3= <>
##$CPDPRG4= <mlev>
##$CPDPRG5= <mlev>
##$CPDPRG6= <mlev>
##$CPDPRG7= <mlev>
##$CPDPRG8= <mlev>
##$CPDPRGB= <>
##$CPDPRGT= <>
##$D= (0..31)
$$ [...]
##$SUBNAM4= <"">
##$SUBNAM5= <"">
##$SUBNAM6= <"">
##$SUBNAM7= <"">
##$SUBNAM8= <"">
##$SUBNAM9= <"">
##$SW= 239.972175391363
##$SWIBOX= (0..15)
0 1 3 0 0 0 0 0 0 0 0 0 0 0 0 0 
##$SW_h= 12077.2946859903
##$TD= 32768
##$TD0= 1
##$TE= 0
##$TE2= 300
##$TE3= 300
##$TEG= 300
##$TL= (0..7)
120 120 120 120 120 120 120 120 
##$TP= (0..7)
150 150 150 150 150 150 150 150 
##$TP07= 0
##$TPNAME0= <>
##$TPNAME1= <>
##$TPNAME2= <>
##$TPNAME3= <>
##$TPNAME4= <>
##$TPNAME5= <>
##$TPNAME6= <>
##$TPNAME7= <>
##$TPOAL= (0..7)
0.5 0.5 0.5 0.5 0.5 0.5 0.5 0.5 
##$TPOFFS= (0..7)
0 0 0 0 0 0 0 0 
##$TUNHIN= 0
##$TUNHOUT= 0
##$TUNXOUT= 0
##$USERA1= <user>
##$USERA2= <user>
##$USERA3= <user>
##$USERA4= <user>
##$USERA5= <user>
##$V9= 5
##$VALIST= <valist>
##$VCLIST= <CCCCCCCCCCCCCCC>
##$VD= 0
##$VDLIST= <DDDDDDDDDDDDDDD>
##$VPLIST= <PPPPPPPPPPPPPPP>
##$VTLIST= <TTTTTTTTTTTTTTT>
##$WBST= 1024
##$WBSW= 4
##$XGAIN= (0..3)
0 0 0 0 
##$XL= 0
##$YL= 0
##$YMAX_a= 101663392
##$YMIN_a= -27742094
##$ZGOPTNS= <>
##$ZL1= 120
##$ZL2= 120
##$ZL3= 120
##$ZL4= 120
##$ABSF1= 222.646
##$ABSF2= -17.35081
##$ABSG= 5
##$ABSL= 3
##$ALPHA= 0
##$AQORDER= 0
##$ASSFAC= 0
##$ASSFACI= 0
##$ASSFACX= 0
##$ASSWID= 0
##$AUNMP= <proc_1d>
##$AZFE= 0.1
##$AZFW= 0.5
##$BCFW= 0
##$BC_mod= 2
##$BYTORDP= 0
##$COROFFS= 0
##$CY= -3
##$DATMOD= 1
##$DC= 0
##$DFILT= <>
##$DTYPP= 0
##$F1P= 0
##$F2P= 0
##$FCOR= 0.5
##$FTSIZE= 32768
##$FT_mod= 6
##$GAMMA= 0
##$GB= 0
##$INTBC= 1
##$INTSCL= 4.134877e-10
##$ISEN= 128
##$LB= 2
##$LEV0= 0
##$LPBIN= 0
##$MAXI= 10000
##$MC2= 0
##$MEAN= 0
##$ME_mod= 0
##$MI= 0.1934396
##$NCOEF= 0
##$NC_proc= 2
##$NLEV= 6
##$NOISF1= 120.0001
##$NOISF2= 80.00006
##$NSP= 0
##$NTH_PI= 0
##$NZP= 0
##$OFFSET= 222.646
##$PC= 1.4
##$PHC0= -401.2264
##$PHC1= 29.28832
##$PH_mod= 1
##$PKNL= yes
##$PPARMOD= 0
##$PSCAL= 0
##$PSIGN= 0
##$REVERSE= no
##$SF= 50.3227304950709
##$SI= 32768
##$SIGF1= 140
##$SIGF2= 120
##$SINO= 11.81781
##$SIOLD= 32768
##$SREGLST= <13C.CDCl3>
##$SSB= 0
##$STSI= 32768
##$STSR= 0
##$SW_p= 12077.2946859903
##$SYMM= 0
##$S_DEV= 0
##$TDeff= 32768
##$TDoff= 0
##$TI= <>
##$TILT= no
##$TM1= 0
##$TM2= 0
##$TOPLEV= 0
##$USERP1= <user>
##$USERP2= <user>
##$USERP3= <user>
##$USERP4= <user>
##$USERP5= <user>
##$WDW= 1
##$XDIM= 32768
##$YMAX_p= 290296407
##$YMIN_p= -1520166
$$ End of Bruker specific parameters
$$ ---------------------------------
##NTUPLES= NMR SPECTRUM
##VAR_NAME=  FREQUENCY,     SPECTRUM/REAL,   SPECTRUM/IMAG
##SYMBOL=    X,             R,               I
##VAR_TYPE=  INDEPENDENT,   DEPENDENT,       DEPENDENT
##VAR_FORM=  AFFN,          ASDF,            ASDF
##VAR_DIM=   32768,         32768,           32768
##UNITS=     HZ,            ARBITRARY UNITS, ARBITRARY UNITS
##FACTOR=    0.368581032318806, 1,           1
##FIRST=     11204.1544572324, 0,            0
##LAST=      -873.140228757911, 0,           0
##MIN=       -873.140228757911, -1520166,    0
##MAX=       11204.1544572324, 290296407,    0
$$ Real data points
##PAGE= N=1
##DATA TABLE= (X++(R..R)), XYDATA
$$ [...]
15973A05179l4816j36661j80633j43590j8927R9211P7164K8620P0390J12031Q8229
$$ 105179 70363 -66298 -246931 -390521 -409448 -310237 -233073 -204453 -134063 -22032 66197
15962F6197J2197l6966m1586m6441n8912n4672j6242L1498L9577n156j7386Q2989
$$ 66197 78394 41428 -158 -46599 -105511 -160183 -176425 -144927 -105350 -110506 -127892 -44903
15950d4903J74156J73353J61261J64040J76809J43468n642k06867l04050k35253
$$ -44903 129253 302606 463867 627907 804716 948184 942542 735675 431625 196372
15940A96372j20976l1136M1293Q6563J26469J60212J42416N7634m8073j80019
$$ 196372 75396 44260 85553 172116 298585 458797 601213 658847 610774 430755
15930D30755k47261j38529J4461Q1386J39744J61107J22163J12401J03591L7463
$$ 430755 183494 44965 59426 140812 280556 441663 563826 676227 779818 817281
15920H17281j4575m1905j24490k30350k68075k22775j47467j18074j07270n4800
$$ 817281 802706 760801 636311 405961 137886 -84889 -232356 -350430 -457700 -512500
15910e12500n0417r5604j16332o9952K4040R8905J26491J24444P8680m1256j56529
$$ -512500 -562917 -658521 -774853 -844805 -820765 -721860 -595369 -470925 -392245 -433501 -590030
15899e90030j88622j95436k05553j65566o5737L6417P3904K9834j7484J8560J33087
$$ -590030 -778652 -974088 -1179641 -1345207 -1410944 -1374527 -1300623 -1270789 -1288273 -1269713 -1136626
15888a136626K35170K44296J67657P0246J8090J319J0333M0179R5394J62778J92833
$$ -1136626 -901456 -657160 -489503 -419257 -401167 -399848 -389515 -349336 -253942 -91164 101669
15877A01669J53563M0417o6834n5483L0288N5334K0655l710l882k2792j4658M0075
$$ 101669 255232 295649 228815 173332 203620 258954 279609 275899 272017 249225 234567 274642
15865B74642P1406O5960M0041K9067N6138R2000J05529K7004j09020j79161j74451
$$ 274642 346048 412008 452049 481116 537254 629254 734783 761787 652767 473606 299155
15854B99155j92466k09716j43557j2152J20459J62288J42158J23437Q5510m263
$$ 299155 106689 -103027 -246584 -258736 -138277 24011 166169 289606 375116 370853
15844C70853j06681j86790k28885k32035k04886j36412l8808N1102P2963O8382
$$ 370853 264172 77382 -151503 -383538 -588424 -724836 -763644 -712542 -639579 -571197
15834e71197Q5249Q5858O2923M9458N9926Q3472R2083J14655J43137J40198O8064
$$ -571197 -485948 -400090 -337167 -287709 -227783 -144311 -52228 62427 205564 345762 413826
15823D13826m8857j31131j45687j11979n1290P915M1916K0810o3329j99445l20457
$$ 413826 364969 233838 88151 -23828 -75118 -67203 -25287 -4477 -67806 -267251 -587708
15812e87708k59262n4552O6337P5055M4643L7065P2514Q6740R1840J15914J61113
$$ -587708 -846970 -901522 -835185 -760130 -715487 -678422 -605908 -519168 -427328 -311414 -150301
15801a50301K00099J54184Q0341K3636m1135p7977p2253j6679P6267J09165O3716
$$ -150301 49798 203982 284323 307959 266824 188847 116594 99915 176182 285347 349063
15790C49063K9589L5340M1691M8320L0345J3044N5806R8967M3168o8372j30993
$$ 349063 378652 413992 455683 504003 534348 547392 603198 702165 745333 676961 545968
15779E45968j35460j13562j07048j20014p9696q831q727l6948m2078p3222j00373
$$ 545968 410508 296946 189898 69884 -9812 -18643 -27370 -64318 -106396 -179618 -279991
15768b79991r8629j35711j50206l1534J50769K55071K48861J88988J04287M7276
$$ -279991 -378620 -514331 -664537 -696071 -545302 -290231 -41370 147618 251905 299181
15758B99181J4698l7069r0574j28267j67238k05601j93425j45448n5524J00848
$$ 299181 313879 276810 186236 57969 -109269 -314870 -508295 -653743 -709267 -608419
15748f08419K27709K50251J55854k8313j47676j31814o2822l924r900n2722l1137
$$ -608419 -380710 -130459 25395 -2918 -150594 -282408 -345230 -349154 -359054 -411776 -442913
15737d42913K8516P4386R0745Q9940J21953J26758O8004l5850j44117j74199q3218
$$ -442913 -414397 -340011 -249266 -159326 -37373 89385 157389 121539 -22578 -196777 -279995
15726b79995K2334L1984J743L252M6845R4735P8207N8769O9752R265q0890r3309
$$ -279995 -257661 -225677 -223934 -220682 -173837 -79102 -895 57874 127626 136891 56001 -37308
15714c7308N198J34975J22490k3632j29270j64130j77587j60966q9460q471M663
$$ -37308 -32110 102865 225355 201723 72453 -91677 -269264 -430230 -519690 -528161 -523498
15703e23498j0573j0948m5904k7013P9882J17839O3179L5319M2086K3663J0205
$$ -523498 -534071 -545019 -590923 -617936 -538054 -420215 -357036 -321717 -279631 -255968 -245763
15692b45763O0454J27608J53226J81920J81003J01990k4643j36557j61330j26642
$$ -245763 -185309 -57701 95525 277445 458448 560438 535795 399238 237908 111266
15682A11266p3656k5936m2511j11751j25012o8381l5748J3021Q3916R3509R4904
$$ 111266 37610 11674 -30837 -142588 -267600 -335981 -371729 -358708 -274792 -181283 -86379
15671h6379J03247O3459K728j1493P611J5610K394K0108K0129j7519m8922p5698
$$ -86379 16868 80327 83055 71562 79173 94783 97177 117285 137414 119895 70973 -4725
15659d725p4658n1969l6245l0618k0985K2210P3435P3315J6925k5644m0329j00827
$$ -4725 -79383 -131352 -167597 -198215 -219200 -196990 -123555 -50240 -33315 -58959 -99288 -200115
15647b00115j53840j24491k8353O1763N2297J456j2551K3406R8580R4351m3106
$$ -200115 -353955 -478446 -506799 -445036 -392739 -391283 -403834 -380428 -281848 -187497 -230603
15636b30603j24257o3081j087L1403K9450m1141j34697j60502j02617m8006j6342
$$ -230603 -354860 -417941 -419028 -387625 -358175 -399316 -534013 -694515 -797132 -845138 -861480
15625h61480J4675N5450J04648J34752J22118Q3433P0683J07282J20834O0779
$$ -861480 -846805 -791355 -686707 -551955 -429837 -346404 -275721 -168439 -47605 13174
15615A3174l2427p2053q3191j22145j16602q6397p7514k3760P0776J04431P6251
$$ 13174 -19253 -91306 -174497 -296642 -413244 -499641 -577155 -600915 -530139 -425708 -349457
15604c49457P4841Q2149L5997k0622K3239J14737P2904n1427j03635p6801J2688
$$ -349457 -274616 -192467 -156470 -177092 -153853 -39116 33788 -17639 -121274 -198075 -185387
15593a85387P5252P3813M2288k8488r6723j55151k01007j36202Q653J11845J35319
$$ -185387 -110135 -36322 5966 -22522 -119245 -274396 -475403 -611605 -602952 -491107 -355788
15582c55788J19547J28102J73762J77904N9178p9894j30692j42468j67595j92896
$$ -355788 -236241 -108139 65623 243527 302705 222811 92119 -50349 -217944 -410840
15572d10840j71083j26669j04919m2318P9481J69527J86964J88850K16830J89904
$$ -410840 -581923 -708592 -813511 -855829 -776348 -606821 -419857 -231007 -14177 175727
15562A75727M2812j04557j47975j28810o6386J037m712q2901j21492p7546k0279
$$ 175727 218539 113982 -33993 -162803 -229189 -228152 -232864 -315765 -437257 -514803 -535082
15551e35082J7542L0930L0298O8866L0811p7866o5046L8188J24121K00195K06889
$$ -535082 -517540 -486610 -456312 -387446 -356635 -434501 -499547 -461359 -337238 -137043 69846
15540F9846J23540M5926K6320P802j05714k39316l14357k94722j73224o783J26044
$$ 69846 193386 239312 265632 273434 167720 -71596 -385953 -680675 -853899 -860682 -734638
15529g34638J73954J69285J78163J61639N8858j3224L9942J05523J12124J15902
$$ -734638 -560684 -391399 -213236 -51597 7261 -5963 33979 139502 251626 367528
15519C67528N3652p2183r6645l8176K94R018o852q3516k10653k68073k03493p4799
$$ 367528 421180 348997 252352 214176 214470 223488 216636 133120 -77533 -345606 -549099 -623898
15507f23898P9090J74680K10303K35280J92060O9436k2568m2821p1989j02280
$$ -623898 -544808 -370128 -159825 75455 267515 336951 314383 271562 199573 97293
15497I7293p2801Q174O9612L4155p5888j20864p5052l1594J5434M7960L7162N3175
$$ 97293 24492 32666 102278 136433 60545 -60319 -135371 -166965 -151531 -103571 -66409 -13234
15485a3234Q8959Q6135K4749m8870j17743j46385j05749o6465m5495o660j0452
$$ -13234 75725 161860 186609 137739 19996 -126389 -232138 -298603 -344098 -350758 -361210
15474c61210p4411j48372j53742k4567J15156J43037P4645K0348O8080J38361
$$ -361210 -435621 -583993 -737735 -762302 -647146 -504109 -429464 -409116 -341036 -202675
15464b02675J43750J22980R6277J2699o2994p7580j06073j48428j47149p0829
$$ -202675 -58925 64055 160332 173031 110037 32457 -73616 -222044 -369193 -440022
15454d40022K4316R0682J46007J80448J44984O3663K8345M9740M6690J935m6129
$$ -440022 -415706 -325024 -179017 1431 146415 210078 238423 288163 334853 336788 290659
15443B90659r5534j23177j14304j43777k17610k27068j52252o3753J1676O1806
$$ 290659 195125 71948 -42356 -186133 -403743 -630811 -783063 -846816 -835140 -773334
15433g73334J32562J85287J73669J29345M8253k3366p7750r9277o7573K2793J22521
$$ -773334 -640772 -455485 -281816 -152471 -104218 -127584 -205334 -304611 -372184 -349391 -226870
15422b26870J87569K16387J43192J9466l3172m3199m9664n7492j23152k13328
$$ -226870 -39301 177086 320278 339744 306572 263373 213709 156217 33065 -180263
15412a80263k32928j86733j39836p8886J6706R4448J23177J38573J89682K88735
$$ -180263 -413191 -599924 -739760 -818646 -801940 -707492 -584315 -445742 -256060 32675
15402C2675K80047J05077q4052j30703k1041J18614J60287R7576J130o6190j16077
$$ 32675 312722 417799 333747 203044 182003 300617 460904 558480 559610 493420 377343
15391C77343j54103j87352j91486j09372l7312j8221M9053J49758J47932M7104
$$ 377343 223240 35888 -155598 -264970 -302282 -320503 -271450 -121692 26240 73344
15381G3344n386n85m6207j04288j04051p8071k8118P8935J53823R6691M557m8473
$$ 73344 67958 67373 21166 -83122 -187173 -265244 -293362 -214427 -60604 36087 40644 -7829
15369g829o6655j0879P3673M7412j2945L49p801p2982j13869j35589j33419r8079
$$ -7829 -74484 -85363 -11690 35722 22777 23126 15325 -57657 -171526 -307115 -440534 -538613
15357e38613n3179k2117j8638q5294j51367r8600k7562p653M9022J53334J91332
$$ -538613 -591792 -613909 -632547 -717841 -869208 -967808 -995370 -1003023 -954001 -800667 -609335
15346f09335J27452M3050J2958K3439j1777o5232j3001J27959J93497J51868J09346
$$ -609335 -481883 -438833 -425875 -402436 -414213 -479445 -492446 -364487 -170990 -19122 90224
15335I0224J9251j19735k30449k82608k61251k02748j31410n2535K3262P1842
$$ 90224 109475 -10260 -240709 -523317 -784568 -987316 -1118726 -1171261 -1147999 -1076157
15325a076157J24089K30306L62459L93484K30098l6864k03132k41182k42947k11526
$$ -1076157 -952068 -721762 -359303 34181 264279 227415 24283 -216899 -459846 -671372
15315f71372j38147m0880O9029J63163J38613j1354j11173j31873j44270p7690
$$ -671372 -809519 -850399 -781370 -618207 -479594 -490948 -602121 -733994 -878264 -955954
15305i55954O5295J68011J60133J06613Q8868J07180Q7841L1920q575l7617n2816
$$ -955954 -890659 -722648 -562515 -455902 -367034 -259854 -172013 -140093 -148668 -186285 -239101
15294b39101l9079O241P9991J07449M338j17867o4837J07817J85396J25769O0954
$$ -239101 -278180 -271939 -191948 -84499 -80161 -198028 -262865 -155048 30348 156117 217071
15283B17071K9303O4005J62691J93289N4544j72181k63331j92977r4681p3156
$$ 217071 246374 310379 473070 666359 720903 548722 285391 92414 -2267 -75423
15273g5423j41982j98785j73532p9435J5268J23419K37852L01271K57776R1841
$$ -75423 -217405 -416190 -589722 -669157 -653889 -530470 -292618 8653 266429 358270
15263C58270l9700n3247m2578p4665j21060r2741P447O9975M8372J4080L1016
$$ 358270 318570 265323 222745 148080 27020 -65721 -58274 11701 60073 74153 105169
15252A05169J19921K07587K32700K27801J47937k0997j60650j97517j89064j33700
$$ 105169 225090 432677 665377 893178 1041115 1020118 859468 661951 472887 339187
15242C39187R19R8702M6515p3950j38668j03570M229J12509J29004N3963Q255
$$ 339187 340106 438808 485323 411373 272705 169135 173364 285873 414877 468840 477095
15231D77095J3924j1124n2506n3302j8089k0380r9548j82130k17838j80056o5221
$$ 477095 491019 479895 427389 374087 355998 335618 236070 53940 -163898 -343954 -409175
15220d09175L6649N5456J181m2357m0177p7549j45691j06054J0327J26101K21486
$$ -409175 -372526 -317070 -315889 -358246 -398423 -475972 -621663 -727717 -717390 -591289 -369803
15209c69803K71739K66489J95114J07336L7814J5325M5569N5568K2666j1777o2630
$$ -369803 -98064 168425 363539 470875 508689 524014 569583 625151 647817 636040 573410
15198E73410j41614j59606q8669J3474J02211J46686J29756L3043q0099j59511
$$ 573410 431796 272190 183521 196995 299206 445892 575648 608691 528592 369081
15188C69081j89733j31935l8383J5851M6004P5612N3385j7071r2038j19470l3669
$$ 369081 179348 47413 9030 24881 70885 146497 199882 182811 90773 -28697 -62366
15177f2366Q6179J09285N5859l931o0336r6495j02826j27009j55599j42839j07579
$$ -62366 23813 133098 188957 185026 124690 28195 -74631 -201640 -357239 -500078 -607657
15166f07657p8700p4262j17305j45159n4703Q5779J95517K07068J15424M4308
$$ -607657 -686357 -760619 -877924 -1023083 -1077786 -992007 -796490 -589422 -473998 -429690
15156d29690M9446L9521J1237J3389K6085j4801o0342m139J01977J73368J75323
$$ -429690 -380244 -340723 -329486 -316097 -290012 -304813 -365155 -369294 -267317 -93949 81374
15145H1374R7186k1238l1130Q7864J33707O7644k2046j01749j51637j30044o0649
$$ 81374 178560 157322 126192 214056 347763 415407 393361 291612 139975 9931 -50718
15134e0718p558K9128M4975O8159J11034J28629J24580J21904M5185m4280k7066
$$ -50718 -58276 -29148 15827 83986 195020 323649 448229 570133 615318 571038 543972
15123E43972p786r2889j96408j74923o1066O1189J25901J18889Q1937K0490j4585
$$ 543972 536186 443297 246889 71966 10900 72089 197990 316879 398816 419306 404721
15112D04721j1132l7845j14049j36427m1704K4963l175o6098r2864n7298L1660
$$ 404721 393589 355744 241695 105268 63564 88527 85352 19254 -73610 -130908 -99248
15101i9248J27680K01851J95655R8797N168p4670j42666j50959o9808K9998Q4191
$$ -99248 28432 230283 425938 524735 529903 455233 312567 161608 91800 121798 205989
15090B05989J04426P4065l6559j33704j10056k3144L7216L4599L5868Q8691R6334
$$ 205989 310415 384480 347921 214217 104161 81017 118233 152832 188700 277391 373725
15079C73725M3404O228Q431l0748q7132j08740j22754j13417k6780O9047J20410
$$ 373725 417129 423357 431788 401040 313908 205168 82414 -31003 -57783 11264 131674
15068A31674J32696J00876O7180L2518l3711r3727q9241j4104Q5737J24373P2124
$$ 131674 264370 365246 432426 464944 431233 337506 248265 234161 319898 444271 516395
15057E16395N7083J15100J45286J04101K2019K3896P6581M9752l0531n0154k3999
$$ 516395 573478 688578 833864 937965 959984 983880 1060461 1110213 1079682 1029528 1005529
15046A005529m6133j01494j16216p2288n1423j05779j50476j32107r8899l9322
$$ 1005529 959396 857902 741686 669398 617975 512196 361720 229613 130714 91392
15036I1392K0679L4058N5590Q9768O1109M007M132K7259N062m4365o8163o3243
$$ 91392 112071 146129 201719 291487 352596 356603 360735 387994 393056 348691 280528 217285
15024B17285k1947L2924P0517N6181k3229j08683j63669j62786q2861K3116J19037
$$ 217285 195338 228262 298779 354960 331731 223048 59379 -103407 -186268 -163152 -44115
15013d4115J81881J84904J08158J1537o0369j05073p3352k7867j8179j2834l1439
$$ -44115 137766 322670 430828 442365 381996 276923 203571 175704 157525 144691 113252
15002A13252r3395j54494j71033j55380q8999K1970P6300L5369q44J4711K700
$$ 113252 19857 -134637 -305670 -461050 -550049 -528079 -451779 -416410 -417254 -402543 -399843
14991c99843k8557k3217n8792j27932j00780R664J12069J58156R1530p1584j54585
$$ -399843 -428400 -451617 -510409 -638341 -739121 -729457 -617388 -459232 -367702 -439286 -593871
14980e93871j06424l3923K3r099P512R7900J73078J58937J03516Q1040J13632
$$ -593871 -700295 -734218 -734195 -743294 -735782 -637882 -464804 -305867 -202351 -121311 -7679
14969g679J29751R6113N2261K2805K0204L04m5285j17179j88570k10393j68094
$$ -7679 122072 218185 270446 293251 313455 313759 268474 151295 -37275 -247668 -415762
14958d15762q5400j101J7168r446o958L0735P8498Q8323N3398L3175M9109N3209
$$ -415762 -501162 -502263 -485095 -494541 -501499 -470764 -392266 -303943 -250545 -217370 -168261 -115052
14946a15052K6492K6393L7512l901o3087m5785L7191P0711M3002O7862J05494
$$ -115052 -88560 -62167 -24655 -28556 -91643 -137428 -100237 -29526 13476 81338 186832
14935A86832M6601n7390j66550j92991r4401K0008J16936J84473J64400P0841
$$ 186832 233433 176043 9493 -183498 -277899 -257891 -140955 43518 207918 278759
14925B78759p98J3409M6778P8825N6014n3351j41421j83081k24592k07635j04939
$$ 278759 277961 291370 338148 416973 472987 419636 278215 95134 -129458 -337093 -442032
14914d42032l576L7446M8218Q8921J05810N8199N5425Q5861M4854n7380j53842
$$ -442032 -445608 -408162 -359944 -271023 -165213 -107014 -51589 34272 79126 21746 -132096
14903a32096k05286k08224j86211j49620o4084P9001J82664K12071K09805J88226
$$ -132096 -337382 -545606 -731817 -881437 -945521 -866520 -683856 -471785 -261980 -73754
14893g3754J22393J8882m8890k0369N1102L0455m1077m3132r267k301m892M326
$$ -73754 48639 67521 18631 -1738 49364 79819 38742 -4390 -13657 -15958 -20850 -16524
14881a6524n1757j44210j49644o4537L7272M4027l9131r5786p7780k1668J8175
$$ -16524 -68281 -212491 -362135 -426672 -389400 -345373 -384504 -480290 -558070 -579738 -561563
14870e61563K7080O100l9533o9442l8822M0871Q7349O5662M8868R5696J57114
$$ -561563 -534483 -528383 -567916 -637358 -676180 -635309 -547960 -482298 -433430 -337734 -180620
14859a80620J35830P2847K9113K671k0544m9817o7620p8018j25877j02801N605
$$ -180620 -44790 28057 57170 59841 39297 -10520 -78140 -156158 -282035 -384836 -379231
14848c79231Q6019J21899J53133K00791K08474J08792k0891l1155J8000k3236
$$ -379231 -293212 -171313 -18180 182611 391085 499877 478986 447831 465831 442595
14838D42595j33556k16287k45502k31293k14903j80689o9943N4874J30742J90826
$$ 442595 309039 92752 -152750 -384043 -598946 -779635 -849578 -794704 -663962 -473136
14828d73136J80672R1399r99l9822n0534n3923q661P5144N9287k1138l9494l5780
$$ -473136 -292464 -201065 -202064 -241886 -292420 -346343 -355004 -279860 -220573 -241711 -281205 -316985
14816c16985n0364k7235J7617N1741M2924l0308q8159o4143O348Q1153J38634
$$ -316985 -367349 -394584 -376967 -325226 -282302 -312610 -400769 -464912 -458564 -377411 -238777
14805b38777J17543L7177k2867p0292r9553n2183J2985M205m1090o1427l8679
$$ -238777 -121234 -84057 -106924 -177216 -276769 -328952 -315967 -311762 -352852 -414279 -452958
14794d52958K7284J66827K89047K61913R6707o5229j25021j13449r6535q7645
$$ -452958 -425674 -258847 30200 292113 388820 323591 198570 85121 -11414 -99059
14784i9059q2595j03591j23350p3637J3173L6275j1053n1147o9075k8306R3379
$$ -99059 -181654 -285245 -408595 -482232 -469059 -432784 -443837 -494984 -564059 -592365 -498986
14773d98986J68488J14318L5780M2332Q1628L8848n0231r8341l4775J01520J77471
$$ -498986 -330498 -216180 -180400 -138068 -56440 -17592 -67823 -166164 -200939 -99419 78052
14762G8052J76995J65264J63673J36144P9634K6697K847p159m3139j09198j20628
$$ 78052 255047 420311 583984 720128 799762 826459 829306 822147 779008 669810 549182
14751E49182m6386K1016r268q2095j03701j13549j30228j05615n3262p800L9673
$$ 549182 502796 523812 514544 432449 328748 215199 84971 -20644 -73906 -81706 -42033
14740d2033O8111K8009n6722j19975j14507q3886n2183Q138O7916J07201J17546
$$ -42033 26078 54087 -2635 -122610 -237117 -321003 -373186 -365048 -297132 -189931 -72385
14729g2385J20905Q1601k4609q7218p3106K7N6009N502m6373m0930m451q204p2898
$$ -72385 48520 130121 105512 18294 -54812 -54785 1224 6726 -39647 -80577 -85028 -93232 -166130
14716a66130o4823N0811J26199R1503K0709m3807q4486r0768q0369m6521M9974
$$ -166130 -230953 -180142 -53943 37560 58269 14462 -70024 -160792 -241161 -287682 -237708
14705b37708J43814J31855Q517j03108j18433k5640R1589J35228J18008O9587
$$ -237708 -93894 37961 46478 -56630 -175063 -200703 -109114 26114 144122 213709
14695B13709J8914J0807K3281K3469L4347M8015j9205j69704k53837k14241j09822
$$ 213709 232623 243430 266711 290180 324527 372542 353337 183633 -70204 -284445 -394267
14684c94267k6979j2610k7055r548L3764P0183R4709O3220k3918q4051n4515j8774
$$ -394267 -421246 -433856 -460911 -470459 -436695 -366512 -271803 -208583 -232501 -316552 -371067 -389841
14672c89841m6406j14943j71007j89345j81722j37400n1047O1566J73011K09987
$$ -389841 -436247 -551190 -722197 -911542 -1093264 -1230664 -1281711 -1220145 -1047134 -837147
14662h37147J46430K0493r9578j29556k2356J52898K18953J57103O3530J5664
$$ -837147 -690717 -670224 -769802 -899358 -921714 -768816 -549863 -392760 -329230 -313566
14652c13566P9505J45729J13812K0954q5019j47499j15068j1889O5684R2985J08639
$$ -313566 -234061 -88332 25480 46434 -38585 -186084 -301152 -313041 -247357 -154372 -45733
14641d5733J05015O4939J6852n0570j25601r9610Q180O7344K0840l6518m0549
$$ -45733 59282 124221 141073 90503 -35098 -134708 -126528 -59184 -38344 -74862 -115411
14630a15411j1766o81o7950j73011k05804j64006j22835n3694K3310J7184l3082
$$ -115411 -127177 -127858 -195808 -368819 -574623 -738629 -861464 -915158 -891848 -874664 -907746
14619i07746k9814L8092J18653J45071O2137r292L5636J05373J34554J12792J7163
$$ -907746 -937560 -899468 -780815 -635744 -573607 -582899 -547263 -441890 -307336 -194544 -177381
14608a77381q6586j14539r4606k5137N6834N2499k6653j12094j86162k24142j72539
$$ -177381 -263967 -378506 -473112 -498249 -441415 -388916 -415569 -527663 -713825 -937967 -1110506
14597a110506l0567N3214L6949k2887q5371r2983m2635L5920J28273J88905J79804
$$ -1110506 -1141073 -1087859 -1050910 -1073797 -1159168 -1252151 -1294786 -1258866 -1130593 -941688 -761884
14586g61884J08002j4349j21946j29818j3852J43895K37412K41787J65615Q693
$$ -761884 -653882 -668231 -790177 -919995 -933847 -789952 -552540 -310753 -145138 -136445
14576a36445j18504j45589j17609j02354j19779j17771q5766n7797l1256k3286
$$ -136445 -254949 -400538 -518147 -620501 -740280 -858051 -943817 -1001614 -1032870 -1056156
14566a056156m3456m5407L694P1350J39992J84590J46409Q6172R3969J03246R1632
$$ -1056156 -1099612 -1145019 -1141325 -1069975 -929983 -745393 -598984 -512812 -418843 -315597 -223965
14555b23965R7659O1783l3413q6153m2213k721l573J8170N767m1186l7728o1272
$$ -223965 -126306 -64523 -97936 -184089 -226302 -229023 -232596 -214426 -208659 -249845 -287573 -348845
14543c48845j38314j70667j18994o8263m4509k3838M5234J57318J87728J06740
$$ -348845 -487159 -657826 -776820 -845083 -889592 -913430 -868196 -710878 -523150 -416410
14533d16410O097n9257j16009j38655j06757k5291J35576K34588J72609P0916
$$ -416410 -410313 -469570 -585579 -724234 -830991 -856282 -720706 -486118 -313509 -242593
14523b42593J0441n5797j03872j00437o9720k8635K6757Q7706P7090K5289j8020
$$ -242593 -232152 -287949 -391821 -492258 -561978 -590613 -563856 -476150 -399060 -373771 -391791
14512c91791m8521j2788R9884J09861k3929j42513j90926j72702q9741k429M3431
$$ -391791 -440312 -453100 -353216 -243355 -267284 -409797 -600723 -773425 -863166 -865595 -822164
14501h22164Q0646R5466K5683k6340j631j0929o3509j08419r0205L2848J81462
$$ -822164 -741518 -646052 -620369 -646709 -648340 -659269 -722778 -831197 -921402 -888554 -707092
14490g07092K64752K65286K25740J41893J6180o6943o0573m0904n8585o3694j4707
$$ -707092 -442340 -177054 48686 190579 206759 139816 79243 38339 -20246 -83940 -98647
14479i8647M0364R548p0664r4501m3613M092L9435J29713J92953J54254P2950
$$ -98647 -58283 -48735 -119399 -213900 -257513 -253421 -213986 -84273 108680 262934 335884
14468C35884M5492Q3184R5446N0421n9274k05568l40631l53096k05856o113J26939
$$ 335884 381376 464560 560006 610427 551153 345585 4954 -348142 -553998 -560111 -433172
14457d33172J55453J22932J03453J02695L6650n7606j08991j45258j37574k0759
$$ -433172 -277719 -154787 -51334 51361 88011 30405 -78586 -223844 -361418 -382177
14447c82177Q6053J06647J03181P6912p587j14361j44555m0655R9925J61145J06035
$$ -382177 -296124 -189477 -86296 -9384 -16971 -131332 -275887 -316542 -216617 -55472 50563
14436E0563j3482p5635p9585n7739J3062R4493J33183J31871R8791K6344n2264
$$ 50563 37081 -38554 -118139 -175878 -162816 -68323 64860 196731 295522 321866 269602
14425B69602j21435j76334j56195j09564r0064m2570O4861J48082J50919J31735
$$ 269602 148167 -28167 -184362 -293926 -383990 -426560 -361699 -213617 -62698 69037
14415F9037J35403J37480J18740M8436k7567m3313l6340j8110L8930O227j57903
$$ 69037 204440 341920 460660 509096 481529 438216 401876 383766 422696 428923 271020
14404B71020k59289k41687j69188r1309J204J13449J51541J03104N1108J6636
$$ 271020 11731 -229956 -399144 -490453 -489249 -375800 -224259 -121155 -70047 -53411
14394e3411l7068p7002n1455m732J7361L3980L2434k4854r9145j23224q2823n6452
$$ -53411 -90479 -167481 -218936 -223668 -206307 -172327 -139893 -164747 -263892 -387116 -469939 -526391
14382e26391q7117r7410l9206M1038P3339M9381M6199R2097J15041J04521J05897
$$ -526391 -613508 -710918 -750124 -709086 -635747 -586366 -540167 -448070 -333029 -228508 -122611
14371a22611J12898J20801R8016M1284j6607o9547p5589l5321j6533o282J4428
$$ -122611 -9713 111088 209104 250388 233781 164234 88645 53324 36791 30509 44937
14360D4937M0600N8072N9819N7782j7826j60485j86438j06817q8805j10722j09553
$$ 44937 85537 143609 203428 261210 243384 82899 -103539 -210356 -299161 -409883 -519436
14349e19436n9720J9320J02917J10183j3942r2398p3098m4586r116m4025j11366
$$ -519436 -579156 -559836 -456919 -346736 -360678 -453076 -526174 -570760 -579876 -623901 -735267
14338g35267j39950j26239k9298P2452J03572R8681J14978J16057N8053k241k9793
$$ -735267 -875217 -1001456 -1030754 -958302 -854730 -756049 -641071 -525014 -466961 -469202 -498995
14327d98995K489M1988O72o3770m7712O3073J75601J82787Q6251L6500J8177n9998
$$ -498995 -496506 -454518 -453846 -517616 -565328 -502255 -326654 -143867 -57616 -21116 -2939 -62937
14315f2937r5736n6991m6747j05279j61419k23124k78675k54542j55310l0244
$$ -62937 -158673 -215664 -262411 -367690 -529109 -752233 -1030908 -1285450 -1440760 -1471004
14305a471004R2304J79916J88442J43297J06559O9759m541o3644m1836m110L3597
$$ -1471004 -1378700 -1198784 -1010342 -867045 -760486 -690727 -695268 -758912 -800748 -804858 -771261
14294g71261J14645J85454J44170k9586k17434k62396j70028q032J59625K33828
$$ -771261 -656616 -471162 -326992 -356578 -574012 -836408 -1006436 -1014468 -854843 -621015
14284f21015K20375J58810N0264j1156L6900R6206R5270M9446R107K3863N9697
$$ -621015 -400640 -241830 -191566 -202722 -165822 -69616 25654 75100 84207 108070 167767
14273A67767O8511L9528P56r605j9780l6030o2801o7762k6559k1800l6164J8605
$$ 167767 236278 275806 276562 266957 247177 211147 148346 80584 54025 32225 -3939 14666
14261A4666J17851J46113L0582j20626j86397j60571m8931P3865R2056K4036o6163
$$ 14666 132517 278630 309212 188586 2189 -158382 -207313 -133448 -41392 -17356 -83519
14250h3519q9841k2348N8507M9870m7272j26933j29082r4921n5085l3462J356
$$ -83519 -173360 -195708 -137201 -87331 -134603 -261536 -390618 -485539 -540624 -574086 -572730
14239e72730R8767J89258J97100J51905J20829P6903O4546R2416Q8004J6020q5784
$$ -572730 -473963 -284705 -87605 64300 185129 262032 326578 418994 506998 523018 437234
14228D37234j54263j66575r3576Q409P0582R9307J12117J11949R6164K7412o9189
$$ 437234 282971 116396 22820 31229 101811 201118 313235 425184 521348 548760 479571
14217D79571r6388k2216Q2299J27257Q3295k7678q5680k3363J8135m6049j41741
$$ 479571 383183 360967 443266 570523 653818 626140 540460 517097 535232 489183 347442
14206C47442k25976k63648k10583q5585n338n3436j37536j30085l9065M1178N4208
$$ 347442 121466 -142182 -352765 -438350 -443688 -497124 -634660 -764745 -803810 -762632 -708424
14195g08424J4620k3049k8186k7536k8042j6155M697M2020O4888Q1774J10292
$$ -708424 -693804 -716853 -745039 -772575 -800617 -816772 -812075 -770055 -705167 -623393 -513101
14184e13101R2720M5128K1992j3424l1241K03J4297l393L6437J32965J65373N9351
$$ -513101 -420381 -375253 -353261 -366685 -397926 -397723 -383426 -386819 -350382 -217417 -52044 7307
14172G307o6483m8709M1354N9821k0600j23291j63104j58988j58100j28879p0757
$$ 7307 -59176 -107885 -66531 -6710 -27310 -150601 -313705 -472693 -630793 -759672 -830429
14161h30429k0204L3031J02184J30666J28075J73123J95289Q3830o5767j05983
$$ -830429 -850633 -817602 -715418 -584752 -456677 -283554 -88265 -4435 -70202 -176185
14151a76185n9450J7877R1705J10454J03713J11312J16338K2350j52475k52018
$$ -176185 -235635 -217758 -126053 -15599 88114 199426 315764 338114 185639 -66379
14141f6379j80077O771J15784O5539j0530M58R2642J40642J16900P3482O845n2702
$$ -66379 -246456 -239685 -123901 -58362 -68892 -68434 24208 164850 281750 355232 362077 309375
14129C09375n5710p541O593j2547k059k4486r2782j06023r7812j43938j99315
$$ 309375 253665 246124 252717 240170 238111 213625 120843 14820 -82992 -226930 -426245
14118d26245j42740m933Q7185J38414J57797R8576J3963k897N1426J18119Q8700
$$ -426245 -568985 -573918 -486733 -348319 -190522 -91946 -77983 -80880 -29454 88665 177365
14107A77365j8750j05192j31433p9640n479M0053M9810M0815K8320l2313j10355
$$ 177365 158615 53423 -78010 -157650 -163129 -123076 -73266 -32451 -4131 -36444 -146799
14096a46799j11176p8276o1507m0200p88M9303R1516J35533J70254J54620J19991
$$ -146799 -257975 -336251 -397758 -437958 -438746 -389443 -297927 -162394 7860 162480 282471
14085B82471J02280Q6736L2318m6510r4371j54969k19546k19934j19551K3319
$$ 282471 384751 471487 503805 457295 362924 207955 -11591 -231525 -351076 -327757
14075c27757Q0807L1385l1500m6693n0382m8106k793L1020q554q2842j64519k14628
$$ -327757 -246950 -215565 -247065 -293758 -344140 -392246 -395039 -364019 -372573 -455415 -619934 -834562
14063h34562j26087N8843J91670K07404J36062N8834R960k7023p2528q6510n5651
$$ -834562 -960649 -901806 -710136 -502732 -366670 -307836 -297876 -324899 -397427 -483937 -539588
14052e39588q051J7134j7646o9428k8574R6558J62881J27455R2889R2761P0157
$$ -539588 -547639 -530505 -548151 -617579 -646153 -549595 -386714 -259259 -166370 -73609 -3452
14041c452L4387J5129q563n1792m9060M7267J51355J65444O7468k5565l643N4377
$$ -3452 30935 46064 37501 -14291 -63351 -16084 135271 300715 368183 342618 338975 393352
14029C93352L5503p590m1728j00830j13361o9051k0855k644j0512m1723j22949
$$ 393352 428855 421265 379537 278707 165346 96295 75440 72796 62284 20561 -102388
14018a02388j90562j67826p9397o371K0339J0787m2671r1619j22549j96565k48272
$$ -102388 -292950 -460776 -540173 -546544 -526205 -515418 -558089 -649708 -772257 -968822 -1217094
14007a217094j78654j2400J60922K58275K93874L45563L69916K79173J39726L8648
$$ -1217094 -1395748 -1408148 -1247226 -988951 -695077 -349514 20402 299575 439301 477949
13997D77949p022k1196o5894j11527j14508j09577q4974q494J6821p5747j85496
$$ 477949 470927 449731 383837 272310 157802 48225 -36749 -45243 -28422 -104169 -289665
13986b89665k13290j47865o2267p1065j04459l7034O5578J29406J61278J33306
$$ -289665 -502955 -650820 -713087 -784152 -888611 -925645 -860067 -730661 -569383 -436077
13976d36077M4311m2806l4412M7395O9530Q450m2198l0631n692J4807P6931R2061
$$ -436077 -391766 -434572 -468984 -421589 -352059 -343609 -385807 -416438 -422130 -407323 -330392 -238331
13964b38331j1423j14385r8462j9841K3097K9007L9700N2682P2442P7314P9009
$$ -238331 -249754 -364139 -462601 -482442 -459345 -430338 -390638 -337956 -265514 -188200 -109191
13953a09191J04040J32821J41896J05504M9678O142p1623j74841j94303j23870
$$ -109191 -5151 127670 269566 375070 424748 430890 359267 184426 -9877 -133747
13943a33747l3040j6637r8933j70711j42547p2393j0908N6273P4063K5797k5931
$$ -133747 -166787 -183424 -282357 -453068 -595615 -668008 -678916 -622643 -548580 -522783 -548714
13932e48714j01818j48250q3604k3473l6538n6661q8199p9907K3203J04824J10936
$$ -548714 -650532 -798782 -882386 -905859 -942397 -999058 -1087257 -1167164 -1143961 -1039137 -928201
13921i28201J22604J48828J82055K21868K23080J70906J37153J15053N6737K1368
$$ -928201 -805597 -656769 -474714 -252846 -29766 141140 278293 393346 450083 471451
13911D71451J8007m0264j77835l01937k87150j26112J871J2406j0671k9330l1481
$$ 471451 489458 449194 271359 -30578 -317728 -443840 -441969 -429563 -440234 -469564 -501045
13900e01045J2051P1334Q3996M9869L788j9000m7252p4251r0071j05090j46695
$$ -501045 -488994 -417660 -333664 -283795 -280007 -299007 -346259 -420510 -510581 -615671 -762366
13889g62366k13302k41630j64732j2617R9006J51142J68724J50145Q3858N7308
$$ -762366 -975668 -1217298 -1382030 -1394647 -1295641 -1144499 -975775 -825630 -741772 -684464
13879f84464R0497J07585Q9926O2786Q5940J90104K55803K02559Q1747l0457j11487
$$ -684464 -593967 -486382 -396456 -333670 -247730 -57626 198177 400736 482483 452026 340539
13868C40539j82572j88231j16711o5313o2333o3629n3245m0387K863K1510k9352
$$ 340539 157967 -30264 -146975 -212288 -274621 -338250 -391495 -431882 -429019 -407509 -436861
13857d36861q0831o5426O727L1565k4374m2848K8704J07771J63074J31513n865
$$ -436861 -517692 -583118 -576391 -544826 -569200 -612048 -583344 -475573 -312499 -180986 -186851
13846a86851j24534j69425j58383o5415J9570k9463j15941j09616n6314r956N9809
$$ -186851 -311385 -480810 -639193 -704608 -685038 -714501 -830442 -940058 -996372 -1006328 -946519
13835i46519J48236K20545K56313K40874J82099P0596l3977p0149q2385r1281
$$ -946519 -798283 -577738 -321425 -80551 101548 172144 138167 68018 -14367 -105648
13825a05648j07390j30895j19382r4330o4003j2853L4456Q2973J13026R8779M5046
$$ -105648 -213038 -343933 -463315 -557645 -621648 -634501 -600045 -517072 -404046 -305267 -260221
13814b60221l0727j11741j93565k01885r4712M9219J58014J79463J23211J21083
$$ -260221 -290948 -402689 -596254 -798139 -892851 -843632 -685618 -506155 -382944 -261861
13804b61861J38565R4606l603p4386o1164j6106k5934n7957p586M0544K1451K8527
$$ -261861 -123296 -28690 -32293 -106679 -167843 -183949 -209883 -267840 -275426 -234882 -213431 -184904
13792a84904L7909r028r7628j48442q9963K6150J04258J55905J67782J10504O2692
$$ -184904 -146995 -156023 -253651 -402093 -492056 -465906 -361648 -205743 -37961 72543 135235
13781A35235P0099J00753R3409M1974m6647j36926j44032o5601J0080k136j09836
$$ 135235 205334 306087 399496 441470 394823 257897 113865 48264 58344 56208 -53628
13770e3628k08991k15023j81271j35990k5912O7162M6826P90j965L8344R5602
$$ -53628 -262619 -477642 -658913 -794903 -820815 -753653 -706827 -706037 -708002 -669658 -574056
13759e74056J45434J77248J68811J11706L9911p7541k49131l60367l61185k97606
$$ -574056 -428622 -251374 -82563 29143 69054 -8487 -257618 -617985 -979170 -1276776
13749a276776j60422L8604J55481J32208N6567M9737J46206K29602K09217J20071
$$ -1276776 -1437198 -1398594 -1243113 -1110905 -1054338 -1004601 -858395 -628793 -419576 -299505
13739b99505N4338P1417J19201J47921J55302J39056J19776Q9233j0430j69662
$$ -299505 -245167 -173750 -54549 93372 248674 387730 507506 596739 586309 416647
13729D16647k87447k61795j31703R296R9244J51243J32256J248j13345j22282
$$ 416647 129200 -132595 -264298 -255002 -155758 -4515 127741 128989 15644 -106638
13719a06638o8365O78N4343Q2236L9047n3885j11707r2547l4802n051k1156m4045
$$ -106638 -175003 -174325 -119982 -37746 1301 -52584 -164291 -256838 -291640 -296691 -317847 -361892
13707c61892p9115q3892k7946J9064K074k4897N288K3827M3329L7307l2265o5993
$$ -361892 -441007 -524899 -552845 -533781 -531707 -556604 -551316 -527489 -484160 -446853 -479118 -545111
13695e45111m1197k3142r953K2146N2660L7580L8482R3497Q8294J9563K9087J24317
$$ -545111 -586308 -609450 -619403 -597257 -544597 -507017 -468535 -375038 -286744 -267181 -238094 -113777
13683a13777J68618J12006J9483r1368j44494p6098k0351l5723n1657n2750m1909
$$ -113777 54841 166847 186330 94962 -49532 -125630 -145981 -181704 -233361 -286111 -328020
13672c28020o773O8787R7651J7926q6163j71274k22154j35562R4986K58156K11464
$$ -328020 -334793 -266006 -168355 -150429 -236592 -407866 -630020 -765582 -670596 -412440 -200976
13661b00976M0131q7916l9312Q9725R6925L6787k7386q6400q8363l9083K5048
$$ -200976 -160845 -248761 -288073 -198348 -101423 -64636 -92022 -178422 -266785 -305868 -280820
13650b80820M4021L2521Q6256J46550J17219J7499o1527r3220j39231j87875j73535
$$ -280820 -236799 -204278 -118022 28528 145747 163246 101719 8499 -130732 -318607 -492142
13639d92142j26473r8134q5089l9175P1784K26883L16211K60666J53735J10087
$$ -492142 -618615 -716749 -801838 -841013 -769229 -542346 -226135 34531 188266 298353
13629B98353J22438O8741m8409j18595j41550j56893j34841p8121o0363p3865
$$ 298353 420791 489532 441123 322528 180978 24085 -110756 -188877 -249240 -323105
13619c23105j8807Q2712J19038Q4328O7425P0790J6758k7576r505K6795J4901
$$ -323105 -341912 -259200 -140162 -55834 11591 82381 99139 71563 62058 88853 103754
13608A03754o4977j13509q0413N033N4742K3012k7014o6638j40820k19904k44627
$$ 103754 38777 -74732 -155145 -150112 -95370 -72358 -99372 -166010 -306830 -526734 -771361
13597g71361k14640j37285k2595P4087J42673J69408J50060J40876J52244J35330
$$ -771361 -986001 -1123286 -1145881 -1071794 -929121 -759713 -609653 -468777 -316533 -181203
13587a81203P6043N24j21394k24011j74719m0638O5481J03294Q6606N1885N8162
$$ -181203 -105160 -104636 -226030 -450041 -624760 -665398 -599917 -496623 -410017 -358132 -299970
13576b99970R3690J14302J28013J21570J15251J14447J07374K6233r9166j32366
$$ -299970 -206280 -91978 36035 157605 272856 387303 494677 520910 421744 289378
13566B89378n2138K9059L0703k3195n1907L504Q1680R8367R3568O7412l4828q7236
$$ 289378 237240 266299 297002 273807 221900 225404 307084 405451 499019 566431 531603 444367
13554D44367n543N6779N9194M9112N4482P6765Q4618M3157J7198O5131J12302
$$ 444367 438824 495603 554797 603909 658391 735156 819774 862931 880129 945260 1057562
13543A057562Q5409L0600l853k4958k1749k0671o2679j31069j69088j52498q7092
$$ 1057562 1142971 1173571 1169718 1144760 1123011 1102340 1039661 908592 739504 587006 499914
13532D99914J0674N9716K7620k1215q0817j39785j55807j27206n6214N4677J12404
$$ 499914 510588 570304 597924 576709 495892 356107 200300 73094 16880 71557 183961
13521A83961P2560j9664q3769q3752k7678J9865K3310L3111O0523M9034k9174
$$ 183961 256521 236857 153088 69336 41658 61523 84833 117944 178467 227501 198327
13510A98327j66679k72272k61890j17765Q7241J73777J14849L7291n921m8219
$$ 198327 31648 -240624 -502514 -620279 -533038 -359261 -244412 -207121 -213042 -261261
13500b61261r4167j49468j23400M583O1653l1794j38502j43775n8100N1203J04449
$$ -261261 -355428 -504896 -628296 -623713 -562060 -593854 -732356 -876131 -934231 -883028 -778579
13489g78579Q2974P5933J22318J48842R7301M0243O6153J53193K10319J87460
$$ -778579 -695605 -619672 -497354 -348512 -251211 -210968 -144815 8378 218697 406157
13479D06157J16729P1289M8725J2527o3569j50820j79945j67407j60643r3119
$$ 406157 522886 594175 642900 655427 591858 441038 261093 93686 -66957 -160076
13469a60076r365L171M8575M0917q0321j45233j14000m1219K2480L6571O4985
$$ -160076 -169441 -166270 -117695 -76778 -157099 -302332 -416332 -457551 -435071 -398500 -333515
13458c33515J04837Q6715M7285M5243R6091J45426J38901Q1652J8202Q576j6952
$$ -333515 -228678 -141963 -94678 -49435 46656 192082 330983 412635 430837 439413 422461
13447D22461q4556j23998r6212l3614P805N5102J30334J98562K72233K98164J87730
$$ 422461 337905 213907 117695 84081 91886 146988 277322 475884 748117 1046281 1234011
13436A234011L8440q5099k00169k57859k52346j57127m3287L0992P8006J41253
$$ 1234011 1272451 1187352 987183 729324 476978 319851 276564 307556 385562 526815
13426E26815J81225J37766Q2986K1336j5356L8845J26896J29527L0042o3749q5893
$$ 526815 708040 845806 928792 950128 934772 973617 1100513 1230040 1260082 1196333 1110440
13415A110440p5468o7783l6996o398N901l0833j29218j67166j42846q6474l0079
$$ 1110440 1034972 967189 930193 923795 929696 898863 769645 602479 459633 373159 343080
13404C43080j3525P128L8173N3629R7157J46704J28529P7657L9898J1550m2343
$$ 343080 329555 336683 374856 428485 525642 672346 800875 878532 918430 929980 887637
13393H87637r3880j01268o9275n7380q7990j24768j55157j50086o4441M9409R9937
$$ 887637 793757 692489 623214 565834 477844 353076 197919 47833 -16608 32801 132738
13382A32738R8557M5978l9349o8096O94Q9522P0598L001M1515J67741J96275P4280
$$ 132738 231295 277273 237924 169828 170522 260044 330642 333643 375158 542899 739174 813454
13370H13454n6703q3103n0076p3659j64367k17501j76434r3518O314Q6289R5264
$$ 813454 756751 673648 623572 549913 385546 168045 -8389 -101907 -95593 -9304 85960
13359H5960M7767j2840o2839p3560j2579P3488P0812l2809j03333o7244k7285
$$ 85960 133727 120887 58048 -15512 -28091 45397 116209 83400 -19933 -87177 -114462
13348a14462o8442j11378p5009M8517J49985J14139J3204j02859j66828j37493
$$ -114462 -182904 -294282 -369291 -320774 -170789 -56650 -43446 -146305 -313133 -450626
13338d50626n2883O2158J38208J58940J47997J49536J55233Q7732l1484o5354
$$ -450626 -503509 -441351 -303143 -144203 3794 153330 308563 396295 364811 299457
13328B99457N2169J38101P9733m1011j59582k41858k37779j58396o7914J0899
$$ 299457 351626 489727 569460 528449 368867 127009 -110770 -269166 -337080 -326181
13318c26181Q8231J56826J47049M8898o4095j19884o0131R1458K24790K33764
$$ -326181 -237950 -81124 65925 114823 50728 -69156 -129287 -37829 186961 420725
13308D20725J51169J00902J32181J32502K8415r6437j04207j669P2504M4583k6126
$$ 420725 571894 672796 804977 937479 965894 869457 765250 763581 836085 880668 854542
13297H54542q5227j62890j94807j41634n5402L6268J15665J39248J21563J41271
$$ 854542 769315 606425 411618 269984 214582 250850 366515 505763 627326 768597
13287G68597J57806P6515j34427l41871l62335l11936k38384p1080J03395K05592
$$ 768597 926403 1002918 868491 526620 164285 -147651 -386035 -457115 -353720 -148128
13277a48128K51292K63505K22750J01659l8573j17742j43438j23020j14146j02779
$$ -148128 103164 366669 589419 691078 652505 534763 391325 268305 154159 51380
13267E1380k0660O8932J33877K16800K79865K58833J84262J19370M8288l5279
$$ 51380 30720 99652 233529 450329 730194 989027 1173289 1292659 1340947 1305668
13257A305668r9044j04857j10210j41255j01294q696J5611j4254j8179L2881J15121
$$ 1305668 1206624 1101767 991557 850302 749008 740312 755923 741669 723490 756371 871492
13246H71492J84266K02384J79225J72487J60915J07407J2530j38689k62126k67086
$$ 871492 1055758 1258142 1437367 1609854 1770769 1878176 1890706 1752017 1489891 1222805
13236A222805j84277o1704L2524J7331p6589j34047j47302j43440j14110l7079
$$ 1222805 1038528 976824 1009348 1026679 950090 816043 668741 525301 411191 374112
13226C74112M5333O9462J2961m5849M775J25282J78281J72284J23696J7038p1852
$$ 374112 419445 488907 501868 456019 460794 586076 764357 936641 1060337 1077375 1005523
13215A005523r9905j24814j40803p5161Q8427K35434K63461K11625J31630M4628
$$ 1005523 905618 780804 640001 564840 653267 888701 1152162 1363787 1495417 1540045
13205A540045l6442p0991k4765K5296l3493j61972k51887k02728p0603M3680Q8611
$$ 1540045 1503603 1432612 1407847 1433143 1399650 1237678 985791 783063 712460 756140 844751
13194H44751N3764j4089m0154q635K9728P2213Q6381O9990P8885Q4334Q689q9406
$$ 844751 898515 884426 844272 835637 865365 937578 1023959 1093949 1172834 1257168 1265857 1176451
13182A176451o3892N7906J07616O6239L2664M0987K2563m1156p6595j4980J15872
$$ 1176451 1112559 1170465 1278081 1344320 1376984 1417971 1440534 1399378 1322783 1307803 1423675
13171A423675K04816J63024M5049k4958j8415j0213j8905J5467Q3113O0847o6022
$$ 1423675 1628491 1791515 1836564 1811606 1793191 1782978 1764073 1779540 1862653 1923500 1857478
13160A857478j76952j65732j05877r3332q3219o4232q2637j50436j94622j42837
$$ 1857478 1680526 1514794 1408917 1315585 1232366 1168134 1085497 935061 740439 597602
13150E97602m8649M032M8530P7131K9734k3557K716M7293O4601N8088M8185P9881
$$ 597602 548953 552985 601515 678646 708380 684823 687539 734832 799433 857521 905706 985587
13138I85587J40050J45377N7160n3331p4216l662M9590Q4206J44038J60038R9722
$$ 985587 1125637 1271014 1328174 1274843 1200627 1196965 1246555 1330761 1474799 1634837 1734559
13127A734559K0261l2531n8791r7124j04032N708J46929J48330q9j32231j58326
$$ 1734559 1754820 1722289 1663498 1566374 1462342 1468050 1614979 1763309 1763220 1630989 1472663
13116A472663j16257n2226j7808n9744j26890j26251j25514j66283j68919j20312
$$ 1472663 1356406 1304180 1286372 1226628 1099738 973487 847973 681690 512771 392459
13106C92459o0929K1722J07673J25960J42099J98814K25043J64908N4979j4203
$$ 392459 331530 353252 460925 586885 728984 927798 1152841 1317749 1372728 1358525
13096A358525p409M4030L8592J1171R6826K29904K63487J88476J03349M4006J9318
$$ 1358525 1351116 1395146 1433738 1444909 1541735 1771639 2035126 2223602 2326951 2370957 2390275
13085B390275J6682P832j0446n147J7349K1439m5365j29524j30288o9588k8485
$$ 2390275 2406957 2414789 2404343 2399196 2416545 2437984 2392619 2263095 2132807 2063219 2034734
13074B034734l5138m2394k8098L2030O2091J5300k5821j0448M9472J03213J36995
$$ 2034734 1999596 1957202 1929104 1961134 2023225 2038525 2012704 2002256 2051728 2154941 2291936
13063B291936J26257P4100K5454k213j4936J1130M8687K6982n4692r3626m1103
$$ 2291936 2418193 2492293 2517747 2515534 2500598 2511728 2560415 2587397 2532705 2439079 2397976
13052B397976J6185J4725L0864O4056Q3276J04507J00422J24071J60843J71884
$$ 2397976 2414161 2428886 2459750 2523806 2607082 2711589 2812011 2936082 3096925 3268809
13042C268809J82279J78027J35578J12565Q0588j177n7091n5788m0008j4623L1164
$$ 3268809 3451088 3629115 3764693 3877258 3957846 3956669 3899578 3843790 3803782 3789159 3820323
13031C820323R6955K03603K83868K64201K23616K15054J65338P1435l7408j39166
$$ 3820323 3917278 4120881 4404749 4668950 4892566 5107620 5272958 5344393 5306985 5167819
13021E167819j77384j25983j0174J18279K01204J98297K08513K62793K92786K95146
$$ 5167819 4990435 4864452 4854278 4972557 5173761 5372058 5580571 5843364 6136150 6431296
13011F431296L32803L96856M14299M31375M52933M53505M90564N70286O63640
$$ 6431296 6764099 7160955 7575254 8006629 8459562 8913067 9403631 9973917 10637557
13002A0637557P88997R62939J172190J365748J553645J750291J995290K375069
$$ 10637557 11426554 12389493 13561683 14927431 16481076 18231367 20226657 22601726
12994B2601726K890725L501128M181135N050898O157547P539034R365442J1742505
$$ 22601726 25492451 28993579 33174714 38225612 44383159 51922193 61287635 73030140
12986G3030140J4808848J8612761K3062771K7956432L2607291L5306293L3049639
$$ 73030140 87838988 106451749 129514520 157470952 190078243 225384536 258434175
12979B58434175K2707284M642141j5105519k9042422l4306966l3050853k8730205
$$ 258434175 281141459 285783600 270678081 241635659 207328693 174277840 145547635
12972A45547635k3747219j9168644j5348913j2331239r964728q071397o583149
$$ 145547635 121800416 102631772 87282859 74951620 64986892 56915495 50332346
12965E0332346n471900m639567l977203l430472k967990k528112k138596j829787
$$ 50332346 44860446 40220879 36243676 32813204 29845214 27317102 25178506 23348719
12957B3348719j560126j323745j123440r61117q72746q12393p58698p23335o58487
$$ 23348719 21788593 20464848 19341408 18380291 17507545 16695152 15936454 15213119 14554632
12948A4554632n61905m97852m24751l42252l40899l34193k80321k28366k08362
$$ 14554632 13992727 13494875 13070124 12727872 12386973 12052780 11772459 11544093 11335731
12939A1335731k35455k26628j03656R9286K28793K03477J60251J90477K80817
$$ 11335731 11100276 10873648 10769992 10869278 11098071 11301548 11461799 11652276 11933093
12930A1933093L89178M73438N61434O66628P86594R73515J296465J641170J852694
$$ 11933093 12322271 12795709 13357143 14023771 14810365 15783880 17080345 18721515 20574209
12921B0574209J833539J438754O80702j04662o17047p93177o52086k72200J67335
$$ 20574209 22407748 23846502 24527204 24422542 23805495 23012318 22360232 22088032 22255367
12912B2255367M91326P35174J047965J424925J829758K336751L041861L977997
$$ 22255367 22746693 23481867 24529832 25954757 27784515 30121266 33163127 37141124
12904C7141124N113249O458585Q058315R993573J2491230J5711701J9648864K4297500
$$ 37141124 42254373 48712958 56771273 66764846 79256076 94967777 114616641 138914141
12896A38914141K9440936L4112997L6170077L2234273J9423983n37836k0175834
$$ 138914141 168355077 202468074 238638151 270872424 290296407 289758571 269582737
12889B69582737l2257778l5435286l2868745k8035199k2969764j8481532j4726782
$$ 269582737 237324959 201889673 169020928 140985729 118015965 99534433 84807651
12882H4807651j1743720r475410p776819o518542n567562m779104m064831l463045
$$ 84807651 73063931 63588521 55811702 49293160 43725598 38946494 34881663 31418618
12874C1418618k962929k496364k096455j805693j586250j370069j134135r49078
$$ 31418618 28455689 25959325 23862870 22057177 20470927 19100858 17966723 17017645
12866A7017645q72750q09040p24903o64837o20316n51836n05840m67029l52859
$$ 17017645 16144895 15335855 14610952 13946115 13325799 12773963 12268123 11801094 11448235
12857A1448235k14822j92070k56997l00379k92661k36694j82452j29003n7606
$$ 11448235 11233413 11041343 10784346 10483967 10191306 9954612 9772160 9643157 9585551
12848I585551j9338m1627q0020r4552p6308K3554K04590L78332M16908L19904
$$ 9585551 9566213 9524586 9444566 9350014 9273706 9297260 9501850 9880182 10297090 10616994
12838A0616994K13081J47981J38690K25081L25605L28730L30434M20172N08342
$$ 10616994 10830075 10978056 11116746 11341827 11667432 11996162 12326596 12746768 13255110
12829A3255110N89138P05096R02445J140958J307815J482924J731619K055569
$$ 13255110 13844248 14549344 15451789 16592747 17900562 19383486 21115105 23170674
12821B3170674K507294L112155L827428M643702N634767O893738Q511043J0607608
$$ 23170674 25677968 28790123 32617551 37261253 42896020 49789758 58300801 68908409
12813F8908409J3302526J6665446K0728891K5427859L0354562L4304491L4870657
$$ 68908409 82210935 98876381 119605272 145033131 175387693 209692184 244562841
12806B44562841K8726243J3990790n968838k3448557l2969980l4610441l1501649
$$ 244562841 273289084 287279874 281311036 257862479 224892499 190282058 158780409
12799A58780409k6643423k1763224j7515426j4006480j1180862q995514p405459
$$ 158780409 132136986 110373762 92858336 78851856 67670994 58675480 51270021
12792E1270021o199852n178234m296838l578824l010392k559531k185645j874099
$$ 51270021 45070169 39891935 35595097 32016273 29005881 26446350 24260705 22386606
12784B2386606j618946j456681j377223j298087j188136j083705r87244q81110
$$ 22386606 20767660 19310979 17933756 16635669 15447533 14363828 13376584 12495474
12776A2495474p62722o33648n44130n09197n16627n53381n98303n84067m89936
$$ 12495474 11732752 11099104 10554974 10045777 9529150 8975769 8377466 7793399 7303463
12767G303463m21796m48939m43885l52041k78815k14671p4998N2099P0215K3720
$$ 7303463 6881667 6432728 5988843 5636802 5357987 5143316 5068318 5120417 5190632 5214352
12757E214352m1165j20177j86794k15263k08432j68943j14887q3029p6973l2864
$$ 5214352 5173187 5053010 4866216 4650953 4442521 4273578 4158691 4075662 3998689 3965825
12747C965825O6629J13947M9144l915K3879K9013J0805m136p7839j42531j33082
$$ 3965825 4032454 4146401 4195545 4191630 4215509 4244522 4255327 4251191 4173352 4030821 3897739
12736C897739j10561j18888j47012j53348p1782L362p5770j93690k13124j92330
$$ 3897739 3787178 3668290 3521278 3367930 3296148 3299510 3223740 3030050 2816926 2624596
12726B624596j74530r9229l5635n1456p7416k3782K9000l5773q9234p0244k7952
$$ 2624596 2450066 2350837 2315202 2263746 2186330 2162548 2191548 2155775 2066541 1996297 1968345
12715A968345r109r07J9681O0796J00829N9162o3690j09782q0717n3930l8289
$$ 1968345 1959236 1958329 1978010 2038806 2139635 2198797 2135107 2025325 1944608 1890678 1852389
12704A852389l6181l2343n652M9717J27984J40920P0232j215k9853p030K9866
$$ 1852389 1816208 1783865 1778213 1827930 1955914 2096834 2167066 2165851 2135998 2128968 2158834
12693B158834M5032J1q1328j09194q7322p3500j09831j60155j54103p0005L4118
$$ 2158834 2203866 2203877 2122549 2013355 1926033 1852533 1742702 1582547 1428444 1358439 1392557
12682A392557M3918o7938j74934j84157j10286J0996J31886J38638N461j63623
$$ 1392557 1436475 1368537 1193603 1009446 899160 910156 1042042 1180680 1186141 1022518
12672A022518k63645k28630r0679Q8881K19914K08132N9435o2922r0861o9806
$$ 1022518 758873 530243 439564 528445 748359 956491 1015926 953004 862143 792337
12662G92337l2596o309N920K2454N1700R7412J20882R6425M8372J7199K2359J9809
$$ 792337 759741 753432 759352 781806 833506 930918 1051800 1148225 1196597 1213796 1236155 1255964
12650A255964k5345p2698j34639k24185k95931k78781j67076k0296J07368K20832
$$ 1255964 1230619 1157921 1023282 799097 503166 224385 57309 37013 144381 365213
12640C65213L23649L41577K12406m511j69935k27435j98060j07293J9999J19194
$$ 365213 688862 1030439 1242845 1238334 1068399 840964 642904 535611 555610 674804
12630F74804J50117J11709O2080Q3995J26852J02346P5115N3101j1229j35892
$$ 674804 824921 936630 998710 1082705 1209557 1311903 1387018 1440119 1428890 1292998
12620A292998k62649l09158k65277j79114n8908O8982R0110J1118n2303o5536
$$ 1292998 1030349 721191 455914 276800 217892 286874 376984 388102 335799 270263
12610B70263n4015j1206O3651J59517K22374J84907N0242r6977j41705p7745J7747
$$ 270263 216248 205042 268693 428210 650584 835491 885733 788756 647051 569306 587053
12599E87053J12357J67769J32890L0591l9755q7716j05230p7014q6776j05114
$$ 587053 699410 867179 1000069 1030660 990905 903189 797959 720945 634169 529055
12589E29055k5932J07839K26459K47552R3857q2610p8883k2841r3016k17579k27260
$$ 529055 503123 610962 837421 1084973 1178830 1096220 1017337 994496 901480 683901 456641
12578D56641j08203Q105P7267J26681J45582Q3690l8106j16042j20382j23175
$$ 456641 348438 356543 433810 560491 706073 789763 751657 635615 515233 392058
12568C92058j44247j15881j2085J50824K53897J93814N7776l0083o0931l7629
$$ 392058 247811 131930 119845 270669 524566 718380 776156 746073 685142 647513
12558F47513J9007J00872J29062N8951o3912j73766k02080j65859r8748l9040
$$ 647513 666520 767392 896454 955405 891493 717727 515647 349788 251040 212000
12548B12000k1748J444J7762k5171o7122j8787O8444P8257K0091m8742r3369r2854
$$ 212000 190252 191696 209458 184287 117165 98378 166822 245079 265170 216428 123059 30205
12536C0205r1078j15335r0720L6839K00821K63825J44855m9927j40153j02037
$$ 30205 -60873 -176208 -266928 -230089 -29268 234557 379412 329485 189332 87295
12526H7295k1041L5385K7118L9776R9404J04924L0058p7880j43917j01884k8160
$$ 87295 66254 101639 128757 168533 267937 372861 402919 325039 181122 79238 51078
12515E1078k4294J0133R3379J49696J65256J44747Q7871M1344O2930J03582J00619
$$ 51078 26784 36917 130296 279992 445248 589995 677866 719210 782140 885722 986341
12504I86341J2774j18741k00276k32729k13569j71717j35956n2181N1609P9567
$$ 986341 999115 880374 680098 447369 233800 62083 -73873 -126054 -74445 5122
12494E122M2490L8830M6146m4546j43918j04567P201Q6702Q2815J4697k8272J3620
$$ 5122 47612 86442 132588 88042 -55876 -160443 -153242 -66540 16275 30972 2700 16320
12482A6320O9122L8533k9013K0946J27156J26622P2462K8602l5133j20398j60569
$$ 16320 85442 123975 94962 115908 243064 369686 442148 470750 435617 315219 154650
12471A54650j46162r4159j4182P9848J38770R2146n6379j62353j56426r4504n3394
$$ 154650 8488 -85671 -99853 -20005 118765 210911 154532 -7821 -164247 -258751 -312145
12460c12145k3814K2809N8540O7051R2640J40751J62974J30957Q4554N9997K235
$$ -312145 -335959 -313150 -254610 -187559 -94919 45832 208806 339763 424317 484314 486549
12449D86549r7370j49987j13103j4483Q1082J19923J42806J46207J12607J20090
$$ 486549 389179 239192 126089 111606 192688 312611 455417 601624 714231 834321
12439H34321J65681K34163K93259K22633L5426j42119k42566k92157l11473l13723
$$ 834321 1000002 1234165 1527424 1750057 1785483 1643364 1400798 1108641 797168 483445
12429D83445l23301k91896k13950j01968L5436J14309Q5108L7284J8248J6671
$$ 483445 160144 -131752 -345702 -447670 -412234 -297925 -212817 -175533 -157285 -140614
12419a40614P2171J50762J74921J17180J9480o0125p8953k3882O1203O0596n5215
$$ -140614 -68443 82319 257240 374420 393900 333775 254822 230940 292143 352739 297524
12408B97524j57301j78936j27602n5578k0235l899L9607R6229J09551O4498j2695
$$ 297524 140223 -38713 -166315 -221893 -242128 -246027 -206420 -110191 -640 63858 51163
12397E1163q5370n5142J2962L6038K4721J0714J9288P125o5045j32557j42497
$$ 51163 -34207 -89349 -76387 -40349 -15628 -4914 14374 21499 -43546 -176103 -318600
12386c18600j32616j07939l5241N7535J00382Q6516O8093Q1553J40076K06885
$$ -318600 -451216 -559155 -594396 -536861 -436479 -349963 -281870 -200317 -60241 146644
12376A46644K38850J75335M4979l4238q7820j41031j33492q5095o3061j19477
$$ 146644 385494 560829 605808 571570 483750 342719 209227 124132 61071 -58406
12366e8406k13078k09801j09062r190M7734K5931k8594m7007j2338K5546J8517
$$ -58406 -271484 -481285 -590347 -599537 -551803 -525872 -554466 -601473 -613811 -588265 -569748
12355e69748K9623Q1352J16601J21778J11304R6323N1193j4511r7115j71279j52602
$$ -569748 -540125 -458773 -342172 -220394 -109090 -12767 38426 23915 -73200 -244479 -397081
12344c97081p7115j1668M6893P8292K8312l056N2702Q1361R183o5011r0428o5040
$$ -397081 -474196 -485864 -438971 -360679 -332367 -335423 -282721 -201360 -192177 -257188 -347616 -412656
12332d12656J6327N6251M6151L8963M3268O1625Q5426J24531J40958P9622j9354
$$ -412656 -396329 -340078 -293927 -254964 -211696 -150071 -64645 59886 200844 280466 261112
12321B61112l3794O9807J36550Q7147J0699l7306o2519p6580o4012o3319r9543
$$ 261112 227318 297125 433675 520822 531521 494215 431696 355116 291104 227785 128242
12310A28242j01045n0773j36o420m7708m3392Q026J01532K25771K66582J94559
$$ 128242 27197 -23576 -23712 -30132 -77840 -121232 -113206 -11674 214097 480679 675238
12299F75238P3537l3409o8297l8752Q132L8740L2587J5534L8451R4123Q7974J4534
$$ 675238 748775 715366 647069 608317 616449 655189 687776 703310 741761 835884 923858 938392
12287I38392l7455p1491r7091q0356j0655N7646J09933J17252P4501j4432j39650
$$ 938392 900937 829446 732355 651999 641344 698990 808923 926175 1000676 986244 846594
12276H46594k04645j75350j63540j79400j35416l9067K2667J6186l3051r6380
$$ 846594 641949 466599 303059 123659 -11757 -50824 -28157 -11971 -45022 -141402
12266a41402p9232P4235K02641K01997J52032O7093l1857o8591p8565j09797r6654
$$ -141402 -220634 -146399 56242 258239 410271 477364 445507 376916 298351 188554 91900
12255I1900k3210K7418K3647k1049l7546L0736J55564K07326J90657J78304J44267
$$ 91900 68690 96108 119755 98706 61160 91896 247460 454786 645443 823747 968014
12244I68014L8164j02212k22531k93846l00229k26786j12019m4506j8306L021
$$ 968014 1006178 903966 681435 387589 87360 -139426 -251445 -295951 -314257 -311236
12234c11236n320N254O4852J01306P1386N93o1682j01712q5048N706M8432J9063
$$ -311236 -316556 -311302 -246450 -145144 -73758 -73165 -134847 -236559 -321607 -315901 -267469 -248406
12222b48406L10j7745n2019q1695j01121p3123J5029N1838J9826p862m8119p2442
$$ -248406 -248096 -265841 -317860 -399555 -500676 -573799 -558770 -506932 -487106 -494968 -543087 -615529
12210f15529m9924m5734n7660o8524n1885r515L5744R9954J89713K53242K63259
$$ -615529 -665453 -711187 -768847 -837371 -889256 -898771 -863027 -763073 -573360 -320118 -56859
12199e6859K06979P8354j0816J855L1290P5888J26184J13617L9940m8120r7223
$$ -56859 150120 228474 217658 219513 250803 326691 452875 566492 606432 558312 461089
12188D61089q6429k5603K5825n432r2593j11485j2014Q4956N9302k6276p1199
$$ 461089 374660 349057 374882 369450 276857 165372 153358 238314 297616 271340 200141
12177B00141q1871o5413l7795k0695L256J4304n1244j27673j24828l8940O9291
$$ 200141 118270 52857 15062 -5633 -2377 11927 -39317 -166990 -291818 -330758 -261467
12166b61467R7562J00678J27544R7279M9617P839j08621k08198j79756q8108o89
$$ -261467 -163905 -63227 64317 161596 211213 219052 110431 -97767 -277523 -365631 -366320
12155c66320N8241N0904J6214K5587P1968J29790J88310J77317O8290n9785q5773
$$ -366320 -308079 -257175 -240961 -215374 -143406 -13616 174694 352011 420301 360516 274743
12144B74743J2672P2601J6489m9057k2300O3000Q5435K9073m5193j43718j85697
$$ 274743 287415 360016 376505 327448 305148 368148 453583 482656 437463 293745 108048
12133A08048j56284j28769p0159o370j5042k9579p404J3797N9235Q0533M0300
$$ 108048 -48236 -177005 -247164 -253534 -268576 -298155 -305559 -291762 -232527 -151994 -111694
12122a11694m7642j29502j46796j10824l2742R6995K22549K35467J43975O7385
$$ -111694 -159336 -288838 -435634 -546458 -579200 -482205 -259656 -24189 119786 187171
12112A87171L7116q622n9994q9134j12918j07201r4329j19882j15641l5726L8044
$$ 187171 224287 215665 155671 66537 -46381 -153582 -247911 -367793 -483434 -519160 -481116
12101d81116L0342K341M4757R5717J05907J09158J38343J65842J56792J35760
$$ -481116 -450774 -448433 -403676 -307959 -202052 -92894 45449 211291 368083 503843
12091E03843Q2694L552m7959j04204j63234j75361j38373j6921J11869J21374
$$ 503843 586537 590089 542130 437926 274692 99331 -39042 -55963 55906 177280
12081A77280K0977p7300r5793n4667k8507j5651j1200l1997j5221M7220J05884
$$ 177280 198257 120957 25164 -29503 -58010 -73661 -84861 -116858 -132079 -84859 21025
12070B1025O4222p3248j54628j12750k062N6559M4835N5617O1773k6302j52337
$$ 21025 85247 11999 -142629 -255379 -257441 -200882 -156047 -100430 -38657 -64959 -217296
12059b17296j77376o1448K0589l1401j05043j35230j37720r1621K9440J24113
$$ -217296 -394672 -456120 -435531 -466932 -571975 -707205 -844925 -936546 -907106 -782993
12049g82993R9156K7220K1831R3729J50047J29273L6964p4949j46834j40491n7942
$$ -782993 -683837 -656617 -634786 -541057 -391010 -261737 -224773 -299722 -446556 -587047 -644989
12038f44989O6424J60285J94762J63730J14822J22013J23161N1789j7659l7382
$$ -644989 -578565 -418280 -223518 -59788 55034 177047 300208 351997 334338 296956
12028B96956n3892o3966p0797n9851k598O2633J10228J05056J5121k7149L3301
$$ 296956 243064 179098 108301 48450 45852 108485 218713 323769 338890 311741 345042
12017C45042L9861m601k098j8325r0341j47372j60555j73876j62600r6695j8788
$$ 345042 384903 380302 378204 359879 269538 122166 -38389 -212265 -374865 -471560 -490348
12006d90348L6788N4828K8202J4485k181l3969J5582R9889R4283K1723m2293m1608
$$ -490348 -453560 -398732 -370530 -356045 -358226 -392195 -376613 -276724 -182441 -160718 -203011 -244619
11994b44619M4558J37452J40012K9911n0644k3618k5502j17835j57276p2976J2789
$$ -244619 -200061 -62609 77403 107314 56670 33052 7550 -110285 -267561 -340537 -327748
11983c27748Q291o9874j33193p3115J06090K27056J95692J50980J63506J49814
$$ -327748 -319457 -389331 -522524 -595639 -489549 -262493 -66801 84179 247685 397499
11973C97499N0816j05953k38466k60988j80024m3116J10927J91889J47644M6871
$$ 397499 448315 342362 103896 -157092 -337116 -380232 -269305 -77416 70228 117099
11963A17099q679O8483J62865J52999J25119J29882J05995L6155l5588r6702p5908
$$ 117099 108420 176903 339768 492767 617886 747768 853763 889918 854330 757628 681720
11952F81720M4939P7699k5468j26230j02989j2426l19k9353l3463n3259o7441
$$ 681720 726659 804358 778890 652660 549671 537245 536926 507573 474110 420851 353410
11941C53410l1619J2904K3823k1089j13670j79131j84131j29049k1480P0594J29912
$$ 353410 321791 334695 358518 337429 223759 44628 -139503 -268552 -290032 -219438 -89526
11930h9526J70559J55934P5870j1785n3148o9767j14549j39986o6458J5598j3340
$$ -89526 81033 236967 312837 301052 247904 178137 63588 -76398 -142856 -127258 -140598
11919a40598q1799q3325l7306m7846j04592j06057j8737R7289J73085K02694J85281
$$ -140598 -222397 -305722 -343028 -390874 -495466 -601523 -620260 -522971 -349886 -147192 38089
11908C8089J11071M7055P2236J00834J9618p8129p2696l6705n6996p2700m8916
$$ 38089 149160 196215 268451 369285 388903 310774 238078 201373 144377 71677 22761
11897B2761j7614J9903O8393O5487L828j9030K025j5161j03778k09047k45582
$$ 22761 5147 25050 93443 158930 162758 143728 145753 130592 26814 -182233 -427815
11886d27815j77288r8008l9123M9276J21453P2902j8574l0389K0913L3220m8998
$$ -427815 -605103 -703111 -742234 -692958 -571505 -498603 -517177 -547566 -526653 -493433 -542431
11875e42431j23493r9686j2554P7995J18275N7178l7741k6844R1828J51030N7435
$$ -542431 -665924 -765610 -778164 -700169 -581894 -524716 -562457 -589301 -497473 -346443 -289008
11864b89008p9422j11679m5912L7753Q0320N2876q442j8279K3584Q4411J11489
$$ -289008 -368430 -480109 -526021 -488268 -407948 -355072 -363514 -381793 -358209 -273798 -162309
11853a62309J24879J42565Q4450j7141o8434m7686j5596j9230n088M1296J14564
$$ -162309 -37430 105135 189585 172444 104010 56324 40728 21498 16410 57706 172270
11842A72270J66115O1333j89242l89380m04024l49143k96912j58578J5825J04710
$$ 172270 338385 399718 210476 -178904 -582928 -932071 -1228983 -1387561 -1371736 -1267026
11832a267026J71425K85885L06437J67707J5312n990M2690N3616J7310J7335Q3959
$$ -1267026 -1095601 -809716 -503279 -335572 -320260 -326250 -283560 -229944 -212634 -195299 -111340
11821a11340J77155K12043J49119P3837j9902j56372k37161k04762q6543n785
$$ -111340 65815 277858 426977 500814 480912 324540 87379 -117383 -203926 -209711
11811b09711n1345r3960m2446K6310K7373l3348n0752p603q362k5269N418M6516
$$ -209711 -261056 -355016 -397462 -371152 -343779 -377127 -427879 -435482 -443844 -469113 -463695 -417179
11799d17179N6465K344k2521j5130k9048m0580m3387l2499j7785k3775l1659l2906
$$ -417179 -360714 -358370 -380891 -396021 -425069 -465649 -509036 -541535 -559320 -583095 -614754 -647660
11787f47660L775N8430Q9195J07790J36689J50049J49488J05512J2371K43M5289
$$ -647660 -643885 -585455 -496260 -388470 -251781 -101732 47756 153268 165639 165882 211171
11776B11171O2182N4159M9597N7223O3321L9666m4182j33990j26732o2212l2584
$$ 211171 273353 327512 377109 434332 497653 537319 493137 359147 232415 170203 137619
11765A37619k1195K1389N2046K1952q1347j73109j52400q9212p0225o4882m6121
$$ 137619 116424 137813 189859 211811 130464 -42645 -195045 -284257 -354482 -419364 -465485
11754d65485J1765O5382M0808q335l1817n1852p5646n4307M5865J58069J69995
$$ -465485 -453720 -388338 -347530 -355865 -387682 -439534 -515180 -569487 -523622 -365553 -195558
11743a95558R9450N5098L2104J4767K2003n807k8698k886k8299r4085j05608n7587
$$ -195558 -96108 -41010 -8906 5861 27864 22057 -6641 -9527 -37826 -131911 -237519 -295106
11731b95106j3899L3619J04375J32279Q3660M1645r111j20624k06106j88383j55702
$$ -295106 -309005 -275386 -171011 -38732 44928 86573 77462 -43162 -249268 -437651 -593353
11720e93353j57972j38147n5335K7179Q543p8407p1181O6208J84429J93811J15316
$$ -593353 -751325 -889472 -944807 -917628 -909085 -987492 -1058673 -992465 -808036 -614225 -498909
11709d98909K4626m3228p8898q4975q1256o9551j9827N0778Q8037P5089l484o9687
$$ -498909 -474283 -517511 -596409 -681384 -762640 -832191 -852018 -801240 -713203 -638114 -641598 -711285
11697g11285n2779l6447p4757j03989j01071n4256K5797J02265J24692J02758
$$ -711285 -764064 -800511 -875268 -979257 -1080328 -1134584 -1108787 -1006522 -881830 -779072
11687g79072J03907J36089J26245K5182j06794k01692k55321j62614J34691L33332
$$ -779072 -675165 -539076 -412831 -387649 -494443 -696135 -951456 -1114070 -979379 -646047
11677f46047K72670J32674R1114J64836J96270J29758M1039K733N898j1749n4598
$$ -646047 -373377 -240703 -149589 15247 211517 341275 382314 385047 390945 379196 324598
11666C24598n9873m1014o7212j24733p4082M5833Q0969P4549O7875K9956m0184
$$ 324598 264725 223711 156499 31766 -42316 3517 84486 159035 226910 256866 216682
11655B16682j11739j63479j71354p7430Q2215J53195J31715J63073K57219K78463
$$ 216682 104943 -58536 -229890 -307320 -225105 -71910 59805 222878 480097 758560
11645G58560J92315P3772J4666l9053j85689l16501l36917k92976j62828p35Q4588
$$ 758560 950875 1024647 1039313 1000260 814571 498070 161153 -131823 -294651 -295386 -210798
11634b10798J43877J78038J25014M3945k795l3306n7421q1028p3826j3860L2535
$$ -210798 -66921 111117 236131 280076 277281 243975 186554 105526 31700 17840 50375
11623E0375N1800M7905j5154r6420r5412m8933k5103l0678l2942l2635j4870N4770
$$ 50375 102175 150080 134926 38506 -56906 -105839 -130942 -161620 -194562 -227197 -242067 -187297
11611a87297J03315P2973K1191m643p953J6062O1550J28418J64481J11674O2438
$$ -187297 -83982 -11009 10182 5539 -2414 13648 75198 203616 368097 479771 542209
11600E42209N4595L2435j5044q6259j09224o2326j0017j313O917O215q7416j53024
$$ 542209 596804 629239 614195 527936 418712 356386 346369 345056 351973 358188 270772 117748
11588A17748r4666r415L6854N7553M0175k3390j10533j96939k06817j21281k6653
$$ 117748 23082 13667 50521 108074 148249 124859 14326 -182613 -389430 -510711 -537364
11577e37364j0507j02393j65275j02062k6642p317q10M1820J01868J39458J46188
$$ -537364 -547871 -650264 -815539 -917601 -944243 -951560 -952370 -910550 -808682 -669224 -523036
11566e23036J11911N4496M6730J05072J63843J83840J50606O2837L6607Q2983
$$ -523036 -411125 -356629 -309899 -204827 -40984 142856 293462 356299 392906 475889
11556D75889P2623L1322K1665j2995o9274j00327q8527m6234m2675q2206o4209
$$ 475889 548512 579834 601499 588504 519230 418903 330376 284142 241467 159261 95052
11545I5052J3206M9111L3107L2178N9230O7495L6788l47k6719o0615j02593j26958
$$ 95052 108258 157369 190476 222654 281884 349379 386167 385820 359101 298486 195893 68935
11533F8935r0927m1051k1797q299R452L5957J12314K07910K54634J95678L0973
$$ 68935 -21992 -63043 -84840 -93139 -83687 -47730 64584 272494 527128 722806 753779
11522G53779j12434j25722o6105j7243k009k9677p0406o3077m7225k5407J6455
$$ 753779 641345 515623 449518 432275 430266 400589 330183 267106 219881 194474 210929
11511B10929L529l1472j3554M8647N7549m2349j63397k13316j81178r8272l2228
$$ 210929 214458 182986 169432 218079 275628 233279 69882 -143434 -324612 -422884 -455112
11500d55112J3762O2171R4575J09071J10255J22012J36191R4194J5941n7186j12010
$$ -455112 -441350 -379179 -284604 -175533 -65278 56734 192925 287119 303060 245874 133864
11489A33864j14193j17628j11731n0247L5666O1211J6377m4687o4588j6641k1137
$$ 133864 19671 -97957 -209688 -259935 -224269 -163058 -146681 -191368 -255956 -272597 -293734
11478b93734q1636j08372p8302j7100K6155J5308l0306l8401l9386o2477p2420
$$ -293734 -375370 -483742 -562044 -579144 -552989 -537681 -567987 -606388 -645774 -708251 -780671
11467g80671m0486N9294J90196K69983K41556J47029Q8311R6605Q9850K6694q6106
$$ -780671 -821157 -761863 -571667 -301684 -60128 86901 175212 271817 361667 388361 302255
11456C02255j59076j04528J8781J27858J61272Q4260l7273p5292K2939Q5785O237
$$ 302255 143179 38651 57432 185290 346562 430822 393549 318257 341196 426981 433218
11445D33218r3516j26283j19010j05889r9872o7847j1338J3692K0996M8495M9503
$$ 433218 339702 213419 94409 -11480 -111352 -179199 -190537 -176845 -155849 -107354 -57851
11434e7851k5433j05293j22113r1843o2231n4555o2741m729J24199K16418J86334
$$ -57851 -83284 -188577 -310690 -402533 -464764 -519319 -582060 -586789 -462590 -246172 -59838
11423e9838Q7217N3221Q6897J01947O9895M2268p503j28804k66901k87168j99698
$$ -59838 27379 80600 167497 269444 339339 381607 374104 245300 -21601 -308769 -508467
11412e08467q1011k6518p7949o3211O2497J98999K68457K54447K00191J64470
$$ -508467 -589478 -615996 -693945 -757156 -694659 -495660 -227203 27244 227435 391905
11402C91905J14809O852o7639p2640o7842q0413r2435o1335K650O3018O6315O555
$$ 391905 506714 513566 445927 373287 305445 225032 132597 71262 73912 136930 203245 209800
11390B09800o7172j42057j42269o0462K2027P3821J12376J42838J28581J01790
$$ 209800 142628 571 -141698 -202160 -180133 -106312 6064 148902 277483 379273
11380C79273J00441J25428R1701k3205j10023j37138j25472r7651j07274j37938
$$ 379273 479714 605142 696843 673638 563615 426477 301005 203354 96080 -41858
11370d1858j44203j63202k02834j51140J3124J35223J25014Q6377Q4762J08205
$$ -41858 -186061 -349263 -552097 -703237 -690113 -554890 -429876 -343499 -258737 -150532
11360a50532J18633Q5027K9546n5044j07328r1633n6761m23O0635J07735J17569
$$ -150532 -31899 53128 82674 27630 -79698 -171331 -228092 -228515 -167880 -60145 57424
11349E7424P5231K195n1223k5676Q1082J47514J19226Q6428M9914k6014q9511
$$ 57424 132655 134850 83627 57951 139033 286547 405773 492201 542115 516101 426590
11338D26590j13327j15981j03890p0851l1600j7259q22M5580O2475J0959m4553
$$ 426590 313263 197282 93392 22541 -9059 -26318 -27140 18440 80915 91874 47321
11327D7321k9870J0006L684j3050K288N2413Q8753O5931q185o0499k6547P7393
$$ 47321 17451 27457 31141 18091 20379 72792 161545 227476 219291 158792 132245 209638
11315B09638J84063J88066R5372J243p7581j01363p4956m6569l2646m0926o6338
$$ 209638 393701 581767 677139 678382 600801 499438 424482 377913 345267 304341 238003
11304B38003o1212n6305r4292j49521j93493j85075j00615L4713K03244K99579
$$ 238003 176791 120486 26194 -123327 -316820 -501895 -602510 -567797 -364553 -64974
11294f4974K24842Q7793M1251N1099K8934j6865n5308m1022L4521J00474J03327
$$ -64974 159868 247661 288912 340011 368945 352080 296772 255750 290271 390745 494072
11283D94072J3032j37420j89822j42226j25002j62064j99163j76186o3275N1518
$$ 494072 507104 369684 179862 37636 -87366 -249430 -448593 -624779 -688054 -636536
11273f36536R4049R4002N8186O6600J24751J52671J63627J27082R903o6737l9495
$$ -636536 -542487 -448485 -390299 -323699 -198948 -46277 117350 244432 254335 187598 148103
11262A48103K8696R5982O5299p7410j65237r0085L0911Q7523P8479k2857j41335
$$ 148103 176799 272781 338080 260670 95433 5348 36259 123782 202261 179404 38069
11251C8069j97810k27611k21893j51632n7895k0314n4003m5330L0846P6590L4774
$$ 38069 -159741 -387352 -609245 -760877 -818772 -839086 -893089 -938419 -907573 -830983 -796209
11240g96209k5966k7079K3524M9866M1551P7448J09140P0393K0738o360K798K8345
$$ -796209 -822175 -849254 -825730 -775864 -734313 -656865 -547725 -477332 -456594 -462954 -460156 -431811
11228d31811J7692k9929l8206K8873R9715O7272n5596j22590o7878M836J8317
$$ -431811 -414119 -444048 -482254 -453381 -353666 -286394 -341990 -464580 -532458 -527622 -509305
11217e09305j1250n0533r0035j29075j17397k394J90214K99108K41849J09740
$$ -509305 -520555 -571088 -661123 -790198 -907595 -909989 -719775 -420667 -178818 -69078
11207f9078K2658j7O600L0522M5936O2153R2481O9299j8902n9692n3925p9905
$$ -69078 -46420 -46437 -39837 -9315 36621 98774 191255 260554 241652 181960 128035 48130
11195D8130j09958q9886j1706P9006J17375J09116R2609N0966k3601o8718j8339
$$ 48130 -61828 -151714 -163420 -84414 32961 142077 234686 285652 262051 193333 174994
11184A74994J03067K44396L09025K18803L1908j30010k07713k46839k09783q7493
$$ 174994 278061 522457 831482 1050285 1082193 952183 744470 497631 287848 200355
11174B00355j6498l9197p0374r5598r6181m9041L660J9461L0392P5562J23852
$$ 200355 183857 144660 74286 -21312 -117493 -166534 -162874 -143413 -113021 -37459 86393
11163H6393J12510O0144P3383J11293O1382j4973l5737n582L1115q982q6017q3975
$$ 86393 198903 259047 332430 443723 505105 490132 454395 448813 479928 470946 384929 300954
11151C00954k7069K7834Q3049Q3749L875p6479j22101j78205j80034p0868N8805
$$ 300954 273885 301719 384768 468517 472392 395913 273812 95607 -84427 -155295 -96490
11140i6490J27882J00384j3352o3341j0123N2323J15661J59223J24791L8208n6883
$$ -96490 31392 131776 118424 55083 44960 97283 212944 372167 496958 535166 478283
11129D78283j17408j03932m9247Q528M7798Q4213J11447J11176M7699o9978j08365
$$ 478283 360875 256943 207696 216224 264022 348235 459682 570858 618557 548579 440214
11118D40214r0707q3753q7504o6925l6705l4236l8351n9446j16638j45043n9586
$$ 440214 349507 265754 178250 111325 74620 40384 2033 -57413 -174051 -319094 -378680
11107c78680Q1444J57822J52761J11940J9932j12929j66749q8324N0362J36914
$$ -378680 -297236 -139414 13347 125287 145219 32290 -134459 -222783 -172421 -35507
11097c5507J04028M4759M4226N1362J5296m6706m9143M678j510l0424r155r915
$$ -35507 68521 113280 157506 208868 224164 177458 128315 132993 131483 101059 91904 81989
11085H1989p7918j40289j35767j09475q0409j6133O2964P5822r128j47964k34397
$$ 81989 4071 -136218 -271985 -381460 -461869 -478002 -415038 -339216 -348344 -496308 -730705
11074g30705k16653j74357j57509j46490m3581J38264K32109J83546J18943J42775
$$ -730705 -947358 -1121715 -1279224 -1425714 -1469295 -1331031 -1098922 -915376 -796433 -653658
11064f53658J94363J83583J10928L6295j84L8045J10097J35120K0511j85124k95991
$$ -653658 -459295 -275712 -164784 -128489 -128673 -90628 19469 154589 175100 -10024 -306015
11053c06015k28158o2273J11720K24338K03319J03593M3910j0957m6404p535L2100
$$ -306015 -534173 -596446 -484726 -260388 -57069 46524 90434 79477 33073 25538 57638
11042E7638p789o5875p2983l3204N6310J25034J02412N0380J8310k8515p4114
$$ 57638 49849 -16026 -89009 -122213 -65903 59131 161543 211923 230233 201718 127604
11031A27604m3677K6709O7930R1170R2564L5513m3657j9755R5687J62194R0331
$$ 127604 83927 110636 178566 269736 362300 397813 354156 334401 430088 592282 682613
11020F82613q3829k34145k34968j10966j1111J4032p708l6275m2329l1011l197
$$ 682613 598784 364639 129671 18705 7594 21626 13918 -22357 -64686 -95697 -98894
11009i8894K5235J0840k1441m1857o4919n5237J2905Q8752J18341J06140N9146
$$ -98894 -73659 -62819 -84260 -126117 -191036 -246273 -233368 -144616 -26275 79865 139011
10998A39011M2069M5244j3677p9671j32065j17290p8547r3424o6296l2496o7974
$$ 139011 181080 226324 212647 132976 911 -116379 -194926 -288350 -354646 -387142 -455116
10987d55116r3610n8725J8209O4862J0675o7543q0126l4275J5145K5267N2328
$$ -455116 -548726 -607451 -589242 -524380 -513705 -581248 -661374 -695649 -680504 -655237 -602909
10976f02909J50367J81125J46424J28139J11837J36761J63118J26479P3004M0789
$$ -602909 -452542 -271417 -124993 3146 114983 251744 414862 541341 614345 655134
10966F55134K2755K8136l371j09336j92518j74146r0241l5471l8348l6440l0986
$$ 655134 677889 706025 702654 593318 400800 226654 136413 100942 62594 26154 -4832
10955d832n7564p8134p3441l1086k2272p1034n8195L3710O5824J9317k84O1297
$$ -4832 -62396 -140530 -213971 -245057 -267329 -338363 -396558 -362848 -297024 -277707 -277991 -216694
10943b16694J10419J00086N7360J5869K1989P7249J20314J31686J59668J78038
$$ -216694 -106275 -6189 51171 67040 89029 166278 286592 418278 577946 755984
10933G55984R6372l7697j13606j05478j04059j44782j69744j60783j34091q3681
$$ 755984 852356 814659 701053 595575 491516 346734 176990 16207 -117884 -201565
10923b01565k3509J5368Q453o0277j10198q5431L2318J71188K07431J65244J55061
$$ -201565 -225074 -209706 -201253 -261530 -371728 -457159 -424841 -253653 -46222 119022 274083
10912B74083J15847P586p4384q9307m7841n3571j07594r9637l4364K3720P8949
$$ 274083 389930 397516 323132 233825 185984 132413 24819 -74818 -109182 -85462 -6513
10901f513J62759K06310J19192k1601r2428q4626l1932L7164O8510L4778k9670
$$ -6513 156246 362556 481748 460147 367719 283093 251161 288325 356835 391613 361943
10890C61943q3053n3562K6447N1563J7794p367J8260N3847Q2300Q9730J8459r8794
$$ 361943 278890 225328 251775 303338 321132 313765 332025 385872 468172 557902 576361 477567
10878D77567j34097r8881r7563o0028O9547J80549J77117L0948j36371k25228
$$ 477567 343470 244589 147026 86998 156545 337094 514211 545159 408788 183560
10868A83560k29250j76550p3532N9404J52393J91927J60715P0534m903j3292j3569
$$ 183560 -45690 -222240 -295772 -236368 -83975 107952 268667 339201 334298 321006 307437
10857C07437o3005j30942j63574j41917p1430k5681n7953j33139k02423k26176
$$ 307437 244432 113490 -50084 -192001 -263431 -289112 -347065 -480204 -682627 -908803
10847i08803j22367L2781Q8872R0591R6159J10103J47957K13114K34650K24811
$$ -908803 -1031170 -998389 -909517 -818926 -722767 -612664 -464707 -251593 -16943 207868
10837B07868K21980J62301P0355k4449r6286n5110O1908J51240J57092R4242K9714
$$ 207868 429848 592149 662504 638055 541769 486659 548567 699807 856899 951141 980855
10826I80855p144n3725q0787k6781M8584R7140J02899P3162O1046J09370J69155
$$ 980855 973711 919986 839199 812418 861002 958142 1061041 1134203 1195249 1304619 1473774
10815A473774J90667J20096l1462j28804j17020q7264j14452j23539p8100k9459
$$ 1473774 1664441 1784537 1753075 1624271 1507251 1419987 1305535 1181996 1103896 1074437
10805A074437K8840J11244J23206K3365j10254j71417q6517P7992J93251J73625
$$ 1074437 1103277 1214521 1337727 1361092 1250838 1079421 992904 1070896 1264147 1437772
10795A437772O7023M210L3799J18300J79354J93483J92135K13166J84144Q4929
$$ 1437772 1504795 1509005 1542804 1661104 1840458 2033941 2226076 2439242 2623386 2708315
10785B708315M4657J13295J66676J67772K11360L12339M42829O40530Q87978J118370
$$ 2708315 2752972 2866267 3032943 3200715 3412075 3724414 4167243 4807773 5695751 6814121
10775F814121J307650J466556J668584K101747K904619L971289N225048O742748
$$ 6814121 8121771 9588327 11256911 13358658 16263277 20234566 25459614 32202362
10767C2202362Q492605J0354426J2099951J2825596J0815703M754061l716617
$$ 32202362 40694967 51049393 63149344 75974940 86790643 91544704 87828087
10760H7828087j0355177j2822295j2106428j0080712p949136o194793m880116
$$ 87828087 77472910 64650615 52544187 42463475 34514339 28319546 23439430
10753B3439430l829233k985383k415271k055326j741158j405453j073514p97363
$$ 23439430 19610197 16624814 14209543 12154217 10413059 9007606 7934092 7136729
10745G136729o01646m69325m04744l54660k77151k63001l36860m25649m26875
$$ 7136729 6535083 6065758 5661014 5306354 5029203 4766202 4429342 4003693 3576818
10736C576818l71743l62886l77392l11672j91370j16261n5040K4419K5469m8617
$$ 3576818 3205075 2842189 2464797 2153125 1961755 1845494 1790454 1814873 1840342 1791725
10726A791725j11257j26368q0787J0659Q5836Q0600J8710j6197l5073o7170j15795
$$ 1791725 1680468 1554100 1473313 1483972 1569808 1650408 1669118 1652921 1617848 1550678 1434883
10715A434883j53859j45181j00405k6307K6976K7693l6249j03693j24101j03565
$$ 1434883 1281024 1135843 1035438 1009131 1036107 1063800 1027551 923858 799757 696192
10705F96192n5846L4411J70269K14309J21587K5549o2714k11261l08317k70548
$$ 696192 640346 674757 845026 1059335 1180922 1206471 1143757 932496 624179 353631
10695C53631j69527n0913N5602Q7163O2941K2911j9377p68N0632O8518M7556N1592
$$ 353631 184104 133191 188793 275956 338897 361808 342431 341663 392295 460813 508369 559961
10683E59961P5690P8356M3302p7113k00933j42966J2135R6238J04572Q6279L3621
$$ 559961 635651 714007 757309 680196 479263 336297 348432 444670 549242 635521 669142
10672F69142q2326j71917j55614q0311l0792m2066j17276j72422j31478k9939
$$ 669142 586816 414899 259285 178974 148182 106116 -11160 -183582 -315060 -344999
10662c44999N1041R8081J38311J38620R6418R2495J32923J18908R46j39490j92796
$$ -344999 -293958 -195877 -57566 81054 177472 269967 402890 521798 522744 383254 190458
10651A90458k10270k34806j93025q1522K247J9787K5323L4659R637n692K6724
$$ 190458 -19812 -254618 -447643 -529165 -526918 -507131 -481808 -447149 -437512 -443204 -416480
10640d16480J9034j52M3065Q2615P5976J1031q529O5453J33210J35648J08740
$$ -416480 -397446 -397598 -354533 -271918 -195942 -184911 -193440 -127987 5223 140871 249611
10629B49611Q3715L1962q3293j59940o7182J19422K11066J84016P9356k5405j4883
$$ 249611 333326 365288 281995 122055 54873 174295 385361 569377 648733 623328 608445
10618F08445P0398R8317N1542J248k8269l1259k7735M372Q8173J67030J57765
$$ 608445 678843 777160 828702 829950 801681 770422 742687 747059 835232 1002262 1160027
10607A160027R0112L1737J4465k0709r5789j84422k41596k16482j42551n4272
$$ 1160027 1250139 1281876 1296341 1275632 1179843 995421 753825 537343 394792 340520
10597C40520M5515R4364R2233Q5989O5562P3577P5375L6217K5781P510r7501j74692
$$ 340520 386035 480399 572632 658621 724183 797760 873135 909352 935133 942643 845142 670450
10585F70450j49408j41215j64793j11578l6388o0296j11326m8435P6038J32102
$$ 670450 521042 379827 215034 103456 67068 6772 -104554 -152989 -76951 55151
10575E5151J04056M4587n0112j60025j76683j19224r1344o6552L048L9236L0079
$$ 55151 159207 203794 153682 -6343 -183026 -302250 -393594 -460146 -457098 -417862 -387783
10564c87783K8014N8044J22336J65200J28579P4716O3224P7607P5844K904j12469
$$ -387783 -359769 -301725 -179389 -14189 114390 189106 252330 329937 405781 408685 296216
10553B96216j56119j10437l0099O0457J21365R7808N217o7186m4597j1090m4003
$$ 296216 140097 29660 -439 60018 181383 279191 284408 217222 172625 161535 117532
10542A17532j12193j30057p7015k7975J1980Q8451J52592J63967J25200O0601
$$ 117532 5339 -124718 -201733 -229708 -217728 -129277 23315 187282 312482 373083
10532C73083K3770K9777M3329J3716n8502r7066r1621m5166O3873J80241K58514
$$ 373083 396853 426630 469959 483675 425173 328107 236486 191320 255193 435434 693948
10521F93948K50938J37123J8122n7652j06254j18547r9226q7991j26062j57046
$$ 693948 944886 1082009 1100131 1042479 936225 817678 718452 630461 504399 347353
10511C47353j21373j3490J23721J67336P2103o1308j05747m4122L7644J01028
$$ 347353 225980 212490 336211 503547 575650 514342 408595 364473 402117 503145
10501E03145J32599J32517Q7684L0328j0114o9903j63143j81881q4536K4927Q3655
$$ 503145 635744 768261 855945 886273 876159 806256 643113 461232 376696 401623 485278
10490D85278P1027K2785K8634L3677k5194q9283q2558L792O5221O9531N9747J0777
$$ 485278 556305 579090 607724 641401 616207 526924 444366 448158 513379 582910 642657 653434
10478F53434l2308l3570o6394j43873k09875j71068m5809R0673J63367J30770
$$ 653434 621126 587556 521162 377289 167414 -3654 -49463 41210 204577 335347
10468C35347P7543O9551N1846j5870p1089j01506j50176j71454j12366q4164r4809
$$ 335347 412890 482441 534287 518417 447328 345822 195646 24192 -88174 -172338 -267147
10457b67147q3592m7713K6559P8468N3997q238n1805o0972r0380r6591j2114Q9022
$$ -267147 -350739 -398452 -371893 -293425 -239428 -247666 -299471 -360443 -450823 -547414 -559528 -470506
10445d70506R8702K4148j5507L1582J00635J05038J4256r0226j68162k10617j65828
$$ -470506 -371804 -347656 -363163 -331581 -230946 -125908 -111652 -201878 -370040 -580657 -746485
10434g46485r6216n6707K034Q6467J31183J57785K03069K06478J13583J3998L6
$$ -746485 -842701 -899408 -897374 -810907 -679724 -521939 -318870 -112392 1191 15189 15225
10423A5225K4690K0043k7255p1879m3115R237M2005N2889M0025K5257N6829O9474
$$ 15225 39915 59958 32703 -39176 -82291 -73054 -31049 21840 61865 87122 143951 213425
10411B13425J6378o0926o2025L7322J18695J58451J71935J32876Q4419M6641j2485
$$ 213425 229803 168877 106852 144174 262869 421320 593255 726131 810550 857191 844706
10400H44706k4576M0785J35190J73676J64671J56357J44219O5306p6969k12244
$$ 844706 820130 860915 996105 1169781 1334452 1490809 1635028 1700334 1623365 1411121
10390A411121l18290l66107l37301k40368j39719j20485j62839j54174n9073P8937
$$ 1411121 1092831 726724 389423 149055 9336 -111149 -273988 -428162 -487235 -408298
10380d08298J82619J84734J12244M3940J0886L5513k727j59136k59084k19184
$$ -408298 -225679 -40945 71299 115239 126125 161638 158911 -225 -259309 -478493
10370d78493o7880J05299K05243J85771J31755J09615J08694J02477N7492K4333
$$ -478493 -546373 -441074 -235831 -50060 81695 191310 300004 402481 459973 484306
10360D84306M0882R1533J43095J09928l7125j77003j90889j11232j8211M5398
$$ 484306 525188 616721 759816 869744 832619 655616 464727 353495 335284 380682
10350C80682J9622q8075j73134j99160j67913q2831j5036r016l2742n4227k5379
$$ 380682 400304 312229 139095 -60065 -227978 -310809 -325845 -334861 -367603 -421830 -447209
10339d47209N1107J16032J58075J69416J04152K8640N5193J06737K7688j18061
$$ -447209 -396102 -280070 -121995 47421 151573 180213 235406 342143 369831 251770
10329B51770j83088j42582n3966n515q728j9355l3073l8176n357P3358J25186
$$ 251770 68682 -73900 -127866 -133381 -142109 -161464 -194537 -232713 -238070 -164712 -39526
10318c9526J18383J17993J27988J16659M2233p1145j35536j34660j17206j33343
$$ -39526 78857 196850 324838 441497 483730 412585 277049 142389 25183 -108160
10308a08160j24643o6983L6910J47224J74339P5286j09439k70216k98749j78827
$$ -108160 -232803 -299786 -262876 -115652 58687 133973 24534 -245682 -544431 -723258
10298g23258j5674R5010J39547J43114O3809q6001j57494r8263j4318L5932M3998
$$ -723258 -738932 -643922 -504375 -361261 -297452 -383453 -540947 -639210 -653528 -617596 -573598
10287e73598M5256R5997J41839J20686O7306K1262j0002R798Q9847J33128R7003
$$ -573598 -528342 -432345 -290506 -169820 -102514 -81252 -91254 -81456 8391 141519 238522
10276B38522O3401O1593N5425M8810N9120Q3118R7704P9919K2956k5591l5154
$$ 238522 301923 363516 418941 467751 526871 609989 707693 787612 810568 784977 749823
10265G49823o1395j04145r5066n3416j7414k3906m1647j7070J0328O0266J27060
$$ 749823 688428 584283 489217 435801 418387 394481 352834 335764 346092 406358 533418
10254E33418J52339J48444J26986Q0978P002m722J07355K20130K22968J38637
$$ 533418 685757 834201 961187 1042165 1049167 1044445 1151800 1371930 1594898 1733535
10244A733535O1778K8183L8929L6828l0231j57916k68233k24373j22086j24321
$$ 1733535 1795313 1823496 1862425 1899253 1869022 1711106 1442873 1218500 1096414 972093
10234I72093j73119j70879j28839r4850j12233j48412j09491n8599p1389n3319
$$ 972093 798974 628095 499256 404406 292173 143761 34270 -24329 -95718 -149037
10224a49037j629K9751Q2492J28946R1207J5356j1224k0368l3473r210J9015L6596
$$ -149037 -150666 -120915 -38423 90523 181730 197086 185862 165494 132021 122811 141826 178422
10212A78422J7284j7490p295K682l0768l9054L4051J12438J45309J37178O9457
$$ 178422 195706 178216 170921 173603 142835 103781 137832 250270 395579 532757 602214
10201F02214o0721j48587j11460n5437p4986j24173j59417j31535q343J62273
$$ 602214 541493 392906 281446 226009 151023 26850 -132567 -264102 -272445 -110172
10191a10172K70324K75716K34389J31814l6678j94271k68142k14967p8671N5333
$$ -110172 160152 435868 670257 802071 765393 571122 302980 88013 9342 64675
10181F4675J16826R8903N9965j455p7735j19314j24028r9011o8254p8354j13495
$$ 64675 181501 280404 340369 338914 261179 141865 17837 -81174 -149428 -227782 -341277
10170c41277j32845j08792k9122N2005Q1306R2651J27282J37260O3609r792L4281
$$ -341277 -474122 -582914 -612036 -560031 -478725 -386074 -258792 -121532 -57923 -67715 -33434
10159c3434J05351Q1302J4769j4655m549K5139K6400q812j7085j860Q700k4373
$$ -33434 71917 153219 167988 153333 148784 173923 200323 191511 174426 172566 181266 156893
10147A56893j33013k81041l54153k48811j7443J88127K52113J97467J01930J1464
$$ 156893 23880 -257161 -611314 -860125 -877568 -689441 -437328 -239861 -137931 -126467
10137a26467l2507m2220Q390J19701J68918J35138J04388O5847j0643r1568j03694
$$ -126467 -158974 -201194 -192804 -73103 95815 230953 335341 401188 390545 298977 195283
10126A95283l3124M5019Q5836R1437O2026P0443J62161K40579J63122k0917j15663
$$ 195283 162159 207178 293014 384451 446477 516920 679081 919660 1082782 1061865 946202
10115I46202q3534J5086J07708J32614R0402L5935j8405p7548j15584j45517j82589
$$ 946202 862668 877754 985462 1118076 1208478 1244413 1226008 1148460 1032876 887359 704770
10104G04770k20687j90503j07929q9049q0726M104J20334J71119J14692j4867
$$ 704770 484083 293580 185651 96602 15876 19980 140314 311433 426125 411258
10094D11258j32817j26871j0432J07164J58624J03670l0104j53863j90657j41457
$$ 411258 278441 151570 141138 248302 406926 510596 480492 326629 135972 -5485
10084e485o4714n2690j04855j13988m5088l332m1979n7647k8152k8338m4732o8290
$$ -5485 -70199 -122889 -227744 -341732 -386820 -390152 -432131 -489778 -517930 -546268 -591000 -659290
10072f59290p5842k2684M5759P6837J11871J63836K07447K29143J94379J55294
$$ -659290 -735132 -757816 -712057 -635220 -523349 -359513 -152066 77077 271456 426750
10062D26750J38009J03443L1188m0672p9323q2003p8526j11049j33471o7761L083
$$ 426750 564759 668202 699390 658718 579395 497392 418866 307817 174346 106585 109668
10051A09668l1938n3947K7425Q7234M2427m3599j07914j02495O074R0133N2066
$$ 109668 77730 23783 51208 138442 180869 137270 29356 -73139 -67065 23068 75134
10040G5134j6256m9371j6725L2447M5016M7273P229m6368m0722m8878j32742j72495
$$ 75134 58878 9507 -7218 25229 70245 117518 124747 78379 37657 -11221 -143963 -316458
10028c16458j72574j63019r6932J1048J07434J14076R8253J42104J38111N6454
$$ -316458 -489032 -652051 -748983 -737935 -630501 -516425 -418172 -276068 -137957 -81503
10018h1503L3354M7476M775p1101j23374j21159o3506r347M2585J05800J23829
$$ -81503 -48149 -673 4102 -66999 -190373 -311532 -375038 -384385 -341800 -236000 -112171
10007a12171N8612n8405q2800j212M9846L5092Q772L2501L5259o1680j43212q1152
$$ -112171 -53559 -111964 -194764 -195976 -146130 -111038 -102266 -69765 -34506 -96186 -239398 -320550
9995c20550O2114J33832J18527Q2524O3435M0744l7087j36900j61970r4200J2456
$$ -320550 -258436 -124604 -6077 76447 139882 180626 143539 6639 -155331 -249531 -237075
9984b37075O2467N6231P4895R2328Q0156Q3397Q4363M8562l8135j25243j09738
$$ -237075 -174608 -118377 -43482 48846 129002 212399 296762 345324 307189 181946 72208
9973G2208m5252N09J0670n0198j29346j14065O995J25104J57036P9704l1151q3696
$$ 72208 26956 27465 38135 -12063 -141409 -255474 -248479 -123375 33661 113365 82214 -1482
9961a482o5057K86O3346R7068O5980o6985j96313j34862P8994K11401J81170R1264
$$ -1482 -66539 -66253 -2907 94161 160141 93156 -103157 -238019 -159025 52376 233546 324810
9949C24810N2377M5399L4023M6236M6522J8645k2389n8006m4766k8495l0929K4784
$$ 324810 377187 422586 456609 502845 549367 568012 545623 487617 442851 414356 383427 408211
9937D08211R3536Q5007J1915n5602n6649k6405j6843o4911j43677j73755j06951
$$ 408211 501747 586754 598669 543067 486418 460013 443170 378259 234582 60827 -46124
9926d6124L4689J11440R3677L8713k0179j115P2814R8468J05592J34203J15698
$$ -46124 -11435 100005 193682 232395 212216 211101 283915 382383 487975 622178 737876
9915G37876K8782p3117j50540j76906j10743M70O7455Q2223R2312J16191J36475
$$ 737876 766658 693541 543001 366095 255352 255822 323277 405500 497812 614003 750478
9904G50478J00151n2669k25519k98201k04438n815J11439R3550N8219O9776M0380
$$ 750478 850629 797960 572441 274240 69802 63987 175426 268976 327195 396971 437351
9893D37351o6634j31289o9620Q755L69l5692j944N7122R5430J29413J02212M356
$$ 437351 370717 239428 169808 178563 178932 143240 141296 198418 293848 423261 525473 529829
9881E29829k5147L9396J11937J52416J37348Q9241K7038l6783q5299j14948r3702
$$ 529829 504682 544078 656015 808431 945779 1035020 1062058 1025275 939976 825028 731326
9870G31326m5475k6364l1913n3418q7925j24253j64545j98910j76097q6591J3381
$$ 731326 685851 659487 627574 574156 486231 361978 197433 -1477 -177574 -264165 -250784
9859b50784N9742R1100J53973K73299L83641L88097K95097J36678K7608J576k5197
$$ -250784 -191042 -99942 54031 327330 710971 1099068 1394165 1530843 1558451 1560027 1534830
9848A534830p3803r6285q3931m1015K4564N6192P4574J45079K25804K78536L33086
$$ 1534830 1461027 1364742 1280811 1239796 1264360 1320552 1395126 1540205 1766009 2044545 2377631
9837B377631L91420M30694M34610M65443O12258Q14474R54604J067525J234405
$$ 2377631 2769051 3199745 3634355 4099798 4712056 5526530 6481134 7548659 8783064
9828H783064J435668J667482J992804K482057L171757L984964M865748N879782
$$ 8783064 10218732 11886214 13879018 16361075 19532832 23517796 28383544 34263326
9820C4263326P016008Q079920Q675203Q140868N904332K119552k242133n911784
$$ 34263326 41279334 49359254 58034457 66175325 72079657 74199209 71957076 66045292
9812F6045292p956532q371258p747595o676309n588871m625411l800386l147959
$$ 66045292 58088760 49717502 41969907 35293598 29704727 25079316 21278930 18130971
$$ [...]
##END NTUPLES=NMR SPECTRUM
##END=
