##TITLE=C13_LR-796-C1-K2
 CDCl3, 22200sc

 20.1.2025
##JCAMPDX= 6.0         $$ Bruker NMR JCAMP-DX V2.0
##DATA TYPE= NMR SPECTRUM
##DATA CLASS= NTUPLES
##ORIGIN= UXNMR, Bruker Analytische Messtechnik GmbH
##OWNER= root
$$ XWIN-NMR		Version 3.5
$$ Tue Jan 21 13:39:54 2025 Russian Standard Time (UT+4h)  she@DPX200
##.OBSERVE FREQUENCY= 50.327896
##.OBSERVE NUCLEUS= ^13C
##.ACQUISITION MODE= SIMULTANEOUS
##.ACQUISITION SCHEME= undefined
##.AVERAGES= 22201
##.DIGITISER RES= 17
##SPECTROMETER/DATA SYSTEM= spect
##.PULSE SEQUENCE= zgpg30
##.SOLVENT NAME= CDCl3
##.SHIFT REFERENCE= (INTERNAL, CDCl3, 0, 222.646)
##AUDIT TRAIL= $$ (NUMBER, WHEN, WHO, WHERE, WHAT)
$$ ##TITLE= Audit trail, XWIN-NMR		Version 3.5
$$ ##JCAMPDX= 5.01
$$ ##ORIGIN= Bruker BioSpin GmbH
$$ ##OWNER= she
$$ F:/spectra/data/she/nmr/c13/1/pdata/1/auditp.txt
$$ ##AUDIT TRAIL=  $$ (NUMBER, WHEN, WHO, WHERE, WHAT)
(   1,<2025-01-21 13:38:23.12 +0400>,<she>,<DPX200>,
      <created by zg, POWCHK disabled, PULCHK disabled
       terminated by command 'halt'
       configuration hash MD5:
       00 E9 B6 7A A2 85 ED C7 34 08 36 98 17 FE 4E 26
       data hash MD5: 32K
       56 43 B1 48 21 B0 12 18 71 06 0F 73 C0 57 EF 4F>)
(   2,<2025-01-21 13:38:24.90 +0400>,<she>,<DPX200>,
      <Start of raw data processing
       efp BC_mod = 2 LB = 2 FT_mod = 6 PKNL = 1 PHC0 = -400.0432 PHC1 = 21.88833 SI = 32K 
       data hash MD5: 32K
       EF 8B A2 28 A4 59 4F 54 78 84 2E E7 FD 14 40 30>)
(   3,<2025-01-21 13:38:39.59 +0400>,<she>,<DPX200>,
      <abs ABSG = 5 
       data hash MD5: 32K
       13 8E A5 DA 9B 86 47 33 F7 F5 91 9B DE E7 07 C1>)
(   4,<2025-01-21 13:38:57.14 +0400>,<she>,<DPX200>,
      <pk PHC0 = -2.966239 PHC1 = 3.2 
       data hash MD5: 32K
       A2 0F 84 34 A7 9E 23 28 0E C7 A0 E2 6C 6D 08 56>)
(   5,<2025-01-21 13:39:00.43 +0400>,<she>,<DPX200>,
      <abs ABSG = 5 
       data hash MD5: 32K
       35 01 66 50 C5 28 61 84 6B C9 A8 C4 6F CB BB 96>)
$$ ##END=
$$ 
$$ hash MD5
$$ 41 0A 79 54 C6 F3 46 11 AD 5C 32 51 17 10 9C C3
##$RELAX= 
##$RELAX= 
##$RELAX= 
##$RELAX= 
##$RELAX= 
##$RELAX= 
##$RELAX= 
##$RELAX= 
$$ Bruker specific parameters
$$ --------------------------
##$DU= <F:/spectra>
##$EXPNO= 1
##$NAME= <c13>
##$PROCNO= 1
##$TYPE= <nmr>
##$USER= <she>
##$AMP= (0..31)
100 100 100 100 100 100 100 100 100 100 100 100 100 100 100 100 100 100 
100 100 100 100 100 100 100 100 100 100 100 100 100 100 
##$AQSEQ= 0
##$AQ_mod= 1
##$AUNM= <au_zg>
##$AUTOPOS= <>
##$BF1= 50.322709
##$BF2= 200.13
##$BF3= 50.322709
##$BF4= 500.13
##$BF5= 500.13
##$BF6= 500.13
##$BF7= 500.13
##$BF8= 500.13
##$BYTORDA= 1
##$CFDGTYP= 0
##$CFRGTYP= 5
##$CHEMSTR= <none>
##$CNST= (0..31)
1 1 145 1 1 1 1 1 1 1 1 1 1 1 1 1 1 1 1 1 1 1 1 1 1 1 1 1 1 1 1 1 
##$CPDPRG= <waltz16>
##$CPDPRG1= <>
##$CPDPRG2= <waltz16>
##$CPDPRG3= <>
##$CPDPRG4= <mlev>
##$CPDPRG5= <mlev>
##$CPDPRG6= <mlev>
##$CPDPRG7= <mlev>
##$CPDPRG8= <mlev>
##$CPDPRGB= <>
##$CPDPRGT= <>
##$D= (0..31)
$$ [...]
##$SUBNAM4= <"">
##$SUBNAM5= <"">
##$SUBNAM6= <"">
##$SUBNAM7= <"">
##$SUBNAM8= <"">
##$SUBNAM9= <"">
##$SW= 239.972175391363
##$SWIBOX= (0..15)
0 1 3 0 0 0 0 0 0 0 0 0 0 0 0 0 
##$SW_h= 12077.2946859903
##$TD= 32768
##$TD0= 1
##$TE= 0
##$TE2= 300
##$TE3= 300
##$TEG= 300
##$TL= (0..7)
120 120 120 120 120 120 120 120 
##$TP= (0..7)
150 150 150 150 150 150 150 150 
##$TP07= 0
##$TPNAME0= <>
##$TPNAME1= <>
##$TPNAME2= <>
##$TPNAME3= <>
##$TPNAME4= <>
##$TPNAME5= <>
##$TPNAME6= <>
##$TPNAME7= <>
##$TPOAL= (0..7)
0.5 0.5 0.5 0.5 0.5 0.5 0.5 0.5 
##$TPOFFS= (0..7)
0 0 0 0 0 0 0 0 
##$TUNHIN= 0
##$TUNHOUT= 0
##$TUNXOUT= 0
##$USERA1= <user>
##$USERA2= <user>
##$USERA3= <user>
##$USERA4= <user>
##$USERA5= <user>
##$V9= 5
##$VALIST= <valist>
##$VCLIST= <CCCCCCCCCCCCCCC>
##$VD= 0
##$VDLIST= <DDDDDDDDDDDDDDD>
##$VPLIST= <PPPPPPPPPPPPPPP>
##$VTLIST= <TTTTTTTTTTTTTTT>
##$WBST= 1024
##$WBSW= 4
##$XGAIN= (0..3)
0 0 0 0 
##$XL= 0
##$YL= 0
##$YMAX_a= 135373541
##$YMIN_a= -42712701
##$ZGOPTNS= <>
##$ZL1= 120
##$ZL2= 120
##$ZL3= 120
##$ZL4= 120
##$ABSF1= 222.646
##$ABSF2= -17.35081
##$ABSG= 5
##$ABSL= 3
##$ALPHA= 0
##$AQORDER= 0
##$ASSFAC= 0
##$ASSFACI= 0
##$ASSFACX= 0
##$ASSWID= 0
##$AUNMP= <proc_1d>
##$AZFE= 0.1
##$AZFW= 0.5
##$BCFW= 0
##$BC_mod= 2
##$BYTORDP= 0
##$COROFFS= 0
##$CY= -3
##$DATMOD= 1
##$DC= 0
##$DFILT= <>
##$DTYPP= 0
##$F1P= 0
##$F2P= 0
##$FCOR= 0.5
##$FTSIZE= 32768
##$FT_mod= 6
##$GAMMA= 0
##$GB= 0
##$INTBC= 1
##$INTSCL= 4.134877e-10
##$ISEN= 128
##$LB= 2
##$LEV0= 0
##$LPBIN= 0
##$MAXI= 10000
##$MC2= 0
##$MEAN= 0
##$ME_mod= 0
##$MI= 0.1934396
##$NCOEF= 0
##$NC_proc= 2
##$NLEV= 6
##$NOISF1= 120.0001
##$NOISF2= 80.00006
##$NSP= 0
##$NTH_PI= 0
##$NZP= 0
##$OFFSET= 222.646
##$PC= 1.4
##$PHC0= -403.0095
##$PHC1= 25.08833
##$PH_mod= 1
##$PKNL= yes
##$PPARMOD= 0
##$PSCAL= 0
##$PSIGN= 0
##$REVERSE= no
##$SF= 50.3227304950709
##$SI= 32768
##$SIGF1= 140
##$SIGF2= 120
##$SINO= 11.81781
##$SIOLD= 32768
##$SREGLST= <13C.CDCl3>
##$SSB= 0
##$STSI= 32768
##$STSR= 0
##$SW_p= 12077.2946859903
##$SYMM= 0
##$S_DEV= 0
##$TDeff= 32768
##$TDoff= 0
##$TI= <>
##$TILT= no
##$TM1= 0
##$TM2= 0
##$TOPLEV= 0
##$USERP1= <user>
##$USERP2= <user>
##$USERP3= <user>
##$USERP4= <user>
##$USERP5= <user>
##$WDW= 1
##$XDIM= 32768
##$YMAX_p= 330305229
##$YMIN_p= -2006833
$$ End of Bruker specific parameters
$$ ---------------------------------
##NTUPLES= NMR SPECTRUM
##VAR_NAME=  FREQUENCY,     SPECTRUM/REAL,   SPECTRUM/IMAG
##SYMBOL=    X,             R,               I
##VAR_TYPE=  INDEPENDENT,   DEPENDENT,       DEPENDENT
##VAR_FORM=  AFFN,          ASDF,            ASDF
##VAR_DIM=   32768,         32768,           32768
##UNITS=     HZ,            ARBITRARY UNITS, ARBITRARY UNITS
##FACTOR=    0.368581032318806, 1,           1
##FIRST=     11204.1544572324, 0,            0
##LAST=      -873.140228757911, 0,           0
##MIN=       -873.140228757911, -2006833,    0
##MAX=       11204.1544572324, 330305229,    0
$$ Real data points
##PAGE= N=1
##DATA TABLE= (X++(R..R)), XYDATA
$$ [...]
$$ plain form
15954 -334453 -443891 -464656 -367202 -172807 20642 141720 255606 426776 576575 619837
15944 619837 612228 642736 747897 872376 858912 642525 364770 171414 95171 79578 87664
15933 87664 155034 275237 405335 518413 604280 591814 436736 225386 53928 -37335
15923 -37335 -69993 -85072 -120908 -201677 -339461 -480959 -532138 -541945 -582595 -632567 -671675
15912 -671675 -691055 -696915 -720938 -769246 -806842 -758681 -595952 -414089 -269643 -96382 111279
15901 111279 267192 323892 286476 212661 163978 137372 98815 60765 46286 42166 41248 -12482
15889 -12482 -185799 -443768 -643647 -716081 -670382 -512847 -307816 -111721 38486 88147
15879 88147 22510 -127828 -310799 -452835 -480953 -381732 -213807 -47230 63374 81228
$$ packed form
15954c34453j09438k0765R7454J94395J93449J21078J13886J71170J49799M3262
15944F19837p609L0508J05161J24479j3464k16387k77755j93356p6243j5593Q086
15933H7664O7370J20203J30098J13078Q5867j2466j55078k11350j71458r1263
15923c7335l2658j5079l5836q0769j37784j41498n1179r807m0650m9972l9108
15912f71675j9380n860k4023m8308l7596M8161J62729J81863J44446J73261K07661
15901A11279J55913N6700l7416p3815m8683k6606l8557l8050j4479m120r18n3730
15889a2482j73317k57969j99879p2434M5699J57535K05031J96095J50207M9661
15879H8147o5637j50338j82971j42036k8118R9221J67925J66577J10604J7854
$$ plain form
15869 81228 24133 -45797 -76961 -79437 -105873 -194280 -285159 -331409 -324894 -242256 -91970 77360
15857 77360 202281 236604 189378 99118 -7177 -60878 -87463 -200789 -392536 -603126 -734211
15846 -734211 -703252 -599443 -526232 -499107 -496609 -495401 -492144 -445491 -339232 -245609 -216934 -298267
15834 -298267 -508969 -753171 -935134 -1059447 -1109408 -1025558 -859385 -728968 -709306 -818294
15824 -818294 -968487 -1054283 -1015429 -841815 -653808 -550085 -476340 -353196 -193116 -85500
15814 -85500 -109076 -221926 -286104 -250465 -174347 -78630 22144 93630 158517 231995 286538
15803 286538 281228 176333 23106 -96733 -159916 -154065 -49748 146770 348601 492157
15793 492157 565849 517082 367237 220170 100422 10797 17020 153123 340252 451206
$$ packed form
15869H1228n7095o9930l1164k476k6436q8407r0879m6250O515Q2638J50286J69330
15857G7360J24921L4323m7226r0260j06295n3701k6585j13326j91747k10590j31085
15846g34211L0959J03809P3211K7125K498J208L257M6653J06259R3623K8675q1333
15834b98267k10702k44202j81963j24313m9961Q3850J66173J30417J9662j08988
15824h18294j50193q5796L8854J73614J88007J03723P3745J23144J60080J07616
15814h5500k3576j12850o4178L5639P6118R5717J00774P1486O4887P3478N4543
15803B86538n310j04895j53227j19839o3183N851J04317J96518K01831J43556
15793D92157P3692m8767j49845j47067j19748q9625O223J36103J87129J10954
$$ plain form
15783 451206 392732 195423 -6335 -117517 -142657 -65406 100565 211753 157456 142
15773 142 -122613 -148344 -115713 -99512 -77910 -25211 -19201 -50812 -23219 86680 164325 98806
15761 98806 -48122 -172488 -246983 -280072 -273844 -238496 -179750 -96384 -128 75221 78977 20614
15749 20614 -87918 -234307 -359985 -428255 -462737 -490807 -517372 -554772 -597756 -572911 -430986
15738 -430986 -218087 -53829 12923 1732 -94506 -283675 -466372 -570507 -647345 -686667
15728 -686667 -610023 -445155 -302261 -259060 -295815 -295356 -284082 -332766 -409345 -468885 -463984 -375985
15716 -375985 -196398 29756 225855 397825 572332 723052 774752 671837 450318 181206
15706 181206 -123819 -419665 -636684 -744063 -738321 -634807 -449039 -228666 -50183 13380
$$ packed form
15783D51206n8474j97309k01758j11182k5140P7251J65971J11188n4297j57314
15773A42j22755k5731L2631J6201K1602N2699O010l1611K7593J09899P7645o5519
15761I8806j46928j24366p4495l3089O228L5348N8746Q3366R6256P5349L756n8363
15749B0614j08532j46389j25678o8270l4482k8070k6565l7400m2984K4845J41925
15738d30986K12899J64258O6752j1191r6238j89169j82697j04135p6838l9322
15728f86667P6644J64868J42894M3201l6755M59J1274m8684p6579n9540M901Q7999
15716c75985J79587K26154J96099J71970J74507J50720N1700j02915k21519k69112
15706A81206l05025k95846k17019j07379N742J03514J85768K20373J78483O3563
$$ plain form
15696 13380 -75782 -331094 -622926 -796028 -836995 -800316 -750522 -653821 -491392 -332491 -265834
15685 -265834 -321567 -442023 -542130 -592387 -594391 -575468 -582000 -627002 -674239 -679116 -640048 -566030
15673 -566030 -473755 -406517 -394070 -410959 -475551 -632482 -852877 -1070714 -1239786 -1388633
15663 -1388633 -1512848 -1551265 -1513182 -1435976 -1321843 -1157688 -929223 -642840 -376856 -177160
15653 -177160 -40516 23860 17663 -37625 -111880 -185411 -222886 -198786 -139255 -60760 18968
15642 18968 71539 59015 -44978 -230641 -439977 -604886 -709517 -737543 -629736 -385586
15632 -385586 -130241 43318 131898 133614 41678 -125752 -300013 -414391 -409707 -271199 -79740
15621 -79740 92044 200258 210109 140451 95780 126589 188471 225075 230166 254254 290046 306441
$$ packed form
15696A3380q9162k55312k91832j73102m0967L6679M9794R6701J62429J58901O6657
15685b65834n5733j20456j00107n0257k004J8923o532m5002m7237m877L9068P4018
15673e66030R2275O7238J2447j6889o4592j56931k20395k17837j69072j48847
15663a388633j24215l8417L8083P7206J14133J64155K28465K86383K65984J99696
15653a77160J36644O4376o197n5288p4255p3531l7475K4100N9531P8495P9728
15642A8968N2571j2524j03993j85663k09336j64909j04631k8026J07807K44150
15632c85586K55345J73559Q8580J716r1936j67430j74261j14378M684J38508J91459
15621g9740J71784J08214R851o9658m4671L0809O1882L6604N091K4088L5792J6395
$$ plain form
15609 306441 302626 296420 310410 308073 236062 162429 147369 121445 79255 102194 172890 221316
15597 221316 268743 351101 406503 346219 192322 112056 181332 265394 286068 290876 304239
15586 304239 278095 213881 204735 312055 515621 722328 796663 694299 472025 217853
15576 217853 21108 -107880 -148960 -74203 18177 2495 -77621 -128935 -165618 -190694 -212921
15565 -212921 -273269 -349132 -446310 -552046 -573879 -436940 -200617 6404 141020 245838
15555 245838 288314 229030 81510 -70054 -114333 -57813 78950 339051 647405 853942
15545 853942 947069 970449 958578 940293 900881 826743 708180 558580 440180 398525 418809
15534 418809 439722 435586 389302 254258 25683 -192083 -284754 -211775 -44891 114561 221665
$$ packed form
15609C06441l815o206J3990k337p2011p3633j5060k5924m2190K2939P0696M8426
15597B21316M7427Q2358N5402o0284j53897q0266O9276Q4062K0674M808J3363
15586C04239k6144o4214r146J07320K03566K06707P4335j02364k22274k54172
15576B17853j96745j28988m1080P4757R2380j5682q0116n1314l6683k5076k2227
15565b12921o0348p5863r7178j05736k1833J36939K36323K07021J34616J04818
15555B45838M2476n9284j47520j51564m4279N6520J36763K60101L08354K06537
15545H53942R3127K3380j1871j8285l9412p4138j18563j49600j18400m1655K0284
15534D18809K0913m136m6284j35044k28575k17766r2671P2979J66884J59452J07104
$$ plain form
15523 221665 276823 312575 341554 348752 361248 423158 543580 719496 907289 1027629 1036365
15512 1036365 931960 769952 609900 494184 468199 531309 642115 690098 594972 442168
15502 442168 341288 259697 124567 -37123 -116176 -60916 86134 272218 444168 537622
15492 537622 565813 584217 618244 686272 754348 754549 679692 563082 408265 249050 181054
15481 181054 199679 172536 56223 -81200 -190875 -259029 -278494 -245529 -183006 -197304 -378351
15470 -378351 -621818 -781041 -851137 -825563 -671286 -420902 -175174 -92250 -234797 -487607
15460 -487607 -661516 -663230 -572420 -460884 -361232 -320668 -393284 -574050 -727455 -764688 -745035
15449 -745035 -764390 -846463 -872593 -763165 -541570 -334221 -277502 -353863 -455720 -521698 -534204
$$ packed form
15523B21665N5158L5752K8979P198J2496O1910J20422J75916J87793J20340Q736
15512A036365j04405j62008j60052j15716k5985O3110J10806M7983r5126j52804
15502D42168j00880q1591j35130j61690p9053N5260J47050J86084J71950R3454
15492E37622K8191J8404L4027O8028O8076K01p4857j16610j54817j59215o7996
15481A81054J8625k7143j16313j37423j09675o8154j9465L2965O2523j4298j81047
15470c78351k43467j59223p0096K5574J54277K50384K45728Q2924j42547k52810
15460d87607j73909j714R0810J11536R9652M0564p2616j80766j53405l7233J9653
15449g45035j9355q2073k6130J09428K21595K07349N6719p6361j01857o5978j2506
$$ plain form
15438 -534204 -521121 -568907 -663919 -666632 -572386 -493938 -460650 -471222 -544549 -685421 -825167
15427 -825167 -858470 -776481 -636830 -436362 -211645 -61839 -2452 -34831 -173204 -356050
15417 -356050 -500320 -629296 -764872 -852941 -879966 -775242 -524017 -255229 -38987 118398
15407 118398 182076 175017 191757 219483 218888 239928 288605 307360 272219 208238 119179 -8355
15395 -8355 -142321 -233708 -266711 -231259 -139403 -9501 151660 277148 313920 277003 207326
15384 207326 114076 8168 -110590 -279062 -465638 -597782 -635949 -638374 -660425 -703664 -773002
15373 -773002 -830156 -811995 -741578 -709159 -709664 -705502 -701497 -725647 -759953 -784141 -794913 -768644
15361 -768644 -699214 -606656 -483172 -327834 -179369 -78708 -42706 -53759 -56498 -10098 71542
$$ packed form
15438e34204J3083m7786r5012k713R4246P8448L3288j0572p3327j40872j39746
15427h25167l3303Q1989J39651K00468K24717J49806N9387l2379j38373j82846
15417c56050j44270j28976j35576q8069k7025J04724K51225K68788K16242J57385
15407A18398O3678p059J6740K7726n95K1040M8677J8755l5141o3981q9059j27534
15395h355j33966r1387l3003L5452R1856J29902J61161J25488L6772l6917o9677
15384B07326r3250j05908j18758j68472j86576j32144l8167k425k2051m3239o9338
15373g73002n7154J8161P0417L2419n05M162M005k4150l4306k4188j0772K6269
15361g68644O9430R2558J23484J55338J48465J00661L6002j1053k739M6400Q1640
$$ plain form
15350 71542 194264 350728 471670 506123 470724 395010 261280 71036 -102265 -200996
15340 -200996 -219968 -195975 -161405 -144828 -141464 -139857 -153863 -203616 -319990 -499937 -669073
15329 -669073 -702781 -563328 -382276 -310158 -350085 -389880 -380063 -351055 -331081 -330885 -356623 -402000
15317 -402000 -490871 -573912 -558840 -507430 -482242 -434921 -369505 -325198 -299231 -251805 -132634
15306 -132634 45445 193675 198473 77662 -74905 -218539 -328815 -389731 -368651 -318462
15296 -318462 -374816 -538562 -699011 -811084 -886195 -910521 -867393 -794719 -751423 -704774 -582592
15285 -582592 -407525 -274037 -209256 -137560 8405 164207 269702 329654 372543 411575
15275 411575 462557 525233 590037 587674 468584 346188 299616 275231 189673 47385 -46538
$$ packed form
15350G1542J22722J56464J20942L4453l5399p5714j33730j90244j73301r8731
15340b00996j8972K3993L4570J6577L364J607j4006m9753j16374j79947j69136
15329f69073l3708J39453J81052P2118l9927l9795R817K9008J9974J96k5738m5377
15317d02000q8871q3041J5072N1410K5188M7321O5416M4307K5967M7426J19171
15306a32634J78079J48230M798j20811j52567j43634j10276o0916K1080N0189
15296c18462n6354j63746j60449j12073p5111k4326M3128P2674M3296M6649J22182
15285e82592J75067J33488O4781P1696J45965J55802J05495N9952M2889L9032
15275D11575N0982O2676O4804k363j19090j22396m6572k4385q5558j42288r3923
$$ plain form
15264 -46538 -52803 -72853 -189226 -371546 -522732 -586908 -570308 -550283 -575146 -582433 -492290
15253 -492290 -314102 -140500 -47969 -88023 -258369 -430663 -488414 -435532 -314246 -155166
15243 -155166 35513 223280 337613 316135 133721 -155335 -422048 -552678 -568952 -544213
15233 -544213 -471272 -340977 -161285 15698 78180 12808 -104200 -214434 -303375 -438145
15223 -438145 -670059 -972019 -1235853 -1365174 -1397015 -1386208 -1334726 -1216608 -1023729 -775045
15213 -775045 -523236 -343623 -272138 -248387 -215172 -147779 -73545 -27854 13930 54865 81015
15202 81015 131580 237567 346614 308859 83649 -201172 -462584 -648718 -706326 -668851
15192 -668851 -664550 -764361 -856125 -802670 -582324 -250647 67568 284676 398811 437567 450612
$$ packed form
15264d6538o265k0050j16373j82320j51186o4176J6600K0025k4863p287R0143
15253d92290J78188J73602R2531m0054j70346j72294n7751N2882J21286J59080
15243a55166J90679J87767J14333k1478j82414k89056k66713j30630j6274K4739
15233e44213P2941J30295J79692J76983O2482o5372j17008j10234q8941j34770
15223d38145k31914l01960k63834j29321l1841J0807N1482J18118J92879K48684
15213g75045K51809J79613P1485K3751L3215O7393P4234M5691M1784M0935K6150
15202H1015N0565J05987J09047l7755k25210k84821k61412j86134n7608L7475
15192f68851M301r9811r1764N3455K20346L31677L18215K17108J14135L8756J3045
$$ plain form
15181 450612 463185 437828 359311 260790 177313 141292 177011 259427 292852 241389 154666
15170 154666 92763 72672 72258 81488 99250 143821 237644 288141 261197 213968 94352 -136138
15158 -136138 -352423 -466175 -539509 -625045 -696212 -728072 -740020 -763571 -777176 -757906 -743908
15147 -743908 -756339 -717193 -538073 -267856 -40713 76007 106449 75150 52544 77239 91674
15136 91674 104212 163794 269418 404848 497536 468932 339805 158111 -5564 -116220
15126 -116220 -181632 -213241 -241499 -287249 -343127 -365961 -336826 -256283 -132580 1185 116826
15115 116826 154021 96168 68060 162128 345101 514422 557822 455320 278602 115848
15105 115848 30912 -24060 -109091 -172908 -138640 -48652 7068 38863 70597 59866 -19727
$$ packed form
15181D50612J2573k5357p8517r8521q3477l6021L5719Q2416L3425n1463q6723
15170A54666o1903k0091m14R230J7762M4571R3823N0497k6944m7229j19616k30490
15158a36138k16285j13752p3334q5536p1167l1860j1948k3551j3605J9270J3998
15147g43908j2431L9146J79120K70217K27143J16720L0442l1299k2606K4695J4435
15136I1674J2538N9582J05624J35430R2688k8604j29127j81694j63675j10656
15126a16220o5412l1609k8258m5750n5878k2834K9135Q0543J23703J33765J15641
15115A16826L7195n7853k8108R4068J82973J69321M3400j02502j76718j62754
15105A15848q4936n4972q5031o3817L4268Q9988N5720L1795L1734j0731p9593
$$ plain form
15094 -19727 -120363 -152461 -95626 -75539 -149408 -254489 -364132 -462569 -534349 -574775 -606766
15083 -606766 -658006 -710691 -693727 -541670 -344202 -239767 -212113 -198526 -189474 -228218 -328141
15072 -328141 -442688 -525732 -590742 -622020 -556584 -350992 -45624 261021 463293 528499
15062 528499 494107 422464 346239 284764 236366 218697 193627 46015 -208099 -465629 -637236
15051 -637236 -645687 -505052 -366879 -341942 -397674 -450888 -469239 -514552 -631661 -731410 -704569
15040 -704569 -597338 -462421 -243171 -2870 122886 123638 87467 90287 156459 208558 191313
15029 191313 169152 184667 214392 217461 192332 154037 78064 -52246 -185499 -247106 -265471
15018 -265471 -347826 -509428 -626097 -686882 -785929 -926665 -1033266 -1077729 -1090146 -1029357 -888569
$$ packed form
15094a9727j00636l2098N6835K0087p3869j05081j09643r8437p1780m0426l1991
15083f06766n1240n2685J6964J52057J97468J04435K7654J3587R052l8744r9923
15072c28141j14547q3044o5010l1278O5436K05592L05368L06645K02272O5206
15062E28499l4392p1643p6225o1475m8398j7669k5070j47612k54114k57530j71607
15051f37236q451J40635J38173K4937n5732n3214j8351m5313j17109r9749K6841
15040g04569J07231J34917K19250K40301J25756P52l6171K820O6172N2099j7245
15029A91313k2161J5515K9725L069k5129l8295p5973j30310j33253o1607j8365
15018b65471q2355j61602j16669o0785r9047j40736j06601m4463j2417O0789J40788
$$ plain form
15007 -888569 -742714 -667295 -677650 -710592 -700706 -654640 -582938 -472951 -372615 -307690 -309448
14996 -309448 -362539 -322723 -141097 49819 179728 232019 227804 246148 300862 365407 406788
14985 406788 351718 147041 -136076 -339157 -373492 -277016 -158021 -65798 -8561 27954 93885
14974 93885 187267 245135 264499 279353 269196 253815 245016 237970 226305 206107 176299 140206
14962 140206 107518 86890 79143 71501 69059 84501 106223 126590 137999 145986 171955 195739
14950 195739 135237 -25141 -231295 -395102 -432759 -309516 -78207 100782 146720 136468
14940 136468 129508 100837 34785 -13334 5916 53525 62301 2830 -93023 -158036 -142208 -16950
14928 -16950 162408 340860 513550 649276 675446 541688 281966 12007 -170001 -265137
$$ packed form
15007h88569J45855P5419j0355l2942R886M6066P1702J09987J00336O4925j758
14996c09448n3091L9816J81626J90916J29909N2291m215J8344N4714O4545M1381
14985D06788n5070k04677k83117k03081l4335R6476J18995R2223N7237L6515O5931
14974I3885R3382N7868J9364J4854j0157j5381q799p046j1665k0198k9808l6093
14962A40206l2688k0628p747p642k442J5442K1722K0367J1409P987K5969K3784
14950A95739o0502j60378k06154j63807l7657J23243K31309J78989M5938j0252
14940A36468o960k8671o6052m8119J9250M7609Q776n9471r5853o5013J5828J25258
14928a6950J79358J78452J72690J35726K6170j33758k59722k69959j82008r5136
$$ plain form
14918 -265137 -342512 -422827 -468817 -474042 -431300 -306697 -84746 154725 229540 85992 -94489
14907 -94489 -165106 -134114 -55341 13073 12509 -75585 -219760 -314075 -294814 -223853 -177038 -172928
14895 -172928 -148713 -96955 -119088 -253933 -456799 -569949 -520748 -414146 -337107 -305594 -320439
14884 -320439 -380758 -448552 -461627 -455269 -440124 -349783 -142873 158556 422537 538482 555090
14873 555090 538620 510886 495309 476746 398558 232676 911 -180301 -232961 -203062 -114580
14862 -114580 55913 233908 297815 246997 215000 294464 438824 580643 650596 633184 570429
14851 570429 427265 263592 294565 524338 749047 815592 784163 775419 751978 641032 484846
14840 484846 354186 277276 236895 146945 -29082 -209688 -265819 -182298 -115292 -212074 -451218
$$ packed form
14918b65137p7375q0315m5990n225M2742J24603K21951K39471P4815j43548j80481
14907i4489p0617L0992P8773O8414n64q8094j44175r4315J9261P0961M6815M110
14895a72928K4215N1758k2133j34845k02866j13150M9201J06602P7039L1513j4845
14884c20439o0319o7794j3075O358J5145R0341K06910L01429K63981J15945J6608
14873E55090j6470k7734j5577j8563p8188j65882k31765j81212n2660K9899Q8482
14862a14580J70493J77995O3907n0818l1997P9464J44360J41819O9953j7412o2755
14851E70429j43164j63673L0973K29773K24709O6545l1429q744k3441j10946j56186
14840D84846j30660p6910m0381q9950j76027j80606n6131Q3521O7006r6782k39144
$$ plain form
14829 -451218 -665650 -699856 -584495 -450506 -387774 -411102 -426346 -421319 -472712 -586593 -633092
14818 -633092 -521154 -294660 -31997 193333 320490 357863 392284 442170 428472 286932
14808 286932 76902 -73302 -47754 145403 322189 398733 482849 655725 834596 915469
14798 915469 892866 800334 674254 519711 373650 268066 173328 43355 -123083 -222457
14788 -222457 -165916 -30004 71563 146040 243577 326624 324632 242238 154531 87088 1655
14777 1655 -94863 -123384 -72299 13876 123056 220290 230430 154349 66606 -22623 -104551 -93189
14765 -93189 31462 186307 298255 298243 214709 161064 187880 283845 448019 621916 729487
14754 729487 741107 685974 612459 533581 422854 251151 14360 -230584 -389493 -412858
$$ packed form
14829d51218k14432l4206J15361J33989O2732k3328j5244N027n1393j13881m6499
14818f33092J11938K26494K62663K25330J27157L7373L4421M9886j3698j41540
14808B86932k10030j50204K5548J93157J76786P6544Q4116J72876J78871Q0873
14798I15469k2603r2532j26080j54543j46061j05584r4738j29973j66438r9374
14788b22457N6541J35912J01567P4477R7537Q3047j992q2394q7707o7443q5433
14777A655r6518k8521N1085Q6175J09180R7234J0140p6081q7743q9229q1928J1362
14765i3189J24651J54845J11948j2q3534n3645K6816R5965J64174J73897J07571
14754G29487J1620n5133p3515p8878j10727j71703k36791k44944j58909k3365
$$ plain form
14744 -412858 -393391 -492891 -671202 -795983 -828684 -761285 -595723 -399799 -276984 -262451
14734 -262451 -345834 -466962 -564703 -619226 -588932 -489782 -414674 -419975 -466960 -511562 -592341
14723 -592341 -702896 -735320 -660325 -584603 -572620 -600025 -642862 -691419 -743164 -769442 -739673
14712 -739673 -666538 -579630 -524383 -523522 -507463 -426735 -287811 -101667 104471 270357 322073
14701 322073 231897 100725 50801 79938 147884 237263 378162 559721 666338 637086 550313
14690 550313 531967 593804 633750 579773 431946 252072 73968 -93845 -272510 -494530
14680 -494530 -724912 -881786 -949638 -925168 -774985 -528656 -295670 -142376 -6546 136848
14670 136848 215913 268899 430780 657708 799253 848383 897259 947377 981693 991000 946602
$$ packed form
14744d12858J9467r9500j78311j24781l2701O7399J65562J95924J22815J4533
14734b62451q3383j21128r7741n4523L0294R9150P5108n301m6985m4602q0779
14723e92341j10555l2424P4995P5722J1983k7405m2837m8557n1745k6278K9769
14712g39673P3135Q6908N5247Q61J6059Q0728J38924J86144K06138J65886N1716
14701C22073r0176j31172m9924K9137O7946Q9379J40899J81559J06617k9252q6773
14690E50313j8346O1837L9946n3977j47827j79874j78104j67813j78665k22020
14680d94530k30382j56874o7852K4470J50183K46329K32986J53294J35830J43394
14670A36848P9065N2986J61881K26928J41545M9130M8876N0118L4316R307m4398
$$ plain form
14659 946602 881035 838153 793622 700255 520004 288407 48052 -184427 -356030 -451654
14649 -451654 -505399 -557128 -641670 -752867 -810516 -790245 -755901 -724556 -633065 -446906 -240615
14638 -240615 -84503 48725 194262 327376 441426 563180 710608 832045 788789 548541
14628 548541 261038 57946 -70234 -164240 -275858 -395920 -449228 -373918 -189377 -11715
14618 -11715 60120 24082 -36846 -26709 65907 173316 243310 227796 166970 203319 392839
14607 392839 632426 808450 864015 777922 611758 408163 165596 -56472 -149752 -84816
14597 -84816 28292 98393 159586 254811 277060 132814 -59510 -150297 -144192 -134783 -182785
14586 -182785 -301381 -468440 -659314 -869430 -1040730 -1123404 -1136312 -1037899 -795355 -531635
$$ packed form
14659I46602o5567m2882m4531r3367j80251k31597k40355k32479j71603r5624
14649d51654n3745n1729q4542j11197n7649K0271L4344L1345R1491J86159K06291
14638b40615J56112J33228J45537J33114J14050J21754J47428J21437m3256k40248
14628E48541k87503k03092j28180r4006j11618j20062n3308P5310J84541J77662
14618a1715P1835l6038o0928J0137R2616J07409O9994j5514o0826L6349J89520
14607C92839K39587J76024N5565q6093j66164k03595k42567k22068r3280O4936
14597h4816J13108P0101O1193R5225K2249j44246j92324r0787O105R409m8002
14586a82785j18596j67059j90874k10116j71300q2674j2908R8413K42544K63720
$$ plain form
14576 -531635 -383676 -296425 -173984 -68976 -50597 -106893 -184282 -243253 -269329 -332056 -508301
14565 -508301 -751684 -930540 -967779 -899746 -791578 -653850 -473267 -319725 -257261 -281884
14555 -281884 -396503 -563328 -719699 -812597 -778060 -671517 -650952 -753504 -846809 -810453
14545 -810453 -640234 -395991 -170531 -8897 114164 190919 154153 16914 -93898 -127461
14535 -127461 -116476 -112620 -184459 -328756 -465921 -584891 -696470 -802309 -912487 -953436
14525 -953436 -842392 -634763 -450665 -321843 -220818 -182054 -214744 -247966 -277720 -337033
14515 -337033 -384241 -396617 -403463 -405296 -401310 -405571 -427707 -398174 -255953 -79143 7819 -13681
14503 -13681 -90102 -192896 -274079 -247034 -75184 165216 339122 381412 328010 232962 137080
$$ packed form
14576e31635J47959Q7251J22441J05008J8379n6296p7389n8971k6076o2727j76245
14565e08301k43383j78856l7239O8033J08168J37728J80583J53542O2464k4623
14555b81884j14619j66825j56371r2898L4537J06543K0565j02552r3305L6356
14545h10453J70219K44243K25460J61634J23061P6755l6766j37239j10812l3563
14535a27461J0985L856p1839j44297j37165j18970j11579j05839j10178m0949
14525i53436J11044K07629J84098J28822J01025L8764l2690l3222k9754n9313
14515c37033m7208j2376o846j833L986m261k2136K9533J42221J76810Q6962k1500
14503a3681p6421j02794q1183K7045J71850K40400J73906M2290n3402r5048r5882
$$ plain form
14492 137080 74641 64051 78836 70230 14145 -17200 46263 177784 280503 301301 289462
14481 289462 273195 247182 223471 186389 124641 41491 -79860 -193987 -275535 -345388 -388387
14470 -388387 -376054 -330887 -336269 -399833 -406595 -320795 -219684 -153281 -66646 56383 134028
14459 134028 93569 -66360 -261905 -405917 -460539 -418662 -355148 -338850 -409125 -570498 -722170
14448 -722170 -790804 -781387 -658797 -463107 -340935 -327607 -339691 -365285 -409996 -397138 -300059
14437 -300059 -177688 -47044 63063 96322 28968 -122079 -284191 -418591 -537409 -671376
14427 -671376 -796222 -860333 -861798 -791590 -667684 -566048 -583388 -704546 -851728 -972984
14417 -972984 -1008105 -977627 -929301 -837007 -705538 -571203 -444119 -335699 -281065 -294007 -316498
$$ packed form
14492A37080o2439j0590J4785q606n6085l1345O3463J31521J02719K0798j1839
14481B89462j6267k6013k3711l7082o1748q3150j21351j14127q1548o9853m2999
14470c88387J2333M5167n382o3564o762Q5800J01111O6403Q6635J23029P7645
14459A34028m0459j59929j95545j44012n4622M1877O3514J6298p0275j61373j51672
14448g22170o8634R417J22590J95690J22172J3328j2084k5594m4711J2858R7079
14437c00059J22371J30644J10107L3259o7354j51047j62112j34400j18818j33967
14427f71376j24846o4111j465P0208J23906J01636j7340j21158j47182j21256
14417i72984l5121L0478M8326R2294J31469J34335J27084J08420N4634j2942k2491
$$ plain form
14406 -316498 -312910 -339312 -416104 -470206 -476808 -470563 -451405 -383127 -280522 -224215 -276280 -442532
14394 -442532 -648095 -795444 -841046 -810068 -770707 -730219 -714410 -745589 -730620 -598023 -385539
14383 -385539 -151136 75119 252984 352028 347708 239842 89688 -74730 -250152 -376449
14373 -376449 -389107 -336303 -279939 -191487 -24359 140818 163359 8948 -224046 -382079
14363 -382079 -365803 -258158 -192724 -187098 -151358 -30578 72876 46157 -44176 -86056 -88195
14352 -88195 -67316 -23938 28953 79052 87185 16803 -107948 -193733 -190311 -137754 -80404 -55056
14340 -55056 -98387 -163216 -202002 -276510 -403315 -504591 -509156 -416355 -296827 -216778 -174117
14329 -174117 -155694 -118751 -10275 123810 162442 45377 -101973 -148568 -126738 -95927 -65319
$$ packed form
14406c16498L588k6402p6792n4102o602O245J9158O8278J02605N6307n2065j66252
14394d42532k05563j47349m5602L0978L9361M0488J5809l1179J4969J32597K12484
14383c85539K34403K26255J77865R9044m320j07866j50154j64418j75422j26297
14373c76449j2658N2804N6364Q8452J67128J65177K2541j54411k32994j58033
14363c82079J6276J07645O5434N626L5740J20780J03454k6719r0333m1880k139
14352h8195K0879M3378N2891N0099Q133p0382j24751q5785L422N2557N7350K5348
14340e5056m3331o4829l8786p4508j26805j01276m565R2801J19528Q0049M2661
14329a74117J8423L6943J08476J34085L8632j17065j47350m6595K1830L0811L0608
$$ plain form
14318 -65319 -35474 -38736 -52491 9418 169243 363445 523207 660800 819277 976643 1084666
14307 1084666 1147448 1165078 1119929 1035676 954349 878110 753057 598218 460937 361675 313857
14296 313857 309634 347296 413704 502201 597123 628892 606920 608843 612796 557960 416900 192094
14284 192094 -41864 -207426 -321023 -420814 -505134 -533813 -552573 -568932 -518458 -425567 -317334
14273 -317334 -186365 -52138 24141 1519 -71675 -177277 -328210 -435792 -398030 -272698
14263 -272698 -136090 -21820 89340 224393 346079 420957 436692 387031 277064 165643
14253 165643 107311 84392 65303 6895 -81558 -117900 -100912 -134511 -228550 -278414 -231384
14242 -231384 -151702 -194326 -387769 -585361 -677619 -680245 -619289 -504745 -350900 -246671 -245813
$$ packed form
14318f5319K9845l262j3755O1909J59825J94202J59762J37593J58477J57366J08023
14307A084666O2782J7630m5149q4253q1327p6239j25053j54839j37281r9262m7818
14296C13857m223L7662O6408Q8497R4922L1769k1972J923L953n4836j41060k24806
14284A92094k33958j65562j13597r9791q4320k8679j8760j6359N0474R2891J08233
14273c17334J30969J34227P6279k2622p3194j05602j50933j07582L7762J25332
14263b72698J36608J14270J11160J35053J21686P4878J5735m9661j09967j11421
14253A65643n8332k2919j9089n8408q8453l6342J6988l3599r4039m9864M7030
14242b31384P9682m2624j93443j97592r2258k626O0956J14544J53845J04229Q58
$$ plain form
14231 -245813 -261271 -227464 -173744 -146209 -165397 -281021 -490536 -699097 -841244 -896386 -853968
14220 -853968 -723765 -573606 -451210 -372253 -346630 -339147 -344850 -375739 -426839 -500749 -566118
14209 -566118 -575959 -546751 -531684 -514759 -452049 -323965 -130777 70639 205030 241175 171145
14198 171145 53934 -13034 -808 47137 101955 179379 287880 349952 288730 165995 91963
14187 91963 127850 233371 320418 378636 419631 424397 407121 421133 483154 534293 540846 562802
14175 562802 657366 802924 931139 991143 942992 792287 613720 494839 478283 533775
14165 533775 586174 587061 563612 548723 523435 449515 289571 61227 -151545 -301227 -403768
14154 -403768 -480839 -511452 -470102 -404840 -368330 -322634 -236191 -123300 -16218 48758 69886
$$ packed form
14231b45813j5458L3807N3720K7535j9188j15624k09515k08561j42147n5142M2418
14220h53968J30203J50159J22396P8957K5623P483n703l0889n1100p3910o5369
14209e66118r841K9208J5067J6925O2710J28084J93188K01416J34391L6145p0030
14198A71145j17211o6968J2226M7945N4818P7424J08501O2072o1222j22735p4032
14187I1963L5887J05521Q7047N8218M0995M766j7276J4012O2021N1139O553K1956
14175E62802R4564J45558J28215O0004m8151j50705j78567j18881j6556N5492
14165E33775N2399Q87k3449j4889k5288p3920j59944k28344k12772j49682j02541
14154d03768p7071l0613M1350O5262L6510M5696Q6443J12891J07082O4976K1128
$$ plain form
14143 69886 86871 121312 115986 14120 -158338 -311823 -360081 -292671 -151666 20333 174060
14132 174060 248258 255789 284637 368944 458196 489028 440664 338663 223603 99038 -53971
14121 -53971 -188971 -203614 -80521 41417 30799 -67853 -134503 -151292 -216348 -332943 -398501
14110 -398501 -410168 -451385 -542432 -609646 -582025 -504275 -494430 -576197 -637559 -586078 -436383
14099 -436383 -281068 -176649 -53506 121515 301585 453154 551449 599104 564012 428141
14089 428141 279999 162409 44992 -82277 -200433 -287825 -312559 -240494 -91153 79788
14079 79788 211587 264209 220643 125825 56554 2133 -110430 -298172 -478484 -547274 -478602
14068 -478602 -341179 -205912 -109898 -28501 69075 124857 105435 26238 -111137 -239606 -279729
$$ packed form
14143F9886J6985L4441n326j01866j72458j53485m8258O7410J41005J71999J53727
14132A74060P4198P531K8848Q4307Q9252L0832m8364j02001j15060j24565j53009
14121e3971j35000j4643J23093J21938j0618r8652o6650j6789o5056j16595o5558
14110c98501j1667m1217r1047o7214K7621P7750R845q1767o1362N1481J49695
14099d36383J55315J04419J23143J75021J80070J51569R8295M7655l5092j35871
14089D28141j48142j17590j17417j27269j18156q7392k4734P2065J49341J70941
14079G9788J31799N2622m3566r4818o9271n4421j12563j87742j80312o8790O8672
14068d78602J37423J35267R6014Q1397R7576N5782j9422p9197j37375j28469m0123
$$ plain form
14057 -279729 -238720 -149784 5191 165474 237558 209757 106659 4482 -21041 -31790 -50805
14046 -50805 28133 208175 374692 478427 551199 592737 630399 713120 806188 807680 683661
14035 683661 508149 349740 235282 174583 152189 121055 66289 51119 147045 372442 647595
14024 647595 823122 806529 638339 409225 207761 58932 -93501 -301409 -535287 -726087
14014 -726087 -828670 -843547 -800936 -721312 -628398 -507080 -373367 -311011 -349121 -458429 -579161
14003 -579161 -641642 -632721 -619421 -656395 -708113 -739270 -759605 -761878 -752624 -715230 -642363 -555931
13991 -555931 -503999 -501210 -546425 -657756 -781787 -842645 -839175 -811318 -754057 -636851 -475361
13980 -475361 -298405 -92065 150158 335081 392048 371259 398417 548616 802587 1057700
$$ packed form
14057b79729M1009Q8936J54975J60283P2084k7801j03098j02177k5523j0749j9015
14046e0805P8938J80042J66517J03735P2772M1538L7662Q2721R3068J492j24019
14035F83661j75512j58409j14458o0699k2394l1134n4766j5170R5926K25397K75153
14024F47595J75527j6593j68190k29114k01464j48829j52433k07908k33878j90800
14014g26087j02583j4877M2611P9624R2914J21318J33713O2356l8110j09308j20732
14003e79161o2481Q921J3300l6974n1718l1157k0335k273R254L7394P2867Q6432
13991e55931N1932K789m5215j11331j24031o0858L470K7857N7261J17206J61490
13980d75361J76956K06340K42223J84923N6967k0789K7158J50199K53971K55113
$$ plain form
13970 1057700 1182666 1102161 851410 586235 420583 309672 219929 168949 143257 109235
13960 109235 19688 -142617 -347819 -547512 -695125 -757624 -742298 -664385 -532796 -351743
13950 -351743 -178812 -86076 -76777 -113139 -180275 -251592 -235326 -104399 61869 173042 182800
13939 182800 104645 -4160 -98996 -162153 -160753 -154061 -202316 -250940 -229848 -162491 -85902 6662
13927 6662 81295 109285 153438 280457 474461 621812 638787 556407 454132 327384 101302
13916 101302 -191637 -399364 -440656 -348562 -181431 27378 166020 127212 -26072 -175812
13906 -175812 -252389 -273899 -241305 -145550 -76857 -96379 -149243 -195074 -238116 -268684 -264602 -226435
13894 -226435 -203194 -242173 -322536 -414076 -510497 -608369 -684245 -737393 -764008 -717180 -561337
$$ packed form
13970A057700J24966q0505k50751k65175j65652j10911q9743n0980k5692l4022
13960A09235q9547j62305k05202j99693j47613o2499J5326P7913J31589J81053
13950c51743J72931R2736R299l6362o7136p1317J6266J30927J66268J11173R758
13939A82800p8155j08805r4836o3157J400O692m8255m8624K1092O7357P6589R2564
13927F662P4633K7990M4153J27019J94004J47351J6975q2380j02275j26748k26082
13916A01302k92939k07727m1292R2094J67131K08809J38642l8808j53284j49740
13906a75812p6577k1510L2594R5755O8693j9522n2864m5831m3042l0568M082L8167
13894b26435K3241l8979q0363r1540r6421r7872p5876n3148k6615M6828J55843
$$ plain form
13883 -561337 -356702 -204122 -125942 -101520 -129674 -210408 -291843 -331753 -394424 -532312 -664321
13872 -664321 -701040 -660617 -558310 -387818 -204704 -73790 16891 112065 197141 208380 117148
13861 117148 -15588 -127285 -182951 -165637 -122685 -127267 -175333 -237020 -317392 -404558 -521165
13850 -521165 -698821 -838026 -868449 -848498 -834257 -796532 -661544 -466433 -384779 -452092 -534823
13839 -534823 -541416 -446203 -284346 -217663 -374261 -640445 -800183 -768011 -626120 -495421
13829 -495421 -363109 -179567 -31548 -11660 -47133 -61964 -49551 -19778 53298 207469 485395
13818 485395 841461 1092213 1160389 1132512 1072918 994666 913437 842207 816457 817029 827257
13807 827257 893597 915954 732894 429915 191894 43581 -71972 -125835 -115874 -98429 -89239
$$ packed form
13883e61337K04635J52580P8180K4422k8154q0734q1435l9910o2671j37888j32009
13872f64321l6719M0423J02307J70492J83114J30914R0681R5174Q5076J1239r1232
13861A17148j32736j11697n5666J7314M2952m582m8066o1687q0372q7166j16607
13850e21165j77656j39205l0423J9951J4241L7725J34988J95111Q1654o7313q2731
13839e34823o593R5213J61857O6683j56598k66184j59738L2172J41891J30699
13829d95421J32312J83542J48019J9888l5473j4831J2413K9773P3076J54171K77926
13818D85395L56066K50752O8176k7877n9594p8252q1229p1230k5750N72J0228
13807H27257O6340K2357j83060l02979k38021j48313j15553n3863R961J7445R190
$$ plain form
13796 -89239 -57953 19239 95659 136833 187109 230682 207987 145633 78004 7918 -71900 -171744
13784 -171744 -265147 -348252 -424919 -475081 -512599 -613258 -824400 -1037363 -1080667 -918190 -655847
13773 -655847 -451261 -353785 -332600 -380539 -497984 -644359 -700991 -607249 -436927 -321385
13763 -321385 -310149 -360798 -374075 -295473 -183400 -136934 -162139 -148215 -37072 107060 137784
13752 137784 5678 -205036 -379577 -490863 -588885 -668633 -643926 -524575 -440629 -480437
13742 -480437 -597408 -647101 -549222 -365832 -186179 -46346 59128 156921 237742 247571 155418
13731 155418 -593 -196175 -361034 -440263 -389410 -195406 10602 89033 72557 15774
13721 15774 -85073 -151071 -126238 -96321 -185943 -375867 -561942 -713693 -872665 -1031906
$$ packed form
13796h9239L1286P7192P6420M1174N0276M3573k2695o2354o7629p0086p9818r9844
13784a71744r3403q3105p6667n0162l7518j00659k11142k12963m3304J62477K62343
13773f55847K04586R7476K1185m7939j17445j46375n6632R3742J70322J15542
13763c21385J1236n0649j3277P8602J12073M6466k5205J3924J11143J44132L0724
13752A37784j32106k10714j74541j11286r8022p9748K4707J19351Q3946l9808
13742d80437j16971m9693R7879J83390J79653J39833J05474R7793Q0821R829r2153
13731A55418j56011j95582j64859p9229N0853J94004K06008P8431j6476n6783
13721A5774j00847o5998K4833K9917q9622j89924j86075j51751j58972j59241
$$ plain form
13711 -1031906 -1122344 -1093374 -958976 -822939 -746403 -706511 -739169 -858516 -985075 -1032497
13701 -1032497 -1022645 -1014039 -985660 -857934 -579635 -207486 144717 389463 527947 602327
13691 602327 621243 601034 565120 506660 408575 300682 187350 35102 -109727 -218895
13681 -218895 -317771 -360923 -296728 -186457 -160297 -256052 -361339 -336393 -208621 -115320 -72695
13670 -72695 -64170 -117836 -253417 -458996 -644065 -778440 -841777 -789772 -679023 -533317 -369145
13659 -369145 -231756 -136322 -138665 -251697 -367634 -385695 -315452 -244723 -200038 -150985 -76835
13648 -76835 35619 70538 -37682 -153892 -188068 -193907 -189359 -162017 -163567 -230622 -328534 -414506
13636 -414506 -457176 -431093 -322823 -185146 -82405 -45527 -18199 97433 262687 404501
$$ packed form
13711a031906r0438K8970J34398J36037P6536L9892l2658j19347j26559m7422
13701a032497R852Q606K8379J27726K78299L72149L52203K44746J38484P4380
13691F02327J8916k0209l5914n8460r8085j07893j13332j52248j44829j09168
13681b18895r8876m3152O4195J10271K6160r5755j05287K4946J27772R3301M2625
13670g2695Q525n3666j35581k05579j85069j34375o3337N2005J10749J45706J64172
13659c69145J37389R5434k343j13032j15937j8061P0243P0729M4685M9053P4150
13648g6835J12454L4919j08220j16210l4176n839M548K7342j550o7055r7912q5972
13636d14506m2670K6083J08270J37677J02741L6878K7328J15632J65254J41814
$$ plain form
13626 404501 507119 597689 644703 567429 367230 143245 25361 27749 77532 142770 199477
13615 199477 215274 162872 40229 -127791 -261127 -278851 -193357 -41903 104633 130199
13605 130199 10324 -85385 -66605 6083 62996 64305 54390 99493 207065 307962 357691
13594 357691 361113 305370 167050 17965 -22583 66925 208570 342906 431472 436455 346093
13583 346093 283006 385079 596229 713247 628543 390638 161198 67230 59514 -9190 -154620
13572 -154620 -271025 -297115 -249940 -200192 -205411 -223110 -149626 22163 234745 480569 675051
13561 675051 675938 520427 354726 285524 315467 362802 368890 341232 331936 396601 507666 526413
13549 526413 384765 221185 130330 90447 63623 39898 25257 -11851 -56846 -56169 -11767
$$ packed form
13626D04501J02618R0570M7014p7274k00199k23985j17884K388M9783O5238N6707
13615A99477J5797n2402j22643j68020j33336j7724Q5494J51454J46536K5566
13605A30199j19875r5709J8780P2688N6913J309r915M5103J07572J00897M9729
13594C57691L422n5743j38320j49085m0548Q9508J41645J34336Q8566M983r0362
13583C46093o3087J02073K11150J17018q4704k37905k29440r3968p716o8704j45430
13572a54620j16405k6090M7175M9748n219j7699P3484J71789K12582K45824J94482
13561F75051Q87j55511j65701o9202K9943M7335O088k7658r296O4665J11065J8747
13549E26413j41648j63580r0855l9883k6824k3725j4641l7108m4995O77M4402
$$ plain form
13538 -11767 56359 148293 253170 333645 405315 464154 497719 538914 521971 357909 121740
13527 121740 -82458 -256681 -356900 -352965 -288795 -210299 -175674 -232515 -337495 -410800 -418176
13516 -418176 -381095 -306425 -225740 -227401 -319346 -421793 -481022 -449135 -325827 -241542 -283192
13505 -283192 -423041 -598617 -734823 -730178 -588703 -458646 -426389 -448940 -535441 -711516
13495 -711516 -898423 -970396 -877284 -667859 -405693 -112310 141850 263741 269592 248971
13485 248971 236979 245755 263388 234652 163863 88280 51055 68359 106802 120574 97183 67572
13473 67572 106146 258206 460951 624119 717825 793519 857773 815759 687112 599590 597270
13462 597270 637681 662679 639324 593510 556812 547862 580698 649396 716794 721533 657636 585628
$$ packed form
13538a1767O8126R1934J04877Q0475P1670N8839L3565M1195j6943j64062k36169
13527A21740k04198j74223j00219L935O4170P8496L4625n6841j04980p3305p376
13516d18176L7081P4670Q0685j661r1945j02447n9229L1887J23308Q4285m1650
13505b83192j39849j75576j36206M645J41475J30057L2257k2551q6501j76075
13495g11516j86907p1973R3112K09425K62166K93383K54160J21891N851k0621
13485B48971j1992Q776J7633k8736p0789p5583l7225J7304L8443J3772k3391k9611
13473F7572L8574J52060K02745J63168R3706P5694O4254m2014j28647q7522k320
13462E97270M0411K4998k3355m5814l6698q950L2836O8698O7398M739o3897p2008
$$ plain form
13450 585628 571197 634662 779983 963707 1131929 1217114 1181849 1129882 1167442 1268133 1351810
13439 1351810 1381658 1379720 1382992 1363055 1254808 1040249 822487 696252 637149 626635 658560
13428 658560 684132 739727 851927 904780 798601 568444 329178 174178 142453 168318
13418 168318 132560 62768 75958 201430 351636 410438 369949 306781 296593 405993 613290
13407 613290 813799 896834 814053 628667 427694 265878 159907 110510 164870 339720
13397 339720 549509 667629 665199 625196 574172 454214 262137 102420 47258 42867 2074
13386 2074 -63182 -68612 -9195 94763 260613 423466 476833 403699 246661 84940 38308
13375 38308 164352 388686 588383 679436 635282 530710 489549 534792 601908 651806 685914
$$ packed form
13450E85628j4431O3465J45321J83724J68222Q5185l5265n1967L7560J00691Q3677
13439A351810K9848j938L272j9937j08247k14559k17762j26235n9103j0514L1925
13428F58560K5572N5595J12200N2853j06179k30157k39266j55000l1725K5865
13418A68318l5758o9792J3190J25472J50206N8802m0489o3168j0188J09400K07297
13407F13290K00509Q3035q2781j85386k00973j61816j05971m9397N4360J74850
13397C39720K09789J18120k430m0003n1024j19958j92077j59717n5162m391m0793
13386B074o5256n430N9417J03958J65850J62853N3367p3134j57038j61721m6632
13375C8308J26044K24334J99697R1053m4154j04572m1161M5243O7116M9898L4108
$$ plain form
13364 685914 651661 526090 370370 273351 264811 311604 342692 297690 195744 55159 -82840
13353 -82840 -145702 -151446 -162902 -161016 -138893 -113464 -25692 144733 312845 406143 457210 535052
13341 535052 651414 761034 850990 907298 921459 921287 896108 822570 712818 603633 549216
13330 549216 610415 673175 594324 443351 312437 270511 373320 569726 734207 803500
13320 803500 855951 960979 1070259 1123275 1134754 1136714 1154364 1172216 1177345 1177283 1191757 1235760
13308 1235760 1314282 1335278 1204388 988632 787847 698061 764567 909278 1056944 1210424
13298 1210424 1341923 1364701 1341240 1339181 1293578 1228006 1204946 1186952 1130053 1067744 1070683
13287 1070683 1114736 1150642 1203190 1247556 1223693 1155702 1131354 1181118 1221539 1199552 1101955
$$ packed form
13364F85914l4253j25571j55720r7019q540M6793L1088m5002j01946j40585j37999
13353h2840o2862n744j1456J886K2123K5429Q7772J70425J68112R3298N1067P7842
13341E35052J16362J09620Q9956N6308J4161j72k5179p3538j09752j09185n4417
13330E49216O1199O2760p8851j50973j30914m1926J02809J96406J64481O9293
13320H03500N2451J05028J09280N3016J1479J960J7650J7852N129o2J4474M4003
13308A235760P8522K0996j30890k15756k00785q9786O6506J44711J47666J53480
13298A210424J31499K2778k3461k059m5603o5572k3060j7994n6899o2309K939
13287A070683M4053L5906N2548M4366k3863o7991k4348M9764M0421k1987r7597
$$ plain form
13276 1101955 995001 974897 1019719 1067574 1090037 1140879 1265658 1404812 1490002 1536064 1571380
13265 1571380 1586324 1573029 1495431 1355611 1194750 1058307 944129 860894 787171 677387
13255 677387 597650 605614 681251 751574 804281 918458 1115767 1304774 1430733 1491627 1495280
13244 1495280 1485367 1529141 1643624 1780845 1905843 2023530 2100992 2125925 2133135 2078936 1982582
13233 1982582 1950206 1979623 1984449 1943509 1909580 1885147 1865173 1833549 1738837 1667822 1758136
13222 1758136 1919436 2012155 2025846 1980142 1914983 1877440 1850141 1796477 1736398 1664015 1519333
13211 1519333 1317549 1174968 1161253 1235583 1351079 1462989 1545737 1609143 1624082 1568124
13201 1568124 1515758 1500435 1525851 1622514 1730261 1762885 1789177 1905218 2027997 2068878 2038244
$$ packed form
13276A101955j06954k0104M4822M7855K2463N0842J24779J39154Q5190M6062L5316
13265A571380J4944j3295p7598j39820j60861j36443j14178q3235p3723j09784
13255F77387p9737P964P5637P0323N2707J14177J97309J89007J25959O0894L653
13244A495280r913M3774J14483J37221J24998J17687P7462K4933P210n4199r6354
13233A982582l2376K9417M826m0940l3929k4433j9974l1624r4712p1015R0314
13222A758136J61300R2719J3691m5704o5159l7543k7299n3664o0079p2383j44682
13211A519333k01784j42581j3715P4330J15496J11910Q2748O3406J4939n5958
13201A568124n2366j5323K5416R6663J07747L2624K6292J16041J22779M0881l0634
$$ plain form
13190 2038244 2009419 2088315 2234467 2322311 2265905 2088273 1936844 1879729 1846632 1795558 1741165
13179 1741165 1689470 1650839 1660479 1771055 1953570 2050050 2003874 1881420 1751647 1694598 1689083
13168 1689083 1649359 1619582 1663652 1741189 1791002 1760973 1661333 1515702 1323260 1112227 934809
13157 934809 814046 764156 814892 951852 1120586 1278252 1393629 1419338 1364708 1318955
13147 1318955 1335018 1396779 1531731 1769290 2041072 2309508 2522342 2593219 2538876 2415105
13137 2415105 2280277 2161235 2044163 1899421 1744647 1644430 1639452 1704647 1769437 1818274
13127 1818274 1838462 1821525 1834027 1970051 2177832 2355546 2474752 2513561 2563007 2737581
13117 2737581 3007063 3228340 3260629 3145688 3041939 2963860 2806380 2562316 2329874 2237415
$$ packed form
13190B038244k8825P8896J46152Q7844n6406j77632j51429n7115l3097n1074n4393
13179A741165n1695l8631R640J10576J82515R6480m6176j22454j29773n7049n515
13168A689083l9724k9777M4070P7537M9813l0029r9640j45631j92442k11033j77418
13157I34809j20763m9890N0736J36960J68734J57666J15377K5709n4630m5753
13147A318955J6063O1761J34952K37559K71782K68436K12834P0877n4343j23771
13137B415105j34828j19042j17072j44742j54774j00217m978O5195O4790M8837
13127A818274K0188j6937J2502J36024K07781J77714J19206L8809M9446J74574
13117B737581K69482K21277L2289j14941j03749p8079j57480k44064k32442r2459
$$ plain form
13107 2237415 2318367 2503073 2738806 2916951 2933911 2888265 2839510 2719470 2569297 2434106
13097 2434106 2325799 2302800 2391513 2571813 2804353 2975898 3024425 2970207 2852301 2767686
13087 2767686 2759583 2764836 2756344 2803883 2909450 2989987 3016008 3036858 3129452 3314444 3504161
13076 3504161 3608029 3615917 3590017 3604519 3716225 3935762 4208080 4455960 4668926 4838214
13066 4838214 4930770 4946748 4898539 4879308 4992087 5201064 5443729 5617281 5659833 5663104 5742159
13055 5742159 5906225 6058062 6073293 5923793 5731478 5605687 5511602 5395367 5346140 5439607
13045 5439607 5587001 5714580 5836071 5930649 5997814 6086090 6196336 6278419 6409620 6631572
13035 6631572 6812551 6879729 6932076 7043467 7149363 7227270 7396761 7720940 8115280 8512552
$$ packed form
13107B237415Q0952J84706K35733J78145J6960m5646m8755j20040j50173j35191
13097B434106j08307k2999Q8713J80300K32540J71545M8527n4218j17906q4615
13087B767686q103N253q492M7539J05567Q0537K6021K0850R2594J84992J89717
13076C504161J03868P888k5900J4502J11706K19537K72318K47880K12966J69288
13066D838214R2556J5978m8209j9231J12779K08977K42665J73552M2552L271P9055
13055E742159J64066J51837J5231j49500j92315j25791r4085j16235m9227R3467
13045E439607J47394J27579J21491R4578O7165Q8276J10246Q2083J31201K21952
13035F631572J80979O7178N2347J11391J05896P7907J69491L24179L94340L97272
$$ plain form
13025 8512552 8860789 9130671 9400962 9706141 9976941 10097882 10064009 10010636 10045792 10233013
13015 10233013 10604615 11130277 11696965 12231264 12767084 13328410 13842545 14266271 14667638
13006 14667638 15079139 15475190 15912510 16495122 17261586 18186021 19253077 20437514 21724605
12997 21724605 23145153 24721533 26456121 28347866 30446934 32805516 35414076 38324302
12989 38324302 41690698 45654150 50257485 55573011 61822960 69242448 77992929 88306412
12981 88306412 100538668 115121838 132574372 153464721 178430431 207880336 241295287
12974 241295287 276063564 306321025 323576496 321162649 299659380 266468684 230092914
12967 230092914 195998674 166432777 141744003 121439131 104753189 91003304 79730465
$$ packed form
13025H512552L48237K69882K70291L05179K70800J20941l3873n3373L5156J87221
13015A0233013L71602N25662N66688N34299N35820N61326N14135M23726M01367
13006A4667638M11501L96051M37320N82612P66464R24435J067056J184437J287091
12997B1724605J420548J576380J734588J891745K099068K358582K608560K910226
12989C8324302L366396L963452M603335N315526O249949P419488Q750481J0313483
12981H8306412J2232256J4583170J7452534K0890349K4965710K9449905L3414951
12974B41295287L4768277L0257461J7255471k413847k1503269l3190696l6375770
12967B30092914l4094240k9565897k4688774k0304872j6685942j3749885j1272839
$$ plain form
12960 79730465 70531946 62908149 56386502 50721305 45886672 41917190 38688211 35965283
12952 35965283 33564960 31467294 29720838 28191459 26733093 25372023 24169563 23084298
12944 23084298 22079490 21162101 20306209 19557821 18995273 18630987 18378476 18102230 17789863
12935 17789863 17529008 17355485 17218756 17088741 16989040 16974420 17076232 17216652 17289347 17328424
12925 17328424 17460946 17759609 18214643 18790138 19448692 20151368 20895110 21709050 22636893
12916 22636893 23741469 25044574 26469380 27816465 28832404 29518424 30126041 30861227
12908 30861227 31796404 32978732 34474241 36283407 38420801 40999429 44182387 48083624
12900 48083624 52778337 58374340 65027219 72858805 81973292 92597705 105177350 120322794
$$ packed form
12960G9730465r198519p623797o521647n665197m834633l969482l228979k722928
12952C5965283k400323k097666j746456j529379j458366j361070j202460j085265
12944B3084298j004808r17389q55892p48388n62548l64286k52511k76246l12367
12935A7789863k60855j73523j36729j30015r9701j4620J01812J40420P2695L9077
12925A7328424J32522K98663M55034N75495O58554P02676P43742Q13940R27843
12916B2636893J104576J303105J424806J347085J015939O86020O07617P35186
12908C0861227R35177J182328J495509J809166K137394K578628L182958L901237
12900D8083624M694713N596003O652879P831586R114487J0624413J2579645J5145444
$$ plain form
12892 120322794 138717436 161027388 187826417 219273970 254360120 289635135 317990322
12885 317990322 330305229 321287541 294091755 257617724 220199942 186501420 157986118
12878 157986118 134459592 115187280 99427205 86584086 76093952 67446244 60283939
12871 60283939 54316424 49298230 45032835 41335969 38111345 35349542 32998758 30938944
12863 30938944 29108333 27425526 25819542 24338320 23078800 22101279 21340261 20646234
12855 20646234 19940396 19233646 18494858 17776068 17184088 16715456 16343362 16056829 15850762
12846 15850762 15770055 15862338 16073449 16269025 16322390 16209429 16055878 16041091 16191747 16409934
12836 16409934 16575219 16631574 16689338 16849411 17097382 17399851 17803929 18407028 19186898 20059131
$$ packed form
12892A20322794J8394642K2309952K6799029L1447553L5086150L5275015K8355187
12885C17990322J2314907r017688k7195786l6474031l7417782l3698522k8515302
12878A57986118k3526526j9272312j5760075j2843119j0490134q647708p162305
12871F0283939n967515n018194m265395l696866l224624k761803k350784k059814
12863C0938944j830611j682807j605984j481222j259520r77521p61018o94027
12855B0646234p05838p06750p38788p18790n91980m68632l72094k86533k06067
12846A5850762q0707R2283K11111J95576N3365j12961j53551j4787J50656K18187
12836A6409934J65285N6355N7764J60073K47971L02469M04078O03099P79870Q72233
$$ plain form
12826 20059131 20995849 21982836 23065842 24304101 25754198 27530722 29614757 31901196
12818 31901196 34407047 37252970 40515357 44212464 48372735 53094115 58610369 65138807
12810 65138807 72931584 82298993 93529356 106995181 123171043 142598710 165847387
12803 165847387 193391287 225152346 259600467 292479093 316167361 322361039 308043870
12796 308043870 278251287 241901345 206155198 174527530 147902224 125915656 107814416
12789 107814416 92876578 80566479 70415091 61950860 54791251 48728442 43605167
12782 43605167 39230184 35486642 32293535 29530777 27093275 24928172 23009812 21296845
12774 21296845 19735490 18354386 17166854 16079762 14989190 13896466 12885137 11991545
$$ packed form
12826B0059131R36718R86987J083006J238259J450097J776524K084035K286439
12818C1901196K505851K845923L262387L697107M160271M721380N516254O528438
12810F5138807P792777R367409J1230363J3465825J6175862J9427667K3248677
12803A65847387K7543900L1761059L4448121L2878626K3688268O193678j4317169
12796C08043870k9792583l6349942l5746147l1627668k6625306k1986568j8101240
12789A07814416j4937838j2310099j0151388q464231p159609o062809n123275
12782D3605167m374983l743542l193107k762758k437502k165103j918360j712967
12774B1296845j561355j381104j187532j087092j090572j092724j011329q93592
$$ plain form
12766 11991545 11238407 10598202 10000497 9455949 9022319 8669109 8352145 8086785 7865343
12757 7865343 7666240 7434665 7071499 6603389 6176528 5839430 5540950 5265250 5060884
12748 5060884 4969668 4966756 5013141 5043210 5003810 4898019 4734005 4520305 4240455 3929058
12738 3929058 3668072 3486329 3358557 3271721 3254822 3280393 3278661 3224670 3095886 2850391
12728 2850391 2515448 2196561 1983475 1872237 1844585 1868864 1860447 1794921 1747545 1740704 1737105
12717 1737105 1773627 1880492 1997080 2054850 2039619 1974846 1828696 1564166 1259740 1009267
12707 1009267 837308 759383 802984 920618 1032684 1127411 1208494 1264711 1346632 1455834
12697 1455834 1524424 1525525 1465873 1369247 1294608 1222641 1154737 1194041 1381931 1592390 1713823
$$ packed form
12766A1991545p53138o40205n97705n44548m33630l53210l16964k65360k21442
12757G865343j99103k31575l63166m68110m26861l37098k98480k75700k04366
12748E060884r1216k912M6385L0069l9400j05791j64014k13700k79850l11397
12738C929058k60986j81743j27772q6836j6899K5571j732n3991j28784k45495
12728B850391l34943l18887k13086j11238k7652K4279q417o5526m7376o841l599
12717A737105L6522J06865J16588N7770j5231o4773j46150k64530l04426k50473
12707A009267j71959p7925M3601J17634J12066R4727Q1083N6217Q1921J09202
12697A455834O8590J101n9652r6626p4639p1967o7904L9304J87890K10459J21433
$$ plain form
12686 1713823 1722619 1591882 1354379 1160611 1150612 1303436 1506206 1592599 1474185 1240422
12676 1240422 1036851 960620 1057930 1277987 1483478 1641668 1770338 1833205 1803541 1653473
12666 1653473 1437120 1261816 1155236 1038495 911002 848234 851316 887428 908416 877218
12656 877218 760245 612683 536798 533959 581061 658610 732022 791699 834872 858998 889623
12645 889623 899406 850065 777726 754880 814380 910440 984487 1000377 895249 684859 512784
12634 512784 454867 477974 515967 487644 370094 218815 115790 143803 237144 299505 346420
12623 346420 391880 429666 410134 279246 98362 -17554 -79717 -183345 -296780 -282428
12613 -282428 -139732 20098 127717 151310 158623 239134 377750 520535 619283 641630 582060
$$ packed form
12686A713823Q796j30737k37503j93768r999J52824K02770Q6393j18414k33763
12676A240422k03571p6231R7310K20057K05491J58190J28670O2867k9664j50068
12666A653473k16353j75304j06580j16741j27493o2768L082L6112K0988l1198
12656H77218j16973j47562p5885k839M7102P7549P3412N9677M3173K4126L0625
12645H89623R783m9341p2339k2846N9500R6060P4047J5890j05128k10390j72075
12634E12784n7917K3107L7993k8323j17550j51279j03025K8013R3341O2361M6915
12623C46420M5460L7786j9532j30888j80884j15916o2163j03628j13435J4352
12613b82428J42696J59830J07619K3593P313Q0511J38616J42785R8748K2347n9570
$$ plain form
12602 582060 465285 309891 142446 54608 53785 29027 -62032 -153653 -271114 -461796 -658889
12591 -658889 -804336 -898765 -916278 -858031 -794498 -781425 -835391 -924891 -979261 -962844 -874079
12580 -874079 -752822 -643740 -550923 -511542 -526097 -556583 -533304 -421987 -246686 -52516
12570 -52516 125266 303057 484325 621429 664490 609085 521140 477604 452684 371154 202946
12559 202946 62594 29693 41259 57908 86843 121041 103372 20241 -83314 -173077 -202478
12548 -202478 -117366 30044 138832 143252 3220 -243555 -441995 -458572 -329494 -161946
12538 -161946 -31208 25633 41972 66210 106139 150363 172487 171499 112680 -6179 -87437
12527 -87437 -76592 -813 120086 257991 380858 497602 592605 638413 601675 475463 323345
$$ packed form
12602E82060j16775j55394j67445q7838q23k4758r1059r1621j17461j90682j97093
12591f58889j45447r4429j7513N8247O3533J3073n3966q9500n4370J6417Q8765
12580h74079J21257J09082R2817L9381j4555l0486K3279J11317J75301J94170
12570e2516J77782J77791J81268J37104M3061n5405q7945m3536k4920q1530j68208
12559B02946j40352l2901J1566J6649K8935L4198j7669q3131j03555q9763k9401
12548b02478Q5112J47410J08788M420j40032k46775j98440j6577J29078J67548
12538a61946J30738N6841J6339K4238L9929M4224K2124r88n8819j18859q1258
12527h7437J0845P5779J20899J37905J22867J16744R5003M5808l6738j26212j52118
$$ plain form
12516 323345 199277 96236 -7451 -92472 -117370 -64013 15890 84888 145561 187786 213265
12505 213265 195952 139420 143874 239155 331872 361219 359615 361623 380071 416414 457167 487886
12493 487886 441098 291965 131201 31616 8524 46119 116614 202721 310262 445611 568265
12482 568265 593626 524691 472823 511095 576816 587157 567672 540742 476415 390814 381876 470277
12470 470277 539990 527379 486990 412905 246612 55608 -14616 83066 242400 342934 334149
12459 334149 233384 121814 96603 173459 231124 168143 -3174 -249752 -484262 -590994
12449 -590994 -547482 -401647 -165103 120850 308297 373981 439115 536549 593391 576233 507983
12438 507983 429917 381919 434673 520790 472176 293464 160856 166419 168121 98522 67139
$$ packed form
12516C23345j24068j03041j03687q5021k4898N3357P9903O8998O0673M2225K5479
12505B13265j7313n6532M454R5281R2717K9347j604K008J8448L6343M0753L0719
12493D87886m6788j49133j60764r9585k3092L7595P0495Q6107J07541J35349J22654
12482E68265K5361o8935n1868L8272O5721J0341j9485k6930o4327q5601q938Q8401
12470D70277O9713j2611m0389p4085j66293j91004p0224R7682J59334J00534q785
12459C34149j00765j11570k5211P6856N7665o2981j71317k46578k34510j06732
12449e90994M3512J45835K36544K85953J87447O5684O5134R7434N6842j7158o8250
12438E07983p8066m7998N2754Q6117m8614j78712j32608N563J702o9599l1383
$$ plain form
12427 67139 145867 342793 604283 799853 845839 755902 567978 295475 -20162 -217531
12417 -217531 -167131 48673 256808 377887 452656 533601 596960 636875 721135 832061 852025
12406 852025 764752 672844 676616 763815 793206 671536 506973 419924 407859 450526 522224
12395 522224 565889 557009 520223 491222 479548 458451 394383 252404 62885 -54868 -73050
12384 -73050 -97978 -142879 -142061 -103632 -78463 -52119 -8953 14270 -23730 -127825 -221538 -239693
12372 -239693 -210154 -207116 -257865 -333687 -344270 -237220 -81151 42959 91615 74379 50783
12361 50783 15903 -55736 -104035 -122518 -183155 -319339 -452690 -485170 -433567 -369426 -341782
12350 -341782 -346813 -359640 -352038 -297332 -213327 -137784 -107028 -166459 -343657 -599526 -828512
$$ packed form
12427F7139P8728J96926K61490J95570M5986q9937j87924k72503l15637j97369
12417b17531N0400K15804K08135J21079P4769Q0945O3359L9915Q4260J10926J9964
12406H52025q7273r1908L772Q7199K9391j21670j64563q7049j2065M2667P1698
12395E22224M3665q880l6786k9001j1674k1097o4068j41979j89519j17753j8182
12384g3050k4928m4901Q18L8429K5169K6344M3166K3223l8000j04095r3713j8155
12372b39693K9539L038n0749p5822j0583J07050J56069J24110M8656j7236k3596
12361E0783l4880p1639m8299j8483o0637j36184j33351l2480N1603O4141K7644
12350c41782n031j2827P602N4706Q4005P5543L0756n9431j77198k55869k28986
$$ plain form
12339 -828512 -988592 -1099588 -1131657 -1026712 -799044 -518027 -290611 -180281 -186961 -315689
12329 -315689 -521754 -734880 -922865 -1063333 -1149279 -1148782 -1024443 -841586 -688983 -618149
12319 -618149 -625085 -618275 -567085 -566275 -636785 -624863 -474389 -299256 -187600 -192692 -307598 -452558
12307 -452558 -543651 -580229 -587079 -517556 -387867 -343037 -413257 -493749 -485785 -401396 -305673 -226988
12295 -226988 -186607 -221930 -357201 -474068 -429526 -317502 -283930 -335829 -391661 -353973 -192895
12284 -192895 4656 143513 248737 306876 244013 128263 95191 147283 232598 334035
12274 334035 347312 174250 -90594 -284363 -360141 -388977 -398803 -356110 -265570 -147353 -18840
12263 -18840 79704 96852 59977 45439 27744 -55612 -197433 -332871 -371021 -321018 -242762
$$ packed form
12339h28512j60080j10996l2069J04945K27668K81017K27416J10330o680j28728
12329c15689k06065k13126j87985j40468q5946M97J24339J82857J52603P0834
12319f18149o936O810N1190Q10p0510J1922J50474J75133J11656n092j14906j44960
12307d52558r1093l6578o850O9523J29689M4830p0220q0492P964Q4389R5723P8685
12295b26988M0381l5323j35271j16867M4542J12024L3572n1899n5832L7688J61078
12284a92895J97551J38857J05224N8139o2863j15750l3072N2092Q5315J01437
12274C34035J3277j73062k64844j93769p5778k8836r826M2693R0540J18217J28513
12263a8840R8544J7148l6875j4538j7695q3356j41821j35438l8150N0003P8256
$$ plain form
12252 -242762 -178216 -147475 -143481 -141974 -79335 36647 122894 124218 79940 34855 -51606 -190229
12240 -190229 -287193 -297085 -276794 -249243 -147805 66154 316506 461652 455570 402593 354997
12229 354997 243665 57916 -69860 -28270 79556 95798 9265 -87025 -123853 -137455 -196215
12218 -196215 -258989 -250519 -181030 -100322 -53300 -56990 -80121 -89661 -84045 -86016 -101428 -117260
12206 -117260 -133814 -176388 -264265 -383054 -466137 -476352 -462638 -492713 -557807 -588022 -520495
12195 -520495 -322609 -24860 287244 492965 542783 476454 345229 193816 57857 -46843
12185 -46843 -104179 -130147 -133094 -85539 47534 261003 461722 543512 456927 240659 -28746
12174 -28746 -298727 -527542 -701393 -775135 -698792 -505862 -312550 -198078 -172159 -219701
$$ packed form
12252b42762O4546L0741L994J507O2639J15982Q6247J324m4278m5085q6461j38623
12240a90229r6964r892K0291K7551J01438K13959K50352J45146o082n2977m7596
12229C54997j11332j85749j27776M1590J07826J6242q6533r6290l6828j3602n8760
12218a96215o2774Q470O9489Q0708M7022l690k3131r540N616j971j5412j5832
12206a17260j6554m2574q7877j18789q3083j0215J3714l0075o5094l0215O7527
12195e20495J97886K97749L12104K05721M9818o6329j31225j51413j35959j04700
12185d6843n7336k5968k947M7555J33073K13469K00719Q1790q6585k16268k69405
12174b8746k69981k28815j73851p3742P6343J92930J93312J14472K5919m7542
$$ plain form
12164 -219701 -258470 -289277 -442241 -674990 -777994 -655300 -347494 16258 317243 510454
12154 510454 578265 546209 486241 447146 403102 286900 86138 -139819 -327497 -437967
12144 -437967 -442702 -326561 -212402 -219542 -244420 -134143 89483 338910 574799 732425
12134 732425 705852 469128 209348 130673 214120 311755 371064 444482 497559 485159 424558
12123 424558 349055 274871 181807 28678 -188208 -374880 -401629 -271503 -165705 -186524
12113 -186524 -203993 -133096 -48363 7962 19236 12744 27202 37253 7253 -53414 -106098 -125937
12101 -125937 -134389 -152931 -161032 -129024 -59834 51018 238542 450533 541037 452465 281477
12090 281477 157406 125697 153419 174460 181607 231851 299568 245742 27069 -185149 -215363
$$ packed form
12164b19701l8769l0807j52964k32749j03004J22694L07806L63752L00985J93211
12154E10454O7811l2056n9968l9095m4044j16202k00762k25957j87678j10470
12144d37967m735J16141J14159p140k4878J10277K23626K49427K35889J57626
12134G32425k6573k36724k59780p8675Q3447R7635N9309P3418N3077j2400o0601
12123D24558p5503p4184r3064j53129k16886j86672k6749J30126J05798k0819
12113a86524j7469P0897Q4733N6325J1274o492J4458J0051l0000o0667n2684j9839
12101a25937q452j8542q101L2008O9190J10852J87524K11991R0504q8572j70988
12090B81477j24071l1709K7722K1041P147N0244O7717n3826k18673k12218l0214
$$ plain form
12079 -215363 -96659 37195 151379 291368 444596 555085 585341 509572 380570 238856
12069 238856 71164 -63150 -58246 72494 189214 199305 175171 211301 297814 385915 483536
12058 483536 587005 666606 683427 638713 588446 555697 535746 478315 316624 138984 57265
12047 57265 90202 202717 315050 381333 399905 363167 318118 292767 245381 181965 113705
12036 113705 33530 -45127 -114362 -186558 -277537 -350114 -371191 -378083 -421261 -483626 -508524 -484229
12024 -484229 -446999 -441803 -501988 -602870 -674748 -711621 -771082 -859442 -897852 -858558 -780173
12013 -780173 -700823 -639411 -572229 -451455 -248091 -3110 189784 314395 390722 391052 263384
12002 263384 -1731 -294924 -458021 -472471 -430074 -379364 -301841 -216442 -194107 -246076 -296728
$$ packed form
12079b15363J18704J33854J14184J39989J53228J10489L0256p5769j29002j41714
12069B38856j67692j34314M904J30740J16720J0091k4134L6130Q6513Q8101R7621
12058D83536J03469P9601J6821m4714n0267l2749j9951n7431j61691j77640q1719
12047E7265L2937J12515J12333O6283J8572l6738m5049k5351m7386o3416o8260
12036A13705q0175p8657o9235p2196r0979p2577k1077o892m3178o2365k4898K4295
12024d84229L7230N196o0185j00882p1878l6873n9461q8360l8410L9294P8385
12013g80173P9350O1412O7182J20774K03364K44981J92894J24611P6327L30j27668
12002B63384k65115k93193j63097j4450M2397N0710P7523Q5399K2335n1969n0652
$$ plain form
11991 -296728 -299809 -255728 -178413 -72885 36222 87897 95906 143290 200417 124469 -98250
11980 -98250 -370408 -595267 -699486 -706750 -680546 -663645 -639910 -603850 -603475 -659351 -724648 -759764
11968 -759764 -746851 -676183 -521946 -317229 -143389 -6693 116596 177012 111270 -60078
11958 -60078 -296981 -567894 -757198 -727719 -487744 -179832 132773 472222 831178 1106165
11948 1106165 1173629 1036269 729312 304126 -44794 -168578 -144916 -100034 -42054 36525
11938 36525 98723 93648 21385 -23704 -9040 17939 65907 140663 169953 114255 57083 66311
11926 66311 83939 32919 -90249 -196269 -172471 -23237 125450 172294 209427 367123 569052
11915 569052 663850 584320 404546 267260 199491 146075 80862 -14239 -111447 -173279 -211778
$$ packed form
11991b96728l081M4081P7315J05528J09107N1675Q009M7384N7127p5948k22719
11980i8250k72158k24859j04219p264K6204J6901K3735L6060L75n5876o5297l5116
11968g59764J2913P0668J54237K04717J73840J36696J23289O0416o5742j71348
11958f0078k36903k70913j89304K9479K39975L07912L12605L39449L58956K74987
11948A106165O7464j37360l06957m25186l48920j23784K3662M4882N7980P8579
11938C6525O2198n075p2263m5089J4664K6979M7968P4756K9290n5698n7172R228
11926F6311J7628n1020j23168j06020K3798J49234J48687M6844L7133J57696K01929
11915E69052R4798p9530j79774j37286o7769n3416o5213r5101r7208o1832l8499
$$ plain form
11904 -211778 -211625 -122129 109283 470160 824793 1041406 1053822 916989 732425 563425
11894 563425 429537 307297 191909 37285 -200280 -465870 -642756 -642984 -460971 -227287
11884 -227287 -84010 -4650 78085 151935 226203 372895 609348 844041 966501 968876 934390
11873 934390 876497 662473 288871 -66326 -285495 -328069 -245182 -181378 -143556 -48470 52435
11862 52435 60361 -7129 -62430 -63145 -106708 -272177 -498302 -661130 -715584 -669950 -499950
11851 -499950 -275790 -127487 -73089 -103706 -265534 -516769 -692828 -639921 -437970 -365672
11841 -365672 -570680 -955715 -1238459 -1286476 -1197321 -1127928 -1169534 -1203512 -1087679 -888626
11831 -888626 -780972 -819087 -918525 -946843 -881734 -779270 -637866 -495053 -436936 -465927 -531286
$$ packed form
11904b11778J53Q9496K31412L60877L54633K16613J2416j36833j84564j69000
11894E63425j33888j22240j15388j54624k37565k65590j76886k28J82013K33684
11884b27287J43277P9360Q2735P3850P4268J46692K36453K34693J22460K375l4486
11873I34390n7893k14024l73602l55197k19169m2574Q2887O3804L7822R5086J00905
11862E2435P926o7490n5301p15m3563j65469k26125j62828n4454M5634J70000
11851d99950K24160J48303N4398l0617j61828k51235j76059N2907K01951P2298
11841c65672k05008l85035k82744m8017Q9155O9393m1606l3978J15833J99053
11831h88626J07654l8115r9438k8318O5109J02464J41404J42813N8117k8991o5359
$$ plain form
11820 -531286 -608608 -631865 -558730 -453723 -416201 -495330 -600608 -548319 -299969 4478 200029
11809 200029 211803 139468 77928 16676 -13372 104573 320586 508380 654424 721969 663811
11798 663811 562001 536420 627843 795259 934408 1013783 1102915 1294044 1666365 2227892
11788 2227892 2906743 3611443 4303160 5011006 5805352 6777188 7976393 9369935 10731320
11779 10731320 11689671 12013336 11766039 11180973 10503101 9888602 9339319 8790275 8128951
11770 8128951 7273763 6294847 5359609 4609238 4019316 3470011 2957046 2562884 2330617
11761 2330617 2221896 2130173 1960970 1760555 1621228 1537517 1536021 1669031 1843676 1839327
11751 1839327 1554974 1144253 834365 688971 579405 443387 347115 266037 182025 157883
$$ packed form
11820e31286p7322k3257P3135J05007L7522p9129j05278N2289K48350L04447J95551
11809B00029J1774p2335o1540o1252l0048J17945K16013J87794J46044O7545n8158
11798F63811j01810k5581R1423J67416J39149P9375Q9132J91129L72321N61527
11788B227892O78851P04700O91717P07846P94346R71836J199205J393542J361385
11779A0731320R58351L23665k47297n85066o77872o14499n49283n49044o61324
11770H128951q55188r78916r35238p50371n89922n49305n12965l94162k32267
11761B330617j08721r1723j69203k00415j39327q3711j496J33010J74645m349
11751A839327k84353m10721l09888j45394j09566j36018r6272q1078q4012k4142
$$ plain form
11741 157883 242725 458505 733524 949772 1039405 977056 807744 650087 625512 771619
11731 771619 932331 950966 882707 856165 953983 1136632 1203257 1044463 760318 493987
11721 493987 317043 235170 215263 215317 206859 201353 238078 359555 569715 818496 1033513
11710 1033513 1166277 1231050 1264594 1274409 1215503 1097394 983264 919324 908247 917362 913077
11699 913077 870763 771960 681570 694695 856627 1116018 1347582 1499826 1625983 1816157
11689 1816157 2105719 2431715 2681018 2826780 2942503 3086228 3248704 3400059 3502760
11680 3502760 3540643 3574879 3708045 4065309 4783967 5738875 6692802 7626634 8669034 9958114
11670 9958114 11585778 13569778 15857974 18447662 21436447 24918677 28740532 32422475
$$ packed form
11741A57883Q4842K15780K75019K16248Q9633o2349j69312j57657k4575J46107
11731G71619J60712J8635o8259k6542R7818J82649O6625j58794k84145k66331
11721D93987j76944q1873j9907N4q458n506L6725J21477K10160K48781K15017
11710A033513J32764O4773L3544R815n8906j18109j14130o3940j1077R115m285
11699I13077m2314r8803r0390J3125J61932K59391K31564J52244J26157J90174
11689A816157K89562L25996K49303J45762J15723J43725J62476J51355J02701
11680C502760L7883L4236J33166L57264P18658R54908R53927R33832J042400J289080
11670I958114J627664J984000K288196K589688K988785L482230L821855L681943
$$ plain form
11662 32422475 35250629 36499788 35724664 33080171 29327459 25365075 21752797 18624155
11654 18624155 15938273 13648674 11690529 10003926 8551304 7300709 6217352 5298509
11646 5298509 4556977 3985618 3503637 3011031 2531611 2149413 1907333 1793819 1777740 1803150
11636 1803150 1762128 1596432 1395327 1238276 1101194 921135 733654 632561 643238 775700
11626 775700 988457 1131036 1126746 1048242 1021266 1078618 1182515 1309995 1420441 1499809 1539069
11615 1539069 1453492 1185243 805761 421590 106658 -97044 -179461 -176157 -118225 -58
11605 -58 151892 285366 325265 202919 263 -109639 -126590 -152755 -189835 -189127 -146773 -98882
11593 -98882 -88092 -95324 -73014 -21813 4030 -91482 -308294 -560141 -783711 -937974 -970135
$$ packed form
11662C2422475K828154J249159p75124k644493l752712l962384l612278l128642
11654A8624155k685882k289599j958145j686603j452622j250595j083357r18843
11646E298509p41532n71359m81981m92606m79420l82198k42080j13514j6079K5410
11636A803150m1022j65696k01105j57051j37082j80059j87481j01093J0677J32462
11626G75700K12757J42579m290p8504k6976N7352J03897J27480J10446P9368L9260
11615A539069q5577k68249l79482l84171l14932k03702q2417L304N7932J18167
11605e8J51950J33474L9899j22346k02656j09902j6951k6165l7080P08M2354M7891
11593i8882J0790p232K2310N1201K5843r5512k16812k51847k23570j54263l2161
$$ plain form
11582 -970135 -904224 -815929 -735696 -619174 -484314 -410497 -359496 -291317 -215208 -70220 187854
11571 187854 457676 601152 596720 502958 319687 65761 -117322 -127936 20376 222342
11561 222342 361292 365004 189314 -133248 -458031 -661603 -729282 -704034 -605328 -461373
11551 -461373 -292637 -91122 96179 187793 132984 -2858 -71948 -21959 61804 109130 74312
11540 74312 -33670 -80242 36490 208204 314674 379692 431616 409136 284951 175439
11530 175439 172535 219012 281762 382750 534324 691169 747978 666771 482589 259672 65674
11519 65674 -53026 -120857 -175378 -234609 -281916 -281728 -249242 -235710 -290926 -401833 -495540 -552880
11507 -552880 -549585 -426540 -239261 -111890 -75418 -77392 -49095 20656 39249 -37428 -169166
$$ packed form
11582i70135O5911Q8295Q0233J16522J34860P3817N1001O8179P6109J44988K58074
11571A87854K69822J43476m432r3762j83271k53926j83083j0614J48312K01966
11561B22342J38950L712j75690l22562l24783k03572o7679K5248R8706J43955
11551d61373J68736K01515J87301R1614n4809j35842o9090M9989Q3763M7326l4818
11540G4312j07982m6572J16732J71714J06470O5018N1924k2480j24185j09512
11530A75439k904M6477O2750J00988J51574J56845N6809q1207j84182k22917j93998
11519F5674j18700o7831n4521n9231m7307J88L2486J3532n5216j10907r3707n7340
11507e52880L295J23045J87279J27371L6472j974K8297O9751J8593p6677j31738
$$ plain form
11496 -169166 -293921 -351247 -398414 -471000 -485729 -423020 -347697 -309899 -322973 -404788 -567059
11485 -567059 -730895 -799550 -763816 -694069 -603833 -412779 -148449 77071 180945 163311
11475 163311 110784 116103 218362 387264 534381 573782 518818 460286 414895 328216 215536
11464 215536 139124 136325 195989 242392 203903 83370 -80823 -249378 -357036 -379562 -375254
11453 -375254 -408920 -443115 -392528 -290777 -264954 -345531 -484028 -605563 -645402 -628827 -611140
11442 -611140 -603198 -640706 -752880 -855035 -870060 -840074 -810129 -811737 -853365 -890249 -915774
11431 -915774 -963726 -1064448 -1142870 -1119720 -1017582 -908297 -814381 -735651 -663463 -625131 -669489
11420 -669489 -727731 -712183 -592728 -425507 -293315 -240185 -260952 -276746 -269177 -235951 -113019
$$ packed form
11496a69166j24755n7326m7167p2586j4729O2709P5323L7798j3074q1815j62271
11485e67059j63836o8655L5734O9747R0236J91054K64330K25520J03874j7634
11475A63311n2527N319J02259J68902J47117L9401n4964n8532m5391q6679j12680
11464B15536p6412k799N9664M6403l8489j20533j64193j68555j07658k2526M308
11453c75254l3666l4195N0587J01751K5823q0577j38497j21535l9839J6575J7687
11442f11140P942l7508j12174j02155j5025K9986K9945j608m1628l6884k5525
11431i15774m7952j00722p8422K3150J02138J09285R3916P8730P2188L8332m4358
11420f69489n8242J5548J19455J67221J32192N3130k0767j5794P569L3226J22932
$$ plain form
11409 -113019 104770 333281 511091 601349 558643 391792 159286 -44444 -166962 -179812
11399 -179812 -98362 -44112 -96925 -206687 -284239 -270356 -234196 -253763 -274931 -247667 -203443
11388 -203443 -159258 -91117 -5196 55669 3184 -184374 -402359 -553742 -649850 -732086 -733944
11377 -733944 -623240 -478450 -344706 -236141 -188042 -204585 -280769 -424014 -583213 -752528
11367 -752528 -967562 -1212419 -1443087 -1566161 -1531452 -1420113 -1279077 -1140658 -1060898 -1023049
11357 -1023049 -977876 -911177 -819967 -634455 -322981 -9687 195431 322025 393945 385911
11347 385911 317836 210602 118912 128633 239025 372505 468666 449354 281524 77414 -30214
11336 -30214 -17822 26370 51831 120184 257969 386931 419609 354192 256991 144940 19950
$$ packed form
11409a13019K17789K28511J77810R0258m2706j66851k32506k03730j22518j2850
11399a79812Q1450N4250n2813j09762p7552J3883L6160j9567k1168K7264M4224
11388b03443M4185O8141Q5921O0865n2485j87558k17985j51383r6108q2236j858
11377g33944J10704J44790J33744J08565M8099j6543p6184j43245j59199j69315
11367g52528k15034k44857k30668j23074L4709J11339J41036J38419P9760L7849
11357a023049M5173O6699R1210J85512L11474L13294K05118J26594P1920q034
11347C85911o8075j07234r1690R721J10392J33480R6161j9312j67830k04110j07628
11336c0214J2392M4192K5461O8353J37785J28962L2678o5417r7201j12051j24990
$$ plain form
11325 19950 -71579 -132924 -176309 -179789 -172349 -198003 -261069 -363626 -534125 -732031 -843897
11314 -843897 -827782 -741274 -644035 -532030 -364798 -167953 -32091 6647 -34385 -110279 -128247
11303 -128247 -51803 55363 137853 238671 342018 381916 332157 227808 154769 81488 -43606
11292 -43606 -121003 -74821 17541 52276 23705 -34508 -164197 -292600 -336317 -330721 -341229
11281 -341229 -402161 -500313 -603968 -716465 -817460 -870152 -903186 -958469 -1029048 -1057654 -1001983
11270 -1001983 -846226 -589349 -290670 -60773 59666 134183 191461 194319 175944 125706
11260 125706 -35481 -287544 -487847 -529626 -454178 -370259 -329317 -311502 -275022 -199898 -94288
11249 -94288 -8680 -21236 -120078 -220716 -278584 -247010 -157155 -101690 -101126 -156532 -274060 -387333
$$ packed form
11325A9950r1529o1345m3385l480P440k5654o3066j02557j70499j97906j11866
11314h43897J6115Q6508R7239J12005J67232J96845J35862L8738m1032p5894j7968
11303a28247P6444J07166Q2490J00818J03347L9898m9759j04349p3039p3281j25094
11292d3606p7397M6182R2362L4735k8571n8213j29689j28403m3717N596j0508
11281c41229o0932r8152j03655j12497j00995n2692l3034n5283p0579k8606N5671
11270a001983J55757K56877K98679K29897J20439P4517N7278K858j8375n0238
11260A25706j61187k52063k00303m1779P5448Q3919M0942J7815L6480P5124J05610
11249i4288Q5608j2556r8842j00638n7868L1574Q9855N5465N64n5406j17528j13273
$$ plain form
11237 -387333 -431769 -435828 -433410 -419013 -373463 -323075 -351650 -470125 -650995 -871237 -1040798
11226 -1040798 -1106787 -1088841 -1001698 -899098 -842497 -810339 -721439 -566959 -452069 -411400 -369074
11215 -369074 -305338 -275925 -270344 -273695 -298804 -351375 -393790 -367613 -300777 -244521 -199563 -196747
11203 -196747 -261122 -347884 -412539 -456514 -462938 -445353 -432689 -394049 -330401 -286599 -319552 -488306
11191 -488306 -739231 -953961 -1075558 -1072825 -1002294 -927912 -882157 -862485 -858319 -900116 -932562
11180 -932562 -847453 -652217 -443972 -279457 -145623 -55612 -25808 -22922 -38639 -84964 -149934
11169 -149934 -226506 -314783 -384414 -375632 -316796 -298830 -296456 -200410 -16309 144995 233927
11158 233927 225638 147909 100030 89864 83081 73359 65489 48109 1245 -43543 -38591 19620
$$ packed form
11237c87333m4436m059K418J4397M5550N0388k8575j18475j80870k20242j69561
11226a040798o5989J7946Q7143J02600N6601L2158Q8900J54480J14890M0669M2326
11215c69074O3736K9413N581l351k5109n2571m2415K6177O6836N6256M4958K816
11203a96747o4375q6762o4655m3975o424J7585J2664L8640O3648M3802l2953j68754
11191d88306k50925k14730j21597K733P0531P4382M5755J9672M166m1797l2446
11180i32562Q5109J95236K08245J64515J33834R0011K9804K886j5717m6325o4970
11169a49934p6572q8277o9631Q782N8836J7966K374R6046J84101J61304Q8932
11158B33927q289p7729m7879j0166o783r722p870j7380m6864m4788M952N8211
$$ plain form
11146 19620 76974 56849 -27618 -118301 -181789 -230418 -327529 -512793 -741842 -933512 -1061697
11135 -1061697 -1142027 -1214245 -1366937 -1548513 -1605996 -1497937 -1269412 -973229 -649730 -374953
11125 -374953 -222471 -170132 -176239 -250451 -365761 -424574 -357787 -176618 15598 106982 121014
11114 121014 144874 215419 335350 455360 504490 468209 415272 363400 254181 118356 16516
11103 16516 -53474 -118803 -187846 -217955 -236504 -359474 -556339 -662199 -586221 -424431 -244923
11092 -244923 -48277 156902 343697 452979 509866 579481 584096 455341 262850 88934
11082 88934 -38373 -127322 -205442 -285150 -365256 -477212 -623286 -715990 -717338 -674341 -599453
11071 -599453 -508796 -457144 -447890 -422643 -412632 -492242 -644821 -788736 -840941 -770548 -679982
$$ packed form
11146A9620N7354k0125q4467r0683o3488m8629r7111j85264k29049j91670j28185
11135a061697q0330p2218j52692j81576n7483J08059K28525K96183L23499K74777
11125c74953J52482N2339o107p4212j15310n8813O6787J81169J92216R1384J4032
11114A21014K3860P0545J19931J20010M9130l6281n2937n1872j09219j35825j01840
11103A6516o9990o5329o9043l0109j8549j22970j96865j05860P5978J61790J79508
11092b44923J96646K05179J86795J09282N6887O9615M615j28755j92491j73916
11082H8934j27307q8949p8120p9708q0106j11956j46074r2704j348M2997P4888
11071e99453R0657N1652R254K5247J0011p9610j52579j43915n2205P0393R0566
$$ plain form
11060 -679982 -653988 -699664 -766952 -771471 -709271 -629296 -564912 -491721 -420998 -336235 -211962
11049 -211962 -121909 -158648 -282122 -377508 -417961 -451214 -533785 -674325 -794051 -833897 -772789
11038 -772789 -640046 -537677 -533339 -565127 -570741 -582408 -561588 -434066 -242653 -57298 47416
11027 47416 31017 -68158 -187527 -282830 -355308 -429757 -490592 -468631 -350660 -210392 -123660
11016 -123660 -71097 -16887 20256 13482 -27410 -104857 -244069 -398255 -468508 -447285 -456105
11005 -456105 -565226 -733971 -904485 -1018410 -1033462 -951902 -832672 -723950 -609978 -476774
10995 -476774 -357233 -280770 -260198 -292435 -348943 -361087 -305269 -242414 -217177 -295702 -459243
10984 -459243 -593747 -663229 -676382 -643339 -605219 -600455 -596176 -503974 -310004 -82966 57647
$$ packed form
11060f79982K5994m5676o7288m519O2200P9975O4384P3191P0723Q4763J24273
11049b11962R0053l6739j23474r5386m0453l3253q2571j40540j19726l9846O1108
11038g72789J32743J02369M338l1788n614j1667K0820J27522J91413J85355J04714
11027D7416j6399r9175j19369r5303p2478p4449o0835K1961J17971J40268Q6732
11016a23660N2563N4210L7143o774m0892p7447j39212j54186p0253K1223q820
11005d56105j09121j68745j70514j13925j5052Q1560J19230J08722J13972J33204
10995d76774J19541P6463K0572l2237n6508j2144N5818O2855K5237p8525j63541
10984d59243j34504o9482j3153L3043L8120M764M279R2202J93970K27038J40613
$$ plain form
10973 57647 57459 14094 1349 -26222 -115755 -244313 -382504 -500410 -525149 -404536 -231166
10962 -231166 -143584 -138489 -162816 -183732 -209224 -260180 -326059 -408736 -431295 -347436 -243605
10951 -243605 -205186 -232296 -281348 -288796 -234535 -102368 66405 127873 31764 -116032 -232512
10940 -232512 -304804 -314980 -283344 -228258 -167681 -145247 -181829 -215287 -198332 -95990 81934
10929 81934 236946 327755 367917 375548 384364 403639 397184 423897 523056 566642 465608 263710
10917 263710 5574 -245786 -463307 -688762 -894397 -1004533 -1021608 -1023840 -1033580 -1032651 -1031210
10906 -1031210 -1061152 -1113116 -1121501 -1055250 -974491 -938788 -923854 -900487 -866333 -800865 -746734
10895 -746734 -710570 -617564 -493134 -399106 -340163 -299793 -259042 -176739 -60097 52643 75032
$$ packed form
10973E7647j88m3365j2745k7571q9533j28558j38191j17906k4739J20613J73370
10962b31166Q7582N095k4327k0916k5492n0956o5879q2677k2559Q3859J03831
10951b43605L8419k7110m9052p448N4261J32167J68773O1468r6109j47796j16480
10940b32512p2292j0176L1636N5086O0577K2434l6582l3458J6955J02342J77924
10929H1934J55012R0809M0162P631Q816J9275o455K6713R9159M3586j01034k01898
10917B63710k58136k51360k17521k25455k05635j10136j7075k232r740R29J441
10906a031210k9942n1964q385O6251Q0759L5703J4934K3367L4154O5468N4131
10895g46734L6164R3006J24430R4028N8943M0370M0751Q2303J16642J12740K2389
$$ plain form
10884 75032 -33006 -191805 -341079 -439281 -491967 -520995 -567051 -667133 -779701 -833524 -818899
10873 -818899 -756724 -631453 -489168 -397148 -345891 -289346 -186805 -119586 -148177 -166547 -93479
10862 -93479 33143 147131 250110 379890 524256 637963 668873 605577 458760 232430
10852 232430 -17517 -228509 -371887 -434535 -389196 -292913 -246928 -241504 -239157 -234308 -201171
10841 -201171 -112458 21309 157942 231817 212278 156787 110023 64138 -22523 -177534 -362127
10830 -362127 -532292 -595280 -523723 -411820 -343432 -348648 -356231 -288624 -214341 -194884 -175102
10819 -175102 -124474 -46956 19346 27988 16506 64072 139871 151961 65971 -56959 -163688
10808 -163688 -276708 -382880 -455389 -528632 -623178 -652879 -587030 -459917 -283346 -109634
$$ packed form
10884G5032j08038j58799j49274r8202n2686k9028m6056j00082j12568n3823J4625
10873h18899O2175J25271J42285R2020N1257N6545J02541O7219k8591j8370P3068
10862i3479J26622J13988J02979J29780J44366J13707L0910o3296j46817k26330
10852B32430k49947k10992j43378o2648M5339R6283M5985N424K347M849L3137
10841b01171Q8713J33767J36633P3875j9539n5491m6764m5885q6661j55011j84593
10830c62127j70165o2988P1557J11903O8388n216p583O7607P4283J9457J9782
10819a75102N0628P7518O6302Q642j1482M7566P5799J2090q5990j22930j06729
10808a63688j13020j06172p2509p3243r4546k9701O5849J27113J76571J73712
$$ plain form
10798 -109634 7940 20220 -55155 -157516 -258553 -336933 -353422 -289304 -139447 113312
10788 113312 430834 721249 902169 904585 727782 449148 172688 -7715 -79735 -51246
10778 -51246 41260 143079 249800 354302 433094 470459 415918 265521 120684 62623 20492
10767 20492 -87292 -198537 -291517 -410135 -518255 -534925 -435498 -288784 -160203 -62512
10757 -62512 -12101 6945 -4003 -15090 8489 43657 82638 68477 -29322 -167665 -283930
10746 -283930 -374200 -484157 -576797 -566973 -445648 -217562 116201 433172 604948 611694 523112
10735 523112 455458 392792 240072 52331 -70626 -118519 -130930 -156677 -155529 -64913 31049
10724 31049 -23946 -286126 -620844 -873513 -994045 -1016691 -1012745 -1013297 -1002734 -960527 -841587
$$ packed form
10798a09634J17574J2280p5375j02361j01037p8380j6489O4118J49857K52759
10788A13312L17522K90415J80920K416j76803k78634k76460j80403p2020K8489
10778e1246R2506J01819J06721J04502P8792L7365n4541j50397j44837n8061m2131
10767B0492j07784j11245r2980j18618j08120j6670R9427J46714J28581R7691
10757f2512N0411J9046j0948j1087K3579L5168L8981j4161r7799j38343j16265
10746b83930r0270j09957r2640R824J21325K28086L33763L16971J71776O746q8582
10735E23112o7654o2666j52720j87741j22957m7893j2411k5747J148R0616R5962
10724C1049n4995k62180l34718k52669j20532k2646L946n52J0563M2207J18940
$$ plain form
10713 -841587 -679888 -565654 -501353 -469574 -509262 -632178 -773737 -859811 -850526 -786802 -785159
10702 -785159 -866975 -928997 -906233 -830323 -726835 -568920 -341261 -125795 -22712 6464
10692 6464 -6596 -83483 -182040 -238944 -227423 -123141 67892 232969 239197 70904 -143606
10681 -143606 -279012 -278954 -141743 50053 196571 237900 155128 49470 46001 102137 108396
10670 108396 75951 42526 31359 88253 197745 291029 378493 512322 623282 647221 658281
10659 658281 745092 845721 865369 801553 705164 568824 405510 302358 266788 236521 205506
10648 205506 208611 199927 119182 -15181 -83209 -39119 14714 54060 99342 105560 28181 -135454
10636 -135454 -360367 -553469 -628245 -570546 -415162 -216809 -58430 11096 7431 -49097 -82641
$$ packed form
10713h41587J61699J14234O4301L1779l9688j22916j41559q6074R285O3724J643
10702g85159q1816o2022K2764P5910J03488J57915K27659K15466J03083K9176
10692F464j3060p6887r8557n6904J1521J04282J91033J65077O228j68293k14510
10681a43606j35406N8J37211J91796J46518M1329q2772j05658l469N6136O259
10670A08396l2445l3425j1167N6894J09492R3284Q7464J33829J10960K3939J1060
10659F58281Q6811J00629J9648o3816r6389j36340j63314j03152l5570l0267l1015
10648B05506L105q684q0745j34363o8028M4090N3833L9346M5282O218p7379j63635
10636a35454k24913j93102p4776N7699J55384J98353J58379O9526l665n6528l3544
$$ plain form
10625 -82641 14273 210060 319520 260251 144255 56010 -21082 -66251 -74614 -95267 -144999
10614 -144999 -230987 -332137 -369397 -306151 -210535 -165258 -174944 -216082 -317542 -420159 -426862
10603 -426862 -321387 -165727 -20676 93710 137901 82423 -27716 -120427 -199426 -274904
10593 -274904 -355272 -467058 -564759 -598463 -536367 -380379 -196051 -41294 22684 -44655 -211234
10582 -211234 -419517 -629061 -832905 -1018045 -1096623 -1032538 -941834 -943728 -983041 -907116 -689810
10571 -689810 -423560 -185459 -62753 -89587 -211213 -334065 -377308 -326683 -182674 81616
10561 81616 445040 771636 932903 903353 733827 524147 389433 315367 230838 198028
10551 198028 245174 312507 325649 292739 280737 346725 487189 626866 711560 773582 868532
$$ packed form
10625h2641R6914J95787J09460n9269j15996q8245p7092m5169q363k0653m9732
10614a44999q5988j01150l7260O3246R5616M5277r686m1138j01460j02617o703
10603d26862J05475J55660J45051J14386M4191n5478j10139r2711p8999p5478
10593b74904q0368j11786r7701l3704O2096J55988J84328J54757O3978o7339j66579
10582b11234k08283k09544k03844j85140p8578O4085R0704j894l9313P5925K17306
10571f89810K66250K38101J22706k6834j21626j22852m3243N0625J44009K64290
10561H1616L63424L26596J61267k9550j69526k09680j34714p4066q4529l2810
10551A98028M7146O7333J3142l2910j2002O5988J40464J39677Q4694O2022R4950
$$ plain form
10540 868532 976582 1063362 1077795 983253 846689 759164 737381 688324 485986 165056 -113297
10529 -113297 -195518 -11512 299231 546077 705629 810132 823585 721168 551163 375484
10519 375484 294245 350507 469150 575186 659685 680819 630967 607499 651776 669338 564767
10508 564767 345304 99817 -78739 -135515 -114281 -93430 -63476 1677 93866 163866 154560
10497 154560 62768 1949 79552 244574 423778 547501 515738 299782 25963 -184628
10487 -184628 -336736 -476526 -587497 -629617 -620510 -581316 -485423 -325344 -144926 38752
10477 38752 220544 368138 460946 452738 357948 257897 184274 143582 156861 215324 252555
10466 252555 251558 207070 109234 -2226 -91105 -157393 -223907 -314700 -441690 -599285 -728908
$$ packed form
10540H68532J08050Q6780J4433r4542j36564q7525k1783m9057k02338l20930k78353
10529a13297q2221J84006L10743K46846J59552J04503J3453j02417j70005j75679
10519C75484q1239N6262J18643J06036Q4499K1134m9852k3468M4277J7562j04571
10508E64767k19463k45487j78556n6776K1234K0851K9954O5153R2189P0000r306
10497A54560r1792o0819P7603J65022J79204J23723l1763k15956k73819k10591
10487a84628j52108j39790j10971m2120R107L9194R5893J60079J80418J83678
10477C8752J81792J47594R2808q208r4790j00051p3623m0692J3279N8463L7231
10466B52555r97m4488r7836j11460q8879o6288o6514r0793j26990j57595j29623
$$ plain form
10455 -728908 -786818 -778102 -695058 -454079 -100906 151300 208770 126142 42941 34488 32505
10444 32505 -5051 -53118 -78704 -80444 -59958 -33827 -7801 6561 -29972 -144446 -333171
10433 -333171 -605619 -915808 -1154008 -1247774 -1228471 -1186514 -1147392 -1086187 -1017011 -946211 -794468
10422 -794468 -518907 -227937 -33640 36544 -1092 -121496 -311529 -565712 -854030 -1112531
10412 -1112531 -1260297 -1247536 -1152800 -1112012 -1197628 -1347049 -1409331 -1311714 -1129688 -989648
10402 -989648 -962029 -1027007 -1073337 -986801 -727645 -337846 56530 324500 438597 480594
10392 480594 474012 393894 310537 279593 262222 234864 190919 116157 33553 34385 140627 255130
10380 255130 329640 404430 475968 459560 296995 47057 -206292 -437737 -606363 -678610
$$ packed form
10455g28908n7910Q716Q3044K40979L53173K52206N7470q2628q3201q453j983
10444C2505l7556m8067k5586j740K0486K6131K6026J4362l6533j14474j88725
10433c33171k72448l10189k38200r3766J9303M1957L9122O1205O9176P0800J51743
10422g94468K75561K90970J94297P0184l7636j20404j90033k54183k88318k58501
10412a112531j47766J2761R4736M0788q5616j49421o2282R7617J82026J40040
10402i89648K7619o4978m6330Q6536K59156L89799L94376K67970J14097M1997
10392D80594o582q0118q3357l0944j7371k7358m3945p4762q2604Q32J06242J14503
10380B55130P4510P4790P1538j6408j62565k49938k53349k31445j68626p2247
$$ plain form
10370 -678610 -663109 -562260 -362009 -132193 46967 179068 222115 124025 -67353 -253791
10360 -253791 -353822 -365698 -319185 -246792 -190624 -198385 -291279 -392974 -394885 -259686 -75536
10349 -75536 -43712 -218023 -439361 -578048 -615695 -586943 -531499 -482840 -396069 -274571 -168853
10338 -168853 -47812 68437 95412 34108 -2925 9603 -1465 -46892 -114553 -187793 -195674
10327 -195674 -81333 104558 273634 433300 604463 710125 695171 589221 419293 192277
10317 192277 13590 -79755 -157030 -226413 -234594 -157593 -47985 43169 121024 181576 198136
10306 198136 144669 48386 -40916 -99001 -85814 30271 185892 271731 243809 170284 149424
10295 149424 165434 155041 97030 23287 -6136 8293 47912 127823 173269 124645 55039
$$ packed form
10370f78610J5501J00849K00251K29816J79160J32101M3047r8090j91378j86438
10360b53791j00031j1876M6513P2393N6168p761r2894j01695j911J35199J84150
10349g5536L1824j74311k21338j38687l7647K8752N5444M8659Q6771J21498J05718
10338a68853J21041J16249K6975o1304l7033J2528j1068m5427o7661p3240p881
10327a95674J14341J85891J69076J59666J71163J05662j4954j05950j69928k27016
10317A92277j78687r3345p7275o9383q181P7001J09608R1154P7855O0552J6560
10306A98136n3467r6283q9302n8085J3187J16085J55621Q5839k7922p3525k0860
10295A49424J6010j0393n8011p3743k9423J4429L9619P9911M5446m8624o9606
$$ plain form
10284 55039 6400 -74358 -129110 -85433 -22416 -17800 -85868 -239508 -474835 -746472 -915252
10273 -915252 -922639 -886553 -893725 -916031 -899124 -807352 -651455 -462880 -258053 -50684 74413
10262 74413 68804 -19637 -143637 -256014 -367884 -483346 -554963 -603879 -683866 -801055 -923207
10251 -923207 -984700 -963309 -885518 -744195 -488102 -171601 31034 49656 207 31081 174010
10240 174010 350220 487226 515807 427156 332290 336494 370997 296716 154699 111787 213414
10229 213414 369121 471265 442762 330273 237664 174955 130844 120552 154295 193751 173404
10218 173404 106713 71193 98796 131485 123284 101129 86216 98289 158048 298982 498435
10207 498435 588447 494467 257083 -1361 -138587 -189931 -265840 -363274 -442989 -504867 -567701
$$ packed form
10284E5039m8639q0758n4752M3677O3017M616o8068j53640k35327k71637j68780
10273i15252p387L6086p172k2306J6907R1772J55897J88575K04827K07369J25097
10262G4413n609q8441j24000j12377j11870j15462p1617m8916p9987j17189j22152
10251i23207o1493K1391P7791J41323K56093L16501K02635J8622m9449L0874J42929
10240A74010J76210J37006K8581q8651r4866M204L4503p4281j42017m2912J01627
10229B13414J55707J02144k8503j12489r2609o2709m4111j0292L3743L9456k0347
10218A73404o6691l5520K7603L2689q201k2155j4913J2073N9759J40934J99453
10207D98435R0012r3980k37384k58444j37226n1344p5909r7434p9715o1878o2834
$$ plain form
10196 -567701 -618061 -612919 -573792 -529994 -451517 -295843 -84155 124786 276391 375193 488024
10185 488024 630758 749335 787209 737499 635301 553367 534186 580189 655765 651705 475871
10174 475871 214996 20009 -78556 -115454 -74412 64257 268940 457550 547307 553627 535890
10163 535890 512362 478277 447808 435134 419131 383753 348130 306860 300169 369785 467359 541964
10151 541964 586893 603716 600248 576281 586871 642576 647688 579267 489129 441899 450620 452516
10139 452516 386081 278170 187187 137839 115225 123820 154225 124979 -563 -149599 -266249
10128 -266249 -308441 -261791 -159741 -36011 132704 355210 554826 677087 721156 733357
10118 733357 682455 550903 385063 254035 194544 154995 74026 -31731 -123166 -204198 -300485
$$ packed form
10196e67701n0360N142L9127M3798P8477J55674K11688K08941J51605R8802J12831
10185D88024J42734J18577L7874m9710j02198q1934j9181M6003P5576m060j75834
10174D75871k60875j94987r8565l6898M1042J38669K04683J88610Q9757O320j7737
10163E35890k3528l4085l0469j2674j6003l5378l5623m1270o691O9616R7574P4605
10151E41964M4929J6823l468k3967J0590N5705N112o8421r0138m7230Q721J896
10139D52516o6435j07911r0983m9348k2614Q595L0405k9246j25542j49036j16650
10128b66249m2192M6650J02050J23730J68715K22506J99616J22261M4069J2201
10118G33357n0902j31552j65840j31028n9491l9549q0969j05757r1435q1032r6287
$$ plain form
10107 -300485 -413833 -566190 -736205 -816188 -825118 -827717 -796271 -698916 -587329 -527547 -477970
10096 -477970 -373143 -253636 -181629 -136021 -97813 -53367 18551 98571 158094 206389 222945
10085 222945 170657 31750 -170500 -315662 -314969 -268123 -281929 -361401 -486706 -666030 -861244
10074 -861244 -953328 -808240 -410072 73534 467681 715200 855114 877218 772585 629769
10064 629769 568577 621012 744987 867103 917042 871455 751299 590173 428970 302682
10054 302682 221352 199857 234814 249676 163255 22752 -76069 -164718 -272475 -361398 -400613
10043 -400613 -372304 -297830 -202098 -113958 -3569 194695 453561 661820 753014 850719 1064355
10032 1064355 1351877 1640500 1883451 2130473 2408199 2629068 2685552 2575325 2342888 2060964
$$ packed form
10107c00485j13348j52357j70015p9983q930k599L1446R7355J11587N9782M9577
10096d77970J04827J19507P2007M5608L8208M4446P1918Q0020N9523M8295J6556
10085B22945n2288j38907k02250j45162O93M6846j3806p9472j25305j79324j95214
10074h61244r2084J45088L98168M83606L94147K47519J39914K2104j04633j42816
10064F29769o1192N2435J23975J22116M9939m5587j20156j61126j61203j26288
10054C02682q1330k1495L4957J4862q6421j40503r8821q8649j07757q8923l9215
10043d00613K8309P4474R5732Q8140J10389J98264K58866K08259R1194R7705K13636
10032A064355K87522K88623K42951K47022K77726K20869N6484j10227k32437k81924
$$ plain form
10022 2060964 1825488 1630226 1422692 1221566 993631 680489 409343 334881 395330 471791
10012 471791 535700 586125 664169 779878 817916 695712 438067 149802 -57978 -164516
10002 -164516 -204231 -230767 -264829 -317478 -369712 -405139 -456448 -519722 -562224 -570872 -536718 -464707
9990 -464707 -388509 -312844 -213951 -111307 -46555 -31703 -46863 -110589 -252525 -408439 -527750
9979 -527750 -643231 -712965 -663474 -507584 -363170 -346756 -407215 -412648 -331510 -203992 -85058
9968 -85058 -13675 -12524 -52360 -28597 113048 294827 448210 582383 682510 776465 933284
9957 933284 1167498 1444872 1710274 1948632 2120654 2198407 2201597 2112923 1924114 1690176
9947 1690176 1507626 1445201 1447452 1399671 1225237 1005058 903396 933295 1006498 1040210 987623
$$ packed form
10022B060964k35476j95262k07534k01126k27935l13142k71146p4462O0449P6461
10012D71791O3909N0425P8044J15709L8038j22204k57645k88265k07780j06538
10002a64516l9715k6536l4062n2649n2234l5427n1309o3274m2502q648L4154P2011
9990d64707P6198P5665R8893J02644O4752J4852j5160o3726j41936j55914j19311
9979e27750j15481o9734M9491J55890J44414J6414o0459n433Q1138J27518J18934
9968h5058P1383J151l9836K3763J41645J81779J53383J34173J00127R3955J56819
9957I33284K34214K77374K65402K38358J72022P7753L190q8674j88809k33938
9947A690176j82550o2425K251m7781j74434k20179j01662K9899P3203L3712n2587
$$ plain form
9936 987623 867071 733744 575294 383973 220101 137432 115701 105035 54069 -55791
9926 -55791 -192129 -313572 -383779 -429134 -479964 -463539 -346305 -168367 23453 99561 6515
9915 6515 -155191 -294182 -335432 -264082 -167148 -134369 -116658 -688 229399 510883 788058
9904 788058 1021466 1170829 1189277 1114332 1036632 968871 835180 609797 353508 144324
9894 144324 42462 34296 78342 186924 400656 701551 938857 990323 886440 693324
9884 693324 499282 385760 360975 425246 530371 612348 615578 562558 564126 638924 696079
9873 696079 664703 603756 542299 459947 362913 310105 366052 559094 804905 961069 964951
9862 964951 853434 707819 642099 707320 864876 1030056 1081052 998157 902752 861297 803085
$$ packed form
9936I87623j20552j33327j58450j91321j63872q2669k1731j0666n0966j09860
9926e5791j36338j21443p0207m5355n0830J6425J17234J77938J91820P6108r3046
9915F515j61706j38991m1250P1350R6934L2779J7711J15970K30087K81484K77175
9904G88058K33408J49363J8448p4945p7700o7761j33691k25383k56289k09184
9894A44324j01862q166M4046J08582K13732L00895K37306N1466j03883j93116
9884F93324j94042j13522k4785O4271J05125Q1977L230n3020J568P4798N7155
9873F96079l1376o0947o1457q2352r7034n2808N5947J93042K45811J56164L882
9862I64951j11517j45615o5720O5221J57556J65180N0996q2895r5405m1455n8212
$$ plain form
9851 803085 705622 632091 625887 671806 770178 951363 1190367 1407362 1545518 1626647 1692438
9840 1692438 1780829 1942381 2169014 2373742 2490809 2451852 2241256 1993928 1834711 1800066
9830 1800066 1861629 1935384 1943376 1857280 1665335 1356964 1002980 700145 500838 416037 407142
$$ packed form
9851H03085r7463p3531o204M5919R8372J81185K39004K16995J38156Q1129O5791
9840A692438Q8391J61552K26633K04728J17067l8957k10596k47328j59217l4645
9830A800066O1563P3755P992q6096j91945l08371l53984l02835j99307q4801q895
$$ [...]
##END NTUPLES=NMR SPECTRUM
##END=
