##TITLE=C13_LR-795-MK1
 CDCl3, 22300sc

 27.1.2025
##JCAMPDX= 6.0         $$ Bruker NMR JCAMP-DX V2.0
##DATA TYPE= NMR SPECTRUM
##DATA CLASS= NTUPLES
##ORIGIN= UXNMR, Bruker Analytische Messtechnik GmbH
##OWNER= root
$$ XWIN-NMR		Version 3.5
$$ Tue Jan 28 13:36:49 2025 Russian Standard Time (UT+4h)  she@DPX200
##.OBSERVE FREQUENCY= 50.327896
##.OBSERVE NUCLEUS= ^13C
##.ACQUISITION MODE= SIMULTANEOUS
##.ACQUISITION SCHEME= undefined
##.AVERAGES= 22101
##.DIGITISER RES= 17
##SPECTROMETER/DATA SYSTEM= spect
##.PULSE SEQUENCE= zgpg30
##.SOLVENT NAME= CDCl3
##.SHIFT REFERENCE= (INTERNAL, CDCl3, 0, 222.646)
##AUDIT TRAIL= $$ (NUMBER, WHEN, WHO, WHERE, WHAT)
$$ ##TITLE= Audit trail, XWIN-NMR		Version 3.5
$$ ##JCAMPDX= 5.01
$$ ##ORIGIN= Bruker BioSpin GmbH
$$ ##OWNER= she
$$ F:/spectra/data/she/nmr/c13/1/pdata/1/auditp.txt
$$ ##AUDIT TRAIL=  $$ (NUMBER, WHEN, WHO, WHERE, WHAT)
(   1,<2025-01-28 13:35:36.67 +0400>,<she>,<DPX200>,
      <created by zg, POWCHK disabled, PULCHK disabled
       terminated by command 'halt'
       configuration hash MD5:
       00 E9 B6 7A A2 85 ED C7 34 08 36 98 17 FE 4E 26
       data hash MD5: 32K
       83 DE 50 E5 F0 F1 8E 81 53 AA C7 62 DD AF 26 3B>)
(   2,<2025-01-28 13:35:46.00 +0400>,<she>,<DPX200>,
      <Start of raw data processing
       efp BC_mod = 2 LB = 2 FT_mod = 6 PKNL = 1 PHC0 = -404.6255 PHC1 = 36.88833 SI = 32K 
       data hash MD5: 32K
       DE 13 2B 75 90 A2 38 A5 3F 06 31 1F 01 F1 6C 7A>)
(   3,<2025-01-28 13:35:49.62 +0400>,<she>,<DPX200>,
      <abs ABSG = 5 
       data hash MD5: 32K
       80 76 F1 EF 13 13 22 28 5B BC 32 4D C1 48 05 CE>)
(   4,<2025-01-28 13:36:12.57 +0400>,<she>,<DPX200>,
      <pk PHC0 = 1.834866 PHC1 = -2.4 
       data hash MD5: 32K
       FD A9 AC 5A 0C 31 FC 62 B4 53 44 2A FC 69 14 9F>)
(   5,<2025-01-28 13:36:16.25 +0400>,<she>,<DPX200>,
      <abs ABSG = 5 
       data hash MD5: 32K
       B1 EA 4A 96 B6 BD 0B 61 51 FE F1 36 DF 82 90 AD>)
$$ ##END=
$$ 
$$ hash MD5
$$ A5 C4 30 82 F3 21 38 F4 75 D6 A2 B2 81 EA 33 74
##$RELAX= 
##$RELAX= 
##$RELAX= 
##$RELAX= 
##$RELAX= 
##$RELAX= 
##$RELAX= 
##$RELAX= 
$$ Bruker specific parameters
$$ --------------------------
##$DU= <F:/spectra>
##$EXPNO= 1
##$NAME= <c13>
##$PROCNO= 1
##$TYPE= <nmr>
##$USER= <she>
##$AMP= (0..31)
100 100 100 100 100 100 100 100 100 100 100 100 100 100 100 100 100 100 
100 100 100 100 100 100 100 100 100 100 100 100 100 100 
##$AQSEQ= 0
##$AQ_mod= 1
##$AUNM= <au_zg>
##$AUTOPOS= <>
##$BF1= 50.322709
##$BF2= 200.13
##$BF3= 50.322709
##$BF4= 500.13
##$BF5= 500.13
##$BF6= 500.13
##$BF7= 500.13
##$BF8= 500.13
##$BYTORDA= 1
##$CFDGTYP= 0
##$CFRGTYP= 5
##$CHEMSTR= <none>
##$CNST= (0..31)
1 1 145 1 1 1 1 1 1 1 1 1 1 1 1 1 1 1 1 1 1 1 1 1 1 1 1 1 1 1 1 1 
##$CPDPRG= <waltz16>
##$CPDPRG1= <>
##$CPDPRG2= <waltz16>
##$CPDPRG3= <>
##$CPDPRG4= <mlev>
##$CPDPRG5= <mlev>
##$CPDPRG6= <mlev>
##$CPDPRG7= <mlev>
##$CPDPRG8= <mlev>
##$CPDPRGB= <>
##$CPDPRGT= <>
##$D= (0..31)
$$ [...]
##$SUBNAM4= <"">
##$SUBNAM5= <"">
##$SUBNAM6= <"">
##$SUBNAM7= <"">
##$SUBNAM8= <"">
##$SUBNAM9= <"">
##$SW= 239.972175391363
##$SWIBOX= (0..15)
0 1 3 0 0 0 0 0 0 0 0 0 0 0 0 0 
##$SW_h= 12077.2946859903
##$TD= 32768
##$TD0= 1
##$TE= 0
##$TE2= 300
##$TE3= 300
##$TEG= 300
##$TL= (0..7)
120 120 120 120 120 120 120 120 
##$TP= (0..7)
150 150 150 150 150 150 150 150 
##$TP07= 0
##$TPNAME0= <>
##$TPNAME1= <>
##$TPNAME2= <>
##$TPNAME3= <>
##$TPNAME4= <>
##$TPNAME5= <>
##$TPNAME6= <>
##$TPNAME7= <>
##$TPOAL= (0..7)
0.5 0.5 0.5 0.5 0.5 0.5 0.5 0.5 
##$TPOFFS= (0..7)
0 0 0 0 0 0 0 0 
##$TUNHIN= 0
##$TUNHOUT= 0
##$TUNXOUT= 0
##$USERA1= <user>
##$USERA2= <user>
##$USERA3= <user>
##$USERA4= <user>
##$USERA5= <user>
##$V9= 5
##$VALIST= <valist>
##$VCLIST= <CCCCCCCCCCCCCCC>
##$VD= 0
##$VDLIST= <DDDDDDDDDDDDDDD>
##$VPLIST= <PPPPPPPPPPPPPPP>
##$VTLIST= <TTTTTTTTTTTTTTT>
##$WBST= 1024
##$WBSW= 4
##$XGAIN= (0..3)
0 0 0 0 
##$XL= 0
##$YL= 0
##$YMAX_a= 115493924
##$YMIN_a= -61644174
##$ZGOPTNS= <>
##$ZL1= 120
##$ZL2= 120
##$ZL3= 120
##$ZL4= 120
##$ABSF1= 222.646
##$ABSF2= -17.35081
##$ABSG= 5
##$ABSL= 3
##$ALPHA= 0
##$AQORDER= 0
##$ASSFAC= 0
##$ASSFACI= 0
##$ASSFACX= 0
##$ASSWID= 0
##$AUNMP= <proc_1d>
##$AZFE= 0.1
##$AZFW= 0.5
##$BCFW= 0
##$BC_mod= 2
##$BYTORDP= 0
##$COROFFS= 0
##$CY= -3
##$DATMOD= 1
##$DC= 0
##$DFILT= <>
##$DTYPP= 0
##$F1P= 0
##$F2P= 0
##$FCOR= 0.5
##$FTSIZE= 32768
##$FT_mod= 6
##$GAMMA= 0
##$GB= 0
##$INTBC= 1
##$INTSCL= 4.134877e-10
##$ISEN= 128
##$LB= 2
##$LEV0= 0
##$LPBIN= 0
##$MAXI= 10000
##$MC2= 0
##$MEAN= 0
##$ME_mod= 0
##$MI= 0.1934396
##$NCOEF= 0
##$NC_proc= 2
##$NLEV= 6
##$NOISF1= 120.0001
##$NOISF2= 80.00006
##$NSP= 0
##$NTH_PI= 0
##$NZP= 0
##$OFFSET= 222.646
##$PC= 1.4
##$PHC0= -402.7906
##$PHC1= 34.48833
##$PH_mod= 1
##$PKNL= yes
##$PPARMOD= 0
##$PSCAL= 0
##$PSIGN= 0
##$REVERSE= no
##$SF= 50.3227304950709
##$SI= 32768
##$SIGF1= 140
##$SIGF2= 120
##$SINO= 11.81781
##$SIOLD= 32768
##$SREGLST= <13C.CDCl3>
##$SSB= 0
##$STSI= 32768
##$STSR= 0
##$SW_p= 12077.2946859903
##$SYMM= 0
##$S_DEV= 0
##$TDeff= 32768
##$TDoff= 0
##$TI= <>
##$TILT= no
##$TM1= 0
##$TM2= 0
##$TOPLEV= 0
##$USERP1= <user>
##$USERP2= <user>
##$USERP3= <user>
##$USERP4= <user>
##$USERP5= <user>
##$WDW= 1
##$XDIM= 32768
##$YMAX_p= 329451384
##$YMIN_p= -1715923
$$ End of Bruker specific parameters
$$ ---------------------------------
##NTUPLES= NMR SPECTRUM
##VAR_NAME=  FREQUENCY,     SPECTRUM/REAL,   SPECTRUM/IMAG
##SYMBOL=    X,             R,               I
##VAR_TYPE=  INDEPENDENT,   DEPENDENT,       DEPENDENT
##VAR_FORM=  AFFN,          ASDF,            ASDF
##VAR_DIM=   32768,         32768,           32768
##UNITS=     HZ,            ARBITRARY UNITS, ARBITRARY UNITS
##FACTOR=    0.368581032318806, 1,           1
##FIRST=     11204.1544572324, 0,            0
##LAST=      -873.140228757911, 0,           0
##MIN=       -873.140228757911, -1715923,    0
##MAX=       11204.1544572324, 329451384,    0
$$ Real data points
##PAGE= N=1
##DATA TABLE= (X++(R..R)), XYDATA
$$ [...]
15957a237068k4529K6351N7932J29812J96105K34762K62578K66178K22339J02175
$$ -1237068 -1261597 -1235246 -1177314 -1047502 -851397 -616635 -354057 -87879 134460 236635
15947B36635k918M1948J71333K25948J02393r0316j84356j56062q1619l6151k5253
$$ 236635 233717 275665 446998 672946 775339 685023 500667 344605 262986 226835 201582
15936B01582k3068k0371l8656p4560j02675j5548K00246L61485L40172J28132
$$ 201582 178514 158143 119487 44927 -57748 -73296 126950 488435 828607 956739
15926I56739j53812k97046k27562q1533J1529M8019O6024O2775l9478j74142k09435
$$ 956739 802927 505881 278319 196786 208315 256334 322358 385133 345655 171513 -37922
15915c7922j20733J4570R7635Q8854K5612k9047k6392k4753p3522q6567l7630
$$ -37922 -158655 -144085 -46450 42404 68016 38969 12577 -12176 -85698 -172265 -209895
15904b09895k3090n0756o213M8103L2328l9471j44741j98946j84372j43279j11664
$$ -209895 -232985 -283741 -289954 -241851 -209523 -248994 -393735 -592681 -777053 -920332 -1031996
15893a031996o7085L8533J53977J90039J43799P5781M4148N1801N1388K7703k0969
$$ -1031996 -1099081 -1060548 -906571 -716532 -572733 -496952 -452804 -401003 -349615 -321912 -342881
15882c42881r2594j34666j07363m3757O087k1613p9885k0410J15038J59658J23192
$$ -342881 -435475 -570141 -677504 -721261 -715174 -736787 -816672 -837082 -722044 -562386 -439194
15871d39194P3395K9071J3792l653j1835N4455J43817J65612J19261L8802p9510
$$ -439194 -365799 -336728 -322936 -326589 -338424 -283969 -140152 25460 144721 183523 104013
15860A04013j38769j14798j27632j43567j23812j06345n3025R0661J88705J32461
$$ 104013 -34756 -149554 -277186 -420753 -544565 -650910 -703935 -613274 -424569 -292108
15850b92108p65o2604j8086O7570Q4424N426p0426j05988j22381j07791m8108
$$ -292108 -292873 -355477 -373563 -305993 -221569 -216143 -286569 -392557 -514938 -622729 -670837
15839f70837j3827k1685n553K6386O2386J07365J50156J70101J97886J97662J07104
$$ -670837 -684664 -706349 -711902 -685516 -623130 -515765 -365609 -195508 2378 200040 307144
15828C07144M840l6581o9309j26723j43119q1330l1533l9044n3287O329Q1541
$$ 307144 311984 275403 206094 79371 -63748 -145078 -176611 -215655 -268942 -262613 -181072
15817a81072P3080Q878n2547o0216K5289J16454J07623O2980J4325n9733j01777
$$ -181072 -107992 -99114 -151661 -211877 -186588 -70134 37489 100469 114794 55061 -46716
15806d6716q6961p1110j04310j62547j76477j79165j50880p6190J2532J10125
$$ -46716 -133677 -204787 -309097 -471644 -648121 -827286 -978166 -1054356 -1041824 -931699
15796i31699J49472J32401J16139P0419R334K3237R1905J27963J24161J14500
$$ -931699 -782227 -649826 -533687 -463268 -453934 -430697 -338792 -210829 -86668 27832
15786B7832R3632M0301j8431q2618j47289j40814j00426q0716m002J22302J46294
$$ 27832 121464 161765 143334 60716 -86573 -227387 -327813 -408529 -412531 -290229 -143935
15775a43935M3351j00797j83669r5570R2346K25907K80005K56392J59967L6771
$$ -143935 -100584 -201381 -385050 -480620 -388274 -162367 117638 374030 533997 570768
15765E70768p4160j57824k42937l25101l04659j65150k1414M6139L8641K2744
$$ 570768 496608 338784 95847 -229254 -533913 -699063 -720477 -674338 -635697 -612953
15755f12953L9071N8792O2489K8491m267j4726m1833k7448O8745J05190P7038
$$ -612953 -573882 -515090 -452601 -424110 -428377 -443103 -484936 -512384 -443639 -338449 -261411
15744b61411P4782O7378N7700Q557j03826j38639r1989k2065R3372J47864J27439
$$ -261411 -186629 -119251 -61551 -52994 -156820 -295459 -387448 -409513 -316141 -168277 -40838
15733d0838J06836M9464n5712j29628j65694j69481j25056q7128o7645k7385L440
$$ -40838 65998 115462 59750 -69878 -235572 -405053 -530109 -617237 -684882 -712267 -708827
15722g08827j7847o6097n7156O2403J97836K44502J90034P1703K0642N0318J9149
$$ -708827 -726674 -792771 -849927 -787524 -589688 -345186 -155152 -83449 -62807 -12489 6660
15711F660m9824m3043j0673k041L3751Q2195Q3540N1497n443j8945N990m26n4293
$$ 6660 -43164 -86207 -96880 -98921 -65170 17025 100565 152062 146619 127674 133664 133238 78945
15698G8945n3235P551j739q5127j40163j08741n5404k2001J1118k3994q7992n1813
$$ 78945 25710 33261 31522 -53605 -193768 -302509 -357913 -379914 -368796 -392790 -480782 -532595
15686e32595O7703K10901K74098J75884L3852l6235l7184r0779j56637j13528
$$ -532595 -464892 -253991 20107 195991 229843 193608 156424 65645 -90992 -204520
15676b04520k8561K4045K2091l1179m6714K0617N2303j224l9055L8902J58581
$$ -204520 -233081 -209036 -186945 -218124 -264838 -244221 -191918 -193142 -232197 -193295 -34714
15665c4714J71457P9464q37m0980p0530r7010j01089o5170P191R8199J64494J31789
$$ -34714 136743 216207 215370 174390 103860 6850 -94239 -159409 -152218 -54019 110475 242264
15653B42264K8477m2972n8568p4155j11856j19835r1044p4134q9496j30158q9090
$$ 242264 270741 227769 169201 95046 -16810 -136645 -227689 -301823 -391319 -521477 -610567
15642f10567O7191K26206L21455K71207M6091j80280k53239j85431q2930Q541
$$ -610567 -543376 -317170 4285 275492 321583 141303 -111936 -297367 -380297 -371756
15632c71756N2195L178p7709q8899p8073r3056o5309L047P6709J53708J98888
$$ -371756 -319561 -316383 -394092 -482991 -561064 -654120 -719429 -716382 -639673 -485965 -287077
15621b87077J56584L9795p2958r5982m4788J930K5980N5334R9887J28165J12117
$$ -287077 -130493 -90698 -163656 -259638 -304426 -302496 -276516 -221182 -121295 6870 118987
15610A18987O7358J1637n7989j31463j57657p0173O7145R5041J7872q392L0912
$$ 118987 186345 197982 139993 8530 -149127 -219300 -152155 -57114 -39242 -47634 -16722
15599a6722M5603R116p0885j39024j68810j29977j8805L1875m946q8564j03670
$$ -16722 28881 37997 -32888 -171912 -340722 -470699 -489504 -457629 -462575 -551139 -654809
15588f54809j2370Q2231J15622Q6894L0034k7394n0771j4835Q1289J77374K35224
$$ -654809 -667179 -584948 -469326 -382432 -352398 -379792 -430563 -445398 -364109 -186735 48489
15577D8489K31077J38160J767p2958r1508o1012j6152o0913j21676j32123r3003
$$ 48489 279566 417726 419493 346535 255027 194015 177863 116950 -4726 -136849 -229852
15566b29852q7636j32733j08517K368J39236J61001K5327j00320q5015J5496M7707
$$ -229852 -317488 -450221 -558738 -556370 -417134 -256133 -230806 -331126 -416141 -400645 -352938
15555c52938n7962j59710j53621r1773J3208R9968Q6311M3163K6779N283O1640
$$ -352938 -410900 -570610 -724231 -816004 -802796 -702828 -616517 -573354 -546575 -541292 -479652
15544d79652J59634J34901k4075k08064k57684q5927K02893L69035L09321Q3178
$$ -479652 -320018 -185117 -209192 -417256 -674940 -760867 -557974 -188939 120382 203560
15534B03560j30468k04118j67843j05273n2435M396R5844J47201J27015R8264
$$ 203560 73092 -131026 -298869 -404142 -456577 -452181 -356337 -209136 -82121 16143
15524A6143P2976o320j18845j92604k54076k94867k96072k74706j84999n3397
$$ 16143 89119 82799 -36046 -228650 -482726 -777593 -1073665 -1348371 -1533370 -1586767
15514a586767P5562J86021K74523K76410K17703J76155R9401L426k5695K9419
$$ -1586767 -1511205 -1325184 -1050661 -774251 -556548 -380393 -280992 -277566 -303261 -273842
15504b73842R4594Q9506n390j28216j60194j09149k9532N6127Q6305N6986L0853
$$ -273842 -179248 -89742 -95132 -223348 -383542 -492691 -522223 -466096 -379791 -322805 -291952
15493b91952K0406L565l0567m5479J767N4465M4835Q54o8279j36956k13990k85706
$$ -291952 -271546 -267981 -298548 -344027 -342260 -287795 -242960 -242106 -310385 -447341 -661331 -947037
15481i47037k19788k1633J17187J29534J32727J55637J60054Q4945l371Q76O8322
$$ -947037 -1166825 -1188458 -1071271 -941737 -809010 -653373 -493319 -408374 -411745 -410869 -342547
15470c42547J07466M5872r8389k15203k63257k11271o6838O0927J18943J41352
$$ -342547 -235081 -189209 -287598 -502801 -766058 -977329 -1044167 -983240 -864297 -722945
15460g22945J44761J20859R3586O6876J5505j3100O224P0833J03539O9900j4655
$$ -722945 -578184 -457325 -363739 -296863 -281358 -294458 -288234 -217401 -113862 -43962 -58617
15449e8617j26794j68638r1161J9620M5014N276k4502j8079Q066K0967j5801o4599
$$ -58617 -185411 -354049 -445210 -425590 -380576 -375300 -399802 -417881 -409815 -388848 -404649 -469248
15437d69248l2574L1327M3449J1645j4657j1521k5804n5072k5694L3754R0858
$$ -469248 -501822 -470495 -427046 -415401 -430058 -441579 -467383 -522455 -548149 -514395 -423537
15426d23537R3087R375o3006n6182k1364r581K2706P4722O0979j8645j12099j24058
$$ -423537 -330450 -321075 -384081 -440263 -461627 -471208 -448502 -373780 -312801 -331446 -443545 -567603
15414e67603n8348R001O1617K1740r7477j91964j06513J27704K63998K42735J61457
$$ -567603 -625951 -616950 -555333 -533593 -631070 -823034 -929547 -801843 -537845 -295110 -133653
15403a33653L1307p4660o2133J4353N6212N1678J8685l0n013o4378j80928k01669
$$ -133653 -102346 -177006 -239139 -224786 -168574 -116896 -98211 -98241 -103254 -167632 -348560 -550229
15391e50229q9093K6494P0664P8973K6947j10477j94454j78069j22264m7457M7474
$$ -550229 -639322 -612828 -542164 -463191 -436244 -546721 -741175 -919244 -1041508 -1088965 -1041491
15380a041491J02329R8322J01360J38363J90261K38447K40334J81344Q5419J6006
$$ -1041491 -939162 -840840 -739480 -601117 -410856 -172409 67925 249269 334688 350694
15370C50694J775O589K1353O4548Q3754N9169K6289L444o239k3989j5703N8589
$$ 350694 352469 359058 380411 444959 528713 587882 614171 617615 611376 587387 571684 630273
15358F30273J32635J26872J431j62617k42912k09213j53923k00879k97283l03094
$$ 630273 762908 889780 891211 728594 485682 276469 122546 -78333 -375616 -678710
15348f78710k71072k51210j84492q2594O0856K41210L26264K74325K12863K04530
$$ -678710 -949782 -1200992 -1385484 -1468078 -1407222 -1166012 -839748 -565423 -352560 -148030
15338a48030K09063J64222N2336q7843j86171j83666j12009j3366N0494O5918
$$ -148030 61033 225255 277591 189748 3577 -180089 -292098 -305464 -254970 -189052
15328a89052J23210J99959K11702J53087J21498J57424J64853J14832O4630J2898
$$ -189052 -65842 134117 345819 498906 620404 777828 942681 1057513 1122143 1135041
15318A135041n9924j53597k25183k10272j36124q4096n6984l9951o1532q8424
$$ 1135041 1075117 921520 696337 486065 349941 265845 208861 168910 107378 18954
15308A8954q6958p4797r5302j28249j37284n7244O4142J21480J56384J92839K04435
$$ 18954 -68004 -142801 -238103 -366352 -503636 -560880 -496738 -375258 -218874 -26035 178400
15297A78400J35700J8426o7747j06511j37481j76993j55002p7316K3163J32536
$$ 178400 314100 332526 264779 158268 20787 -156206 -311208 -388524 -365361 -232825
15287b32825J75987K02110K48061K43879K13348J44997L0926r8088k03080k78861
$$ -232825 -56838 145272 393333 637212 850560 995557 1026483 928395 725315 446454
15277D46454l58489l50983j79953K3463J39165J49541R7705N6564q815q8724n7209
$$ 446454 87965 -263018 -442971 -419508 -280343 -130802 -33097 23467 14652 -74072 -131281
15266a31281P2591J41597J26842J06554P3944j9653j51090k42168k71072k42853
$$ -131281 -58690 82907 209749 316303 390247 370594 219504 -22664 -293736 -536589
15256e36589j37649K66J32081K54493K72807J40848k7575j35791j53816j09905
$$ -536589 -674238 -673972 -541891 -287398 -14591 126257 98682 -37109 -190925 -300830
15246c00830n5711k2385l3321r4037j37964j12903k5905M8606L0292l0469k8241
$$ -300830 -356541 -378926 -412247 -506284 -644248 -757151 -783056 -734450 -704158 -734627 -762868
15235g62868K9054J06701J55581R5502j3533j7627Q3900J63666J52516J21859
$$ -762868 -733814 -627113 -471532 -376030 -389563 -407190 -323290 -159624 -7108 114751
15225A14751J28569J63829J73944J18996J4284j11701k05071j96021j08612k2727
$$ 114751 243320 407149 581093 700089 714373 602672 397601 201580 92968 70241
15215G0241k1611p0874q7816p5672m2080q963L2426L7158M175J4966L2921N5052
$$ 70241 48630 -22244 -110060 -185732 -227812 -236775 -204349 -167191 -163016 -148050 -115129 -60077
15203f0077J00917J09163J01309R9381R6685J00413L6275j35029k27745j87218
$$ -60077 40840 150003 251312 350693 447378 547791 584066 449037 221292 34074
15193C4074j50506j39832j14113o8432l8751k6335j3627J0486L1360N9770R6564
$$ 34074 -116432 -256264 -370377 -438809 -477560 -503895 -517522 -507036 -475676 -415906 -319342
15182c19342J05378N8421k7106n6112k3176m3852n7428K8312J34212J46444N8543
$$ -319342 -213964 -155543 -182649 -238761 -261937 -305789 -363217 -334905 -200693 -54249 4294
15171D294m3085q6052r1118j03931j10140m9201R1597J69115J59050J49164Q2197
$$ 4294 -38791 -124843 -215961 -319892 -430032 -479233 -387636 -218521 -59471 89693 171890
15160A71890q3675k25743k15835m1368J25634J34005N3346m1375j10132m9511
$$ 171890 88215 -137528 -353363 -394731 -269097 -135092 -81746 -123121 -233253 -282764
15150b82764Q9616J51815N4266j41899k31876j32664O1484J79370J83647J40291
$$ -282764 -193148 -41333 12933 -128966 -360842 -493506 -432022 -252652 -69005 71286
15140G1286N1325l4279n0125m7063p8644j08313m5079Q7208J13450K8465m7816
$$ 71286 122611 88332 38207 -8856 -87500 -195813 -240892 -153684 -40234 -11769 -59585
15129e9585j04379j53738j40338n6120k7713k5731O9621J52403J18059K2569m3437
$$ -59585 -163964 -317702 -458040 -514160 -541873 -567604 -497983 -345580 -227521 -204952 -248389
15118b48389j05513j50729j39959j44400j48053p6833L2184J36486J91373J94054
$$ -248389 -353902 -504631 -644590 -788990 -937043 -1013876 -981692 -845206 -653833 -459779
15108d59779J72713J58009J45657J07584R0751P6055K312n1602l3421l3229m6844
$$ -459779 -287066 -129057 16600 124184 214935 290990 293302 241700 208279 175050 128206
15097A28206l6940k9633K6027J13859J66319J84769J61973P1606m1472j15566
$$ 128206 91266 61633 87660 201519 367838 552607 714580 786186 744714 629148
15087F29148j73761k22793j95646q9941J2416M4440l620p6931r7479p4258r4590
$$ 629148 455387 232594 36948 -52993 -40577 3863 243 -76688 -174167 -248425 -343015
15076c43015j20330p6223J6768M5620K9016M2110M3569J6195N4605J72738J80406
$$ -343015 -463345 -539568 -522800 -477180 -448164 -406054 -362485 -346290 -291685 -118947 61459
15065F1459K9158j07126k04731k68280j92774p3312q987O6169P7451j0385m4220
$$ 61459 90617 -16509 -221240 -489520 -682294 -755606 -764593 -698424 -620973 -631358 -675578
15054f75578q164O128N6971J28274J35368J00465O6010N2601K2610k084K966j4768
$$ -675578 -683742 -677614 -620643 -492369 -357001 -256536 -190526 -137925 -115315 -117399 -114433 -129201
15042a29201p8675j24816j19465q2494m1974k3466M4996J57405J80061J12527
$$ -129201 -207876 -332692 -452157 -534651 -576625 -600091 -555095 -397690 -217629 -105102
15032a05102M9521P840k3593j2744L2379Q7558J28268J06434L4103m9634j61851
$$ -105102 -55581 -47741 -71334 -84078 -51699 35859 164127 270561 304664 255030 93179
15021I3179k63582k84924k39046j47952J5073K20568K94142J69358L1351K7649
$$ 93179 -170403 -455327 -694373 -842325 -827252 -606684 -312542 -143184 -111833 -84184
15011h4184R6104J35608Q9576k9683j13820j35984j51318j37782q5491n3329n5550
$$ -84184 11920 147528 237104 207421 93601 -42383 -193701 -331483 -416974 -470303 -525853
15000e25853o2186j940J29325K60719K68140J09186p9961j63233j39018q2172
$$ -525853 -588039 -589979 -460654 -199935 68205 177391 97430 -65803 -204821 -286993
14990b86993m5291m5312l2383K4272N4216N3160Q5166J11927R1585K104j22139
$$ -286993 -332284 -377596 -409979 -385707 -331491 -278331 -193165 -81238 10347 12451 -109688
14979a09688j61696j04307m5052K302N8572Q2276M1585R309J4159j2502l7949
$$ -109688 -271384 -375691 -420743 -418441 -359869 -277593 -236008 -226699 -212540 -225042 -262991
14968b62991q239N2262J10368J49114J38707N5740r2751k17847j99985r2964j7558
$$ -262991 -271230 -218968 -108600 40514 179221 234961 142210 -75637 -275622 -368586 -386144
14957c86144m357l6456k7949N5542R6757M3736n1971j07945r2738p6915j23108
$$ -386144 -390501 -426957 -454906 -399364 -302607 -258871 -310842 -418787 -511525 -588440 -711548
14946g11548j38828p2402j4262j2621k9195n6988m8811M9166J21423M8298q0183
$$ -711548 -850376 -922778 -937040 -949661 -978856 -1035844 -1084655 -1035489 -914066 -865768 -945951
14935i45951j50072j66170r5603j7402J8002Q1650J74343K36339J51727n2776
$$ -945951 -1096023 -1262193 -1357796 -1375198 -1357196 -1275546 -1101203 -864864 -713137 -765913
14925g65913j22128j0291J19806J65699J20199N1219l4970j28239j59636r0374
$$ -765913 -888041 -898332 -778526 -612827 -492628 -441409 -476379 -604618 -764254 -854628
14915h54628N963J8986J7669Q0608J18639N0907n0643q0305p1797o4865M136J13881
$$ -854628 -848665 -829679 -812010 -731402 -612763 -561856 -612499 -692804 -764601 -829466 -825330 -711449
14903g11449J80428J57957L4540r4442j80681k36656k06112n2117J12648J88145
$$ -711449 -531021 -373064 -338524 -432966 -613647 -850303 -1056415 -1108532 -995884 -807739
14893h07739J84830J42832O9771k2691p8000m619J27446J42086K5668j04855j50372
$$ -807739 -622909 -480077 -410306 -432997 -510997 -515616 -388170 -246084 -220416 -325271 -475643
14882d75643o5320J17636K03935J39096K4253m7039m5055J7380R4492R5308K5677
$$ -475643 -540963 -423327 -219392 -80296 -56043 -103082 -148137 -130757 -36265 59043 84720
14871H4720n7553p8279o15L2689j5739o5425l8125L7334M1658k0014j27725k07256
$$ 84720 27167 -51112 -51727 -19038 -34777 -100202 -138327 -100993 -59335 -79349 -207074 -414330
14859d14330j61872q0176k9569J5980O1680J17815J34738O5707J7662K6248K5777
$$ -414330 -576202 -656378 -685947 -669967 -608287 -490472 -355734 -290027 -272365 -246117 -220340
14848b20340j2678m9763j8326N5547J27861J62227R7400l7000j42461j49055j03542
$$ -220340 -233018 -282781 -301107 -245560 -117699 44528 141928 104928 -37533 -186588 -290130
14837b90130p8415n4849R776Q8156J27228J47455O9906r4977j58949j00552l7103
$$ -290130 -368545 -423394 -413618 -325462 -198234 -50779 19127 -75850 -234799 -335351 -372454
14826c72454Q514R9499K04231K24759J63714P5973L2059K0197n3845r6310K454
$$ -372454 -363940 -264441 -60210 164549 328263 404236 436295 456492 402647 306337 308791
14815C08791J3671j28240j85443j62570j32746o7407K9622J10258J25681J00884
$$ 308791 322462 194222 8779 -153791 -286537 -353944 -324322 -214064 -88383 12501
14805A2501P1550K7224m7245j18649j20830q8551m4116j4064k6037N967J17718
$$ 12501 84051 111275 64030 -54619 -175449 -264000 -308116 -322180 -348217 -342250 -224532
14794b24532J77892P5034r5608j86349j55568m6577O9885J74208K39692K32165
$$ -224532 -46640 28394 -67214 -253563 -409131 -455708 -385823 -211615 28077 260242
14784B60242J80429R4509j5617r9505j26519r2328n2208r4248j86709j67063K9449
$$ 260242 440671 535180 519563 420058 293539 201211 149003 54755 -131954 -299017 -269568
14773b69568K26480K94187K57375K11292J75814J26716P2044R928o1091j28396
$$ -269568 -43088 251099 508474 719766 895580 1022296 1094340 1104268 1043177 914781
14763I14781j61288j83579j66949p7520M4740J16041R8819O8479L961j23084k21528
$$ 914781 753493 569914 402965 325445 370185 486226 585045 653524 657485 534401 312873
14752C12873k14056j31904j05632j30476r8954j4668J20056K06274J51710M9338
$$ 312873 98817 -33087 -138719 -269195 -368149 -382817 -262761 -56487 95223 144561
14742A44561r149o0233j67052k76953k58867n8506J88720K99200K18228P7858
$$ 144561 135412 75179 -91873 -368826 -627693 -686199 -497479 -198279 19949 97807
14732I7807j0193m4188m0544n5299p9475r2263o2645M3636J61281K05748J70231
$$ 97807 87614 43426 2882 -52417 -131892 -224155 -286800 -243164 -81883 123865 294096
14721B94096P0476o6567j42599r2459J1270L7074j1191k3363J4931Q1042J36336
$$ 294096 364572 298005 155406 62947 74217 111291 100100 76737 91668 172710 309046
14710C09046J35081P4192k2043j53386k89996l08759k04720j41278j63616j29616
$$ 309046 444127 518319 496276 342890 52894 -255865 -460585 -601863 -765479 -895095
14700h95095n4953n2817m9771k3692k7410q6378k21790k22863r87J75836J87861
$$ -895095 -950048 -1002865 -1052636 -1076328 -1103738 -1190116 -1411906 -1634769 -1635756 -1459920 -1272059
14689a272059J37171R2927R3061J34786J66532J47402O2732l6314r1725o4828
$$ -1272059 -1134888 -1041961 -948900 -814114 -647582 -500180 -437448 -473762 -565487 -630315
14679f30315k7327n4437o6750m526M8954N8532P9932P7991P3369J29741K06693
$$ -630315 -657642 -712079 -778829 -783355 -734401 -675869 -595937 -517946 -444577 -314836 -108143
14668a08143J72191N47j17913j08461r5395j06421m3780J2565m8217j21708j09865
$$ -108143 64048 64595 -53318 -161779 -257174 -363595 -407375 -394810 -443027 -564735 -674600
14657f74600q1226r4974q7772j981P9791J33474J85612K19872J95654J02283j0870
$$ -674600 -755826 -850800 -938572 -940553 -860762 -727288 -541676 -321804 -126150 -23867 -34737
14646c4737q4772p1380l5156l6275J6122J11681Q3583O994L9779R0519O9249k958
$$ -34737 -119509 -190889 -226045 -262320 -246198 -134517 -50934 -43940 -4161 86358 155607 152649
14634A52649l4474L6755R6738Q8312N1378r553n5471l8500k8123o8936j17415
$$ 152649 118175 154930 251668 339980 391358 381805 326334 287834 259711 190775 73360
14623G3360j24883j24124j34666r0958k9097n7049j13578j02779m4267J8540R8259
$$ 73360 -51523 -175647 -310313 -401271 -430368 -487417 -600995 -703774 -748041 -729501 -631242
14612f31242K06503K54879J93955Q2294K4715N91k6870k5612m9355n6050m1095
$$ -631242 -424739 -169860 24095 106389 131104 131695 104825 79213 29858 -26192 -67287
14601f7287n6206l2449K3090r151j26180j70355l5913J61024K59945K13144J16399
$$ -67287 -123493 -155942 -132852 -142003 -268183 -438538 -474451 -313427 -53482 159662 276061
14590B76061N2218K5894L2675K2156l7631r0019j01793j21343j16480m1885L7540
$$ 276061 328279 354173 386848 409004 371373 281354 179561 58218 -58262 -100147 -62607
14579f2607N9910M3629l578l1232K8354J02405P7390L934o862J6485M3812N1217
$$ -62607 -2697 40932 37354 6122 34476 136881 214271 218205 211343 227828 271640 322857
14567C22857L1197M713k0042p3440j92543k44380k13628j93492j63233j05562
$$ 322857 354054 358767 338725 265285 72742 -171638 -385266 -578758 -741991 -847553
14557h47553j2547R9958J34694R7417R0828R6381P2838N4139K5314l7656j38298
$$ -847553 -860100 -760142 -625448 -528031 -437203 -340822 -267984 -213845 -188531 -226187 -364485
14546c64485k41505k51702j66438o6677p581K8681P2728Q8750L9220k813J7504
$$ -364485 -605990 -857692 -1024130 -1090807 -1098388 -1069707 -996979 -908229 -869009 -871822 -854318
14535h54318M2108M1626N0415J04047J14740L8022j04207k28044k62354j32014
$$ -854318 -812210 -770584 -720169 -616122 -501382 -463360 -567567 -795611 -1057965 -1189979
14525a189979J05153K00411J46110M6304o1226j03375n7851K2745N9911k294p9658
$$ -1189979 -1084826 -884415 -738305 -692001 -753227 -856602 -914453 -891708 -831797 -834091 -913749
14514i13749n9030K7389N3511R419l3050k8556O6229J96554K96867K89738K03880
$$ -913749 -972779 -945390 -891879 -882460 -915510 -944066 -877837 -681283 -384416 -94678 109202
14503A09202J74835J45237Q279r2338j02945j16265j25946j69015k26947j78491
$$ 109202 284037 429274 437553 345215 242270 126005 59 -168956 -395903 -574394
14493e74394k2215J49250K07478J18216p534n9921K6462K00680L57119L85703
$$ -574394 -596609 -447359 -239881 -121665 -129199 -189120 -162658 38022 395141 780844
14483G80844K50885N6000m2440n2024p4496o2333N176N3200L4213j9196r8508
$$ 780844 1031729 1087729 1045289 993265 918769 856436 861612 914812 949025 929829 831321
14472H31321k29119l38793l40467k07584k6046O2681P416n6396r123L8041j0662
$$ 831321 602202 263409 -77058 -284642 -310688 -248007 -240591 -296987 -306110 -268069 -278731
14461b78731j19822j91893j22125p898M7260P9703J09877R2169J3280m2782k2698
$$ -278731 -398553 -590446 -712571 -720469 -673209 -593506 -483629 -391460 -378180 -420962 -443660
14450d43660K3798R1276J32649J06175K4702o2980j05970j35401j49927r3691
$$ -443660 -419862 -328586 -195937 -89762 -65060 -128040 -234010 -369411 -519338 -613029
14440f13029Q908J26162K06458J71083P6636j3303r4075j27268j02535q3179o7715
$$ -613029 -604121 -477959 -271501 -100418 -23782 -37085 -131160 -258428 -360963 -444142 -511857
14429e11857n3730o2919l0948j4557k9965l5405n6062o2494m5946k2169L9301
$$ -511857 -565587 -628506 -659454 -674011 -703976 -739381 -795443 -857937 -903883 -926052 -886751
14418h86751J04110R9638L8320J2615L3981N1680M8500O648m0703L3867J30875
$$ -886751 -782641 -683003 -644683 -632068 -598087 -546407 -497907 -491259 -531962 -498095 -367220
14407c67220J41750J44176J45132J10490P0484M313q9778j33606o6412O8616J12597
$$ -367220 -225470 -81294 63838 174328 244812 249125 159347 25741 -40671 27945 140542
14396A40542M3963q2124j82380k08633j85725j72466j41686q3511j0949O5124
$$ 140542 184505 102381 -79999 -288632 -474357 -646823 -788509 -872020 -882969 -817845
14386h17845M0522p2481j57167j79653j32324j1218J55692K92617K47312Q6266
$$ -817845 -777323 -849804 -1006971 -1186624 -1318948 -1330166 -1174474 -881857 -634545 -548279
14376e48279M1496J17776J49638J05697K1229r5967j90100j93080r6074J8573
$$ -548279 -506783 -389007 -239369 -133672 -112443 -208410 -398510 -591590 -687664 -669091
14366f69091N3401J0130R821L1828j9403p2383n9554l9870n4806m8752L7874J66947
$$ -669091 -615690 -605560 -595739 -563911 -583314 -655697 -715251 -755121 -809927 -858679 -820805 -653858
14354f53858K75056L20071K98595J84162P3595M3229P0845J08256J12536R1269
$$ -653858 -378802 -58731 239864 424026 497621 540850 611695 719951 832487 923756
14344I23756L3899n9026j12899j02541p2318o3633j10242j88728j96769j26718
$$ 923756 957655 898629 785730 683189 610871 547238 436996 248268 51499 -75219
14334g5219k2216N3365K6083r3072k10151k36862j93553r6342O0535J96387K11790
$$ -75219 -97435 -44070 -17987 -111059 -321210 -558072 -751625 -847967 -787432 -591045 -379255
14323c79255J43167P5170M1984K8477L772m4030o2763j7702M7266R8161J49561
$$ -379255 -236088 -160918 -118934 -90457 -86685 -130715 -193478 -211180 -163914 -65753 83808
14312H3808J28462L9983j4450o2542o7568k3325l0941n4190L4209J66454J83575
$$ 83808 212270 252253 237803 175261 107693 84368 53427 -763 33446 199900 383475
14301C83475J08211M2965Q61l4011p2035j26669j78750j95839j48076j5711J55829
$$ 383475 491686 534651 535512 501501 429466 302797 124047 -71792 -219868 -235579 -79750
14290g9750J81848J8517j24411r6166K3494R7673J14262J09309L9465r6806j78455
$$ -79750 102098 120615 -3796 -99962 -76468 21205 135467 244776 284241 187435 8980
14279H980j94880k21362k05444r2317K3128R3887J54986J31165j5559j68643k27646
$$ 8980 -185900 -407262 -612706 -705023 -681895 -588008 -433022 -301857 -317416 -486059 -713705
14268g13705j92428q9710R3669K59459K64847J45879L1279k5373k5521n562P236
$$ -713705 -906133 -995843 -902174 -642715 -377868 -231989 -200710 -226083 -251604 -257166 -249930
14257b49930M5293R3891J13409P9192K3369L3144Q4593O3089k1779o6901l3134
$$ -249930 -204637 -110746 2663 81855 105224 138368 222961 286050 264271 197370 164236
14246A64236L3900P2803O7731N3750K6591K1936N4049K4064n9327j33601j59302
$$ 164236 198136 270939 338670 392420 419011 440947 494996 519060 459733 326132 166830
14235A66830j13711o9086o7478p9149j00802j01861r7849j62430k25059j75796
$$ 166830 53119 -15967 -83445 -162594 -263396 -365257 -463106 -625536 -850595 -1026391
14225a026391p2985R207O9331P4725M4645M0044R9156J26673P8433K7450k0990
$$ -1026391 -1099376 -1090169 -1020838 -946113 -901468 -861424 -762268 -635595 -557162 -529712 -550702
14214e50702l7061L7379J32347J30555P9148N1879R0834J46816O3366n6034n7264
$$ -550702 -587763 -550384 -418037 -287482 -208334 -156455 -65621 81195 144561 88527 31263
14203C1263k7934r5N0264R1565P5247j2409q7746j19811j21557r7555n0404j1128
$$ 31263 3329 3234 53498 145063 220310 207901 120155 344 -121213 -218768 -269172 -280300
14191b80300n2300j38663j71585j36616o0613L5429R5110J05661J15838L8571
$$ -280300 -332600 -471263 -642848 -779464 -840077 -804648 -709538 -603877 -488039 -449468
14181d49468p8823o9321P9430K56213L30831K39014O7322m1502m9468l313J0794
$$ -449468 -528291 -597612 -518182 -261969 68862 307876 375198 333696 284228 280915 291709
14170B91709q601l5791j03125j08299j8606J5084m0756r4362n7115K1949M261
$$ 291709 283108 247317 144192 35893 17287 32371 -8385 -102747 -159862 -137913 -133652
14159a33652r5245j49769j20781o0361o137M7225M1418j492p6408j43952r4147
$$ -133652 -228897 -378666 -499447 -559808 -565945 -518720 -477302 -478794 -555202 -699154 -793301
14148g93301M6986J29752R1986J3326J8554J01887J64714J59989J32633J07808
$$ -793301 -746315 -616563 -524577 -511251 -492697 -390810 -226096 -66107 66526 174334
14138A74334O5344M8943J08069J89662J86475P1433r6925j64289j08855q3703
$$ 174334 239678 288621 396690 586352 772827 844260 747335 583046 474191 390488
14128C90488j47958k12684k24882k04549j33727k2809J08203J71284J27091Q0558
$$ 390488 242530 29846 -195036 -399585 -533312 -556121 -447918 -276634 -149543 -68985
14118f8985J10600J40200J12064N4117o5769k11918k57825j93186p6841M8149
$$ -68985 41615 181815 293879 347996 282227 70309 -187516 -380702 -457543 -409394
14108d09394J17628J11252R2630P2829M4377M3589N7327O9874M6936N424K875
$$ -409394 -291766 -180514 -87884 -15055 29322 72911 130238 200112 247048 252472 255347
14097B55347J5647o995m5089n5652j5583N6097R3405P0161M2753K1373k0709k9631
$$ 255347 270994 263999 218910 163258 147675 203772 297177 367338 410091 431464 410755 381124
14085C81124m6451q7396m5082J141p2377j15064l8151P4314J08266Q797j49651
$$ 381124 334673 247277 202195 203336 130959 15895 -22256 52058 160324 169121 19470
14074A9470k02303j28791k6860O8683P8269K5357M2495P7691L883j00418j04167
$$ 19470 -182833 -311624 -338484 -269801 -191532 -166175 -123680 -45989 -42106 -142524 -246691
14063b46691n0636k0280k6024l3114P23J9918m410k4088j5524j6022j606K472
$$ -246691 -297327 -317607 -343631 -376745 -376022 -356104 -360514 -384602 -400126 -416148 -417754 -415282
14051d15282j01793j78330r4866K6918N5534J3846m675M1168J33701J68504J13484
$$ -415282 -517075 -695405 -790271 -763353 -707819 -693973 -698648 -657480 -523779 -355275 -241791
14040b41791M0683l0073j08330j65566j75290j47833j13039q3067m2534K0856
$$ -241791 -201108 -231181 -339511 -505077 -680367 -828200 -941239 -1024306 -1066840 -1045984
14030a045984P5336P6355J8309k6965R20O7625Q7543Q9315J05972J01321N0251
$$ -1045984 -970648 -894293 -875984 -902949 -902029 -834404 -746861 -657546 -551574 -450253 -400002
14019d00002j3632J4513J16689J68895J23577K6779m0857p1401q7143r7595q6496
$$ -400002 -413634 -399121 -282432 -113537 10040 36819 -4038 -75439 -162582 -260177 -346673
14008c46673m9394L1623J27210J60453J20165K6522m9139l9374J1767J0123k2338
$$ -346673 -396067 -364444 -237234 -76781 43384 69906 20767 -18607 -6840 3283 -19055
13997a9055k2315r110j8006n3650j01006j23729j21218j34686j52608j30413m5787
$$ -19055 -41370 -50480 -68486 -122136 -223142 -346871 -468089 -602775 -755383 -885796 -931583
13986i31583O5153J34583J55301J99419K19465J54299R7954Q5675K7889n4907
$$ -931583 -866430 -731847 -576546 -377127 -157662 -3363 94591 180266 208155 153248
13976A53248j22238k20385l11074l13039k04375m6607L8696R913j2352Q44L718
$$ 153248 31010 -189375 -500449 -813488 -1017863 -1064470 -1025774 -1015861 -1028213 -1027369 -1023651
13965a023651j2586j9636j9981k4488M9637J89366K98624L18645K51296J56204
$$ -1023651 -1036237 -1055873 -1075854 -1100342 -1050705 -861339 -562715 -244070 7226 163430
13955A63430L7147q4704j27749p1363j483J3399j3099n5799l3763P4275J71232
$$ 163430 200577 115873 -11876 -83239 -84722 -71323 -84422 -140221 -173984 -99709 71523
13944G1523J69104Q5331k540n2253n1464m6928l5430n5581j54057k25887k11591
$$ 71523 240627 325958 323418 271165 219701 172773 137343 81762 -72295 -298182 -509773
13933e09773j31975p4170o1823m550O3798R4211J09170Q3096M6338P1851J63697
$$ -509773 -641748 -715918 -777741 -782291 -718493 -624282 -515112 -432016 -385678 -313827 -150130
13922a50130K36171K93940L26596K76176J58904J6275j18242j81698j31216m7592
$$ -150130 86041 379981 706577 982753 1141657 1157932 1039690 857992 726776 679184
13912F79184k2910p9401j42070j79193j69659j10192k8277P3201J23252O2249
$$ 679184 656274 576873 434803 255610 85951 -24241 -52518 20683 143935 206184
13902B06184l0419q4805j34192j57653j76693j94315j07131n224K4775K4013O5035
$$ 206184 175765 90960 -43232 -200885 -377578 -571893 -679024 -684248 -659473 -635460 -570425
13891e70425J13742J06837J00232J10434P4883O952l6575n3749m4570j2338P2615
$$ -570425 -456683 -349846 -249614 -139180 -64297 -57345 -93920 -147669 -192239 -204577 -131962
13880a31962J11649P2151L4589j128k1174j1247K139j7439o4454j22828j74388
$$ -131962 -20313 51838 86427 85299 64125 52878 55017 37578 -26876 -149704 -324092
13869c24092j86263j34501j6965J31970J89829J12110L8077K5943J0180m065j6821
$$ -324092 -510355 -644856 -661821 -529851 -340022 -227912 -189835 -163892 -153712 -157777 -174598
13858a74598q0917j22761k4493J02129J38913J29545O2206p1637j83341j97327
$$ -174598 -255515 -378276 -402769 -300640 -161727 -32182 30024 -41613 -224954 -422281
13848d22281j15421N2767K05200K47804K29795J72749O4257j4158k1605P541K4256
$$ -422281 -537702 -484935 -279735 -31931 197864 370613 434870 420712 399107 406648 430904
13837D30904K5943R958l336j5307p0556j44777j19966m598O1968N5112L8709M5437
$$ 430904 456847 466805 463469 448162 377606 232829 112863 108265 170233 225345 264054 309491
13825C09491k3506j55447k51789k35730j33719o3059l1796j2184k3171o2180p4752
$$ 309491 285985 130538 -121251 -356981 -490700 -553759 -585555 -597739 -620910 -683090 -757842
13814g57842l7966O9090J88004K06067J72080J63517J56430J22007P8459j5595
$$ -757842 -795808 -726718 -538714 -332647 -160567 2950 159380 281387 359846 344251
13804C44251j58365k32938j97573j05595l1118J9139M0911L5204J7658j3728Q285
$$ 344251 185886 -47052 -244625 -350220 -381338 -362199 -321288 -286084 -268426 -282154 -273869
13793b73869P9448J12217L6879p7523j04045n4229j04610k44728k60847j06344
$$ -273869 -194421 -82204 -45325 -122848 -226893 -281122 -385732 -630460 -891307 -997651
13783i97651M8928Q7976O4724L6065J1523m315K0269O8893O3325O038l9427n2863
$$ -997651 -948723 -860747 -796023 -759958 -748435 -752750 -732481 -663588 -600263 -594225 -633652 -686515
13771f86515m8520l2195k0501m2490q8663p3442J1326Q7081J03094J09663J43179
$$ -686515 -735035 -767230 -787731 -830221 -918884 -992326 -981000 -893919 -790825 -681162 -537983
13760e37983J40532P2929K6294L8964P8301R5672O4819K0420l810k7315n4366
$$ -537983 -397451 -324522 -298228 -259264 -180963 -85291 -20472 -52 -3862 -31177 -85543
13749h5543j8900R6168J14352K5211j9166m3643p3154m0279M8908P6720M9447
$$ -85543 -104443 -8275 106077 131288 112122 68479 -4675 -44954 3954 80674 130121
13738A30121K7843j2952m8147J1609J06837J40948J33608J29692J29839J16404
$$ 130121 157964 145012 96865 108474 215311 356259 489867 619559 749398 865802
13728H65802O5577l2855j08048j18563q8592l9076l0895j22491j98273j67291
$$ 865802 931379 898524 790476 671913 583321 544245 513350 390859 192586 25295
13718B5295o5797O8888J33769Q9937M8549L0732J763k9389k6937J0887l995o6340
$$ 25295 -40502 28386 162155 252092 300641 331373 333136 303747 276810 287697 283702 217362
13706B17362q7084o3751j6541Q2818J36494P9824K4063K762k6056o1100j06225
$$ 217362 130278 66527 49986 132804 269298 349122 373185 375947 349891 288791 182566
13695A82566j53853j67880r7869j01N7636Q2068R7719R4620P628j22337j82554
$$ 182566 28713 -139167 -237036 -237137 -179501 -97433 286 94906 102534 -19803 -202357
13684b02357j22878l2317m950J3397M7679N1920L5340M3585K9805n064m5875j12831
$$ -202357 -325235 -357552 -362502 -349105 -301426 -249506 -214166 -170581 -140776 -145840 -191715 -304546
13672c04546j33463m4392Q9213J25311K7458n8598l2220L0563L9401L6750P0379
$$ -304546 -438009 -482401 -393188 -267877 -240419 -299017 -331237 -300674 -261273 -224523 -154144
13661a54144J31012J71414K14081K37337J42357n4464k06575k15578j48364j03943
$$ -154144 -23132 148282 362363 599700 742057 687593 481018 265440 117076 13133
13651A3133p9730m5155M710O3079R0683M3571l210N8472J89223K25168J52876
$$ 13133 -66597 -111752 -107042 -43963 46720 90291 87081 145553 334776 559944 712820
13640G12820J20965J33191R3260k5276j81050k56102j94590j06997m4253j3529
$$ 712820 833785 966976 1060236 1034960 853910 597808 403218 296221 251968 238439
13630B38439J4315N4954J08397J75873J78195O4930r4494j51025p0223L1723Q3393
$$ 238439 252754 307708 416105 591978 770173 835103 740609 589584 519361 551084 634477
13619F34477R3899N5083N123k5756m1672j6679L8250O5920P9649J14759J05995
$$ 634477 728376 783459 788582 762826 721154 704475 742725 808645 888294 1003053 1109048
13608A109048L9000l2262r0651j18637j03892p4930o1256l1595N3865O3400k8479
$$ 1109048 1148048 1115786 1025135 906498 802606 727676 666420 634825 688690 752090 723611
13597G23611r7832j38657j22622L5239K22663K64911J46034p6169k54951k63275
$$ 723611 625779 487122 364500 399739 622402 887313 1033347 957178 702227 438952
13587D38952j53696l571R8491R6082O1199K4730j7211n2244j05318j30697p1776
$$ 438952 285256 281685 380176 476258 537457 562187 544976 492732 387414 256717 184941
13576A84941J852N1459R6738J48714J46011J08476J31656J53728Q7190j6128o2190
$$ 184941 186793 238252 334990 483704 629715 738191 869847 1023575 1110765 1094637 1032447
13565A032447n9431k8208J4080L7383K3568l47k820J1963N2912O9341K3697n1289
$$ 1032447 973016 944808 958888 996271 1019839 1019492 1016672 1028635 1081547 1150888 1174585 1123296
13553A123296j13266j47166j15120n1501l3849l9685K532L2986j3247m6761k5414
$$ 1123296 1010030 862864 747744 696243 662394 622709 625241 658227 644980 598219 572805
13542E72805k5233p9073j03771r5078j64394k72834k93162j95853q460J77162
$$ 572805 547572 468499 364728 269650 105256 -167578 -460740 -656593 -665053 -487891
13532d87891K34239J67672R8325M3850r672k4447j5346L561M4933P7477K6313
$$ -487891 -253652 -85980 12345 56195 46523 22076 6730 10291 55224 132701 159014
13521A59014n0931r7673j11463p1260J8265J10422J55455J68392J33327P5800
$$ 159014 108083 10410 -101053 -172313 -154048 -43626 111829 280221 413548 489348
13511D89348O0319O0847P587k3151j2822n7000j36849j87646j68733n9462O3695
$$ 489348 549667 610514 618101 594950 582128 525128 388279 200633 31900 -27562 36133
13500C6133J09211P6674J9923p288k7064N546J26467K46597L09991L03177J97544
$$ 36133 145344 222018 241941 234653 207589 213135 339602 586199 896190 1199367 1396911
13489A396911M4206m7480q3972j46825k30728k23753j57054q6304N8272K02414
$$ 1396911 1441117 1393637 1309665 1162840 932112 708359 551305 465001 523273 725687
13479G25687J95725N3664p8003j58505j65993m6846P4903Q9863O2945N8795N6554
$$ 725687 921412 975076 897073 738568 572575 525729 600632 690495 753440 812235 868789
13468H68789K2347k1225n8513r5881j07078o9274j0917K023n9337j85020k88559
$$ 868789 891136 869911 811398 715517 608439 539165 528248 530271 470934 285914 -2645
13457b645k70521j47023m856O6274O3130P3666J06432J16030J24960J12110O3476
$$ -2645 -273166 -420189 -425045 -358771 -295641 -221975 -115543 487 125447 237557 301033
13446C01033P389j05603j64258j00993j8383L154o1609j05981k8667P6504O8330
$$ 301033 308422 202819 38561 -62432 -80815 -77661 -139270 -245251 -273918 -197414 -129084
13435a29084L7858R7380K32823L13726K66540J35696k6321j28964p9017N9349
$$ -129084 -91226 6154 238977 552703 819243 954939 928618 799654 720637 779986
13425G79986J56409J29729K6618m3626r9816j69615j56158m4239L3588N6323P9218
$$ 779986 936395 1066124 1092742 1049116 949300 779685 623527 579288 612876 669199 748417
13414G48417P9716K8362n9666j28706j08886k0076J9032k6028o4074o5706r0787
$$ 748417 828133 856495 796829 668123 559237 539161 558193 532165 468091 402385 311598
13403C11598r4784k3909L4550P2134O7243k2790j20265j50582j22163p3861n0981
$$ 311598 216814 192905 227455 299589 366832 344042 223777 73195 -48968 -122829 -173810
13392a73810p1082q3844J7278J51043J75336J42260J02756J03450J64845J90686
$$ -173810 -244892 -328736 -311458 -160415 14921 157181 259937 363387 528232 718918
13382G18918J51863O1563j8252k7537r983m9930r2826m7024j4966l8943l2362
$$ 718918 870781 932344 914092 886555 876572 826642 733816 686792 671826 632883 600521
13371F00521M529l980n0609m0694O9472J70743J42745J363j69737k43745j47723
$$ 600521 605050 601070 550461 509767 579239 749982 892727 894090 724353 480608 332885
13360C32885J7378R1136Q9372J27109J83073J46790K9414p2402j51448j83805
$$ 332885 350263 441399 530771 657880 840953 987743 1017157 944755 793307 609502
13350F09502j01810K5691J11402J22882Q5988P1053O9767N5525N2369J2266j06196
$$ 609502 507692 533383 644785 767667 853655 924708 994475 1050000 1102369 1114635 1008439
13339A008439k29399k86874k40108j19853k3513O807n3720j11273j02420p0443
$$ 1008439 779040 492166 252058 132205 108692 115499 61779 -49494 -151914 -222357
13329b22357P0514K60710L15377K05836K2911j36762k32997k19991q7842L8812
$$ -222357 -151843 108867 424244 630080 652991 516229 283232 63241 -24601 14211
13319A4211M1806k5843k3214N8255J20586J44862J04880P798n0693o5924q6256
$$ 14211 56017 30174 6960 65215 185801 330663 435543 443341 392648 326724 240468
13308B40468j23336r3782L2965J08447N7418J8382Q2950J43639J44062J11096
$$ 240468 117132 23350 56315 164762 222180 240562 323512 467151 611213 722309
13298G22309J2275j45065k39302k29758j75580q5823J6055Q5335J18564J42772
$$ 722309 734584 589519 350217 120459 -55121 -140944 -124889 -39554 79010 221782
13288B21782J79773K02008J64860O8138j3437k6686j8230k4646Q065K3884k6432
$$ 221782 401555 603563 768423 836561 823124 796438 778208 753562 761627 785511 759079
13277G59079j3875K6736k3454j25442j85351j94538j33218K1891J22723J23444
$$ 759079 745204 771940 748486 623044 437693 243155 109937 131828 254551 377995
13267C77995P2437j0489m3993m671J5598m2690j14913j50119j47884r0868p576
$$ 377995 450432 439943 395950 391279 406877 364187 249274 99155 -48729 -139597 -147173
13256a47173J0097n7045n8637L6749R6855R0681Q8898J50159J66958Q2229O1893
$$ -147173 -137076 -194121 -252758 -216009 -119154 -28473 60425 210584 377542 459771 521664
13245E21664Q6739P7449P7785R9888O0471o7624j56230j43877q0491L1650J20500
$$ 521664 608403 685852 763637 863525 923996 856372 700142 556265 475774 507424 627924
13234F27924P2482m3765o2160K0489N9908L4181J8888P279o6444j51478j82847
$$ 627924 700406 656641 594481 614970 674878 709059 727947 735226 668782 517304 334457
13223C34457j31470K93J02207R6862P6139J02641J36317R3102j0179n7061k1952
$$ 334457 202987 203280 305487 402349 478488 581129 717446 810548 800369 743308 721356
13212G21356M2906P0338L2981m7399j18484j40128j55558j72944o7983J14200
$$ 721356 764262 834600 867581 820182 701698 561570 406012 233068 165085 279285
13202B79285J69568J39375J42813J60393J30857L8165l0123n9356q7436o1716
$$ 279285 448853 588228 731041 891434 1022291 1060456 1030333 970977 883541 821825
13192H21825N4706J43812O3383r0943j60391j77803j54619q5370j0207M0055M9677
$$ 821825 876531 1020343 1083726 992783 832392 654589 499970 414600 404393 444448 494125
13181D94125L7603K5993r082j12074j59420p2455O6660J79129K69954L21112K53786
$$ 494125 531728 557721 548639 436565 277145 204690 271350 450479 720433 1041545 1295331
13170A295331J29806J1770q5636q1250K8613J21407J15274M6083n0832q5515o210
$$ 1295331 1425137 1436907 1351271 1270021 1298634 1420041 1535315 1581398 1530566 1445051 1438841
13159A438841J25374J77413J06433K7742o97m5782j20029j93281k05831j48848
$$ 1438841 1564215 1741628 1848061 1875803 1875106 1829324 1709295 1516014 1310183 1161335
13149A161335k5733J26496J82477J52909Q8768L8172O0464J07172J40305J32567
$$ 1161335 1135602 1262098 1444575 1597484 1686252 1724424 1784888 1892060 2032365 2164932
13139B164932N9296n8575j62962k10548j29139o7448j19860j17050l9273l4531
$$ 2164932 2224228 2165653 2002691 1792143 1663004 1595556 1475696 1358646 1319373 1284842
13129A284842q4182r2900p0969m3172r207J5690K6159L7840M3596Q3347J86907
$$ 1284842 1200660 1107760 1036791 993619 984412 1000102 1026261 1064101 1107697 1191044 1377951
13118A377951L09944L51245K16301J1879o2035k2836l773l5678p5612p9075n9305
$$ 1377951 1687895 2039140 2255441 2267320 2205285 2182449 2178676 2142998 2067386 1988311 1929006
13107A929006n7107q1540j11734p2598K9701O6792K4102j9470K875P8245R7494
$$ 1929006 1871899 1790359 1678625 1606027 1635728 1702520 1726622 1707152 1710027 1788272 1885766
13096A885766J752j01021p5319L9853J20897J29786J03402O0562K2692L284J4569
$$ 1885766 1887518 1786497 1711178 1751031 1871928 2001714 2105116 2165678 2188370 2191654 2206223
13085B206223N7694R6130R7633Q2785P0687N8060P2672J19004J17360L9840o1141
$$ 2206223 2263917 2360047 2457680 2540465 2611152 2669212 2741884 2860888 2978248 3018088 2956947
13074B956947j57675j55752n0737L4652N2058J0683j9322M301L8017Q5904J66348
$$ 2956947 2799272 2643520 2592783 2627435 2679493 2690176 2670854 2675155 2713172 2799076 2965424
13063B965424J73620J05133N6709j4284j21547j46352l8788J18658K34758K91590
$$ 2965424 3139044 3244177 3300886 3286602 3165055 3018703 2979915 3098573 3333331 3624921
13053C624921K80451J98948J14640N9988J2005k9181p5432r1545q8435o3012j5996
$$ 3624921 3905372 4104320 4218960 4278948 4290953 4261772 4186340 4094795 4006360 3943348 3927352
13042C927352O76J9101J29882K47741K36998J10275j6953m4039l8971n3938l1375
$$ 3927352 3928028 3947129 4077011 4324752 4561750 4672025 4655072 4611033 4572062 4518124 4486749
13031D486749N0695J74485K96021L44086K68603J58714Q9698N8601Q2834J37340
$$ 4486749 4537444 4711929 5007950 5352036 5620639 5779353 5869051 5927652 6010486 6147826
13021F147826J45995J28487J38176J32001Q9291J12354K39517L89015M91997N67342
$$ 6147826 6293821 6422308 6560484 6692485 6781776 6894130 7133647 7522662 8014659 8582001
13011H582001N68360M15634K46323K11166L18968M57073N23527N69803O11486
$$ 8582001 9150361 9565995 9812318 10023484 10342452 10799525 11323052 11892855 12504341
13002A2504341O72952Q31630J067669J306911J477887J604741J795991K033296
$$ 12504341 13177293 14008923 15076592 16383503 17861390 19466131 21262122 23295418
12994B3295418K241972K468974K798427L233522L835828M646000N607858O773924
$$ 23295418 25537390 28006364 30804791 34038313 37874141 42520141 48127999 54901923
12986E4901923Q245649J0052438J2237610J4938193J8250628K2229395K6787864
$$ 54901923 63147572 73200010 85437620 100375813 118626441 140855836 167643700
12979A67643700L1474517L5289998L6266824L1497151J8703353n41556j9711922
$$ 167643700 199118217 234408215 270675039 302172190 320875543 320333987 300622065
12972C00622065l2131873l6196118l4496338l0172863k5226181k0631751j6771421
$$ 300622065 268490192 232294074 197797736 167624873 142398692 121766941 104995520
12965A04995520j3705872j1284033r314739p726491o491042n540470m759643m069976
$$ 104995520 91289648 80005615 70690876 62964385 56473343 50932873 46173230 42103254
12957D2103254l475671l001494k653960k372881k093114j786060j487922j312641
$$ 42103254 38627583 35626089 32972129 30599248 28506134 26720074 25232152 23919511
12949B3919511j246167j120165r02127o98438o09390o29211o73762o97984o09210
$$ 23919511 22673344 21553179 20651052 19952614 19343224 18714013 18040251 17342267 16733057
12940A6733057m18742k57535k02581k26901k72435k73115j96994r7514o3980j16694
$$ 16733057 16314315 16056780 15854199 15627298 15354863 15081748 14884754 14787240 14723260 14606566
12930A4606566j58085p6333O0871J44745K03067K98511M42219N86149P38563Q79490
$$ 14606566 14448481 14372148 14433019 14577764 14780831 15079342 15521561 16107710 16846273 17725763
12920A7725763J013374J173205J265441J171394Q82637N47182L27050K86609M00899
$$ 17725763 18739137 19912342 21177783 22349177 23231814 23778996 24106046 24392655 24793554
12911B4793554O08424Q28455J067441J352562J687904K137568K691091L295072
$$ 24793554 25401978 26230433 27297874 28650436 30338340 32475908 35166999 38462071
12903C8462071L934841M594067N400846O617515Q313220J0408111J2922510J5964065
$$ 38462071 42396912 46990979 52391825 59009340 67322560 77730671 90653181 106617246
12895A06617246J9648644K3947661K8642771L3288824L6792761L6717930K9713069
$$ 106617246 126265890 150213551 178856322 212145146 248937907 285655837 315368906
12888C15368906J4082478o768943k5208054l5491990l7479676l4397939k9362612
$$ 315368906 329451384 322682441 297474387 261982397 224502721 190104782 160742170
12881A60742170k4198965j9657251j5927152j2968892j0612156q738953p283922
$$ 160742170 136543205 116885954 100958802 87989910 77377754 68638801 61354879
12874F1354879o174166n297262m517841l807034l195224k697213k322847k082203
$$ 61354879 55180713 49883451 45365610 41558576 38363352 35666139 33343292 31261089
12866C1261089j944854j839442j723913j573773j380891j193489r79587p67228
$$ 31261089 29316235 27476793 25752880 24179107 22798216 21604727 20625140 19857912
12858A9857912o38788o12967o67695p09021o47809m76184k96269k45332k95705
$$ 19857912 19219124 18606157 17938462 17229441 16581632 16105448 15809179 15563847 15268142
12849A5268142l42164l31125k41701j59041r9793l6851l7509n7616l4688M1299
$$ 15268142 14925978 14594853 14353152 14194111 14094318 14057467 14019958 13962342 13927654 13968953
12839A3968953J66472L05172M09668L98852K83944K22337K78965L88321N04206
$$ 13968953 14135425 14440597 14850265 15249117 15533061 15755398 16034363 16422684 16926890
12830A6926890O10816P10945Q00694Q80609R42089R94169J043433J115715J286538
$$ 16926890 17537706 18248651 19049345 19929954 20872043 21866212 22909645 24025360 25311898
12821B5311898J568260J957870K409024K929262L556382M301542N197163O273940
$$ 25311898 26880158 28838028 31247052 34176314 37732696 42034238 47231401 53505341
12813E3505341P509585Q953620J0872461J3486174J6773841K0612566K4894945
$$ 53505341 61014926 69968546 80841007 94327181 111101022 131713588 156608533
12806A56608533K9424153L3599528L6084383L4360741K5342981Q384198j1855748
$$ 156608533 186032686 219632214 255716597 290077338 315420319 323804517 311948769
12799C11948769k7943918l5657803l6025696l2376336k7457385k2707888j8589229
$$ 311948769 284004851 248347048 212321352 179945016 152487631 129779743 111190514
12792A11190514j5198823j2526251j0390651q629065p152376n949506n061467
$$ 111190514 95991691 83465440 73074789 64445724 57293348 51343842 46282375
12785D6282375m404756l837648l263279k775588k509672k302570k014187j777647
$$ 46282375 41877619 38039971 34776692 32001104 29491432 27188862 25174675 23397028
12777B3397028j590132j389231j240268j182085j174385j096490q71963o28435
$$ 23397028 21806896 20417665 19177397 17995312 16820927 15724437 14852474 14224039
12769A4224039m86658m33924m16390m19333m25353m29423m34140m13010l47400
$$ 14224039 13737381 13303457 12887067 12467734 12042381 11612958 11178818 10765808 10418408
12760A0418408k67664k64154k82885k48872j79367j01258j01981k30967m10984
$$ 10418408 10150744 9886590 9603705 9354833 9175466 9074208 8972227 8741260 8330276
12751H330276m73097m04226l36522l18441k93727k50882k30498k89858l84139
$$ 8330276 7857179 7452953 7116431 6797990 6504263 6253381 6022883 5733025 5348886
12742E348886l95888l20749k35084j60774p4649o363l1315j09250j54615j28407
$$ 5348886 4952998 4632249 4397165 4236391 4161742 4155379 4124064 4014814 3860199 3731792
12732C731792j13136j41271j32537r5583p1900o9973k6762P8786J72569J93743
$$ 3731792 3618656 3477385 3344848 3249265 3177365 3107392 3080630 3159416 3331985 3525728
12722C525728J04012n7467j34045j04474j03611j49494j67056j25737m2633O1671
$$ 3525728 3629740 3572273 3438228 3333754 3230143 3080649 2913593 2787856 2745223 2806894
12712B806894J13745O7218k6216r2352j06253j13095q7235J161J20595K30238
$$ 2806894 2920639 2987857 2961641 2869289 2763036 2649941 2562706 2563867 2684462 2914700
12702B914700K70269K07632J04660J6830r4953k03080k25311j51866p5359J002
$$ 2914700 3184969 3392601 3497261 3514091 3419138 3216058 2990747 2838881 2763522 2764524
12692B764524J08876J69054J71100J01244m2072j87870l04503l23986k33991j05374
$$ 2764524 2873400 3042454 3213554 3314798 3272726 3084856 2780353 2456367 2222376 2117002
12682B117002j9583j4151n7689o1726J5539O5273O1483N8047O318j07180j72480
$$ 2117002 2097419 2083268 2025579 1963853 1979392 2044665 2106148 2164195 2170513 2063333 1890853
12671A890853j49124j15680j40133j81644j88507j70749j38833j01736k0637Q4204
$$ 1890853 1741729 1626049 1485916 1304272 1115765 945016 806183 704447 683810 768014
12661G68014J20429P0827N0573L9128J8233P3438J51465J20446J6244m873M4606
$$ 768014 888443 959270 1009843 1048971 1067204 1140642 1292107 1412553 1428797 1423924 1468530
12650A468530N9401Q690p2660j26426j84258k19013j73418p4884q76J1089j6408
$$ 1468530 1527931 1536621 1463961 1337535 1153277 934264 760846 685962 685086 696175 679767
12639F79767q541L8508M6551r648q8425q5970k0724J1265m232q236M9008J77800
$$ 679767 671226 709734 756285 746637 658212 572242 551518 562783 558551 550315 599323 777123
12627G77123K95760K99719J88309L6513o5441r4192q4826r2655j00961r5903j04028
$$ 777123 1072883 1372602 1560911 1597424 1531983 1437791 1352965 1260310 1159349 1063446 959418
12616I59418r1584n4664o529Q1097J39258J56342J84402J84111J63409J25433
$$ 959418 867834 813170 806641 887738 1026996 1183338 1367740 1551851 1715260 1840693
12606A840693P4524J2369l4072m7410p5481j48426j90276j14808J1558K7824k5368
$$ 1840693 1915217 1927586 1893514 1846104 1770623 1622197 1431921 1317113 1328671 1356495 1331127
12595A331127l2923k9123j5222J473Q079p237p8884j35335q1501P461J785o9766
$$ 1331127 1298204 1269081 1253859 1255332 1263411 1256174 1177290 1041955 960454 967915 969700 899934
12583H99934q0570j9325M8838J13237J04300J1007m1573k9603j0699l0775r4991
$$ 899934 819364 800039 848877 962114 1066414 1077421 1035848 1006245 995546 964771 869780
12572H69780j55117j25144M330J67742L32596L96978L19671J21029j25844k45124
$$ 869780 714663 589519 593849 761591 1094187 1491165 1810836 1931865 1806021 1560897
12562A560897k23450j36365l3180j5054o2924p9580m4021j279l7341j28474j59672
$$ 1560897 1337447 1201082 1167902 1152848 1089924 1010344 966323 965044 927703 799229 639557
12551F39557j22704m3865K1976O1792J01167J10162J14983P9815j9738q0222q9070
$$ 639557 516853 472988 494964 556756 657923 768085 883068 962883 943145 862923 773853
12540G73853p6410m8195O134L3668k2065j00832j43727j05245q24P6765J16142
$$ 773853 697443 649248 655382 689050 666985 566153 422426 317181 316357 393122 509264
12529E09264J71472K22906K15553J66607P4544m2146j57709k39245k64264k10554
$$ 509264 680736 903642 1119195 1285802 1360346 1318200 1160491 921246 656982 446428
12519D46428r6828J9393P1560P7111P0269K6924M188M7185R9602R4740N8787L1075
$$ 446428 349600 368993 440553 517664 587933 614857 619045 666230 765832 860572 919359 950434
12507I50434L6512O7358O1674K2480q266K635N8453R6510L8405p1907j84523k88701
$$ 950434 986946 1054304 1115978 1138458 1130192 1132827 1191280 1287790 1326195 1254288 1069765 781064
12495G81064l59025l29858k20381j46632r4198j0168N7739R0541Q6422O1811O1004
$$ 781064 422039 92181 -128200 -274832 -369030 -379198 -321459 -230918 -144496 -82685 -21681
12484b1681L5127l2136l8175L5095Q4608K8776m0271K9982J91339K66220K48280
$$ -21681 13446 -18690 -56865 -21770 62838 91614 51343 81325 272664 538884 787164
12473G87164K19660J73333Q6075L4292L7184J2325k3666j1843J2760o632o0546
$$ 787164 1006824 1180157 1266232 1300524 1337708 1350033 1326367 1314524 1327284 1320652 1260106
12462A260106j23988j35345j39182j72791k29717k07398q1294K9447N2946K2309
$$ 1260106 1136118 1000773 861591 688800 459083 251685 170391 199838 252784 275093
12452B75093K151K1537K1705k9146j04432j71732j52514l4397J06303J98800K53215
$$ 275093 277244 298781 320486 291340 186908 15176 -137338 -171735 -65432 133368 386583
12441C86583K62537J61576R033q7464j24966j14644o0065m8674r4883p3441n082
$$ 386583 649120 810696 819729 732265 607299 492655 432590 383916 289033 215592 210510
12430B10510L2316O5695Q5615J12762J63939J83163J72508J93622J69156O8314
$$ 210510 242826 308521 394136 506898 670837 854000 1026508 1220130 1389286 1457600
12420A457600j0868m7018q5377j02742p5247k9147O122l9396j27974j94595k28357
$$ 1457600 1446732 1399714 1314337 1211595 1136348 1107201 1113323 1073927 945953 751358 523001
12409E23001j82221n4684N7495J10498J25048R2501k74p2773k6965P2999L3202
$$ 523001 340780 286096 343591 454089 579137 671638 671364 598591 571626 644625 677827
12398F77827j52660k30271j31711j6234N8474J01090J07919R3217N1465p12p1017
$$ 677827 525167 294896 163185 146951 205425 306515 414434 507651 559116 558404 487387
12387D87387j32458r9533k3522K9243L8109n298j8408K0756j1687j16205j72353
$$ 487387 354929 255396 231874 261117 299226 293928 275520 296276 284589 168384 -3969
12376c969j26252j7671K6476J1466k1609q9889j78914j85804n0965J36317K50073
$$ -3969 -130221 -147892 -121416 -109950 -131559 -221448 -400362 -586166 -637131 -500814 -250741
12365b50741K69196K86761L22225K73794P8929j27012j54102q6009k6321M5169
$$ -250741 18455 305216 627441 901235 980164 853152 699050 613041 586720 631889
12355F31889J02679J17947J32707J50402J15621M5338n1112j56026k63362k82494
$$ 631889 734568 852515 985222 1135624 1251245 1296583 1245471 1089445 826083 543589
12345E43589j35744K8805J17644J92290K24441J38919P911p3738j44739k06222
$$ 543589 407845 436650 554294 746584 971025 1109944 1117855 1044117 899378 693156
12335F93156k31809j97867j31180j12471j32890j17901k4735J04262K10291K36857
$$ 693156 461347 263480 132300 19829 -113061 -230962 -255697 -151435 58856 295713
12325B95713J63588R3148P1990j308j14000j28290j1179J08630J18486P4761k099
$$ 295713 459301 552449 624439 623131 509131 380841 369662 478292 596778 671539 669440
12314F69440j12462j56848p9859K4165K7794o1306q6132k1427j4969o3818o5864
$$ 669440 556978 400130 320271 344436 372230 310924 224792 203365 188396 124578 58714
12303E8714n5442q0182o6850l6773n4744p8205p5355N332P3552M7748O8453J28897
$$ 58714 3272 -76910 -143760 -180533 -235277 -313482 -388837 -383505 -309953 -262205 -193752 -64855
12291f4855J25032Q0411L0198k173l6563o7361p0281n5279m3876l2317L4345J67344
$$ -64855 60177 140588 170786 168613 132050 64689 -5592 -60871 -104747 -137064 -102719 64625
12279F4625K37689K06384J72181J10138m3525j75376j44998J1932J04238R831
$$ 64625 302314 508698 680879 791017 747492 572116 427118 439050 543288 553119
12269E53119j14623r4391l507O7496J24446J17784M5214m1653q4731m8671K4899
$$ 553119 438496 344105 340598 408094 532540 650324 695538 653885 569154 520483 545382
12258E45382P378j31076k40598k91049l19286k71295j44450j1747J07329J74020
$$ 545382 552760 421684 181086 -109963 -429249 -700544 -844994 -856741 -749412 -575392
12248e75392J72389J89527J98727J18520K5707m134R957O9425J18859R3960K2803
$$ -575392 -403003 -213476 -14749 103771 129478 125344 135301 204726 323585 417545 440348
12237D40348m7829q4867p2430l1419K9052N8081j7928q6449o0900L9016J09741
$$ 440348 392519 307652 235222 203803 232855 290936 273008 186559 125659 164675 274416
12226B74416L5856j14444k00100j33531J5748R4507J14466J12136J20074J22808
$$ 274416 310272 195828 -4272 -137803 -122055 -27548 86918 199054 319128 441936
12216D41936J26137J48173J22007Q2472M3515l9900j07924j20143j19332j43116
$$ 441936 568073 716246 838253 920725 964240 924340 816416 696273 576941 433825
12206D33825j73940j53722j01930n1900K0484J21617J87451J64107J21277J09548
$$ 433825 259885 106163 4233 -47667 -27183 94434 281885 445992 567269 676817
12196F76817R4688J6820m7077R026P5522Q1084L0088l5161j09501j88714j95541
$$ 676817 771505 788325 741248 750274 825796 906880 936968 901807 792306 603592 408051
12185D08051r3870L84o368p1823j03022m3417P6329J11580J1244p1748q1170l6062
$$ 408051 314181 314565 308197 236374 133352 89935 166264 277844 289088 217340 136170 100108
12173A00108M1039Q1915M9897l8786q4750p6545q8799q3712l7822j4381r212J917
$$ 100108 141147 223062 272959 234173 149423 72878 -15921 -99633 -137455 -151836 -161048 -159131
12161a59131N0206J32438J00172q0404k35364k34445r7166K0207M6543l591j41614
$$ -159131 -108925 23513 123685 43281 -192083 -426528 -523694 -503487 -456944 -460535 -602149
12150f02149k43736j33897R7623K47803L31889L66374K52935Q0776L0732J06422
$$ -602149 -845885 -979782 -882159 -634356 -302467 63907 316842 397618 428350 534772
12140E34772Q0472p4423j73814j63625j35589j17283q9186r0115k9298J20039
$$ 534772 615244 540821 367007 203382 67793 -49490 -138676 -228791 -258089 -138050
12130a38050K04280J71627J11444J02272Q5866L456p2419j07010j40648k06632
$$ -138050 66230 237857 349301 451573 537439 540895 468476 361466 220818 14186
12120A4186k60247k61477k43641k08363j32440j5944J36658K40059K36597J85010
$$ 14186 -246061 -507538 -751179 -959542 -1091982 -1107926 -971268 -731209 -494612 -309602
12110c09602J29948N1432n5824j24202j10144l6142M339m4397p7867k7924O3417
$$ -309602 -179654 -128222 -184046 -308248 -418392 -454534 -450195 -494592 -572459 -600383 -536966
12099e36966J27953J08889K5659n0012q8544p0097J4050J10111J38682R1287M0601
$$ -536966 -409013 -300124 -274465 -324477 -413021 -483118 -469068 -358957 -220275 -128988 -88387
12088h8387J8899n733l5406k4819R098L4627O5539R2271J14763J32956P1929n2810
$$ -88387 -69488 -75221 -110627 -135446 -126348 -91721 -26182 66089 180852 313808 385737 332927
12076C32927r0402k5579M8237P3595M4109K740m9369q6113p2135o8118q2102p5281
$$ 332927 242525 216946 265183 338778 382887 385627 336258 250145 178010 109892 27790 -47491
12064d7491n9581k9199o022l0021q1191j00466n0449N7842J23126J14954J32534
$$ -47491 -107072 -136271 -142293 -172314 -253505 -353971 -404420 -346578 -223452 -108498 24036
12053B4036J87120J66329P8123k6053j46866j64938k6674Q4409Q6911P3508J19214
$$ 24036 211156 377485 455608 429555 282689 117751 91077 175486 262397 335905 455119
12042D55119J40319J19148J39586J73203J38185Q9107N7847j7884o9959n6247
$$ 455119 595438 714586 854172 1027375 1165560 1254667 1312514 1294630 1224671 1168424
12032A168424n8400j00054j27206j12521n1614N0389J36622J25038J9802r4675
$$ 1168424 1110024 1009970 882764 770243 718629 769018 905640 1030678 1050480 955805
12022I55805j36408r9844j0583O6763N2076m7303j27906j60339j77905j61589
$$ 955805 819397 719553 708970 775733 827809 780506 652600 492261 314356 152767
12012A52767q4497o0425r6997j11075j9896J20362J82551J61646J06358m799j55826
$$ 152767 68270 7845 -89152 -200227 -220123 -99761 82790 244436 350794 345995 190169
12001A90169j96266n8489J27949K15534J59110P391r0222q5918l0386L1971N8756
$$ 190169 -6097 -64586 63363 278897 438007 445398 355176 269258 238872 270843 329599
11990C29599N0441K4074k1925n9683n4328R34Q4555J14426P4631Q5148J76149
$$ 329599 380040 404114 382189 322506 268178 269112 353667 468093 542724 627872 804021
11979H04021K16508J06495l1909n6372m9023n8969n2850p3748j17726r5326m2658
$$ 804021 1020529 1127024 1095115 1038743 989720 930751 877901 804153 686427 591101 548443
11968E48443q134l391k5026m5031l9912J9523J18031J76709J08207p3780k11573
$$ 548443 540309 536918 511892 466861 426949 446472 564503 741212 849419 775639 564066
11957E64066k39906j96828j43880n6743R5014J50420J8320k27753l53116k82728
$$ 564066 324160 127332 -16548 -73291 21723 172143 190463 -37290 -390406 -673134
11947f73134j20852R6858K32628K02574J80893K63066L31331K95445J48718m3168
$$ -673134 -793986 -697128 -464500 -261926 -81033 182033 513364 808809 957527 914359
11937I14359j83362k08651j42353j21028j17593l5230P8085J46651J11137j8969
$$ 914359 730997 522346 379993 258965 141372 106142 184227 330878 442015 423046
11927D23046j89650k88217k18966l1242R8630M3586r7131j27042l8314O3835J54931
$$ 423046 233396 -54821 -273787 -305029 -206399 -162813 -259944 -386986 -425300 -361465 -206534
11916b06534J73703J13739O7266N1199L4352L6619J3680m8467j08330j57665j61750
$$ -206534 -32831 80908 148174 199373 233725 270344 284024 235557 127227 -30438 -192188
11905a92188j05570m471O8068L2959o7107j22879q8345j8533N1149J86634L57294
$$ -192188 -297758 -302229 -234161 -201202 -268309 -391188 -479533 -498066 -446917 -260283 97011
11894I7011L70491K19035O4532j8023k8414k0346l9519m3154J237J8493o5114
$$ 97011 467502 686537 751069 733046 704632 684286 644767 601613 602850 621343 556229
11883E56229j92477k72250k97606k40622j11657M4722J63606J60124Q8758J9383
$$ 556229 363752 91502 -206104 -446726 -558383 -513661 -350055 -189931 -101173 -81790
11873h1790l3678o3231n9307m6484q3718j23607o7976M7518J29725J41984J09474
$$ -81790 -115468 -178699 -238006 -284490 -368208 -491815 -559791 -512273 -382548 -240564 -131090
11862a31090J03700J17791Q0993K2992L8378N7489l298m6759j9326J7337O2462
$$ -131090 -27390 90401 171394 194386 232764 290253 286955 240196 220870 238207 300669
11851C00669O8644N3623M3007k6228r3986j19681j03116k5234K8920J9427j0522
$$ 300669 369313 422936 465943 439715 345729 226048 122932 97698 126618 146045 135523
11840A35523j3890l5551j68852k48868j02526K34831M76677K99738j81826m82396
$$ 135523 121633 86082 -82770 -331638 -434164 -199333 277344 577082 395256 -87140
11830h7140m71990l54310r2151K07427K40753P3266O684O8402J78436K38862J18465
$$ -87140 -559130 -913440 -1005591 -798164 -557411 -484145 -477461 -409059 -230623 8239 126704
11819A26704q1589j85639j27306L3874J13336L7698p9434j40415j33803r3351
$$ 126704 45115 -140524 -267830 -233956 -120620 -82922 -162356 -302771 -436574 -529925
11809e29925l6072O4304J27527J02766O3158L1990j8640l9996K4065P5497L8357
$$ -529925 -565997 -501693 -374166 -271400 -208242 -176252 -194892 -234888 -210823 -135326 -96969
11798i6969p979n0353p3251n5529R344L9872j3653o8023l9307J00492J99183J49194
$$ -96969 -104948 -155301 -228552 -284081 -274737 -234865 -248518 -316541 -355848 -255356 -56173 93021
11786I3021o451j82813k23694j23586m4370k8258J4040J02785J68136J32366L4958
$$ 93021 86570 -96243 -319937 -443523 -487893 -516151 -502111 -399326 -231190 -98824 -63866
11775f3866K1551P5985J10413J12612M9358o4768p9911K3417R1210K4190m7657
$$ -63866 -42315 33670 144083 256695 306053 241285 161374 184791 276001 300191 252534
11764B52534J0705Q4647M8501k4178n6721k9504J7327J4088J2299O2314Q3745
$$ 252534 263239 347886 396387 372209 315488 285984 303311 317399 329698 392012 475757
11753D75757J61j44676k46399j98707n5635K9023J9712l9216n8338m5922m9299
$$ 475757 475918 331242 84843 -113864 -169499 -140476 -120764 -159980 -218318 -264240 -313539
11742c13539j7405Q1380J98410K11937J24614O0122k0249j26526j67411j93359
$$ -313539 -330944 -249564 -51154 160783 285397 345519 325270 198744 31333 -162026
11732a62026k26659j68962r887J40957J49494Q5557Q2214J20681J32639N0776
$$ -162026 -388685 -557647 -567534 -426577 -277083 -191526 -109312 11369 144008 194784
11722A94784n52J20083K62444K94976J87629p214j37417j40015q8826j18541k00037
$$ 194784 194232 314315 576759 871735 1059364 1052150 914733 774718 685892 567351 367314
11711C67314j72104o7197r370k9636o9227p1181p9006n6434M7535Q4599P1013
$$ 367314 195210 128013 118643 89007 19780 -51401 -130407 -186841 -139306 -54707 16306
11700A6306J34569J95573J56901O2123j660k9816p8604j14267r0065k0562Q7797
$$ 16306 150875 346448 503349 565472 563812 533996 455392 341125 251060 230498 318295
11689C18295J47614J19247P6055O5858L2221n1257n9688M8194K17704L22514L33863
$$ 318295 465909 585156 661211 727069 759290 708033 648345 696539 914243 1236757 1570620
11678A570620K51716m6304l20281l04207k21951k55011l17141k99325k03590j08888
$$ 1570620 1822336 1776032 1455751 1151544 929593 674582 357441 58116 -145474 -254362
11668b54362p3993q5119j21909j37207j36201j59421j62007j04919o436J36123
$$ -254362 -328355 -413474 -535383 -672590 -808791 -968212 -1130219 -1235138 -1241574 -1105451
11658a105451K24149K18694K22952K24020J45393k6839j93136k78318k29776m0736
$$ -1105451 -881302 -662608 -439656 -215636 -70243 -97082 -290218 -568536 -798312 -839048
11648h39048J25555J70657J60811J34704M7328l4641M241L5458j9258p5925j12673
$$ -839048 -713493 -542836 -382025 -247321 -199993 -234634 -230393 -194935 -214193 -290118 -402791
11637d02791j07544k9080P7026J10338O5969P0018J53185K68345L31080K86633
$$ -402791 -510335 -539415 -462389 -352051 -286082 -216064 -62879 205466 536546 823179
11627H23179K38415K20254J65870Q7127n107p9065q4177l2927K1871O6485Q6890
$$ 823179 1061594 1281848 1447718 1534845 1529738 1450673 1366496 1333569 1355440 1421925 1508815
11616A508815J04574J13676R9793J44919K49584L52112M45717M72063M51485M20622
$$ 1508815 1613389 1727065 1826858 1971777 2221361 2573473 3019190 3491253 3942738 4363360
11606D363360M08127M24272L45162J80397J01254R9065M627k16059l89910l69707
$$ 4363360 4771487 5195759 5540921 5721318 5822572 5921637 5926264 5710205 5320295 4950588
11596D950588k46743j96538k54791l03575l04599k89227k46590j18383N0832J06865
$$ 4950588 4703845 4507307 4252516 3948941 3644342 3355115 3108525 2990142 3040974 3147839
11586C147839P6214N3747O2175R5473J15002J09039J28231K12427L76708N41669
$$ 3147839 3224053 3277800 3339975 3435448 3550450 3659489 3787720 4000147 4376855 4918524
11576D918524N62581N37758O26352P70122Q87656R90274J189268J576269K047306
$$ 4918524 5481105 6018863 6645215 7415337 8302993 9293267 10482535 12058804 14106110
11567A4106110K543468L130554L775581M466328N290563O150097O593829O065837
$$ 14106110 16649578 19780132 23555713 28022041 33312604 39462701 46056530 52122367
11559E2122367M173389J209849j574702l235160m085659m760839n358757n538622
$$ 52122367 56295756 57505605 55930903 52695743 48610084 43849245 38490488 32951866
11551C2951866n104874m340222l596541k966326k446599k007159j617855j297543
$$ 32951866 27846992 23506770 19910229 16943903 14497304 12490145 10872290 9574747
11543I574747j057441q58319o72359n12107m35596l78193k98571k81237l77941
$$ 9574747 8517306 7658987 6986628 6474521 6038925 5660732 5362161 5080924 4702983
11534D702983m97731n29857m87348m07231l31108l02427k84297k06275j11884
$$ 4702983 4205252 3675395 3188047 2780816 2449708 2147281 1862984 1656709 1544825
11525A544825l5616N2188J40011J52723R3405j3661j33521k06322j93750j29726
$$ 1544825 1509209 1561397 1701408 1854131 1947536 1933875 1800354 1594032 1400282 1270556
11515A270556m8574K7359L6033J5523M9428R8627R9458L8925n6194j05659m3888
$$ 1270556 1221982 1249341 1285374 1300897 1350325 1448952 1548410 1587335 1531141 1425482 1381594
11504A381594L1674m490p7397p2072j6626K0442K2826O923m1150j37335j92011
$$ 1381594 1413268 1408778 1331381 1259309 1242683 1263125 1285951 1292874 1251724 1114389 922378
11493I22378j76672j21215O569J23078O0831p0253p8864q928J6830n973K102K5575
$$ 922378 745706 624491 631060 754138 814969 744716 665852 656924 673754 667781 669883 695458
11481F95458n434n9942n2931l0643k1714k655p486n1381m1113K8250P2169K4466
$$ 695458 690024 630082 577151 546508 524794 522139 514653 463272 422159 450409 522578 547044
11469E47044p8658j40072p7144J29317L12518L06925J36074q0113k17072k19752
$$ 547044 468386 328314 251170 380487 693005 999930 1136004 1055891 838819 619067
11459F19067j81410j49846o4990K0266m2163j95921k29289j41049p2237l8353
$$ 619067 437657 287811 222821 243087 200924 5003 -224286 -365335 -437572 -475925
11449d75925o0109j41080j27678K1640J46763J31872N0733M8032J24285J46972
$$ -475925 -536034 -677114 -804792 -783152 -636389 -504517 -453784 -405752 -281467 -134495
11439a34495L9007j15704j36841j8024Q3793J04958J39579K06379K25308J48602
$$ -134495 -95488 -211192 -348033 -366057 -282264 -177306 -37727 168652 393960 542562
11429E42562M304j49184k40723k49550j89134o9022O2157J32826J27352O3995
$$ 542562 546866 397682 156959 -92591 -281725 -350747 -288590 -155764 -28412 35583
11419C5583j6943p6579o6709l620p868j03930j82184j65636n2160J32711K80594
$$ 35583 18640 -57939 -124648 -128268 -136136 -240066 -422250 -587886 -640046 -507335 -226741
11408b26741L26907K54500Q0886o7221j01071j00648j44139j49465j608J96300
$$ -226741 100166 354666 435552 368331 267260 166612 22473 -126992 -128600 67700
11398F7700K12019R0348O3382R8578Q8742M1928N439L2896R0479R2350N0002J9374
$$ 67700 279719 370067 433449 532027 620769 662697 668136 701032 791511 883861 933863 953237
11386I53237j0106j03410j99441k16742j59387n8753K3407P9336J34958J35115
$$ 953237 943131 839721 640280 423538 264151 205398 228805 308141 443099 578214
11376E78214O7284m0858j44426j77267j37283j31231j30835l6530N2228P0777
$$ 578214 645498 604640 460214 282947 145664 14433 -116402 -152932 -100704 -29927
11366b9927Q2306J32482J63905J06242Q062k5999k4965l0551J7472R0421R0823
$$ -29927 52379 184861 348766 455008 463070 437071 412106 381555 399027 489448 580271
11355E80271J016j25378k12586j61235K5487K12521K30262Q7705p539M9111J44274
$$ 580271 581287 455909 243323 82088 107575 320096 550358 638063 630524 679635 823909
11344H23909J32737L9614n1626j38857k26735k63828k10382q6055L9916J05364
$$ 823909 956646 996260 944634 805777 579042 315214 104832 18777 58693 164057
11334A64057J08223O8555J1244m9834q7962r6046j09389j32065j02725r41P8296
$$ 164057 272280 340835 352079 302245 214283 118237 8848 -123217 -225942 -226883 -148587
11323a48587R1564Q0857L1221k8182n1829m0668k4026k9519n1421r5298q2598
$$ -148587 -57023 23834 55055 26873 -24956 -65624 -89650 -119169 -170590 -265888 -348486
11312c48486J270K7373m3038p5778j1242K299n3997n0161p890m3923j31994j51128
$$ -348486 -347216 -319843 -362881 -438659 -449901 -447602 -501599 -551760 -559650 -603573 -735567 -886695
11300h86695p4512n627L6756J00865J52449J50802J27141J33466K30593L23500
$$ -886695 -961207 -966834 -930078 -829213 -676764 -525962 -398821 -265355 -34762 288738
11290B88738K71601J35233M7625L3954j2139j07585j76987j77409j39521r7586
$$ 288738 560339 695572 743197 777151 765012 657427 480440 303031 163510 65924
11280F5924l3832K5656K0137j9690m6827l9870k9752r464N5509J08821J08297
$$ 65924 32092 57748 77885 58195 11368 -28502 -58254 -67718 -12209 96612 204909
11269B04909Q8291Q1232O9664N1303J784p3812q0863J163Q8045J61047K05381
$$ 204909 293200 374432 444096 495399 497183 423371 342508 343671 431716 592763 798144
11258G98144K00600J41127O5101p270j18806j97408j77381j41909j22160p1554
$$ 798144 998744 1139871 1204972 1197702 1078896 881488 704107 562198 440038 368484
11248C68484J5147N7029J3202k9855M8988K09896K70121J58235l0705j74144k52458
$$ 368484 383631 440660 453862 424007 472995 682891 953012 1111247 1080542 906398 653940
11237F53940k52686j68442q6694p9116j38764j76862j78252j64015p5888M3097
$$ 653940 401254 232812 146118 67002 -71762 -248624 -426876 -590891 -666779 -623682
11227f23682J14635J06050Q6252J30420J58651J12206M9216L0765Q0527J28921
$$ -623682 -509047 -402997 -316745 -186325 -27674 84532 133748 164513 245040 373961
11217C73961J04081L8319n0352q9659m5276k0356m3645r6134j08032k0291K3479
$$ 373961 478042 516361 466009 376350 331074 310718 267073 170939 62907 42616 66095
11206F6095q1915k56193l57112k97609j50187j3678J00175J83726J56487M0341
$$ 66095 -15820 -272013 -629125 -926734 -1076921 -1090599 -990424 -806698 -650211 -609870
11196f09870m8479l1493J03388L13542M32634L17175Q3231o8505j35026j76216
$$ -609870 -658349 -689842 -586454 -272912 159722 476897 560128 491623 356597 180381
11186A80381k14444k18581j53453o2856p698K8633L9361L3617K5885j9059m8510
$$ 180381 -34063 -252644 -406097 -468953 -476651 -448018 -408657 -375040 -349155 -368214 -416724
11175d16724m317N6672N6230K5436J0129k2431l7056j0111o877l3955k6374K9670
$$ -416724 -421041 -364369 -308139 -282703 -272574 -295005 -332061 -342172 -349049 -383004 -409378 -379708
11163c79708R8576J09894O7583L6216J261l5592k8305j9055j8422M244N6116J18457
$$ -379708 -281132 -171238 -103655 -67439 -66178 -101770 -130075 -149130 -167552 -163308 -107192 11265
11151A1265O8883o1924j03431p6176k7541M0727Q5329R3687N9371l3931j16511
$$ 11265 80148 18224 -85207 -161383 -188924 -148197 -62868 30819 90190 56259 -60252
11140f0252r2120P177J02723J51824J17546J8978q0904j23152j29106j00554j0467
$$ -60252 -152372 -145195 -42472 109352 226898 245876 164972 41820 -87286 -187840 -198307
11129a98307O5917P4684L5704j3298p2455j63595k17516j72467m4984J40820K80209
$$ -198307 -132390 -57706 -22002 -35300 -107755 -271350 -488866 -661333 -706317 -565497 -285288
11118b85288K50039J08019o926m2094l4738p7276j59718j93617j39741p4901m5511
$$ -285288 -35249 72770 65844 23750 -10988 -88264 -247982 -441599 -581340 -656241 -701752
11107g01752P620O3077J03284J43256J33997O3762k449j5068j340M1032P2659
$$ -701752 -694132 -631055 -527771 -384515 -250518 -186756 -189205 -204273 -205613 -164581 -91922
11096i1922M0201p505p2512j61205j84230j04549j1290l968o5579n5611O3002
$$ -91922 -51721 -59226 -131738 -292943 -477173 -581722 -593012 -596980 -662559 -718170 -655168
11085f55168J74783J99798J61892J09690M1246J826J5579m4033j93474k33152
$$ -655168 -480385 -280587 -118695 -9005 32241 34067 49646 5613 -187861 -421013
11075d21013q9394R4826K04834K29481J59648L4230n7834q8430r4173j04597r7891
$$ -421013 -510407 -415581 -210747 18734 178382 212612 154778 66348 -27825 -132422 -230313
11064b30313m6811J8888J7462n9335j10570n7049P1975J50226J23408K4765n1986
$$ -230313 -277124 -258236 -240774 -300109 -410679 -467728 -395753 -245527 -122119 -97354 -149340
11053a49340n9031n7437j15827j26214m2856O3400J35727J68137J41872Q5581
$$ -149340 -208371 -265808 -381635 -507849 -550705 -487305 -351578 -183441 -41569 44012
11043D4012O6810N4821M2934O7996R7607N6480O894L9392J28731K18000K48878
$$ 44012 110822 165643 208577 276573 374180 430660 437554 476946 605677 823677 1072555
11032A072555K14370J22177o956j27013k22829k37236j65064j03606p8828p9459
$$ 1072555 1286925 1409102 1402146 1275133 1052304 815068 650004 546398 467570 388111
11022C88111n8825l841J664j3828k9021m1731n2834q3926p5009m0031n3202p6607
$$ 388111 329286 325445 327109 313281 284260 242529 189695 105769 30760 -9271 -62473 -139080
11010a39080o9496k436N8478K7377k7268o6553r7965o4472J3639N1861M8558M5363
$$ -139080 -208576 -211012 -152534 -125157 -152425 -218978 -316943 -381415 -367776 -315915 -267357 -221994
10998b21994P819p2731j13410p9328l3254K8041R3651J27948J16296P8318L6664
$$ -221994 -214175 -286906 -400316 -479644 -512898 -484857 -391206 -263258 -146962 -68644 -31980
10987c1980K5323J3100k7945l2650j9702m548m9791j32343j47441j18919j34048
$$ -31980 -6657 6443 -21502 -54152 -73854 -78402 -128193 -260536 -407977 -526896 -660944
10976f60944r5093O713P4212N6113M69p303p080m4772o3001o2330l5123L8283
$$ -660944 -756037 -749324 -675112 -618999 -618530 -625833 -632913 -677685 -740686 -803016 -838139 -799856
10964g99856R5411J24804J49868J73250J85527J41698P7967O1415L7976k1006
$$ -799856 -704445 -579641 -429773 -256523 -70996 70702 148669 210084 248060 227054
10954B27054q6611j18961j00162q3199m1755N4629O0045l7763q3076m0206J7516
$$ 227054 140443 21482 -78680 -161879 -203634 -149005 -88960 -126723 -209799 -250005 -232489
10943b32489J7896n9688p2285L0109P4133J312k8227j177m6043r0337o1459n8787
$$ -232489 -214593 -274281 -346566 -316457 -242324 -241012 -269239 -270416 -316459 -406796 -468255 -527042
10931e27042o4592j1674N1654O3998L8230L6945O1970O8709M6362M1988O5889
$$ -527042 -591634 -603308 -551654 -487656 -449426 -412481 -350511 -281802 -235440 -193452 -127563
10920a27563P9319N7901N0320N0588L2862J1962j3504q0204j73558k20912j96851
$$ -127563 -48244 9657 59977 110565 143427 155389 141885 61681 -111877 -332789 -529640
10909e29640j22219m0968O472l779n1193j03934l5281Q3777P8898M3422Q8849
$$ -529640 -651859 -692827 -686355 -690134 -741327 -845261 -880542 -796765 -717867 -674445 -585596
10898e85596J47421J34810N3881j7708J452N6813O2849J1797o4392q3166p2691
$$ -585596 -438175 -303365 -249484 -267192 -265740 -208927 -146078 -134281 -198673 -281839 -354530
10887c54530q1444p2051j8332M3536L3857l0506q7113r1238m0330J9850K5938
$$ -354530 -435974 -508025 -526357 -482821 -448964 -479470 -566583 -657821 -698151 -678301 -652363
10876f52363r112P323Q3298J74510K15151J81218P5466m4663r4974q9016j01526
$$ -652363 -661475 -654152 -570854 -396344 -181193 25 75491 30828 -64146 -153162 -254688
10865b54688j19848j05109q2824n6109k669L8364L7595K2346N2392J29942J91627
$$ -254688 -374536 -479645 -562469 -618578 -621247 -582883 -545288 -522942 -470550 -340608 -148981
10854a48981K17966J86778O5304o6172j53863j50005m1590L2910J1975k5812j3609
$$ -148981 68985 255763 321067 254895 101032 -48973 -90563 -57653 -45678 -71490 -85099
10843h5099j2350k7742n621M0054Q7752J14029P8523K67l3774k5575j1201K9814
$$ -85099 -97449 -125191 -130812 -90758 -3006 111023 189546 189813 156039 130464 119263 149077
10831A49077N6625L0866J0847J2001j0159l0451k1968j6115j470N3426R6709O1249
$$ 149077 205702 236568 247415 259416 249257 218806 196838 180723 179253 232679 329388 390637
10819C90637l293J9589R8512O3640p2197j31526q3259j3629L6967Q668p5426j00393
$$ 390637 387344 406933 505445 569085 496888 365362 282103 268474 305441 314109 238683 138290
10807A38290j00184r1299k6009L9720J9064l9588l3109M2956R9124M2925o0935
$$ 138290 38106 -53193 -79202 -39482 -20418 -60006 -93115 -50159 48965 91890 30955
10796C0955r4062k7562P3745J42212J60378J32298J05002J16703J45690J46329
$$ 30955 -63107 -90669 -16924 125288 285666 417964 522966 639669 785359 931688
10786I31688N6143q5071j61694j69022j68698j47080p9152k9864Q120O9587R5579
$$ 931688 987831 902760 741066 572044 403346 256266 177114 147250 155370 224957 320536
10775C20536N8211J5728k3580r189P4117J07517N7009k5894o7867m4625j2651
$$ 320536 378747 394475 370895 361706 435823 543340 600349 574455 506588 461963 449312
10764D49312l5162r8339q4036l7532n4191j31833j71806j05331Q49L7654K8912
$$ 449312 414150 315811 231775 194243 140052 8219 -163587 -268918 -268069 -230415 -201503
10753b01503o68l7261J2618R3331R5326J6133o2990o5994J8606J33840J73092
$$ -201503 -202171 -239432 -226814 -133483 -38157 -22024 -85014 -151008 -132402 1438 174530
10742A74530J61630J46016R1196K9390k4936j22049k01798j74924o8077J6521
$$ 174530 336160 482176 573372 602762 577826 455777 253979 79055 10978 27499
10732B7499P4242J19268R5719J4292n3587n4790M6665J92400K60346K36642J60149
$$ 27499 101741 221009 316728 331020 277433 222643 269308 461708 722054 958696 1118845
10721A118845J05702J12850J27007J15404J30689J69997J64143J42608K15390
$$ 1118845 1224547 1337397 1464404 1579808 1710497 1880494 2044637 2187245 2402635
10712B402635L58397M65147N11932N70996O96129P69663P61238Q23307J050078
$$ 2402635 2761032 3226179 3738111 4309107 5005236 5774899 6536137 7359444 8409522
10703H409522J390132J761077K205717K803973L564797M498309N525577O412909
$$ 8409522 9799654 11560731 13766448 16570421 20135218 24633527 30159104 36572013
10695C6572013O784038O073773M140321J801668K04672k95967k56295n21184j685590
$$ 36572013 43356051 49429824 53570145 55371813 55576485 55280518 55024223 54503039 52817449
10686E2817449l673383n574954o410781o094892n193825m189443l295714k629085
$$ 52817449 49144066 43569112 37158331 31063439 25869614 21680171 18384457 15755372
10678A5755372k140105j702224j399280j269042j156017r60822p61761o16747
$$ 15755372 13615267 11913043 10513763 9244721 8088704 7127882 6366121 5749374
10670E749374n20019m74387m16810l35931k46169j80699j47740p9209n8408j50509
$$ 5749374 5229355 4754968 4338158 4002227 3756058 3575359 3427619 3348410 3290002 3139493
10660C139493k42538k45232j68191q8389o6915q4733n8989m9184j36558k01491
$$ 3139493 2896955 2651723 2483532 2395143 2328228 2243495 2184506 2135322 1998764 1797273
10650A797273j75395j26083p9707l5637m6970o0024K1170J50048J95067J22340
$$ 1797273 1621878 1495795 1416088 1380451 1333481 1273457 1294627 1444675 1639742 1762082
10640A762082K8128m3839j03209j75346k21996k01660j59984j68387k29465k30463
$$ 1762082 1790210 1746371 1643162 1467816 1245820 1044160 884176 715789 486324 255861
10630B55861q8490R6877J37033J7928o7573l0403L0592O124k6500M3649J56623
$$ 255861 167371 264248 401281 419209 351636 321233 351825 357949 331449 375098 531721
10619E31721K37270K11523O2247p6898p5297J6955Q1739K0130j46405k08466q0935
$$ 531721 768991 980514 1042761 965863 890566 907521 989260 1009390 862985 654519 573584
10608E73584Q0531J48127J34289J48779J73364J21265m482j53910k35834j71317
$$ 573584 654115 802242 936531 1085310 1258674 1379939 1375457 1221547 985713 814396
10598H14396m4060K9753K0232k4496j0986J2223r6567k22728k23593j97825j56123
$$ 814396 770336 800089 820321 795825 784839 797062 700495 477767 254174 56349 -99774
10587i9774l7634O8865L9330p9315j35567r7916m7838k5419j6032K8574P3542
$$ -99774 -137408 -68543 -29213 -108528 -244095 -342011 -389849 -415268 -431300 -402726 -329184
10576c29184J19731K07842K84368K43280O1506o9697m9943J8594N3834O1105J06932
$$ -329184 -209453 -1611 282757 526037 587543 517846 467903 486497 540331 601436 708368
10565G08368J46668R7977l3133j77943k70909k83532k13073j50550j24843q8736
$$ 708368 855036 953013 919880 741937 471028 187496 -25577 -176127 -300970 -389706
10555c89706n2160L8374J86154K59105K23840J47082P7717J9989j3053M132K5959
$$ -389706 -441866 -403492 -217338 41767 265607 412689 490406 510395 497342 501474 527433
10544E27433M637J8939N0598M4474M8118K1437m7081j08942j57170j53243m9272
$$ 527433 532070 551009 601607 646081 694199 715636 668555 559613 402443 249200 199928
10533A99928Q3287J30594J06089R5533P6774L5198K189m7466j06941j48696j33836
$$ 199928 283215 413809 519898 615431 692205 727403 729592 682126 575185 426489 292653
10522B92653n1911n387l3544p1225p4200m8595m4842q0772j02165q3312o0184
$$ 292653 240742 235355 201811 130586 56386 7791 -37051 -117823 -219988 -303300 -363484
10511c63484l7616j7847r950M8182J50059K32673K70328K36512J44021K7882j04348
$$ -363484 -401100 -418947 -428897 -380715 -230656 2017 272345 508857 652878 680760 576412
10500E76412j98073k04480r4836L3820L5942j0599k8125j443K1705k277n2833
$$ 576412 378339 173859 79023 112843 148785 138186 110061 108618 130323 128046 75213
10489G5213q6902j20682j73773j56418m7163P5901Q4615j2261l8316l098n391
$$ 75213 -11689 -132371 -306144 -462562 -509725 -433824 -349209 -361470 -399786 -402884 -408275
10478d08275m265N9639J26627J16192M9488K7240O1807J17320J58009J54909J57584
$$ -408275 -412540 -352901 -226274 -110082 -60594 -33354 28453 145773 303782 458691 616275
10467F16275J41814O2451o8701k12897l02450k47402q5629L2643J19783K61291
$$ 616275 758089 820540 751839 538942 236492 -10910 -96539 -63896 55887 317178
10457C17178L14902J14866j69662k57879j28980J8707P1371K3698n0026l6600
$$ 317178 632080 746946 577284 319405 190425 209132 280503 304201 254175 217575
10447B17575N4688J22204P7797o6083k21715l00952k47688j38419q6040r1928
$$ 217575 272263 394467 472264 406181 184466 -116486 -364174 -502593 -588633 -680561
10437f80561p3041K4580J27003J66970R9024k6592n2422L6100J36085J54376Q3820
$$ -680561 -753602 -729022 -602019 -435049 -336025 -362617 -415039 -378939 -242854 -88478 -4658
10426d658J4363N9170J61527J56321O2280P341L1753J14374J90456J89995N6380
$$ -4658 9705 68875 230402 386723 449003 456344 488097 602471 792927 982922 1039302
10415A039302j34684k49824k94852k75272j90565p4269O9819K40088L31053K27090
$$ 1039302 904618 654794 359942 84670 -105895 -180164 -110345 129743 460796 687886
10405F87886j7958j90686k25957j80015j15280j37570j60262j07259k4654Q1283
$$ 687886 669928 479242 253285 73270 -42010 -179580 -339842 -447101 -471755 -390472
10395c90472J65510J99102J76880R6864L255k8163N27M376m6307j13931j16237
$$ -390472 -224962 -25860 151020 247884 251139 222976 223503 227879 181572 67641 -48596
10384d8596l8293L6231O110j14562j83212j42018p6919m7610j5007N4345J39686
$$ -48596 -86889 -50658 -44548 -159110 -342322 -484340 -561259 -608869 -623876 -569531 -429845
10373d29845J81760J78477J15051j6512j35312j68195j26553n6684J7322M3180
$$ -429845 -248085 -69608 45443 28931 -106381 -274576 -401129 -457813 -440491 -397311
10363c97311k2220q8663p9179o6925j04659j33357p2950M2853J15032Q1831N112
$$ -397311 -419531 -508194 -587373 -654298 -758957 -892314 -965264 -922411 -807379 -725548 -720436
10352g20436K8091J33464K09334J66388N929j37040j50576n9502P3787J74306
$$ -720436 -692345 -558881 -349547 -183159 -177230 -314270 -464846 -524348 -450561 -276255
10342b76255J94431J44778N7480l1206j07278j36329r7423j7669Q7861K14509
$$ -276255 -81824 62954 120434 89228 -18050 -154379 -251802 -269471 -181610 32899
10332C2899K61287K16853J21231J1184o6657j18423r8484l2185r199k7606k8768
$$ 32899 294186 511039 632270 643454 576797 458374 359890 327705 318506 290900 262132
10321B62132l6895o8102j02868j36453q7615L6570J37452J99094J86930J23424
$$ 262132 225237 157135 54267 -82186 -169801 -133231 4221 203315 390245 513669
10311E13669P4980M5060q570j28986k35245k32154j84478j44229j00780p4681
$$ 513669 588649 633709 625139 496153 260908 28754 -155724 -299953 -400733 -475414
10301d75414n7791l2387l0499o1831k4713Q4718J23343J00776P6402N3903O3401
$$ -475414 -533205 -565592 -596091 -657922 -682635 -597917 -474574 -373798 -297396 -243493 -180092
10290a80092J61839K47477J57646n5439j91974k08113j52224p2640k8618m4551
$$ -180092 -18253 229224 386870 331431 139457 -68656 -220880 -293520 -322138 -366689
10280c66689q2385r5183p0362m2006r707R3503K05833K32883J79389N9378j33738
$$ -366689 -449074 -544257 -614619 -656625 -666332 -572829 -366996 -134113 45276 104654 -29084
10269b9084k97567k53028m9166Q2250J16388J20530J34114J83323K10996J61403
$$ -29084 -326651 -579679 -628845 -546595 -430207 -309677 -175563 7760 218756 380159
10259C80159M1397m1341R394J16974J60734J29244Q1308O9208Q9484O8436l1002
$$ 380159 421556 380215 389609 506583 667317 796561 877869 947077 1036561 1104997 1073995
10248A073995j48524j90317j70247j48591j32540j41106j53934j19501m0309K2064
$$ 1073995 925471 735154 564907 416316 283776 142670 -11264 -130765 -171074 -149010
10238a49010J1547k7906p2237p7676k7144J862O439O0339J20488O2700r6138j63119
$$ -149010 -137463 -165369 -237606 -315282 -342426 -340564 -334125 -273786 -153298 -90598 -186736 -349855
10226c49855n1436Q7690J45899J60298J15931k3536j71928k21932j67719j10840
$$ -349855 -401291 -313601 -167702 -7404 108527 84991 -86937 -308869 -476588 -587428
10216e87428m8490M2055R9690J17961J31464J22529N6322l2008o1237j1391M1598
$$ -587428 -635918 -593863 -494173 -376212 -244748 -122219 -65897 -97905 -159142 -170533 -128935
10205a28935O7672Q0044N6552j280o8792j04892p3908K0595Q8529Q8836P2562
$$ -128935 -61263 18781 75333 74053 5261 -99631 -173539 -152944 -64415 24421 96983
10194I6983R2719J33973J27817N2400l3122k1429M0986Q346m6169l1040k6728
$$ 96983 189702 323675 451492 503892 470770 449341 490327 498673 452504 421464 394736
10183C94736j6608j0308q4849j83427k36443k46272j67866NJ29569J31002P8047
$$ 394736 378128 367820 282971 99544 -136899 -383171 -551037 -551032 -421463 -290461 -212414
10172b12414K9165K71L35k2321l6702j7377q31m848l8912j7143O4280J59779K20416
$$ -212414 -183249 -182978 -182643 -204964 -241666 -259043 -259874 -264722 -303634 -320777 -256497 -96718 123698
10159A23698J60565J7031o8067o6477k8898J416K0581P0128J18543R9913J4906
$$ 123698 284263 301294 233227 166750 137852 139268 159849 229977 348520 448433 463339
10148D63339o3927j07081j34020j34469r2499j4317P9517J47761J78933J69940
$$ 463339 399412 292331 158311 23842 -68657 -82974 -3457 144304 323237 493177
10138D93177R9945K4643j2515l0228n2795o3831k4958J9244k081m1818j7157L7685
$$ 493177 593122 617765 605250 575022 522227 458396 433438 452682 450601 408783 391626 429311
10126D29311P3015N3060l8921j26312j41209n1186N9924L4017n1440m2366J791
$$ 429311 502326 555386 516465 390153 248944 197758 257682 291699 240259 197893 199684
10115A99684k4578o9874j23589k51826k97627k10980j33929o5931M4131J52429
$$ 199684 175106 105232 -18357 -270183 -567810 -778790 -912719 -978650 -934519 -782090
10105g82090J50406K6248p8240p6731J976M6949L6570J1578j3957j950N6508J55321
$$ -782090 -631684 -605436 -683676 -760407 -758431 -711482 -674912 -663334 -677291 -679241 -622733 -467412
10093d67412K29716K24959J53729Q9127Q4720N6509n6707j47732j17981m0783
$$ -467412 -237696 -12737 140992 230119 314839 371348 314641 166909 48928 8145
10083H145l7353m0865r569k7794o7704p2117o8417q6698m5665J02256K41399K64841
$$ 8145 -29208 -70073 -79642 -107436 -175140 -247257 -315674 -402372 -448037 -345781 -104382 160459
10071A60459K22250J57112K9963j28604j42682l144P2974L7092l082j68M2750
$$ 160459 382709 539821 569784 441180 298498 295354 368328 405420 402338 402170 444920
10060D44920R0244R0253Q7843R0856M8953k5119r6288j22124q7067m9476m7683
$$ 444920 535164 625417 713260 804116 853069 827950 731662 609538 522471 472995 425312
10049D25312r1823j66199k08975j85642j30654q7255m2424P453l918l1549L3337
$$ 425312 333489 167290 -41685 -227327 -357981 -445236 -487660 -480207 -484125 -515674 -482337
10038d82337J61194K10704J63786N6582n8058n4407P513j2897q1051j15585j36781
$$ -482337 -321143 -110439 53347 109929 51871 -2536 4977 -7920 -88971 -204556 -341337
10027c41337j22041j1032J52924K38083K38702K04929J70302J52936J02284J6032
$$ -341337 -463378 -474410 -321486 -83403 155299 360228 530530 683466 785750 801782
10017H01782n4897q9357j49151k23823k31702j48486l8531P6372J56903J18030
$$ 801782 746885 657528 508377 284554 52852 -95634 -134165 -57793 99110 217140
10007B17140L6339l4796p7580k9229K2032j306j8658L1345R6863J13149R9139
$$ 217140 253479 218683 141103 111874 133906 132600 113942 145287 242150 355299 454438
9996D54438N8309j4658n1948p918O1738J15383J93707K45664K76458L26356L34897
$$ 454438 512747 498089 446141 438223 499961 615344 809051 1054715 1331173 1657529 1992426
9985A992426K93168K59586K22184J48953O0055l7696k04436m36794n67276m48271
$$ 1992426 2285594 2545180 2767364 2916317 2976372 2938676 2734240 2297446 1730170 1281899
9975A281899j81655M10M507p6064j42526j87960j72258j01427q2516p1838o5657
$$ 1281899 1100244 1100654 1105161 1029097 886571 698611 526353 424926 342410 270572 204915
9964B04915o5744k9239K6788O1444P4693P7982J15559J53467P8146l6537q7142
$$ 204915 139171 109932 136720 198164 272857 350839 466398 619865 698011 661474 574332
9953E74332o4385Q93R4690J35628P2398l3694j40787j73889j09339m0375j6255
$$ 574332 509947 510840 605530 741158 813556 779862 639075 465186 355847 315472 299217
9942B99217J7933Q9758J42885J72178J98377J87737J29141Q5130O7905J09409
$$ 299217 317150 406908 549793 721971 920348 1108085 1237226 1322356 1390261 1499670
9932A499670J90878K71324L28924L43985L67341L66883K34368J3640j83209l15834
$$ 1499670 1690548 1961872 2290796 2634781 3002122 3369005 3603373 3617013 3433804 3117970
9922C117970l96204m59064n05958l81477j28138J808o1736j75192j96514j67330
$$ 3117970 2721766 2262702 1756744 1375267 1247129 1248937 1187201 1012009 815495 648165
9912F48165j52060j39968r9791J1193J40270K14149K11828N3706j98559k90802
$$ 648165 496105 356137 256346 267539 407809 621958 833786 887492 688933 398131
9902C98131k06430j21164r5916r8835l0596N3595P1078M9570M9101M6811K897
$$ 398131 191701 70537 -25379 -124214 -154810 -101215 -30137 19433 68534 115345 118242
9891A18242M4604J72679K13590J21337p492o0556l4189K045M377l8775q4334r7789
$$ 118242 162846 335525 549115 670452 662960 602404 568215 570260 574637 535862 451528 353739
9879C53739q3772p5491n0873l0651m5308q3240j17904r4127l6663l7207j05693
$$ 353739 269967 194476 143603 112952 67644 -15596 -133500 -227627 -264290 -301497 -407190
9868d07190j48045r0263k4141j8424k2128n2048p7147j6041O8919P8984M2571
$$ -407190 -555235 -645498 -669639 -688063 -710191 -762239 -839386 -855427 -786508 -707524 -664953
9857f64953K3092K9111L6007L9367L4412N5389R8129J18473J17932J13319R6200
$$ -664953 -641861 -612750 -576743 -537376 -502964 -447575 -349446 -230973 -113041 278 96478
9846I6478K1291l5875p5279p6718K2383J38666K06957K18385J88315J05377m935
$$ 96478 117769 81894 6615 -70103 -47720 90946 297903 516288 704603 809980 805045
$$ [...]
##END NTUPLES=NMR SPECTRUM
##END=
