##TITLE=C13_LR-788-CR4
 CDCl3, 22100sc

 28.1.2025
##JCAMPDX= 6.0         $$ Bruker NMR JCAMP-DX V2.0
##DATA TYPE= NMR SPECTRUM
##DATA CLASS= NTUPLES
##ORIGIN= UXNMR, Bruker Analytische Messtechnik GmbH
##OWNER= root
$$ XWIN-NMR		Version 3.5
$$ Wed Jan 29 13:38:06 2025 Russian Standard Time (UT+4h)  she@DPX200
##.OBSERVE FREQUENCY= 50.327896
##.OBSERVE NUCLEUS= ^13C
##.ACQUISITION MODE= SIMULTANEOUS
##.ACQUISITION SCHEME= undefined
##.AVERAGES= 22101
##.DIGITISER RES= 17
##SPECTROMETER/DATA SYSTEM= spect
##.PULSE SEQUENCE= zgpg30
##.SOLVENT NAME= D2O
##.SHIFT REFERENCE= (INTERNAL, D2O, 0, 222.646)
##AUDIT TRAIL= $$ (NUMBER, WHEN, WHO, WHERE, WHAT)
$$ ##TITLE= Audit trail, XWIN-NMR		Version 3.5
$$ ##JCAMPDX= 5.01
$$ ##ORIGIN= Bruker BioSpin GmbH
$$ ##OWNER= she
$$ F:/spectra/data/she/nmr/c13/1/pdata/1/auditp.txt
$$ ##AUDIT TRAIL=  $$ (NUMBER, WHEN, WHO, WHERE, WHAT)
(   1,<2025-01-29 13:36:23.03 +0400>,<she>,<DPX200>,
      <created by zg, POWCHK disabled, PULCHK disabled
       terminated by command 'halt'
       configuration hash MD5:
       00 E9 B6 7A A2 85 ED C7 34 08 36 98 17 FE 4E 26
       data hash MD5: 32K
       FD B5 C0 53 7A 8C 0C 44 2C 88 30 A0 97 78 40 AA>)
(   2,<2025-01-29 13:36:31.50 +0400>,<she>,<DPX200>,
      <Start of raw data processing
       efp BC_mod = 2 LB = 2 FT_mod = 6 PKNL = 1 PHC0 = -402.7906 PHC1 = 34.48833 SI = 32K 
       data hash MD5: 32K
       AA DA 93 90 98 5F 8A 13 7C 04 BC 0C 9F 41 F8 F7>)
(   3,<2025-01-29 13:36:53.96 +0400>,<she>,<DPX200>,
      <pk PHC0 = 1.300729 PHC1 = -7.2 
       data hash MD5: 32K
       3B B7 E3 D3 20 96 99 A1 32 CC 17 11 B5 89 CA E7>)
(   4,<2025-01-29 13:36:57.32 +0400>,<she>,<DPX200>,
      <abs ABSG = 5 
       data hash MD5: 32K
       2C F2 45 BD DF 99 17 00 97 6C 3E 97 9A A6 F9 0D>)
(   5,<2025-01-29 13:37:26.37 +0400>,<she>,<DPX200>,
      <pk PHC0 = 0.7261374 PHC1 = 0 
       data hash MD5: 32K
       06 63 DD BC B7 E6 77 F1 AB 49 03 3C 08 8C 9A D3>)
(   6,<2025-01-29 13:37:29.20 +0400>,<she>,<DPX200>,
      <abs ABSG = 5 
       data hash MD5: 32K
       4B 0F A5 3A 50 E8 33 DE 5F 35 8B B7 92 99 10 22>)
$$ ##END=
$$ 
$$ hash MD5
$$ D1 35 6E D4 CB BB B1 BC 65 A1 76 49 72 A0 DA 12
##$RELAX= 
##$RELAX= 
##$RELAX= 
##$RELAX= 
##$RELAX= 
##$RELAX= 
##$RELAX= 
##$RELAX= 
$$ Bruker specific parameters
$$ --------------------------
##$DU= <F:/spectra>
##$EXPNO= 1
##$NAME= <c13>
##$PROCNO= 1
##$TYPE= <nmr>
##$USER= <she>
##$AMP= (0..31)
100 100 100 100 100 100 100 100 100 100 100 100 100 100 100 100 100 100 
100 100 100 100 100 100 100 100 100 100 100 100 100 100 
##$AQSEQ= 0
##$AQ_mod= 1
##$AUNM= <au_zg>
##$AUTOPOS= <>
##$BF1= 50.322709
##$BF2= 200.13
##$BF3= 50.322709
##$BF4= 500.13
##$BF5= 500.13
##$BF6= 500.13
##$BF7= 500.13
##$BF8= 500.13
##$BYTORDA= 1
##$CFDGTYP= 0
##$CFRGTYP= 5
##$CHEMSTR= <none>
##$CNST= (0..31)
1 1 145 1 1 1 1 1 1 1 1 1 1 1 1 1 1 1 1 1 1 1 1 1 1 1 1 1 1 1 1 1 
##$CPDPRG= <waltz16>
##$CPDPRG1= <>
##$CPDPRG2= <waltz16>
##$CPDPRG3= <>
##$CPDPRG4= <mlev>
$$ [...]
##$SUBNAM4= <"">
##$SUBNAM5= <"">
##$SUBNAM6= <"">
##$SUBNAM7= <"">
##$SUBNAM8= <"">
##$SUBNAM9= <"">
##$SW= 239.972175391363
##$SWIBOX= (0..15)
0 1 3 0 0 0 0 0 0 0 0 0 0 0 0 0 
##$SW_h= 12077.2946859903
##$TD= 32768
##$TD0= 1
##$TE= 0
##$TE2= 300
##$TE3= 300
##$TEG= 300
##$TL= (0..7)
120 120 120 120 120 120 120 120 
##$TP= (0..7)
150 150 150 150 150 150 150 150 
##$TP07= 0
##$TPNAME0= <>
##$TPNAME1= <>
##$TPNAME2= <>
##$TPNAME3= <>
##$TPNAME4= <>
##$TPNAME5= <>
##$TPNAME6= <>
##$TPNAME7= <>
##$TPOAL= (0..7)
0.5 0.5 0.5 0.5 0.5 0.5 0.5 0.5 
##$TPOFFS= (0..7)
0 0 0 0 0 0 0 0 
##$TUNHIN= 0
##$TUNHOUT= 0
##$TUNXOUT= 0
##$USERA1= <user>
##$USERA2= <user>
##$USERA3= <user>
##$USERA4= <user>
##$USERA5= <user>
##$V9= 5
##$VALIST= <valist>
##$VCLIST= <CCCCCCCCCCCCCCC>
##$VD= 0
##$VDLIST= <DDDDDDDDDDDDDDD>
##$VPLIST= <PPPPPPPPPPPPPPP>
##$VTLIST= <TTTTTTTTTTTTTTT>
##$WBST= 1024
##$WBSW= 4
##$XGAIN= (0..3)
0 0 0 0 
##$XL= 0
##$YL= 0
##$YMAX_a= 106086813
##$YMIN_a= -75266766
##$ZGOPTNS= <>
##$ZL1= 120
##$ZL2= 120
##$ZL3= 120
##$ZL4= 120
##$ABSF1= 222.646
##$ABSF2= -17.35081
##$ABSG= 5
##$ABSL= 3
##$ALPHA= 0
##$AQORDER= 0
##$ASSFAC= 0
##$ASSFACI= 0
##$ASSFACX= 0
##$ASSWID= 0
##$AUNMP= <proc_1d>
##$AZFE= 0.1
##$AZFW= 0.5
##$BCFW= 0
##$BC_mod= 2
##$BYTORDP= 0
##$COROFFS= 0
##$CY= -3
##$DATMOD= 1
##$DC= 0
##$DFILT= <>
##$DTYPP= 0
##$F1P= 0
##$F2P= 0
##$FCOR= 0.5
##$FTSIZE= 32768
##$FT_mod= 6
##$GAMMA= 0
##$GB= 0
##$INTBC= 1
##$INTSCL= 4.134877e-10
##$ISEN= 128
##$LB= 2
##$LEV0= 0
##$LPBIN= 0
##$MAXI= 10000
##$MC2= 0
##$MEAN= 0
##$ME_mod= 0
##$MI= 0.1934396
##$NCOEF= 0
##$NC_proc= 3
##$NLEV= 6
##$NOISF1= 120.0001
##$NOISF2= 80.00006
##$NSP= 0
##$NTH_PI= 0
##$NZP= 0
##$OFFSET= 222.646
##$PC= 1.4
##$PHC0= -400.7638
##$PHC1= 27.28833
##$PH_mod= 1
##$PKNL= yes
##$PPARMOD= 0
##$PSCAL= 0
##$PSIGN= 0
##$REVERSE= no
##$SF= 50.3227304950709
##$SI= 32768
##$SIGF1= 140
##$SIGF2= 120
##$SINO= 11.81781
##$SIOLD= 32768
##$SREGLST= <13C.CDCl3>
##$SSB= 0
##$STSI= 32768
##$STSR= 0
##$SW_p= 12077.2946859903
##$SYMM= 0
##$S_DEV= 0
##$TDeff= 32768
##$TDoff= 0
##$TI= <>
##$TILT= no
##$TM1= 0
##$TM2= 0
##$TOPLEV= 0
##$USERP1= <user>
##$USERP2= <user>
##$USERP3= <user>
##$USERP4= <user>
##$USERP5= <user>
##$WDW= 1
##$XDIM= 32768
##$YMAX_p= 338133778
##$YMIN_p= -781532
$$ End of Bruker specific parameters
$$ ---------------------------------
##NTUPLES= NMR SPECTRUM
##VAR_NAME=  FREQUENCY,     SPECTRUM/REAL,   SPECTRUM/IMAG
##SYMBOL=    X,             R,               I
##VAR_TYPE=  INDEPENDENT,   DEPENDENT,       DEPENDENT
##VAR_FORM=  AFFN,          ASDF,            ASDF
##VAR_DIM=   32768,         32768,           32768
##UNITS=     HZ,            ARBITRARY UNITS, ARBITRARY UNITS
##FACTOR=    0.368581032318806, 1,           1
##FIRST=     11204.1544572324, 0,            0
##LAST=      -873.140228757911, 0,           0
##MIN=       -873.140228757911, -781532,     0
##MAX=       11204.1544572324, 338133778,    0
$$ Real data points
##PAGE= N=1
##DATA TABLE= (X++(R..R)), XYDATA
$$ [...]
$$ plain form
16001 -161312 -90272 -4192 42385 35577 5184 -37025 -87704 -146616 -202801 -226030 -211694 -165641
15989 -165641 -96338 -21923 39946 73632 56886 -10129 -85638 -137998 -168153 -169683 -154444 -150691
15977 -150691 -173951 -213445 -238106 -231591 -204479 -183397 -181959 -199060 -218771 -245694 -303637 -396368
15965 -396368 -504749 -602895 -655915 -650088 -597964 -511517 -404014 -310693 -270276 -299597 -367753
15954 -367753 -418509 -424723 -372605 -255823 -127730 -48454 -13064 12833 53323 95443 118899
15943 118899 112722 61865 -19873 -56469 -15562 52496 127316 218257 325905 430683 507001
15932 507001 543685 527917 454497 349304 236888 143713 84800 67626 78953 81195 76570
15921 76570 80327 79608 77151 84032 122017 192350 257392 264800 187511 67815 -24265 -73217 -103250
$$ packed form
16001a61312P1040Q6080M6577o808l0393m2209n0679n8912n6185k3229J4336M6053
15989a65641O9303P4415O1869L3686j6746o7015p5509n2360l0155j530J5239L753
15977a50691k3260l9494k4661O515K7112K1082J438j7101j9711k6923n7943r2731
15965c96368j08381r8146n3020N827N2124Q6447J07503R3321M0417k9321o8156
15954c67753n0756o214N2118J16782J28093P9276L5390K5897M0490M2120K3456
15943A18899o177n0857q1738l6596M0907O8058P4820R0941J07648J04778P6318
15932E07001L6684j5768p3420j05193j12416r3175n8913j7174J1327K242m625
15921G6570L757p19k457O881L7985P0333O5042P408p7289j19696r2080m8952l0033
$$ plain form
15908 -103250 -127793 -134849 -117817 -98113 -100746 -127336 -133544 -98887 -54620 -39252 -64661 -121912
15896 -121912 -195369 -227202 -164418 -48048 32512 28543 -41510 -117879 -148325 -146412 -147750 -132651
15884 -132651 -81099 -3404 50541 23636 -52901 -110050 -105833 -43096 55015 169712 232769
15873 232769 199435 124147 60293 11353 -8900 24537 100658 171023 181045 129421 62162
15862 62162 -5826 -82349 -155030 -207147 -233230 -230279 -190714 -108191 -21184 18670 5912 -33949
15850 -33949 -74348 -119124 -169162 -196204 -169366 -123350 -117497 -136069 -168619 -230110 -278749 -290490
15838 -290490 -270638 -217672 -131846 -28977 43620 37396 -49735 -142948 -170960 -133378 -61483
15827 -61483 7659 42688 55883 83984 138559 181425 164379 90179 -10375 -99886 -152987
$$ packed form
15908a03250k4543p056J7032J9704k633k6590o208L4657M4267J5368k5409n7251
15896a21912p3457l1833O2784J16370Q0560l969p0053p6369l0446J913j338J5099
15884a32651N1552P7695N3945k6905p6537n7149M217O2737R8111J14697O3057
15873B32769l3334p5288o3854m8940k0253L3437P6121P0365J0022n1624o7259
15862F2162o7988p6523p2681n2117k6083K951L9565Q2523Q7007L9854j2758l9861
15850c3949m0399m4776n0038k7042K6838M6016N853j8572l2550o1491m8639j1741
15838b90490J9852N2966Q5826J02869P2597o224q7131r3213k8012L7582P1895
15827f1483O9142L5029J3195K8101N4575M2866j7046p4200j00554q9511n3101
$$ plain form
15816 -152987 -155213 -107752 -37680 22286 45752 20100 -25945 -67097 -124915 -216548 -314820 -389041
15804 -389041 -428517 -426194 -385941 -324077 -286931 -298838 -318402 -294242 -223065 -116123 17704
15793 17704 135701 193283 202020 184474 113747 -5054 -108288 -142371 -105295 -5118 124860
15782 124860 242077 294856 248746 128197 -11158 -121063 -207233 -297785 -378124 -400860 -350853
15771 -350853 -287727 -285545 -336718 -375319 -361964 -317964 -279579 -260362 -241846 -192759 -119029 -59327
15759 -59327 -43736 -72873 -113428 -111063 -87578 -91432 -115875 -151538 -197708 -222364 -194940 -96413
15747 -96413 73465 238907 333829 371820 384645 394633 418561 459974 504240 543592 558599
15736 558599 524463 475253 437815 411331 389259 339006 261647 201102 179485 158457 97077
$$ packed form
15816a52987k226M7461P0072N9966K3466k5652m6045m1152n7818r1633r8272p4221
15804c89041l9476K323M0253O1864L7146j1907j9564K4160P1177J06942J33827
15793A7704J17997N7582Q737j7546p0727j18801j03234l4083L7076J00177J29978
15782A24860J17217N2779m6110j20549j39355j09905q6170r0552q0339k2736N0007
15771c50853O3126K182n1173l8601J3355M4000L8385J9217J8516M9087P3730N9702
15759e9327J5591k9137m0555K365K3485l854k4443l5663m6170k4656K7424R8527
15747i6413J69878J65442R4922L7991J2825R988K3928M1413M4266L9352J5007
15736E58599l4136m9210l7438k6484k2072n0253p7359o0545k1617k1028o1380
$$ plain form
15725 97077 1823 -98735 -168392 -199011 -209309 -188596 -127890 -79034 -76947 -113092 -166048 -205065
15713 -205065 -218509 -206300 -181497 -155006 -144223 -157921 -161181 -143700 -119611 -103753 -129314 -201666
15701 -201666 -265474 -274862 -251097 -224742 -188471 -127559 -53919 17028 51183 22426 -26143 -45551
15689 -45551 -38822 -23867 -8368 -11894 -35558 -25202 48559 128997 162822 140537 90338 67198
15677 67198 72728 68540 46691 -304 -67070 -97215 -51397 38447 120992 167212 175721 166864
15665 166864 164440 154163 114827 70338 69241 91715 111078 146603 224507 328775 383952 351383
15653 351383 284371 224912 169653 141569 169044 206984 209149 187876 149070 77121 -28398
15642 -28398 -122304 -165597 -163980 -140585 -107210 -65483 -730 95687 183650 206698 160841 97206
$$ packed form
15725I7077r5254j00558o9657l0619j0298K0713O0706M8856K087l6145n2956l9017
15713b05065j3444J2209K4803K6491J0783j3698l260J7481K4089J5858k5561p2352
15701b01666o3808r388K3765K6355L6271O0912P3640P0947L4155k8757m8569j9408
15689d5551O729J4955J5499l526k3664J0356P3761Q0438L3825k2285n0199k3140
15677F7198N530m188k1849m6995o6766l0145M5818Q9844Q2545M6220Q509q857
15665A66864k424j0277l9336m4489j097K2474J9363L5525P7904J04268N5177l2569
15653C51383o7012n9459n5259k8084K7475L7940K165k1273l8806p1949j05519
15642b8398r3906m3293J617K3395L3375M1727O4753R6417Q7963K3048m5857o3635
$$ plain form
15630 97206 68024 59419 31675 6398 -5763 -46523 -110420 -143638 -147360 -152626 -174971 -224454
15618 -224454 -280346 -292191 -235971 -145020 -62346 21749 127686 244640 341822 397021 410673
15607 410673 375909 324329 304265 298419 272972 243351 231685 215025 192435 182214 145298 36412
15595 36412 -118519 -244220 -280930 -222580 -101727 25519 112925 155530 163817 169464 197341
15584 197341 210632 176707 110600 47652 14147 -20186 -58884 -84627 -106572 -125075 -118139 -64879
15572 -64879 23997 103010 140450 163407 205913 256070 260937 200283 132109 87969 61036 43923
15560 43923 41335 68675 103852 109798 100330 93273 84574 105098 163382 215907 227697 194102 125656
15547 125656 52705 15040 11150 -826 -58597 -154230 -258980 -370758 -476382 -554505 -607890
$$ packed form
15630I7206k9182q605k7744k5277j2161m0760o3897l3218l722n266k2345m9483
15618b24454n5892j1845N6220R0951Q2674Q4095J05937J16954R7182N5199J3652
15607D10673l4764n1580k0064n846k5447k9621j1666j6660k2590j0221l6916j08886
15595C6412j54931j25701l6710N8350J20853J27246Q7406M2605Q287N647K7877
15584A97341J3291l3925o6107o2948l3505l4333l8698k5743k1945j8503O936N3260
15572f4879Q8876P9013L7440K2957M2506N0157M867o0654o8174m4140k6933j7113
15560D3923k588K7340L5177N946r468p057q699K0524N8284N2525J1790l3595o8446
15547A25656p2951l7665l890j1976n7771r5633j04750j11778j05624p8123n3385
$$ plain form
15536 -607890 -615484 -550665 -450208 -371231 -333930 -326638 -317271 -300288 -303192 -328608 -379632 -442658
15524 -442658 -477028 -469164 -410740 -333122 -275590 -235700 -222248 -232330 -242579 -234673 -201560 -159921
15512 -159921 -116589 -91103 -125377 -198067 -253959 -252506 -198733 -116108 -17278 86173 170627
15501 170627 228866 276038 316113 313717 249797 165155 112433 100842 107328 98420 63338 25367
15489 25367 5732 -8473 -52433 -123561 -158958 -126913 -87917 -108247 -163973 -193051 -190223 -165256
15477 -165256 -111061 -58249 -44902 -66349 -88934 -92772 -93545 -104953 -134401 -180590 -222000 -263981
15465 -263981 -329748 -392805 -399107 -344512 -253827 -171640 -136402 -143336 -150645 -107417 -19189 48075
15453 48075 55634 32773 29326 38096 19415 -22824 -47218 -24812 36057 93305 91649 30210
$$ packed form
15536f07890p594O4819J00457P8977L7301P292R367J6983k904k5416n1024o3026
15524d42658l4370P864N8424P7618N7532L9890J3452j0082j0249P906L3113M1639
15512a59921M3332K5486l4274p2690n5892J453N3773Q2625R8830J03451Q4454
15501A70627N8239M7172M0075k396o3920q4642n2722j1591O486q908l5082l7971
15489B5367j9635j4205m3960p1128l5397L2045L8996k0330n5726k9078K828K4967
15477a65256N4195N2812J3347k1447k2585l838p73j1408k9448m6189m1410m1981
15465b63981o5767o3057o302N4595R0685Q2187L5238o934p309M3228Q8228O7264
15453D8075P559k2861l447Q770j8681m2239k4394K2406O0869N7248j656o1439
$$ plain form
15441 30210 -43225 -101583 -153174 -189911 -193553 -185343 -190293 -214934 -236741 -243527 -259408 -294750
15429 -294750 -340077 -376262 -385722 -379417 -378917 -363053 -319862 -253497 -153673 -10655 127099 193414
15417 193414 188632 168337 179113 248993 364364 480388 563284 578834 513167 411978 314491
15406 314491 203875 67486 -44087 -100657 -127682 -138554 -137262 -136717 -140734 -140069 -120201 -77302
15394 -77302 -30864 -16566 -30561 -24937 37121 132985 216918 266377 293025 324389 360587 365755
15382 365755 353420 346849 346647 354703 359702 309604 176488 22359 -91150 -155978 -192573 -216463
15370 -216463 -224872 -203603 -164935 -135323 -134797 -151445 -167982 -200178 -221034 -185979 -146957 -143756
15358 -143756 -135478 -84439 -3617 44065 31431 9662 44727 122652 179060 182908 136791 56004
$$ packed form
15441C0210p3435n8358n1591l6737l642Q210m950k4641k1807o786j5881l5342
15429b94750m5327l6185r460O305N00J5864M3191O6365R9824J43018J37754O6315
15417A93414m782k0295J0776O9880J15371J16024Q2896J5550o5667j01189r7487
15406C14491j10616j36389j11573n6570k7025j0872J292N45m017O65J9868M2899
15394g7302M6438J4298j3995N624O2058R5864Q3933M9459K6648L1364L6198N168
15382C65755j2335o571k02Q056M999n0098j33116j54129j13509o4828l6595k3890
15370b16463q409K1269L8668K9612N26j6648j6537l2196k0856L5055L9022L201
15358a43756Q278N1039Q0822M7682j2634k1769L5065P7925N6408L848m6117q0787
$$ plain form
15346 56004 -46090 -155310 -240816 -286323 -321283 -363682 -375601 -319695 -206485 -77935 36661
15335 36661 111577 124726 75406 -88 -51809 -60321 -48931 -59043 -114757 -202471 -273748 -308831
15323 -308831 -311503 -291079 -260366 -228622 -207462 -196900 -184506 -161497 -120890 -78776 -53017 -48157
15311 -48157 -49303 -14314 65865 146075 190613 198011 172070 123608 67518 1433 -72165 -113058
15299 -113058 -92189 -28576 50071 122092 173873 202796 216603 224181 206413 153423 91867 57966
15287 57966 56217 56667 47134 25830 -7767 -51519 -104475 -149794 -179841 -193427 -187375 -189543 -230218
15274 -230218 -283204 -278473 -212208 -125911 -52442 -13993 -22998 -79438 -148596 -194540 -219001 -241504
15262 -241504 -274801 -330650 -396172 -442565 -458973 -450797 -442990 -466693 -537769 -618521 -667310 -654403
$$ packed form
15346E6004j02094j09220q5506m5507l4960m2399j1919N5906J13210J28550J14596
15335C6661P4916J3149m9320p5494n1721q512J1390j0112n5714q7714p1277l5083
15323c08831k672K0424L0713L1744K1160J0562J2394K3009M0607M2114K5759M860
15311d8157j146L4989Q0179Q0210M4538P398k5941m8462n6090o6085p3598m0893
15299a13058K0869O3613P8647P2021N1781K8923J3807P578j7768n2990o1556l3901
15287E7966j749M50r533k1304l3597m3752n2956m5319l0047j3586O052k168m0675
15274b30218n2986M731O6265Q6297P3469L8449r005n6440o9158m5944k4461k2503
15262b41504l3297n5849o5522m6393j6408Q176P807k3703p1076q0752m8789J2907
$$ plain form
15250 -654403 -570183 -458102 -359088 -295540 -259202 -236024 -248059 -285079 -315548 -333179 -329473
15239 -329473 -290440 -232596 -210243 -237048 -273699 -299398 -290506 -239949 -188456 -155213 -115983 -52026
15227 -52026 8751 43901 78364 126492 119183 10954 -147029 -298240 -417018 -486829 -499248
15216 -499248 -464614 -411970 -344001 -236088 -109473 -23592 -10193 -55596 -125081 -207939 -285124
15205 -285124 -313750 -290209 -257728 -235262 -185736 -111063 -64348 -48459 -20442 43631 121216
15194 121216 180340 217495 230246 218322 196635 187704 184446 182382 189639 179837 138166 103760
15182 103760 109086 139484 140460 95624 20617 -77787 -184671 -274885 -320424 -327193 -313770 -309064
15170 -309064 -326208 -333766 -315189 -283621 -272178 -298076 -363719 -448564 -530167 -590927 -589797 -504251
$$ packed form
15250f54403Q4220J12081R9014O3548L6338K3178j2035l7020l0469j7631L706
15239c29473L9033N7844K2353k6805l6651k5699Q892N0557N1493L3243L9230O3957
15227e2026O0777L5150L4463M8128p309j08229j57983j51211j18778o9811j2419
15216d99248L4634N2644O7969J07913J26615Q5881J3399m5403o9485q2858p7185
15205b85124k8626K3541L2481K2466M9526P4673M6715J5889K8017O4073P7585
15194A21216N9124L7155J2751j1924k1687q931l258k064P257r802m1671l4406
15182A03760N326L0398R76m4836p5007r8404j06884r0214m5539o769J3423M706
15170c09064j7144p558J8577L1568J1443k5898o5643q4845q1603o0760J130Q5546
$$ plain form
15158 -504251 -376571 -292807 -295166 -339089 -370622 -361687 -299878 -204638 -89359 51202 194326
15147 194326 299972 350599 333526 247157 144599 72139 28126 18924 48800 92105 129907
15136 129907 150042 149232 157044 198155 250554 278107 258429 169553 27600 -104122 -188734 -222522
15124 -222522 -220304 -179691 -78265 50216 116564 116475 100207 90030 88657 100718 131565 159759
15112 159759 174217 177569 177309 172902 153446 112627 60110 20337 31734 97522 168915 203399
15100 203399 211957 217889 216735 208001 217026 246954 258182 248565 248674 258801 269744 264131 218947
15087 218947 155892 119542 117363 119310 82664 499 -103885 -208760 -298215 -354063 -390757
15076 -390757 -431811 -465121 -486157 -503304 -483257 -409434 -336336 -310652 -327096 -358602 -375835
$$ packed form
15158e04251J27680Q3764k359m3923l1533Q935O1809R5240J15279J40561J43124
15147A94326J05646N0627j7073q6369j02558p2460m4013r202K9876M3305L7802
15136A29907K0135q10P812M1111N2399K7553j9678q8876j41953j31722q4612l3788
15124b22522K218M0613J01426J28481O6348q9j6268j0177j373J2061L0847K8194
15112A59759J4458L352k60m407j9456m0819n2517l9773J1397O5788P1393L4484
15100B03399Q558N932j154q734R025K9928J1228r617J09J0127J0943n613m5184
15087B18947o3055l6350k179J947l6646q2165j04384j04875q9455n5848l6694
15076c90757m1054l3310k1036j7147K0047P3823P3098K5684j6444l1506j7233
$$ plain form
15065 -375835 -371871 -350747 -286348 -166822 -31524 77099 135250 148433 120966 56231 -26580
15054 -26580 -122471 -217459 -272778 -287324 -276962 -263863 -274825 -321763 -392025 -447738 -464099 -447770
15042 -447770 -422553 -398942 -363703 -323345 -290323 -245845 -155222 -33634 52894 62239 8716
15031 8716 -80462 -161270 -168290 -88839 22124 110121 145689 128413 67931 -13620 -71473 -71692
15019 -71692 -128 115196 191610 187979 134597 63462 -6593 -45955 -42771 -42014 -91185 -184953
15007 -184953 -282856 -349183 -372125 -380706 -407074 -454703 -492405 -478112 -401482 -308445 -253150 -235932
14995 -235932 -209110 -174399 -160040 -162714 -177351 -180192 -131031 -45161 12146 15863 -13183 -42490
14983 -42490 -65140 -79168 -69547 -68929 -101965 -137308 -156026 -173912 -210744 -257908 -275130 -236752
$$ packed form
15065c75835L964K1124O4399J19526J35298J08623N8151J3183k7467o4735q2811
15054b6580r5891r4988n5319j4546J0362J3099j0962m6938p0262n5713j6361J6329
15042d47770K5217K3611L5239M0358L3022M4478R0623J21588Q6528R345n3523
15031H716q9178q0808p020P9451J10963Q7997L5568j7276o0482q1551n7853k19
15019g1692P1564J15324P6414l631n3382p1135p0055l9362L184P57m9171r3768
15007a84953r7903o6327k2942q581k6368m7629l7702J4293P6630R3037N5295J7218
14995b35932K6822L4711J4359k674j4637k841M9161Q5870N7307L717k9046k9307
14983d2490k2650j4028R621O18l3036l5343j8718j7886l6832m7164j7222L8378
$$ plain form
14971 -236752 -149913 -32743 75337 119047 104227 98006 135278 182859 217303 213451 137230
14960 137230 20368 -73448 -121688 -146758 -169690 -184625 -171451 -126991 -60725 -9923 -35471
14949 -35471 -137016 -255744 -349328 -418570 -465850 -479325 -450761 -395127 -327660 -239169 -136937
14938 -136937 -59486 -13304 22278 33723 8973 -29326 -68234 -113091 -143018 -129486 -86592
14927 -86592 -61317 -44789 -10066 46203 127818 214145 274270 318374 381993 454141 483788 452498
14915 452498 385261 331595 337006 394063 435065 407724 326862 243980 176576 99914 9120 -67114
14903 -67114 -101948 -96115 -45756 70498 218920 334866 395088 408671 397164 352887 253110
14892 253110 115217 -2786 -90991 -167312 -244931 -310724 -351848 -360659 -314768 -238865 -154108
$$ packed form
14971b36752Q6839J17170J08080M3710j4820o221L7272M7581L4444l852p6221
14960A37230j16862r3816m8240k5070k2932j4935J3174M4460O6266N0802k5548
14949c5471j01545j18728r3584o9242m7280j3475K8564N5634O7467Q8491J02232
14938a36937P7451M6182L5582J1445k4750l8299l8908m4857k9927J3532M2894
14927h6592K5275J6528L4723N6269Q1615Q6327O0125M4104O3619P2148K9647l1290
14915D52498o7237n3666N411N7057M1002k7341q0862q2882o7404p6662r0794p6234
14903f7114l4834N833N0359J16254J48422J15946O0222J3583j1507m4277r9777
14892B53110j37893j18003q8205p6321p7619o5793m1124q811M5891P5903Q4757
$$ plain form
14881 -154108 -66367 -1824 -1385 -32511 -20413 41210 118880 185859 201999 141656 47120 -14018
14869 -14018 -15434 1975 9700 47234 118533 163197 153227 100797 48415 25096 34360 72810
14857 72810 123967 153848 132195 79223 55583 77509 124058 161888 137971 28806 -113491
14846 -113491 -230522 -281602 -298728 -339555 -384917 -380528 -339408 -315328 -326871 -352994 -365843
14835 -365843 -344839 -261344 -137505 -50325 -31026 -52404 -97374 -159630 -235594 -299703 -327574
14824 -327574 -311647 -258683 -186916 -135300 -121731 -97831 -46087 -3042 6816 -21849 -94170 -208194
14812 -208194 -304160 -339492 -362288 -406266 -439372 -420916 -318683 -155649 7016 121672 182509
14801 182509 245149 333534 391615 387256 329537 207351 23656 -148093 -219130 -180521 -115556
$$ packed form
14881a54108Q7741O4543M39l1126J2098O1623P7670O6979J6140o0343r4536o1138
14869a4018j416J7409P725L7534P1299M4664r970n2430n2382k3319R264L8450
14857G2810N1157K9881k1653n2972k3640K1926M6549L7830k3917j09165j42297
14846a13491j17031n1080j7126m0827m5362M389M1120K4080j1543k6123j2849
14835c65843K1004Q3495J23839Q7180J9299k1378m4970o2256p5964o4109k7871
14824c27574J5927N2964P1767N1616J3569K3900N1744M3045R858k8665p2321j14024
14812b08194r5966l5332k2796m3978l3106J8456J02233J63034J62665J14656O0837
14801A82509O2640Q8385N8081m359n7719j22186j83695j71749p1037L8609O4965
$$ plain form
14790 -115556 -105357 -156823 -221865 -254831 -231805 -172307 -114394 -89940 -123709 -197250 -272195
14779 -272195 -328817 -369554 -402530 -420487 -417570 -383856 -310834 -214239 -134906 -109478 -137840 -203280
14767 -203280 -275038 -303655 -260066 -154730 -31626 46423 64406 56943 55199 41880 -4169
14756 -4169 -70115 -149386 -247492 -350570 -422000 -444496 -409897 -313456 -191724 -130049 -163052
14745 -163052 -236437 -297602 -339522 -360296 -328082 -218560 -87359 17484 122302 231239
14735 231239 294011 288125 251888 206404 133505 39220 -35321 -56864 -48934 -45889 -52741 -69352
14723 -69352 -121933 -221757 -338634 -442515 -500139 -506595 -514342 -542907 -532224 -450168 -328357
14712 -328357 -213792 -125386 -65645 -26515 -6316 -29024 -88350 -140381 -138218 -62874 48908
$$ packed form
14790a15556J0199n1466o5042l2966K3026N9498N7913K4454l3769p3541p4945
14779b72195n6622m0737l2976j7957K917L3714P3022R6595P9333K5428k8362o5440
14767b03280p1758k8617M3589J05336J23104P8049J7983p463j744j3319m6049
14756d169o5946p9271r8106j03078p1430k2496L4599R6441J21732O1675l3003
14745a63052p3385o1165m1920k0774L2214J09522J31201J04843J04818J08937
14735B31239O2772n886l6237m5484p2899r4285p4541k1543P930L045o852j6611
14723f9352n2581r9824j16877j03881n7624o456p747k8565J0683Q2056J21811
14712c28357J14565Q8406N9741L9130K0199k2708n9326n2031K163P5344J11782
$$ plain form
14701 48908 122901 147133 161741 170708 160423 139002 136529 125321 69311 -8535 -70386 -82926
14689 -82926 -38399 34026 83797 90290 76123 41488 -17631 -76876 -134933 -206313 -270002 -274550
14677 -274550 -229801 -209131 -249038 -324339 -388911 -401373 -369914 -340175 -332602 -347998 -399644 -448683
14665 -448683 -441708 -381169 -298305 -217090 -139813 -66616 15524 139998 297530 430656 491368
14654 491368 460928 368241 284546 244660 208276 145776 71021 19584 995 7446 43389 86247
14642 86247 77678 -13318 -133774 -207201 -212857 -183230 -145285 -97126 -39862 16460 73233 112217
14630 112217 107355 55818 -13656 -53384 -40881 -9117 3734 735 3965 11674 8745 -22965
14618 -22965 -74342 -113421 -126954 -114761 -95537 -81353 -70222 -37651 28700 128178 229560
$$ packed form
14701D8908P3993K4232J4608Q967j0285k1421k473j1208n6010p7846o1851j2540
14689h2926M4527P2425M9771O493j4167l4635n9119n9245n8057p1380o3689m548
14677b74550M4749K0670l9907p5301o4572j2462L1459K9739P573j5396n1646m9039
14665d48683O975O0539Q2864Q1215P7277P3197Q2140J24474J57532J33126O0712
14654D91368l0440r2687q3695l9886l6384o2500p4755n1437j8589O451L5943M2858
14642H6247q569r0996j20456p3427n656K9627L7945M8159N7264N6322N6773L8984
14630A12217m862n1537o9474l9728J2503L1764J2851k999L230P709k929l1710
14618b2965n1377l9079j3533J2193J9224J4184J1131L2571O6351R9478J01382
$$ plain form
14607 229560 254774 195276 125073 101343 104294 75769 6873 -82671 -155185 -175242 -141604 -91414
14595 -91414 -49190 -8177 29560 45578 36672 26434 1287 -53971 -112242 -161652 -217381 -291212
14583 -291212 -353746 -356983 -305230 -249011 -224546 -196187 -134657 -63617 -5788 17328 -4595 -41551
14571 -41551 -49901 -63552 -137898 -235461 -270945 -244362 -242978 -307854 -403370 -504002 -586836 -616985
14559 -616985 -551486 -401911 -224476 -54950 75889 168319 239570 299678 334523 314226 255433
14548 255433 187693 136348 107879 105626 126173 155628 184275 192596 161089 123098 126596 168634
14536 168634 215788 251459 262071 240145 220960 247049 290584 301755 271874 232627 195389
14525 195389 138879 89954 74192 79323 94102 97200 95885 103933 111264 90912 11785 -107314
$$ packed form
14607B29560K5214n9498p0203k3730K951k8525o8896q9544p2514k0057L3638N0190
14595i1414M2224M1013L7737J6018q906j0238k5147n5258n8271m9410n5729p3831
14583b91212o2534l237N1753N6219K4465K8359O1530P1040N7829K3116k1923l6956
14571d1551q350j3651p4346r7563l5484K6583J384o4876r5516j00632q2834l0149
14559f16985O5499J49575J77435J69526J30839R2430P1251O0108L4845k0297n8793
14548B55433o7740n1345k8469k253K0547K9455K8647Q321l1507l7991L498M2038
14536A68634M7154L5671J0612k1926j9185K6089M3535J1171k9881l9247l7238
14525A95389n6510m8925j5762N131J4779L098j315Q048P331k0352p9127j19099
$$ plain form
14513 -107314 -193355 -200250 -156758 -108413 -91850 -100897 -93896 -55922 280 70728 131788 164273
14501 164273 164477 142231 127997 123789 121138 118322 131624 168338 185649 153447 106654 86281
14489 86281 72297 37204 -31536 -125728 -205813 -219799 -161135 -72732 41154 170397 245859
14478 245859 222362 126720 12799 -76154 -107807 -72121 -9744 11262 -36459 -143081 -262877
14467 -262877 -330782 -336004 -317507 -283937 -217380 -133118 -79040 -53049 -26252 -17281 -60403 -143976
14455 -143976 -238084 -323822 -376527 -392076 -395949 -385998 -341552 -270912 -204607 -175276 -177614 -174560
14443 -174560 -165693 -149114 -101011 -37060 10974 42974 47085 25466 26815 53088 55061 21143
14431 21143 -25991 -71336 -103964 -99578 -37378 59604 129403 139480 95467 37451 -3052 -40042
$$ packed form
14513a07314q6041o895M3492M8345J6563r047P001L7974N6202P0448O1060L2485
14501A64273K04k2246j4234m208k651k816J3302L6714J7311l2202m6793k0373
14489H6281j3984l5093o8740r4192q0085j3986N8664Q8403J13886J29243P5462
14478B45859k3497r5642j13921q8953l1653L5686O2377K1006m7721j06622j19796
14467b62877o7905n222J8497L3570O6557Q4262N4078K5991K6797Q971m3122q3573
14455a43976r4108q5738n2705j5549l873R951M4446P0640O6305K9331k338L054
14443a74560Q867J6579M8103O3951M8034L2000M111k1619J349K6273J973l3918
14431B1143m7134m5345l2628M386O2200R6982O9799J0077m4013n8016m0503l6990
$$ plain form
14419 -40042 -84676 -106717 -72709 -3190 61646 116696 171989 197022 160945 92402 33898 -11152
14407 -11152 -47510 -79725 -110864 -142015 -157176 -139601 -104259 -88828 -116736 -151451 -155875 -141136
14395 -141136 -132447 -138062 -174646 -250546 -330578 -355935 -308897 -224292 -125125 -64907 -89014 -148164
14383 -148164 -164923 -127473 -60060 4371 30718 17364 14898 61914 126843 155450 116408 7000
14371 7000 -137086 -246749 -283528 -263430 -212757 -159586 -126278 -117210 -147299 -212860 -287038 -342308
14359 -342308 -347517 -298799 -232865 -173478 -131586 -120517 -146790 -187178 -223105 -243250 -240860 -215709
14347 -215709 -167142 -111297 -84929 -72218 -56129 -91486 -170044 -216520 -214168 -208426 -252973 -335765
14335 -335765 -412310 -447661 -409152 -330385 -256549 -198965 -178601 -207586 -261846 -299979 -295701 -246122
$$ packed form
14419d0042m4634k2041L4008O9519O4836N5050N5293K5033l6077o8543n8504m5050
14407a1152l6358l2215l1139l1151j5161J7575L5342J5431k7908l4715m424J4739
14395a41136Q689n615l6584p5900q0032k5357M7038Q4605R9167O0218k4107n9150
14383a48164j6759L7450O7413O4431K6347j3354k466M7016O4929K8607l9042j09408
14371G000j44086j09663l6779K0098N0673N3171L3308R068l0089o5561p4178n5270
14359c42308n209M8718O5934N9387M1892J1069k6273m0388l5927k0145K390K5151
14347b15709M8567N5845K6368J2711J6089l5357p8558m6476K352N742m4547q2792
14335c35765p6545l5351L8509P8767P3836N7584K0364k8985n4260l8133M278M9579
$$ plain form
14323 -246122 -185911 -147136 -148036 -213787 -324990 -416242 -457415 -464666 -461110 -458499 -453304 -421387
14311 -421387 -333633 -206750 -81511 245 -9205 -110195 -221826 -263200 -231324 -187514 -158416
14300 -158416 -115998 -58221 -27765 -38849 -56845 -35559 9943 23521 -5379 -73002 -182994
14289 -182994 -302760 -417853 -521848 -595606 -635680 -653562 -659161 -634822 -558307 -434903 -294867
14278 -294867 -161659 -60530 -17729 -37949 -75844 -76975 -68505 -96330 -119914 -82679 -11822
14267 -11822 54119 112832 183153 267223 327825 321608 236379 126687 50032 -1533 -61190 -98226
14255 -98226 -98349 -116289 -162508 -191753 -183807 -175922 -219926 -290148 -314466 -297229 -310518 -368057
14243 -368057 -425725 -454125 -437930 -388126 -324612 -263436 -219744 -200496 -195074 -176861 -166317 -205998
$$ packed form
14323b46122O0211L8775r00o5751j11203r1252m1173p251L556K611N195L1917
14311d21387Q7754J26883J25239Q1756r450j00990j11631m1374L1876M3810K9098
14300a58416M2418N7777L0456j1084j7996K1286M5502J3578k8900o7623j09992
14289a82994j19766j15093j03995p3758m0074j7882n599K4339P6515J23404J40036
14278b94867J33208J01129M2801k0220l7895j131Q470k7825k3584L7235P0857
14267a1822O5941N8713P0321Q4070O0602o217q5229j09692p6655n1565n9657l7036
14255i8226j23j7940m6219k9245P946P885m4004p0222k4318J7237j3289n7539
14243c68057n7668k8400J6195M9804O3514O1176M3692J9248N422J8213J0544l9681
$$ plain form
14231 -205998 -272290 -325131 -347021 -317060 -253657 -182102 -85485 34478 106653 73168 -50750
14220 -50750 -204907 -331809 -391679 -356212 -238006 -96325 8727 61165 57838 8150 -47320
14209 -47320 -80188 -108380 -145341 -186182 -225754 -242075 -235890 -227767 -205194 -150556 -41429 101091
14197 101091 215849 270929 283792 271447 228093 160849 86094 12482 -79710 -187198 -256264
14186 -256264 -252800 -231072 -268188 -349943 -418956 -464437 -493412 -488396 -446362 -372639 -275693 -203870
14174 -203870 -163122 -140063 -144429 -154531 -149665 -127317 -70138 18408 98205 147231 148345 110354
14162 110354 62271 18586 -6492 12631 81475 147317 152478 107219 74052 69030 45612 -14810
14150 -14810 -92442 -156486 -179365 -149295 -89394 -47661 -68929 -140900 -209475 -238544 -213356 -153005
$$ packed form
14231b05998o6292n2841k1890K9961O3403P1555R6617J19963P2175l3485j23918
14220e0750j54157j26902n9870L5467J18206J41681J05052N2438l327m9688n5470
14209d7320l2868k8192l6961m0841l9572j6321O185Q123K2573N4638J09127J42520
14197A01091J14758N5080J2863j2345m3354o7244p4755p3612r2192j07488o9066
14186b56264L464K1728l7116q1755o9013m5481k8975N016M2034P3723R6946P1823
14174b03870M0748K3059m366j0102M866K2348N7179Q8546P9797M9026J114l7991
14162A10354m8083m3685k5078J9123O8844O5842N161m5259l3167n022k3418o0422
14150a4810p7632o4044k2879L0070N9901M1733k1268p1971o8575k9069K5188O0351
$$ plain form
14138 -153005 -111314 -114699 -141144 -153431 -145386 -158929 -213064 -262091 -261219 -225015 -201714 -237666
14126 -237666 -311825 -359862 -387992 -440169 -498958 -496747 -414009 -309722 -228372 -167720 -146097
14115 -146097 -166648 -190301 -179987 -163120 -202715 -267385 -289661 -272476 -273711 -284593 -254262 -220564
14103 -220564 -230774 -269228 -299420 -319485 -334534 -325422 -282821 -224367 -168977 -139473 -131827 -127694
14091 -127694 -150046 -224841 -328966 -399370 -399183 -333177 -222049 -91894 10658 55062 56702
14080 56702 24900 -44027 -125517 -182948 -197688 -154634 -70137 33047 135652 200141 196271
14069 196271 137107 62191 1083 -30353 -26473 8229 40022 46848 47219 65038 97962 144761
14057 144761 210539 257973 243727 150421 45792 -8971 -37715 -58777 -70443 -69991 -70768 -97116
$$ packed form
14138a53005M1691l385k6445j2287Q045j3543n4135m9027Q72L6204K3301l5952
14126b37666p4159m8037k8130n2177n8789K211Q2738J04287Q1350O0652K1623
14115a46097k0551k3653J0314J6867l9595o4670k2276J7185j235j0882L0331L3698
14103b20564j0210l8454l0192k0065j5049R112M2601N8454N5390K9504P646M133
14091a27694k2352p4795j04125p0404J87O6006J11128J30155J02552M4404J640
14080E6702l1802o8927q1490n7431j4740M3054Q4497J03184J02605O4489l870
14069A96271n9164p4916o1108l1436L880L4702L1793O826L71J7819L2924M6799
14057A44761O5778M7434j4246r3306j04629n4763k8744k1062j1666M52p77k6348
$$ plain form
14045 -97116 -157125 -214705 -238174 -253311 -293397 -343214 -372599 -361344 -311520 -232369 -122493
14034 -122493 1738 101182 153123 164728 163903 140790 51756 -65154 -120932 -114767 -113100 -146045
14022 -146045 -194085 -228446 -257407 -284039 -292233 -279458 -231970 -137344 -27351 48105 83274
14011 83274 88461 91203 94393 95096 109336 106213 53381 -15804 -60437 -79757 -90954 -109586 -133533
13998 -133533 -142572 -138809 -148776 -183493 -234592 -302806 -374841 -417335 -425225 -420521 -408342 -379287
13986 -379287 -329438 -272883 -234483 -234623 -280656 -351026 -396281 -366542 -256092 -109950 1278
13975 1278 21257 -47070 -139903 -196088 -213220 -227345 -269472 -333850 -389204 -426755 -455578 -469932
13963 -469932 -457255 -402874 -301393 -155316 2636 114159 166511 183471 169258 126059 69528
$$ packed form
14045i7116o0009n7580k3469j5137m0086m9817k9385J1255M9824P9151J09876
14034a22493J24231R9444N1941J1605q25k3113q9034j16910n5778O165J667l2945
14022a46045m8040l4361k8961k6632q194J2775M7488R4626J09993P5456L5169
14011H3274N187K742L190P03J4240l123n2832o9185m4633j9320j1197j8632k3947
13998a33533r039L763r967l4717n1099o8214p2035m2494p890M704J2179K9055
13986c79287M9849N6555L8400j40m6033p0370m5255K9739J10450J46142J11228
13975A278J9979o8327r2833n6185j7132j4125m2127o4378n5354l7551k8823j4354
13963d69932J2677N4381J01481J46077J57952J11523N2352J6960j4213m3199n6531
$$ plain form
13952 69528 -10450 -135692 -246245 -300140 -316881 -296694 -242388 -185343 -143229 -94683 -27501
13941 -27501 41037 105799 165259 168240 95512 11261 -42991 -90760 -132062 -150910 -171057 -216487
13929 -216487 -246832 -230651 -216503 -237183 -270385 -309517 -350354 -345898 -273311 -179181 -86812 9212
13917 9212 65035 47189 -21604 -104878 -153203 -140891 -96581 -79045 -111598 -165330 -188905 -170276
13905 -170276 -156235 -167928 -178486 -203615 -293345 -430245 -543833 -611069 -657074 -676754 -632819
13894 -632819 -550997 -501559 -513856 -556149 -587617 -577553 -493988 -376651 -295724 -244535 -199077
13883 -199077 -180504 -194468 -237842 -299449 -361760 -419768 -460195 -451339 -377112 -244653 -72764
13872 -72764 116078 265967 309058 254557 169663 102036 73993 77318 89754 102154 110369 109009
$$ packed form
13952F9528p9978j25242j10553n3895j6741K0187N4306N7045M2114M8546O7182
13941b7501O8538O4762N9460K981p2728q4251n4252m7769m1302j8848k0147m5430
13929b16487l0345J6181J4148k0680l3202l9132m0837M456P2587R4130R2369R6024
13917I212N5823j7846o8793q3274m8325J2312M4310J7536l2553n3732k3575J8629
13905a70276J4041j1693j0558k5129q9730j36900j13588o7236m6005j9680M3935
13894f32819Q1822M9438j2297m2293l1468J0064Q3565J17337Q0927N1189M5458
13883a99077J8573j3964m3374o1607o2311n8008m0427Q856P4227J32459J71889
13872g2764J88842J49889M3091n4501q4894o7627k8043L325J2436J2400Q215j360
$$ plain form
13860 109009 96058 78356 83508 126675 199591 260682 273816 264832 251398 230378 233779 258048
13848 258048 244880 180133 115021 89206 84848 54882 -31743 -137261 -203411 -221622 -199129
13837 -199129 -171714 -194698 -251312 -291332 -282005 -226090 -144925 -49741 32305 47639 -19119 -114363
13825 -114363 -183557 -227778 -279492 -343746 -382913 -387385 -376029 -356480 -327885 -295933 -294416 -313418
13813 -313418 -293450 -238497 -205936 -210379 -235172 -265829 -269044 -210809 -119785 -45290 -17287 -38385
13801 -38385 -82277 -131412 -188251 -246570 -287744 -305283 -316360 -302963 -228513 -107987 23928
13790 23928 126211 160847 147562 140048 127879 95670 71353 87355 126335 127369 54623 -51826
13778 -51826 -130352 -164085 -167506 -149343 -123027 -125239 -172990 -237822 -267828 -243681 -180154 -98390
$$ packed form
13860A09009j2951j7702N152M3167P2916O1091J3134q984j3434k1020L401K4269
13848B58048j3168o4747o5112k5815m358k9966q6625j05518o6150j8211K2493
13837a99129K7415k2984n6614m0020R327N5915Q1165R5184Q2046J5334o6758r5244
13825a14363o9194m4221n1714o4254l9167m472J1356J9549K8595L1952J517j9002
13813c13418J9968N4953L2561m443k4793l0657l215N8235R1024P4495K8003k1098
13801c8385m3892m9135n6839n8319m1174j7539j1077J3397P4450J20526J31915
13790B3928J02283L4636j3285p514j2169l2209k4317J6002L8980J034p2746j06449
13778e1826p8526l3733l421J8163K6316k212m7751o4832l0006K4147O3527Q1764
$$ plain form
13766 -98390 -17736 40681 69044 58619 17157 -7745 -6091 -13181 -32883 -58739 -114688 -204526
13754 -204526 -286667 -344695 -387379 -399799 -348694 -252163 -163952 -104292 -91963 -129844 -173824
13743 -173824 -177615 -169559 -207814 -264457 -287409 -262460 -192942 -128903 -111757 -137169 -167975 -179794
13731 -179794 -189928 -212934 -234104 -239985 -211544 -124849 -7287 100184 176035 218676 245146
13720 245146 258116 223637 133807 47564 21424 55686 103543 137342 180180 263956 339138
13709 339138 332824 249939 129623 -3585 -113053 -161218 -160528 -140090 -128208 -137770 -150377 -146359
13697 -146359 -109045 -30155 72957 182651 297222 381010 402008 368372 296363 204857 148158
13686 148158 183800 295195 403672 462561 488553 507506 530343 544256 530397 491922 456423
$$ packed form
13766i8390Q0654N8417K8363j0425m1462k4902J654p090j9702k5856n5949q9838
13754b04526q2141n8028m2684j2420N1105R6531Q8211N9660J2329l7881m3980
13743a73824l791Q056l8255n6643k2952K4949O9518O4039J7146k5412l0806j1819
13731a79794j0134k3006k1170n881K8441Q6695J17562J07471P5851M2641K6470
13720B45146J2970l4479q9830q6243k6140L4262M7857L3799M2838Q3776P5182
13709C39138o314q2885j20316j33208j09468m8165O90K0438J1882r562j2607M018
13697a46359L7314P8890J03112J09694J14571Q3788K0998l3636p2009r1506n6699
13686A48158L5642J11395J08477N8889K5992J8953K2837J3913j3859l8475l5499
$$ plain form
13675 456423 446046 454317 475593 498214 498713 457363 380970 297806 228520 175117 151292 169977
13663 169977 227462 276131 242557 137788 38213 -10020 1848 54602 110263 134926 100097
13652 100097 23749 -52929 -113462 -135298 -107029 -52666 8379 54123 63373 58400 75111 114060
13640 114060 145986 182084 238630 276534 256688 218127 224817 243811 210507 134499 66394 58049
13628 58049 113819 182467 220147 228106 231350 214714 156503 90297 54287 39623 43861 61694
13616 61694 61439 33029 10866 27982 77700 106162 64124 -26994 -95359 -112086 -101446 -87118
13604 -87118 -88672 -100010 -111830 -129719 -156256 -179085 -172081 -125154 -65347 -22596 -17591 -46376
13592 -46376 -86308 -126378 -167875 -193332 -174293 -117525 -64524 -35930 -27707 -35812 -59539 -94026
$$ packed form
13675D56423j0377Q271K1276K2621M99m1350p6393q3164o9286n3403k3825J8685
13663A69977N7485M8669l3574j04769r9575m8233J1868N2754N5661K4663l4829
13652A00097p6348p6678o0533k1836K8269N4363O1045M5744R250m973J6711L8949
13640A14060L1926L6098N6546L7904j9846l8561O690J8994l3304p6008o8105q345
13628E8049N5770O8648L7680P959L244j6636n8211o6206l6010j4664M238J7833
13616F1694k55k8410k2163J7116M9718K8462m2038r1118o8365j6727J0640J4328
13604h7118j554j1338j1820j7889k6537k2829P004M6927N9807M2751N005k8785
13592d6376l9932m0070m1497k5457J9039N6768N3001K8594Q223q105k3727l4487
$$ plain form
13580 -94026 -115822 -125709 -120166 -62532 51006 179513 288413 368910 415648 413660 365583 277268
13568 277268 185911 140507 153206 192344 205146 131137 -15188 -132394 -157102 -120221 -58916
13557 -58916 35567 150689 239038 281475 274460 252325 252840 257845 244776 215587 201645 217657
13545 217657 254375 295117 303782 266063 231408 240798 293889 365543 434581 510245 581783 618886
13533 618886 595783 491829 330999 199968 140757 113579 103042 118633 144739 150518 121116
13522 121116 55257 -11433 -60585 -100237 -104677 -73086 -38922 -23829 -16947 16594 89597 170501
13510 170501 253757 346287 407739 397723 328432 268846 275427 337417 411841 452954 417711 286044
13498 286044 114639 -21912 -110393 -164344 -182555 -154266 -77389 48111 193206 303559
$$ packed form
13580i4026k1796r887N543N7634J13538J28507J08900Q0497M6738j988m8077q8315
13568B77268r1357m5404J2699L9138J2802p4009j46325j17206k4708L6881O1305
13557e8916R4483J15122Q8349M2437p015k2135N15N005j3069k9189j3942J6012
13545B17657L6718M0742Q665l7719l4655R390N3091P1654O9038P5664P1538L7103
13533F18886k3103j03954j60830j31031n9211k7178j0537J5591K6106N779k9402
13522A21116o5859o6690m9152l9652m440L1591L4164J5093O882L3541P3003Q0904
13510A70501Q3256R2530O1452j0016o9291n9586O581O1990P4424M1113l5243j31667
13498B86044j71405j36551q8481n3951j8211K8289P6877J25500J45095J10353
$$ plain form
13488 303559 332779 279938 182095 83469 19416 12028 43962 83846 136882 190919 216024 226071
13476 226071 239313 249127 256149 269409 275766 266979 291285 356417 418914 424675 346612 220302
13464 220302 96146 3704 -76820 -137854 -149465 -134222 -116723 -93491 -43921 49454 170991
13453 170991 287253 371298 431975 527894 657626 761770 803976 806225 806006 803742 773667 701666
13441 701666 590095 468003 376415 328871 321647 344984 366946 351677 322242 331646 376854
13430 376854 401545 388555 376433 401235 426995 376197 261090 177948 187682 288203 446905
13419 446905 590982 663248 669348 615751 512417 414244 367653 346231 320403 288950 250352
13408 250352 206129 158653 128172 149228 221454 307876 382295 418531 416987 434928 497295 567874
$$ packed form
13488C03559K9220n2841r7843r8626o4053p388L1934L9884N3036N4037K5105J0047
13476B26071J3242R814P022J3260O357q787K4306O5132O2497N761p8063j26310
13464B20302j24156r2442q0524o1034j1611J5243J7499K3232M9570R3375J21537
13453A70991J16262Q4045O0677R5919J29732J04144M2206K249k19k264l0075p2001
13441G01666j11571j22092r1588m7544p224K3337K1962j5269k9435R404M5208
13430C76854K4691j2990j2122K4802K5760n0798j15107q3142R734J00521J58702
13419D46905J44077P2266O100n3597j03334r8173m6591k1422k5828l1453l8598
13408B50352m4223m7476l0481K1056P2226Q6422P4419L6236j544J7941O2367P0579
$$ plain form
13396 567874 610456 624117 618578 584861 523054 457223 413464 359983 250490 146375 141806
13385 141806 217782 288712 321037 320780 302596 277768 242549 195439 166066 170269 182280 164464
13373 164464 117494 74025 28434 -23187 -36987 16391 98795 162507 182215 164095 140397
13362 140397 109911 76810 67779 82477 110838 166419 271374 414029 557962 677163 761740
13351 761740 790909 743235 648520 569827 528346 499541 465884 477738 568939 681007 740756
13340 740756 711287 617270 516697 422224 327679 252397 238821 293496 364983 425333 485223
13329 485223 537819 544120 493089 440174 425088 418254 395428 380683 400525 440648 474148 496507
13317 496507 520327 543175 549382 549137 553492 543578 527998 507023 450415 366267 301412 295549 323115
$$ packed form
13396E67874M2582J3661n539l3717o1807o5831m3759n3481j09493j04115m569
13385A41806P5976P0930L2325k57j8184k4828l5219m7110k9373M203J2011j7816
13373A64464m6970m3469m5591n1621j3800N3378Q2404O3712J9708j8120k3698
13362A40397l0486l3101r031J4698K8361N5581J04955J42655J43933J19201Q4577
13351G61740K9169m7674r4715p8693m1481k8805l3657J1854R1201J12068N9749
13340G40756k9469r4017j00573r4473r4545p5282j3576N4675P1487O0350N9890
13329D85223N2596O301n1031n2915j5086o834k2826j4745J9842M0123L3500K2359
13317D96507K3820K2848O207k45M355r914j5580k0975n6608q4148o4855n863K7566
$$ plain form
13304 323115 330825 305956 258106 202148 158212 127888 128078 195131 299146 367648 383641 374147
13292 374147 367355 380246 412128 448040 470206 501167 559893 627227 665395 672736 668089 646616
13280 646616 592199 523455 499025 525439 549318 555977 536908 476010 410149 373045 373489 407470
13268 407470 448850 481691 517206 556544 570004 539746 498347 483541 514338 593352 690299
13257 690299 769812 838926 905344 956605 995670 1013534 989362 925390 855316 798524 743318
13246 743318 697605 642561 564098 514853 539583 639185 783165 933531 1036611 1065972 1032030
13235 1032030 959289 855639 732539 606939 508246 445194 397618 354045 292491 210534 116424
13224 116424 20116 -50261 -76841 -52043 35519 179418 340201 462100 531312 575858 613483
$$ packed form
13304C23115P710k4869m7850n5958m3936l0324J90O7053J04015O8502J5993r494
13292C74147o792J2891L1882L5912K2166L0961N8726O7334L8168P341m647k1473
13280F46616n4417o8744k4430K6414K3879O659j9069o0898o5861l7104M44L3981
13268D07470M1380L2841L5515L9338J3460l0258m1399j4806L0797P9014R6947
13257F90299P9513O9114O6418N1261L9065J7864k4172o3972p0074n6792n5206
13246G43318m5713n5044p8463m9245K4730R9602J43980J50366J03080K9361l3942
13235A032030p2741j03650j23100j25600r8693o3052m7576m3573o1554q1957r4110
13224A16424r6308p0377k6580K4798Q7562J43899J60783J21899O9212M4546L7625
$$ plain form
13213 613483 645509 659154 642030 620931 617738 658486 765234 889231 949053 905496 808191
13202 808191 732438 708106 726865 781148 851473 916353 1000882 1107385 1206173 1278964 1296454
13191 1296454 1264601 1238389 1246730 1267719 1290474 1317163 1348546 1375055 1351462 1279698 1224241
13180 1224241 1177487 1099199 1020430 975493 970274 991250 1010254 1019348 1031599 1056748 1090526 1127338
13168 1127338 1159706 1159871 1102855 996092 866384 760151 717410 707479 716989 773488 864907
13157 864907 929012 926628 877347 810910 762315 766365 826683 921631 1022055 1115328 1165091 1126184
13145 1126184 1026824 938244 895974 904803 960702 1009720 1002056 966820 956005 958386 944828 923151
13133 923151 911326 921937 949459 962793 973473 995431 1006961 979699 914405 853145 820717
$$ packed form
13213F13483L2026J3645j7124k1099l193M0748J06748J23997N9822m3557r7305
13202H08191p5753k4332J8759N4283P0325O4880Q4529J06503R8788P2791J7490
13191A296454l1853k6212Q341K0989K2755K6689L1383K6509k3593p1764n5457
13180A224241m6754p8288p8769m4937n219K0976J9004R094J2251K5149L3778L6812
13168A127338L2368J65n7016j06763j29708j06233m2741r931R510N6499R1419
13157H64907O4105k384m9281o6437m8595M050O0318R4948J00424R3273M9763l8907
13145A126184r9360q8580m2270Q829N5899M9018p664l5236j0815K381j3558k1677
13133I23151j1825J0611K7522J3334J0680K1958J1530k7262o5294o1260l2428
$$ plain form
13122 820717 812815 826985 874584 980194 1115515 1226453 1279745 1264495 1220836 1204271 1244741
13111 1244741 1315911 1380620 1417582 1418538 1405103 1400788 1418425 1462410 1503502 1514509 1516870 1540967
13099 1540967 1594343 1663836 1717704 1752788 1788786 1806640 1776213 1713877 1668947 1660267 1675212
13088 1675212 1709775 1778742 1862279 1902734 1897047 1874328 1838304 1806811 1843892 1978736 2137402
13077 2137402 2233367 2283828 2353660 2453112 2534841 2589606 2637280 2672103 2711056 2777205 2831058
13066 2831058 2822795 2731851 2597863 2500223 2473892 2510802 2589773 2656691 2698367 2740050 2771425
13055 2771425 2776728 2792331 2837308 2900730 2987234 3095493 3219003 3312879 3333606 3322955 3318798
13044 3318798 3300342 3263034 3229890 3230460 3280090 3366774 3475118 3592240 3704699 3822952 3952768
$$ packed form
13122H20717p902J4170M7599J05610J35321J10938N3292j5250m3659j6565M0470
13111A244741P1170O4709L6962R56j3435m315J7637M3985M1092J1007K361K4097
13099A540967N3376O9493N3868L5084L5998J7854l0427o2336m4930q680J4945
13088A675212L4563O8967Q3537M0455n687k2719l6024l1493L7081J34844J58666
13077B137402R5965N0461O9832R9452Q1729N4765M7674L4823L8953O6149N3853
13066B831058q263r0944j33988r7640k6331L6910P8971O6918M1676M1683L1375
13055B771425N303J5603M4977O3422Q6504J08259J23510R3876K0727j0651m157
13044C318798j8456l7308l3144N70M9630Q6684J08344J17122J12459J18253J29816
$$ plain form
13033 3952768 4084687 4212842 4320985 4377176 4376417 4355614 4364695 4436961 4557869 4676697 4766499
13022 4766499 4862214 5019478 5237974 5451757 5615733 5773115 5970485 6196727 6437114 6701165
13012 6701165 7021556 7385691 7741067 8063087 8361218 8672240 9042944 9482595 9982341
13003 9982341 10555650 11238204 12027072 12879216 13800094 14874820 16171427 17684870 19402253
12994 19402253 21328187 23505295 26011599 28952123 32465502 36702127 41788515 47891242
12986 47891242 55311010 64472319 75889706 90200960 108166459 130567498 158038826
12979 158038826 190910902 228718250 269025080 305926437 330061691 332840997 312977544
12972 312977544 277727801 237178016 198637585 165380022 137995096 115885145 98141958
$$ packed form
13033C952768J31919J28155J08143N6191p59k0803R081P2266J20908J18828Q9802
13022D766499R5715J57264K18496K13783J63976J57382J97370K26242K40387K64051
13012F701165L20391L64135L55376L22020K98131L11022L70704M39651M99746
13003I982341N73309O82554P88868Q52144R20878J074726J296607J513443J717383
12994A9402253J925934K177108K506304K940524L513379M236625N086388O102727
12986D7891242P419768R161309J1417387J4311254J7965499K2401039K7471328
12979A58038826L2872076L7807348M0306830L6901357K4135254K779306j9863453
12972C12977544l5249743m0549785l8540431l3257563k7384926k2109951j7743187
$$ plain form
12965 98141958 83893045 72387036 63049868 55459187 49235076 44058998 39709528 36034227
12957 36034227 32891233 30161413 27789430 25733690 23957892 22427943 21075622 19819167
12949 19819167 18624636 17522108 16546452 15705460 14986639 14334546 13729245 13186240 12728266
12940 12728266 12380019 12117687 11892793 11680702 11475354 11286138 11120732 10996067 10952173
12931 10952173 10999486 11113725 11270707 11423269 11519557 11596225 11712676 11887454 12165396 12586122
12921 12586122 13135144 13796843 14578536 15440712 16288307 17029423 17626739 18118884 18580116
12912 18580116 19076290 19676515 20449765 21447498 22720498 24341896 26343826 28717236 31546568
12903 31546568 34985665 39195488 44358019 50690240 58484111 68153940 80229898 95358812
$$ packed form
12965I8141958j4248913j1506009r337168p590681o224111n176078m349470l675301
12957C6034227l142994k729820k371983k055740j775798j529949j352321j256455
12949A9819167j194531j102528r75656q40992p18821o52093o05301n43005m57974
12940A2728266l48247k62332k24894k12091k05348j89216j65406j24665m3894
12931A0952173M7313J14239J56982J52562R6288P6668J16451J74778K77942M20726
12921A2586122N49022O61699P81693Q62176Q47595P41116N97316M92145M61232
12912A8580116M96174O00225P73250R97733J273000J621398K001930K373410K829332
12903C1546568L439097M209823N162531O332221P793871R669829J2075958J5128914
$$ plain form
12895 95358812 114338665 138043007 167213517 202112228 241827131 283003269 318479428
12888 318479428 338133778 334380558 308483291 269603873 227883738 189688569 157434801
12881 157434801 131225326 110215455 93384752 79860204 68955087 60119686 52916113
12874 52916113 46985703 42055184 37915445 34407018 31373444 28692224 26361185 24385060
12866 24385060 22688907 21202667 19895905 18735760 17664642 16636444 15665538 14808829
12858 14808829 14110451 13539682 13006524 12467793 11960198 11513683 11122224 10808275 10601426
12849 10601426 10476312 10359088 10229481 10123498 10038812 9959686 9915631 9954071 10074211 10211126
12839 10211126 10328491 10453568 10600778 10775492 10999194 11271576 11589439 11936727 12282255
$$ packed form
12895I5358812J8979853K3704342K9170510L4898711L9714903M1176138L5476159
12888C18479428J9654350l753220k5897267l8879418m1720135l8195169l2253768
12881A57434801k6209475k1009871j6830703j3524548j0905117q835401p203573
12874E2916113n930410m930519m139739l508427l033574k681220k331039j976125
12866B4385060j696153j486240j306762j160145j071118j028198r70906q56709
12858A4808829o98378n70769n33158n38731n07595m46515l91459l13949k06849
12849A0601426j25114j17224j29607j05983q4686p9126m4055L8440J20140J36915
12839A0211126J17365J25077J47210J74714K23702K72382L17863L47288L45528
$$ plain form
12830 12282255 12621393 12987035 13426930 14036633 14887141 15908442 17034203 18277011 19666052
12821 19666052 21274455 23196549 25523699 28360616 31788282 35829061 40543862 46144091
12813 46144091 52917733 61201565 71444343 84227896 100230359 120227193 145057277
12806 145057277 175366660 211112593 250789852 290184859 321346588 334552417 324490509
12799 324490509 294847883 255286617 214836634 178582912 148201202 123569406 103842744
12792 103842744 88038610 75311659 64994551 56554848 49585024 43782689 38885695
12785 38885695 34711267 31163903 28156900 25600448 23404188 21464216 19698135 18089342
12777 18089342 16646915 15369463 14258497 13305162 12487223 11765972 11108156 10475481 9835739
$$ packed form
12830A2282255L39138L65642M39895O09703Q50508J021301J125761J242808J389041
12821A9666052J608403J922094K327150K836917L427666M040779M714801N600229
12813D6144091O773642Q283832J0242778J2783553J6002463J9996834K4830084
12806A45057277L0309383L5745933L9677259L9395007L1161729J3205829j0061908
12799C24490509k9642626l9561266m0449983l6253722l0381710k4631796j9726662
12792A03842744j5804134j2726951j0317108q439703o969824n802335m896994
12785C8885695m174428l547364l007003k556452k196260j939972j766081j608793
12777A8089342j442427j277452j110966r53335q17939p21251o57816o32675o39742
$$ plain form
12768 9835739 9202755 8621241 8105083 7676218 7361815 7103923 6851850 6601096 6328280
12759 6328280 6007196 5653725 5315434 5046931 4872353 4748046 4616116 4455619 4261156
12750 4261156 4066080 3927962 3860779 3836608 3825911 3813628 3789792 3716146 3595996 3448473
12740 3448473 3269791 3072253 2882116 2738450 2635629 2538148 2444768 2388166 2338129 2251069
12730 2251069 2136846 2023006 1917712 1826835 1756475 1720273 1717469 1708135 1673789 1626030 1573526
12719 1573526 1542094 1538598 1535298 1524500 1499934 1444476 1339356 1219891 1158741 1163562 1178050
12708 1178050 1137348 1054274 992004 982270 1014527 1036094 1000586 946592 937856 973400 1021158 1051907
12696 1051907 1036092 983943 935429 908218 898589 922464 981802 1047817 1098296 1123486 1125263 1112088
$$ packed form
12768I835739o32984n81514n16158m28865l14403k57892k52073k50754k72816
12759F328280l21084l53471l38291k68503j74578j24307j31930j60497j94463
12750D261156j95076j38118o7183k4171j0697j2283k3836p3646j20150j47523
12740C448473j78682j97538j90137j43666j02821r7481r3380n6602n0037q7060
12730B251069j14223j13840j05294r0877p0360l6202k804r334l4346m7759n2504
12719A573526l1432l496l300j0798k4566n5458j05120j19465o1150M821J4488
12708A178050m0702q3074o2270r734L2257K1567l5508n3994q736L5544M7758L0749
12696A051907j5815n2149m8514k7211r629K3875N9338O6015N0479K5190J777j3175
$$ plain form
12684 1112088 1082988 1037057 985864 947811 937751 951619 976155 1027580 1109456 1189318 1240623
12673 1240623 1248735 1215823 1178586 1183690 1233268 1252872 1204433 1144056 1097851 1063650 1041823 1021286
12661 1021286 972680 889836 809241 774781 789750 826750 868670 881652 826508 754051 732866
12650 732866 751620 770832 779595 775818 782657 808448 835811 846056 835046 819857 804318 770143
12638 770143 718345 667945 616869 534790 434367 367489 332343 300379 278601 274884 271189 262928
12626 262928 260327 269313 279636 289972 311313 340336 375191 395616 392846 380860 371047 384549
12614 384549 423523 472848 519578 525762 456225 346255 242000 162611 126027 106722 83244
12603 83244 83471 132417 212444 282095 336989 402904 472795 514826 544396 612736 716178 822167
$$ packed form
12684A112088k9100m5931n1193l8053j0060J3868K4536N1425Q1876P9862N1305
12673A240623Q112l2912l7237N104M9578J9604m8439o0377m6205l4201k1827k0537
12661A021286m8606q2844q0595l4460J4969L7000M1920J2982n5144p2457k1185
12650G32866J8754J9212Q763l777O839K5791K7363J0245j1010j5189j5539l4175
12638G70143n1798n0400n1076q2079j00423o6878l5146l1964k1778l717l695q261
12626B62928k601Q986J0323J0336K1341K9023L4855K0425k770j1986r813J3502
12614C84549L8974M9325M6730O184o9537j09970j04255p9389l6584j9305k3478
12603H3244K27M8946Q0027O9651N4894O5915O9891M2031K9570O8340J03442J05989
$$ plain form
12591 822167 924275 986209 965080 882513 793728 727284 683923 640833 577646 521719 502428
12580 502428 510710 542407 603511 677860 733989 747420 725040 684964 657201 649641 655498 692245
12568 692245 735278 747457 729392 699240 661737 607477 534618 456226 383834 330987 323876 325987
12556 325987 285516 221223 164968 137448 161865 218365 256691 275780 304840 358952 435208
12545 435208 490178 470400 392449 305082 222406 152766 117058 143460 227190 305762 336055
12534 336055 324216 294008 261584 245537 274970 341426 403133 446961 486411 535300 606770
12523 606770 675432 679914 619092 543476 488877 454941 428548 394368 325161 232994 176792 189981
12511 189981 253057 343304 444275 549617 650081 726142 781472 819663 832072 816357 805219
$$ packed form
12591H22167J02108O1934k1129q2567q8785o6444m3361m3090o3187n5927j9291
12580E02428Q282L1697O1104P4349N6129J3431k2380m0076k7763p560N857L6747
12568F92245M3033J2179j8065l0152l7503n4260p2859p8392p2392n2847p111K111
12556C25987m0471o4293n6255k7520K4417N6500L8326J9089K9060N4112P6256
12545D35208N4970j9778p7951q7367q2676o9640l5708K6402Q3730P8572L0293
12534C36055j1839l0208l2424j6047K9433O6456O1707M3828L9450M8889P1470
12523F06770O8662M482o0822p5616n4599l3936k6393l4180o9207r2167n6202J3189
12511A89981O3076R0247J00971J05342J00464P6061N5330L8191J2409j5715j1138
$$ plain form
12500 805219 822906 840676 817894 754635 683694 633026 592054 532078 461282 406986 394124
12489 394124 422071 466929 498504 509167 502535 467844 404953 330431 254469 192031 184084 240952
12477 240952 332271 416067 468498 496669 533869 596477 644106 636593 580530 509339 453171 409662
12465 409662 355148 289939 240651 219516 234146 279152 331835 384032 440111 491435 509245
12454 509245 469007 385684 311520 272469 257189 230911 194841 188722 221245 271191 351591 451628
12442 451628 516792 541204 547479 545798 527136 508828 500497 481562 440229 355306 246019 174356
12430 174356 160504 166890 167257 190939 248492 316565 366276 361808 311285 276107 292464 330984
12418 330984 335112 283427 214081 174116 167616 181023 200746 200185 176175 173611 200378 230865
$$ packed form
12500H05219J7687J7770k2782o3259p0941n0668m0972n9976p0796n4296j2862
12489C94124K7947M4858L1575J0663o632l4691o2891p4522p5962o2438p947N6868
12477B40952R1319Q3796N2431K8171L7200O2608M7629p513n6063p1191n6168m3509
12465D09662n4514o5209m9288k1135J4630M5006N2683N2197N6079N1324J7810
12454E09245m0238q3323p4164l9051j5280k6278l6070o119L2523M9946Q0400J00037
12442D51628O5164K4412O275j681j8662j8308q331j8935m1333q4923j09287p1663
12430A74356j3852O386L67K3682N7553O8073M9711m468n0523l5178J6357L8520
12418C30984M128n1685o9346l9965o500J3407J9723n61k4010k564K6767L0487
$$ plain form
12406 230865 266209 316766 404550 517851 589559 564423 473856 377544 301102 268659 288837
12395 288837 354685 438560 501220 519315 473552 371191 244623 137531 47463 -34864 -66201
12384 -66201 -27708 39291 75638 63256 36411 14766 -8377 -19043 -4751 5957 2846 -12384
12372 -12384 -48001 -57808 1377 72967 110745 131425 140594 108232 48879 32060 53105 57644
12360 57644 19059 -56936 -142137 -205196 -238798 -271668 -313949 -336296 -307567 -244360 -189605 -126076
12348 -126076 -53947 2761 33559 13798 -38423 -69406 -98110 -132940 -104568 8776 135931
12337 135931 172823 91535 -6181 -22328 17557 66647 121243 166581 183354 183806 186382 225000
12325 225000 315156 404721 439942 445833 486400 549947 578052 535261 436676 340088 295323 309715
$$ packed form
12406B30865L5344N0557Q7784J13301P1708k5136r0567r6312p6442l2443K0178
12395B88837O5848Q3875O2660J8095m5763j02361j26568j07092r0068q2327l1337
12384f6201L8493O6999L6347j2382k6845k1645k3143j0666J4292J0708l111j5230
12372a2384l5617r807N9185P1590L7778K0680R169l2362n9353j6819K1045M539
12360E7644l8585p5995q5201o3059l3602l2870m2281k2347K8729O3207N4755O3529
12348a26076P2129N6708L0798j9761n2221l0983k8704l4830K8372J13344J27155
12337A35931L6892q1288r7716j6147L9885M9090N4596M5338J6773M52K576L8618
12325B25000R0156Q9565L5221N891M0567O3547K8105m2791r8585r6588m4765J4392
$$ plain form
12313 309715 371839 460783 529197 553992 561893 575596 582726 554866 496287 433827 377674 308314
12301 308314 220457 143456 114074 141590 192895 201302 140884 56519 -3629 -22356 -11222 16287
12289 16287 65954 139136 200269 236964 277271 335214 388513 414564 407113 363257 295177 202303
12277 202303 76669 -53585 -134266 -134313 -43833 98721 225804 331899 428856 512610 585362
12266 585362 645622 678679 679335 665238 634193 565408 463254 386511 366419 364245 331640 284808
12254 284808 262707 269062 297813 342222 401193 468679 511856 498099 432060 357153 309695 262379
12242 262379 165929 22130 -117386 -199976 -211456 -184831 -159266 -156847 -167034 -164691 -145696
12231 -145696 -116979 -84927 -55586 -53113 -90408 -143326 -168804 -127130 -54333 -5685 20621 44390
$$ packed form
12313C09715O2124Q8944O8414K4795P901J3703P130k7860n8579o2460n6153o9360
12301C08314q7857p7001k9382K7516N1305Q407o0418q4365o0148j8727J1134K7509
12289A6287M9667P3182O1133L6695M0307N7943N3299K6051p451m3856o8080r2874
12277B02303j25634j30254q0681m7R0480J42554J27083J06095R6957Q3754P2752
12266E85362O0260L3057O56j4097l1045o8785j02154p6743k0092k174l2605m6832
12254B84808k2101O355K8751M4409N8971O7486M3177j3757o6039p4907m7458m7316
12242B62379r6450j43799j39516q2590j1480K6625K5565K419j0187K343J8995
12231a45696K8717L2052K9341K473l7295n2918k5478M1674P2797M8648K6306K3769
$$ plain form
12219 44390 65745 65461 57192 64217 87942 112508 131463 125240 74355 -5685 -100226 -191099 -249022
12206 -249022 -264744 -249880 -232669 -230416 -223841 -186019 -111890 2636 156055 329407 509011
12195 509011 656350 731706 752061 757984 751353 715406 650740 576932 531711 540070 572686 586436
12183 586436 561086 511175 468788 450285 454465 459613 442393 420590 421308 437804 443594 419002
12171 419002 376268 350802 332814 284393 213824 157193 122352 104450 124548 187686 247720
12160 247720 272288 266277 232334 150754 30750 -80341 -156554 -162749 -95799 -25518 10814
12149 10814 51695 106285 121127 73957 -17373 -109286 -155826 -138503 -65682 9146 35867 36004
12137 36004 62301 98546 89114 28994 -22874 -46555 -41279 38650 187371 327458 421784 495525
$$ packed form
12219D4390K1355k84q269P025K3725K4566J8955o223n0885q0040r4541r0873n7923
12206b49022j5722J4864J7211K253O575L7822P4129J14526J53419J73352J79604
12195E09011J47339P5356K0355N923o631l5947o4666p3808m5221Q359L2616J3750
12183E86436k5350m9911m2387j8503M180N148j7220k1803P18J6496N790k4592
12171D19002m2734k5466j7988m8421p0569n6631l4841j7902K0098O3138O0034
12160B47720K4568o011l3943q1580j20004j11091p6213o195O6950P0281L6332
12149A0814M0881N4590J4842m7170r1330r1913m6540J7323P2821P4828K6721J37
12137C6004K6297L6245r432o0120n1868k3681N276P9929J48721J40087R4326P3741
$$ plain form
12125 495525 551447 592791 638708 681214 692410 658558 575749 443230 300463 213551 198060
12114 198060 213030 234158 256677 264632 225416 129569 34879 -27339 -69870 -87525 -49051 19117
12102 19117 45338 26769 3918 -9220 10162 86150 196561 304703 378584 394383 383092
12091 383092 370677 330894 269321 214618 170076 141083 110065 53317 -383 -5032 15191 20234
12079 20234 28453 53955 94568 149614 182667 150562 91271 70769 103978 157760 175889 138829
12067 138829 93848 74755 71685 67897 50597 15617 -20732 -39943 -51973 -71907 -102838 -145004
12055 -145004 -205990 -278748 -339743 -366906 -352769 -324163 -305981 -278029 -217227 -144649 -83934
12044 -83934 -20074 66060 138599 153320 128965 100574 70053 33419 -1160 -14121 18336 51883
$$ packed form
12125D95525N5922M1344M5917M2506J1196l3852q2809j32519j42767q6912j5491
12114A98060J4970K1128K2519P955l9216r5847r4690o2218m2531j7655L8474O8168
12102A9117K6221j8569k2851j3138J9382P5988J10411J08142P3881J5799j1291
12091C83092j2415l9783o1573n4703m4542k8993l1018n6748n3700m649K0223N043
12079B0234Q219K5502M0613N5046L3053l2105n9291k0502L3209N3782J8129l7060
12067A38829m4981j9093l070l788j7300l4980l6349j9211j2030j9934l0931m2166
12055a45004o0986p2758o0995k7163J4137K8606J8182K7952O0802P2578O0715
12044h3934O3860Q6134P2539J4721k4355k8391l0521l6634l4579j2961L2457L3547
$$ plain form
12032 51883 37081 -33716 -158998 -273000 -313409 -278686 -194359 -102765 -50291 -69332 -142401
12021 -142401 -220148 -265663 -262370 -236073 -197820 -116044 5507 125704 218851 264491 244997
12010 244997 177612 80678 -17751 -65132 -46415 7692 56744 73521 50729 23945 22270 47761
11998 47761 103763 154407 169756 161138 144801 142824 187537 258401 298284 298673 257920 168347
11986 168347 56550 -49847 -116719 -111331 -58889 -9158 7955 2951 22812 76331 124856
11975 124856 159791 197893 224676 230569 242152 267686 283333 253529 186861 131981 102263 102313
11963 102313 169033 280335 358490 353400 289641 225333 172519 120820 64715 -7757 -74510
11952 -74510 -98295 -67195 -15323 26916 60675 73880 66085 57742 43530 11346 -41454 -112337
$$ packed form
12032E1883j4802p0797j25282j14002m0409L4723Q4327R1594N2474j9041p3069
12021a42401p7747m5515L293K6297L8253Q1776J21551J20197R3147M5640j9494
12010B44997o7385r6934r8429m7381J8717N4107M9052J6777k2792k6784j675K5491
11998D7761N6002N0644J5349q618j6337j977M4713P0864L9883L89m0753q9573
11986A68347j11797j06397o6872N388N2442M9731J7113n004J9861N3519M8525
11975A24856L4935L8102K6783N893J1583K5534J5647k9804o6668n4880k9718N0
11963A02313O6720J11302P8155n090o3759o4308n2814n1699n6105p2472o6753
11952g4510k3785L1100N1872M2239L3759J3205p795q343j4212l2184n2800p0883
$$ plain form
11940 -112337 -180465 -225596 -251311 -271490 -284291 -286109 -281945 -268740 -233874 -185825 -154815 -130153
11928 -130153 -98093 -88084 -96374 -88798 -41413 36205 127600 210955 245843 211585 174926 206364
11916 206364 286430 346689 360669 329211 262796 189490 137976 131297 155133 169709 150493 97095
11904 97095 40590 49660 124774 175955 129871 18632 -66538 -89023 -67769 -26803 20945 81438
11892 81438 135715 142594 102997 44700 -10217 -64847 -127243 -182544 -208629 -195944 -148608 -92964
11880 -92964 -61718 -53586 -34860 7478 56954 92932 90757 75456 80998 56050 -42705 -163458
11868 -163458 -249624 -296143 -332525 -383038 -412744 -375755 -289457 -208121 -165513 -141346 -88443
11857 -88443 8219 131041 243546 275433 190543 54541 -20299 -27012 -41704 -101934 -193804
$$ packed form
11940a12337o8128m5131k5715k0179j2801j818M164J3205L4866M8049L1010K4662
11928a30153L2060J0009q290P576M7385P7618R1395Q3355L4888l4258l6659L1438
11916B06364Q0066O0259J3980l1458o6415p3306n1514o679K3836J4576j9216n3398
11904I7095n6505R070P5114N1181m6084j11239q5170k2485K1254M0966M7748O0493
11892H1438N4277O879l9597n8297n4917n4630o2396n5301k6085J2685M7336N5644
11880i2964L1246Q132J8726M2338M9476L5978k175j5301N542k4948r8755j20753
11868a63458q6166m6519l6382n0513k9706L6989Q6298Q1336M2608K4167N2903
11857h8443R6662J22822J12505L1887q4890j36002p4840o713j4692o0230r1870
$$ plain form
11846 -193804 -263599 -266923 -217847 -104842 119874 419441 637647 667921 551095 398204
11836 398204 296621 238752 184546 144184 130476 138143 191011 245667 223370 125301 -7354
11825 -7354 -128175 -189339 -191962 -174028 -168214 -196444 -244776 -290711 -353786 -439958 -520032 -568669
11813 -568669 -578829 -542581 -447873 -324597 -220938 -140012 -48787 47445 126294 175506 184496
11802 184496 153823 100292 69159 83341 112946 121189 103074 71949 43874 45133 113448 236870
11790 236870 327505 328544 258080 153682 70697 29714 -307 -42797 -92940 -110929 -72178
11779 -72178 -877 79472 178746 296721 384727 419765 415959 371856 287952 193715 110396 22330
11767 22330 -68278 -122082 -106501 -16674 128886 269473 344138 352960 332991 310212 294313
$$ packed form
11846a93804o9795l324M9076J13005K24716K99567K18206L0274j16826j52891
11836C98204j01583n7869n4206m0362j3708P667N2868N4656k2297r8069j32655
11825g354j20821o1164k623J7934N814k8230m8332m5935o3075q6172q0074m8637
11813e68669j0160L6248R4708J23276J03659Q0926R1225R6232P8849M9212Q990
11802A84496l0673n3531l1133J4182K9605Q243j8115l1125k8075J259O8315J23422
11790B36870R0635J039p0464j04398q2985m0983l0021m2490n0143j7989L8751
11779g2178P1301Q0349R9274J17975Q8006L5038l806m4103q3904r4237q3319q8066
11767B2330r0608n3804J5581Q9827J45560J40587P4665Q822j9969k2779j5899
$$ plain form
11756 294313 271487 240098 219310 225311 273463 337480 363880 345795 303770 228225 133349 72376
11744 72376 68840 121187 213364 309020 379533 408506 405767 405916 390750 319215 203039 74966
11732 74966 -32149 -85075 -85115 -50460 11060 70172 110591 149227 186974 200612 157150 78216
11720 78216 32621 33975 55781 76465 100268 119094 95460 37495 7583 50311 164000 289854
11708 289854 365827 402329 432637 447519 411424 320599 215065 145758 150413 231730 353240
11697 353240 444972 468508 424787 332386 239315 205727 234526 270366 263137 214078 162824 156569
11685 156569 203075 264789 317646 347689 342545 304658 256387 207517 159834 92332 54205 131194
11673 131194 271040 387933 468475 519795 561318 607937 639551 645364 628535 583102 517812
$$ packed form
11756B94313k2826l1389k0788O001M8152O4017K6400j8085m2025p5545r4876o0973
11744G2376l536N2347R2177R5656P0513K8973k739J49j5166p1535j16176j28073
11732G4966j07115n2926m0L4655O1520N9112M0419L8636L7747J3638m3462p8934
11720G8216m5595J354K1806K0684K3803J8826k3634n7965k9912M2728J13689J25854
11708B89854P5973L6502L0308J4882l6095r0825j05534o9307M655Q1317J21510
11697C53240R1732K3536m3721r2401r3071l3588K8799L5840p229m9059n1254o255
11685A56569M6506O1714N2857L0043n144l7887m8271m8870m7683o7502l8127P6989
11673A31194J39846J16893Q0542N1320M1523M6619L1614N813j6829m5433o5290
$$ plain form
11662 517812 483438 496156 518721 530795 534019 524061 500730 481488 494524 546084 584733 581210
11650 581210 572871 583864 613764 620821 583134 534544 501393 484487 476357 468613 457345 451801
11638 451801 475928 534291 598494 641234 630640 559316 464935 382640 333244 331971 346199 352471
11626 352471 375809 452690 614710 854845 1102816 1309973 1477714 1618186 1704792 1732612
11616 1732612 1758594 1818858 1902876 2002127 2099455 2165263 2173039 2101012 1961388 1846955 1814565
11605 1814565 1802188 1738066 1623570 1506978 1432843 1388492 1329429 1247269 1169628 1123124 1117980
11594 1117980 1131356 1139427 1144906 1164401 1201892 1214984 1182091 1126019 1064782 1021039 975848 884583
11582 884583 786758 753460 803590 899885 996554 1094406 1218772 1387417 1594044 1824755 2054709
$$ packed form
11662E17812l4374J2718K2565J2074L224r958k3331j9242J3036N1560L8649l523
11650E81210q339J0993K9900P057l7687m8590l3151j6906q130p744j1268n544
11638D51801K4127N8363O4203M2740j0594p1324r4381q2295m9396j273J4228O272
11626C52471K3338P6881J62020K40135K47971K07157J67741J40472Q6606K7820
11616A732612K5982O0264Q4018R9251R7328O5808P776p2027j39624j14433l2390
11605A814565j2377o4122j14496j16592p4135m4351n9063q2160p7641m6504n144
11594A117980J3376Q071N479J9495L7491J3092l2893n6072o1237m3743m5191r1265
11582H84583r7825l3298N0130R6295R6669R7852J24366J68645K06627K30711K29954
$$ plain form
11571 2054709 2278593 2503252 2725727 2972957 3287981 3727863 4350164 5164658 6146405
11562 6146405 7265270 8504748 9849933 11245363 12588076 13741674 14569547 14995639
11554 14995639 15049878 14776877 14158874 13195002 11984147 10678490 9395394 8207602 7161738
11545 7161738 6269782 5511577 4856824 4299506 3842440 3463132 3134351 2836658 2561350
11536 2561350 2299647 2028563 1756449 1517991 1348584 1251478 1198103 1144360 1063499 950105
11526 950105 838017 761546 702665 643480 580505 535338 513381 499221 481990 458561 461219
11515 461219 496605 538464 567995 568946 538464 512369 538390 584086 603150 584101 511319 388759
11503 388759 270979 213188 196352 171789 118589 43364 -16568 -24900 4059 31604 40920 72727
$$ packed form
11571B054709K23884K24659K22475K47230L15024M39882O22301Q14494R81747
11562F146405J118865J239478J345185J395430J342713J153598Q27873M26092
11554A4995639N4239k73001o18003r63872j210855j305657j283096j187792j045864
11545G161738q91956p58205o54753n57318m57066l79308l28781k97693k75308
11536B561350k61703k71084k72114k38458j69407r7106n3375n3743q0861j13394
11526I50105j12088p6471n8881n9185o2975m5167k1957j4160j7231k3429K658
11515D61219L5386M1859K9531R51l0482k6095K6021M5696J9064j9049p2782j22560
11503C88759j17780n7791j6836k4563n3200p5225n9932q332K8959K7545R316L1807
$$ plain form
11491 72727 166433 296291 405175 463570 456666 401517 319710 221414 125164 43016 26791
11480 26791 124701 284031 417523 504599 570062 604678 605200 597734 593425 600871 622874 626047
11468 626047 594244 527083 428123 335582 283487 267191 255380 230178 208695 197545 178711
11457 178711 149563 117898 96181 103444 104475 64576 12552 -30761 -72389 -100860 -64662 26051
11445 26051 75688 38632 -16111 -9618 35397 67401 100498 151432 206205 239059 220167 157991
11433 157991 92231 33609 -21798 -67802 -96133 -98273 -67288 -2394 69166 109252 112589 99536
11421 99536 84805 60111 36339 29044 50725 117471 208070 248160 197801 82689 -48453
11410 -48453 -130497 -139721 -95163 -13769 107427 225533 266243 238503 191680 128192 59152
$$ packed form
11491G2727R3706J29858J08884N8395o904n5149q1807r8296r6250q2148j6225
11480B6791R7910J59330J33492Q7076O5463L4616N22p466m309P446K2003L173
11468F26047l1803o7161r8960r2541n2095j6296j1811k5202k1483j1150j8834
11457A78711k9148l1665k1717P263J031l9899n2024m3313m1628k8471L6198R0713
11445B6051M9637l7056n4743O493M5015L2004L3097N0934N4773L2854j8892o2176
11433A57991o5760n8622n5407m6004k8331k140L0985O4894P1560M0086L337j3053
11421I9536j4731k4694k3772p295K1681O6746R0599M0090n0359j15112j31142
11410d8453q2044r224M4558Q1394J21196J18106M0710k7740m6823o3488o9040
$$ plain form
11399 59152 15030 14924 24764 -8040 -97379 -221460 -320060 -331778 -284097 -247581 -240297 -236618
11387 -236618 -222738 -198650 -159235 -132408 -145054 -198880 -261030 -262961 -177621 -93724 -90375 -124267
11375 -124267 -142863 -150298 -154738 -162205 -197547 -255561 -321028 -381235 -415167 -404758 -329231 -206420
11363 -206420 -94304 -3410 100063 217721 301147 316393 271574 204260 160389 123945 59421
11352 59421 1609 4922 61806 111070 91794 22323 -47064 -104705 -154325 -168538 -129025 -32931
11340 -32931 102644 242654 375372 474654 486638 397844 255941 134047 100747 158987 248694
11329 248694 322529 370857 400796 423258 447329 480480 507890 501439 447230 365719 298850 250115
11317 250115 180806 83435 -8570 -84751 -151872 -197206 -205733 -181235 -141903 -121542 -117361 -88727
$$ packed form
11399E9152m4122j06R840l2804q9339j24081r8600j1718M7681L6516P284L679
11387b36618J3880K4088L9415K6827j2646n3826o2150j931Q5340Q3897L349l3892
11375a24267j8596p435m440p467l5342n8014o5467o0207l3932J0409P5527J22811
11363b06420J12116R0894J03473J17658Q3426J5246m4819o7314m3871l6444o4524
11352E9421n7812L313N6884M9264j9276o9471o9387n7641m9620j4213L9513R6094
11340c2931J35575J40010J32718R9282J1984q8794j41903j21894l3300N8240Q9707
11329B48694P3835M8328K9939K2462K4071L3151K7410o451n4209q1511o6869m8735
11317B50115o9309r7371r2005p6181o7121m5334q527K4498L9332K0361M181K8634
$$ plain form
11305 -88727 -27936 43921 90169 75761 4806 -78275 -122922 -99502 -30545 36124 79150 104111
11293 104111 121273 141007 167565 187221 192675 213737 251600 258734 232647 200211 172114 148338
11281 148338 167336 244803 319276 358042 370663 355523 321314 300920 293579 240470 142224 49704
11269 49704 -9754 -45825 -93299 -165796 -244211 -292148 -298536 -289090 -290713 -284376 -236881 -166460
11257 -166460 -112791 -107781 -163958 -257034 -321728 -303920 -206314 -105997 -60030 -44599 -38170 -29456
11245 -29456 15886 83138 126320 130160 114370 108698 117839 125168 124181 119492 95084 28648 -35136
11232 -35136 -30351 21464 46217 40844 38968 40337 28987 -6882 -60558 -109728 -139131 -154808
11220 -154808 -172347 -218588 -309582 -402061 -452829 -486200 -547933 -644512 -737980 -767560 -689912
$$ packed form
11305h8727O0791P1857M6248j4408p0955q3081m4647K3420O8957O6669M3026K4961
11293A04111J7162J9734K6558J9656N454K1062L7863P134k6087l2436k8097k3776
11281A48338J8998P7467P4473L8766J2621j5140l4209k0394p341n3109r8246r2520
11269D9704n9458l6071m7474p2497p8415m7937o388R446j623O337M7495P0421
11257a66460N3669N010n6177r3076o4694J7808R7606J00317M5967J5431O429Q714
11245b9456M5342O7252M3182L840j5790n672R141P329r87m689k4408o6436o3784
11232c5136M785N1815K4753n373j876J369j1350l5869n3676m9170k9403j5677
11220a54808j7539m6241r0994r2479n0768l3371o1733r6579r3468k9580P7648
$$ plain form
11209 -689912 -558757 -478355 -473898 -513185 -562107 -604785 -630876 -608520 -545313 -465866 -373997
11198 -373997 -288737 -256145 -263746 -235188 -123963 26095 115946 124875 110778 103616 94935 72941
11186 72941 37364 -1563 -30123 -39603 -24831 9156 34532 17987 -38260 -100934 -178021 -272430
11174 -272430 -331116 -354825 -368712 -367617 -342006 -272427 -153567 -3624 139891 213789 190890
11163 190890 129806 97656 109837 152138 211587 257231 273756 271594 257202 240424 207507 143748
11151 143748 76210 65671 129783 203566 216792 164253 95320 49041 20357 -11325 -54794
11140 -54794 -99607 -145791 -199027 -247154 -264952 -243606 -201891 -157627 -121967 -73868 -8607 38007
11128 38007 50117 63034 125941 216237 281719 311579 308866 266542 179273 65057 -41600
$$ packed form
11209f89912J31155Q0402M457l9287m8922m2678k6091K2356O3207P9447R1869
11198c73997Q5260L2592p601K8558J11225J50058Q9851Q929j4097p162q681k1994
11186G2941l5577l8927k8560r480J4772L3987K5376j6545n6247o2674p7087r4409
11174b72430n8686k3709j3887J095K5611O9579J18860J49943J43515P3898k2899
11163A90890o1084l2150J2181M2301N9449M5644J6525k162j4392j6778l2917o3759
11151A43748o7538j0539O4112P3783J3226n2539o8933m6279k8684l1682m3469
11140e4794m4813m6184n3236m8127j7798K1346M1715M4264L5660M8099O5261M6614
11128C8007J2110J2917O2907R0296O5482K9860k713m2324q7269j14216j06657
$$ plain form
11117 -41600 -108228 -139641 -182670 -255276 -310579 -300832 -252496 -201998 -143504 -69133 -18038 7128
11105 7128 40244 95974 164658 187695 118741 -9615 -147077 -265746 -336471 -361701 -352315
11094 -352315 -297954 -218752 -162813 -125629 -84238 -50376 -44100 -86013 -134980 -139947 -112115 -75476
11082 -75476 -31068 21662 96577 219047 368978 492718 573223 594534 506993 345890 231470
11071 231470 220860 257827 255102 196200 93377 -41286 -159248 -210168 -184458 -112842 -27354
11060 -27354 52435 102774 109949 64494 -9475 -64653 -68605 -9270 56160 57199 561 -53748
11048 -53748 -55473 -5132 54259 104662 145443 182743 208188 195802 147690 80790 33234 33272
11036 33272 41341 15466 8612 75902 207432 351539 443826 460381 415390 328379 234398 170549
$$ packed form
11117d1600o6628l1413m3029p2606n5303R747M8336N0498N8494P4371N1095K5166
11105G128L3116N5730O8684K3037o8954j28356j37462j18669p0725k5230R386
11094c52315N4361P9202N5939L7184M1391L3862O276m1913m8967m967K7832L6639
11082g5476M4408N2730P4915J22470J49931J23740Q0505K1311q7541j61103j14420
11071B31470j0610L6967k725n8902j02823j34663j17962n0920K5710P1616Q5488
11060b7354P9789N0339P175m5455p3969n5178l952N9335O5430J039n6638n4309
11048e3748j725N0341N9391N0403M0781L7300K5445j2386m8112o6900m7556L8
11036C3272Q069k5875o854O7290J31530J44107R2287J6555m4991q7011r3981o3849
$$ plain form
11024 170549 131482 105753 70795 10183 -58460 -120660 -182813 -245110 -275693 -222147 -100909
11013 -100909 12231 57815 26193 -30482 -66055 -84660 -108349 -132777 -143480 -158923 -176978
11002 -176978 -150225 -85416 -38168 -42577 -80894 -110887 -88952 -20678 46786 107913 168568 217418
10990 217418 266303 307350 314877 287111 241789 207380 164010 104473 81530 108545 136505 112492
10978 112492 38447 -47738 -139360 -244706 -344373 -397536 -383931 -335240 -286613 -239739 -197226
10967 -197226 -165725 -127768 -79885 -52195 -67484 -132002 -204708 -230999 -207249 -157568 -114285
10956 -114285 -89230 -79285 -76094 -60375 -35605 -21151 -32368 -67249 -106009 -111957 -94252 -79002
10944 -79002 -33978 68524 175178 213757 173336 85858 -830 -46200 -36116 20177 73400
$$ packed form
11024A70549l9067k5729l4958o0612o8643o2200o2153o2297l0583N3546J21238
11013a00909J13140M5584l1622n6675l5573j8605k3689k4428j0703j5443j8055
11002a76978K6753O4809M7248m409l8317k9993K1935O8274O7464O1127O0655M8850
10990B17418M8885M1047P527k7766m5322l4409m3370n9537k2943K7015K7960k4013
10978A12492p4045q6185r1622j05346r9667n3163J3605M8691M8627M6874M2513
10967a97226L1501L7957M7883K7690j5289o4518p2706k6291K3750M9681M3283
10956a14285K5055R945L191J5719K4770J4454j1217l4881l8760n948J7705J5250
10944g9002M5024J02502J06654L8579m0421q7478q6688m5370J0084N6293N3223
$$ plain form
10933 73400 66482 41682 54266 72531 68675 60551 54117 48338 67773 136030 219345 286902 336481
10920 336481 383604 443276 492272 517803 512303 467238 421326 407654 406950 377289 303109 217356
10908 217356 149769 96054 34492 -38186 -97507 -121071 -102288 -43321 22647 72137 117986
10897 117986 172572 208838 217797 206022 144570 39792 -56935 -120079 -165581 -221589 -311267
10886 -311267 -434089 -542150 -584983 -585218 -578799 -557839 -515805 -455139 -380638 -288473 -168265
10875 -168265 -38764 45632 85063 138999 234733 334563 381824 370000 331521 297115 283422
10864 283422 287046 289496 259710 190930 119021 79107 49054 -203 -41292 -44767 -33798 -35014
10852 -35014 -35298 -15335 27226 59223 68045 74731 78088 86285 114144 151798 160941 126145 60981
$$ packed form
10933G3400o918k4800J2584J8265l856q124o434n779J9435O8257Q3315O7557M9579
10920C36481M7123N9672M8996K5531n500m5065m5912j3672p04k9661p4180q5753
10908B17356o7587n3715o1562p2678n9321k3564J8783N8967O5968M9490M5849
10897A17986N4586L6266Q959j1775o1452j04778r6727o3144m5502n6008q9678
10886c11267j22822j08061m2833k35O419K0960M2034O0666P4501R2165J20208
10875a68265J29501Q4396L9431N3936R5734R9830M7261j1824l8479l4406j3693
10864B83422L624K450k9786o8780p1909l9914l0053m9257m1089l475J0969j216
10852c5014k84J9963M2561L1997Q822O686L357Q197K7859L7654R143l4796o5164
$$ plain form
10839 60981 -14190 -64992 -86074 -107889 -133121 -124649 -78022 -40964 -40713 -58308 -64422 -45907
10827 -45907 -16195 21263 23521 -30400 -56281 -16787 36319 46620 13615 -15448 -29465 -49482
10815 -49482 -46104 1140 34706 19601 -32476 -101664 -133883 -106606 -68526 -69473 -79033 -48785
10803 -48785 13843 73628 95083 77336 54808 52039 31952 11188 72253 198157 286273 275275
10791 275275 218453 195930 213997 238116 221643 142677 44770 -35364 -113773 -183648 -207045
10780 -207045 -193232 -173881 -148534 -86122 -1686 33707 -2630 -49015 -31197 54608 145502
10769 145502 191122 179181 112174 20927 -79361 -190279 -303061 -423345 -541311 -603772
10759 -603772 -580105 -492290 -383890 -289304 -199731 -107088 -32223 34098 111002 188885 262633
$$ packed form
10839F0981p5171n0802k1082k1815k5232Q472M6627L7058K51j7595o114J8515
10827d5907K9712L7458K258n3921k5881L9494N3106J0301l3005k9063j4017k0017
10815d9482L378M7244L3566j5105n2077o9188l2219K7277L8080r47r560L0248
10803d8785O2628N9785K1455j7747k2528k769k0087k0764O1065J25904Q8116j0998
10791B75275n6822k2523J8067K4119j6473p8966r7907q0134p8409o9875k3397
10780b07045J3813J9351K5347O2412Q4436L5393l6337m6385J7818Q5805R0894
10769A45502M5620j1941o7007r1247j00288j10918j12782j20284j17966o2461
10759f03772K3667Q7815J08400R4586Q9573R2643P4865O6321P6904P7883P3748
$$ plain form
10748 262633 315037 315456 240292 115181 -4817 -95239 -166156 -215555 -235306 -249983 -268958
10737 -268958 -282169 -305137 -369442 -455129 -496896 -447363 -307571 -135651 383 100976 206343
10726 206343 310017 359738 334890 263824 176989 83882 9129 -21896 -24041 -41207 -83990
10715 -83990 -112399 -96620 -47555 15074 71025 115271 141260 131656 83665 22989 -43224 -117971
10703 -117971 -178049 -214295 -228478 -197725 -108891 7795 102802 140470 130520 106211 76482
10692 76482 11791 -86794 -160687 -203496 -249852 -293724 -327135 -348477 -339325 -298903 -269069 -257233
10680 -257233 -216201 -112173 34968 169506 253224 268043 216044 123584 41377 34948 109522
10669 109522 180243 199748 205335 214606 185056 109667 50201 42990 60185 56749 28551 -14574
$$ packed form
10748B62633N2404M19p5164j25111j19998r0422p0917m9399j9751j4677j8975
10737b68958j3211k2968o4305q5687m1767M9533J39792J71920J36034J00593J05367
10726B06343J03674M9721k4848p1066q6835r3107p4753l1025k145j7166m2783
10715h3990k8409J5779M9065O2629N5951M4246K5989r604m7991o0676o6213p4747
10703a17971o0078l6246j4183L0753Q8834J16686R5007L7668r950k4309k9729
10692G6482o4691r8585p3893m2809m6356m3872l3411k1342R152M0422K9834J1836
10680b57233M1032J04028J47141J34538Q3718J4819n1999r2460q2207o429P4574
10669A09522P0721J9505N587R271k9550p5389n9466p211J7195l436k8198m3125
$$ plain form
10657 -14574 -60967 -80833 -47098 35648 101878 112034 97490 90407 98052 97535 66920 14947
10645 14947 -43010 -92230 -108140 -98270 -82348 -44709 15959 53434 37136 -36405 -142222 -221461
10633 -221461 -234210 -192660 -141966 -115038 -105639 -113511 -149903 -189692 -211621 -209539 -188386 -168184
10621 -168184 -147347 -105029 -18742 102129 221505 337023 455788 541521 563680 526374 446186
10610 446186 327356 206511 122545 54539 -38498 -160962 -249071 -264566 -237837 -209667 -193999
10599 -193999 -186794 -183179 -178202 -184044 -197564 -208492 -244635 -311844 -365612 -375093 -336692 -250766
10587 -250766 -148169 -57842 6004 26625 5690 -43337 -98026 -122722 -104145 -51986 13309
10576 13309 51294 58676 72803 96590 119496 146491 157355 130614 73119 13477 -18462 -31847
$$ packed form
10657a4574m6393j9866L3735Q2746O6230J0156j4544p083P645n17l0615n1973
10645A4947n7957m9220j5910R870J5922L7639O0668L7475j6298p3541j05817p9239
10633b21461j2749M1550N0694K6928R399p872l6392l9789k1929K082K1153K0202
10621a68184K0837M2318Q6287J20871J19376J15518J18765Q5733K2159l7306q0188
10610D46186j18830j20845q3966o8006r3037j22464q8109j5495K6729K8170J5668
10599a93999P205L615M977n842j3520j0928l6143o7209n3768r481L8401Q5926
10587b50766J02597R0327O3846K0621k0935m9027n4689k4696J8577N2159O5295
10576A3309L7985P382J4127K3787K2906K6995J0864k6741n7495n9642l1939j3385
$$ plain form
10564 -31847 -51940 -54964 -20448 1882 -18615 -54465 -97514 -138297 -158472 -161026 -141546 -98084
10552 -98084 -53594 -10971 20754 2627 -68692 -140500 -167232 -147698 -98775 -40133 8493 20553
10540 20553 -25519 -92241 -111149 -74404 -50724 -73646 -117129 -169129 -204143 -202928 -171177 -143211
10528 -143211 -150082 -164566 -140428 -69218 16531 78289 105522 105754 84849 58017 27360 -31263
10516 -31263 -108978 -189090 -246151 -229467 -134953 -31505 7275 -18268 -41248 -35331 -16645 3241
10504 3241 9131 1675 -13258 -33820 -54155 -81623 -122238 -161970 -181667 -174865 -134696 -84990
10492 -84990 -69428 -104812 -188195 -319302 -441214 -435777 -279270 -77099 65227 129882 148896
10481 148896 136791 116170 106332 111435 124443 128354 116750 91199 45116 -16581 -86226 -163393
$$ packed form
10564c1847k0093l024L4516K2330k0497l5850m3049m0783k0175k554J9480M3462
10552i8084M4490M2623L1725j8127p1319p1808k6732J9534M8923N8642M8626J2060
10540B0553m6072o6722j8908L6745K3680k2922m3483n2000l5014J215L1751K7966
10528a43211o871j4484K4138P1210Q5749O1758K7233K32k0905k6832l0657n8623
10516c1263p7715q0112n7061J6684R4514J03448L8780k5543k2980N917J8686J9886
10504C241N890p456j4933k0562k0335k7468m0615l9732j9697O802M0169M9706
10492h4990J5562l5384q3383j31107j21912N437J56507K02171J42326O4655J9014
10481A48896j2105k0621r838N103J3008L911j1604k5551m6083o1697o9645p7167
$$ plain form
10469 -163393 -212548 -211265 -190156 -152053 -79421 8431 71649 105374 133287 166725 212595 255058
10457 255058 273912 257622 221447 193889 170822 158501 177505 209045 212754 185793 161247 131587
10445 131587 57109 -45810 -137975 -219835 -298518 -369779 -411591 -427183 -430245 -401398 -346526
10434 -346526 -298277 -269568 -248230 -220746 -196045 -210316 -259462 -296634 -293957 -247060 -163449 -56057
10422 -56057 41397 115243 169611 195459 209176 243561 254516 189416 64954 -66908 -161641
10411 -161641 -219179 -260983 -279051 -278744 -283854 -301517 -340349 -381393 -369585 -309154 -256610 -237518
10399 -237518 -249118 -263675 -270277 -296088 -333312 -336398 -313606 -309669 -339199 -359239 -331237 -256667
10387 -256667 -151496 -57113 -38665 -127312 -300119 -489286 -631950 -706121 -671250 -521072
$$ packed form
10469a63393m9155J283K1109L8103P2632Q7852O3218L3725K7913L3438M5870M2463
10457B55058J8854j6290l6175k7558k3067j2321J9004L1540L709k6961k4546k9660
10445A31587p4478j02919r2165q1860p8683p1261m1812j5592l062K8847N4872
10434c46526M8249K8709K1338K7484K4701j4271m9146l7172K677M6897Q3611J07392
10422e6057R7454P3846N4368K5848J3717L4385J0955o5100j24462j31862r4733
10411a61641n7538m1804j8068L07n110j7663l8832m1044J1808O0431N2544J9092
10399b37518j1600j4557o602k5811l7224l086K2792L937k9530k0040K8002P4570
10387b56667J05171R4383J8448q8647j72807j89167j42664p4171L4871J50178
$$ plain form
10377 -521072 -326678 -181324 -134863 -188994 -322931 -472186 -554025 -534544 -439826 -338057
10367 -338057 -267257 -229101 -242761 -308595 -391137 -442240 -444074 -430005 -411052 -374621 -342765 -344839
10355 -344839 -361225 -364190 -336692 -298357 -295301 -337595 -382373 -372716 -298964 -208135 -139472 -88305
10343 -88305 -14023 91778 172702 176482 102873 22734 -8394 -9315 -28015 -103742 -231152 -354616
10331 -354616 -407233 -379770 -322174 -241015 -136843 -58009 -19970 -15320 -49896 -104834 -125703
10320 -125703 -89444 -26529 17719 15287 -50304 -180272 -318432 -390936 -373724 -319344 -285573
10309 -285573 -259806 -227470 -207692 -208477 -217576 -240093 -290144 -376088 -490719 -596799 -653265 -655720
10297 -655720 -631136 -600009 -558897 -501739 -447340 -415092 -393992 -361307 -305808 -239333 -169835
$$ packed form
10377e21072J94394J45354M6461n4131j33937j49255q1839J9481R4718J01769
10367c38057P0800L8156j3660o5834q2542n1103j834J4069J8953L6431L1856k074
10355c44839j6386k965K7498L8335L056m2294m4778R657P3752R0829O8663N1167
10343h8305P4282J05801Q0924L780p3609q0139l1128r21j8700p5727j27410j23464
10331c54616n2617K7463N7596Q1159J04172P8834L8039M650l4576n4938k0869
10320a25703L6259O2915M4248k432o5591j29968j38160p2504J7212N4380L3771
10309b85573K5767L2336J9778p85r099k2517n0051q5944j14631j06080n6466k455
10297f55720K4584L1127M1112N7158N4399L2248K1100L2685N5499O6475O9498
$$ plain form
10286 -169835 -80819 30482 133812 183141 144179 32902 -91485 -157685 -143120 -86222 -2607
10275 -2607 95415 191938 296913 382064 397201 355451 309021 310164 389785 505409 579997 583680
10263 583680 558016 558385 577073 552328 491642 481576 546285 632726 674452 626364 499401 333465
10251 333465 183235 93153 37014 -3432 -9566 15692 45085 64743 54681 -14143 -126849
10240 -126849 -219330 -245007 -210780 -142657 -69839 -9244 44580 76804 59008 8633 -3707
10229 -3707 58920 152018 204159 193916 154999 103112 48721 15176 -17441 -75774 -140427 -198394
10217 -198394 -254903 -291272 -291589 -241598 -181183 -140833 -85686 4998 101926 143819 105181 27876
10205 27876 -61464 -149525 -199556 -183408 -134681 -101525 -117247 -189173 -252741 -246836 -187448 -134423
$$ packed form
10286a69835Q9016J11301J03330M9329l8962j11277j24387o6200J4565N6898Q3615
10275b607R8022R6523J04975Q5151J5137m1750m6430J143P9621J15624P4588L683
10263E83680k5664L69J8688k4745o0686j0066O4709Q6441M1726m8088j26963j65936
10251C33465j50230r0082n6139m0446o134K5258K9393J9658j0062o8824j12706
10240a26849r2481k5677L4227O8123P2818O0595N3824L2224j7796n0375j2340
10229c707O2627R3098N2141j0243l8917n1887n4391l3545l2617n8333o4653n7967
10217a98394n6509l6369l17M9991O0415M0350N5147R0684R6928M1893l8638p7305
10205B7876q9340q8061n0031J6148M8727L3156j5722p1926o3568N905N9388N3025
$$ plain form
10193 -134423 -132460 -181749 -253826 -329945 -386932 -393161 -371159 -383037 -453163 -555781 -649222 -712275
10181 -712275 -746742 -763312 -773974 -779420 -771767 -744119 -698698 -635346 -550594 -464488 -402875 -386835
10169 -386835 -426802 -509177 -569029 -561168 -524590 -504678 -503874 -509106 -520254 -531423 -534648 -511576
10157 -511576 -449271 -351582 -235835 -134907 -70491 -42291 -40890 -59830 -96350 -134497 -148459
10146 -148459 -144867 -162151 -229876 -305060 -323257 -292841 -265001 -268419 -322495 -430181 -556753
10135 -556753 -634509 -624748 -540426 -419942 -302716 -199156 -115096 -68517 -50010 -48811 -39257
10124 -39257 4159 61429 102660 101211 53121 2014 -11147 17748 61665 95295 93896 20439
10112 20439 -110227 -240371 -318694 -329848 -281997 -182796 -64817 9408 -469 -71342 -135094
$$ packed form
10193a34423J963m9289p2077p6119n6987o229K2002j1878p0126j02618r3441o3053
10181g12275l4467j6570j0662n446P653K7648M5421O3352Q4752Q6106O1613J6040
10169c86835l9967q2375n9852P861L6578J9912Q04n232j1148j1169l225K3072
10157e11576O2305R7689J15747J00928O4416K8200J401j8940l6520l8147j3962
10146a48459L592j7284o7725p5184j8197L0416K7840l418n4076j07686j26572
10135e56753p7756R761Q4322J20484J17226J03560Q4060M6579J8507J199R554
10124c9257M3416N7270M1231j449m8090n1107j3161K8895M3917L3630j399p3457
10112B0439j30666j30144p8323j1154M7851R9201J17979P4225r877p0873o3752
$$ plain form
10101 -135094 -139964 -113316 -115101 -141873 -130342 -43974 81534 178737 241879 314039 387920 436466
10089 436466 455344 432724 380103 319639 265105 240645 268129 336186 400094 424020 416216 403144
10077 403144 395407 371276 299379 212214 183800 209668 244584 270914 259906 202538 123765 65038
10065 65038 71405 131313 202503 260177 280054 273392 274987 275717 260501 222648 152123 93928 109524
10052 109524 211091 351076 472992 545564 561086 543755 519792 481222 417106 337363 263127
10041 263127 217606 174115 98802 34293 865 -36137 -94669 -167737 -215879 -210978 -143660 -37090
10029 -37090 40631 63729 52742 51083 83696 139688 192659 223314 237332 245538 251792 254024
10017 254024 262030 298929 370394 443296 478277 461516 392693 281437 146234 19164 -80734
$$ packed form
10101a35094m870K6648j785k6772J1531Q6368J25508R7203O3142P2160P3881M8546
10089D36466J8878k2620n2621o0464n4534k4460K7484O8057O3908K3926p804j3072
10077D03144p737k4131p1897q7165k8414K5868L4916K6330j1008n7368p8773n8727
10065F5038O367N9908P1190N7674J9877o662J595P30j5216l7853p0525n8195J5596
10052A09524J01567J39985J21916P2572J5522j7331k3963l8570o4116p9743p4236
10041B63127m5521m3491p5313o4509l3428l7002n8532p3068m8142M901O7318J06570
10029c7090P7721K3098j0987j659L2613N5992N2971L0655J4018Q206O254K232
10017B54024Q006L6899P1465P2902L4981j6761o8823j11256j35203j27070r9898
$$ plain form
10006 -80734 -144477 -177376 -212339 -245430 -229723 -178497 -148685 -148241 -146995 -114109 -40434 67087
9994 67087 178233 261481 294711 270092 202254 109454 9062 -63555 -83283 -69869 -32817
9983 -32817 34870 112645 172827 220102 288041 381046 464141 499209 493611 476740 445779 408557
9971 408557 394434 404731 409711 404863 420477 431355 367610 226631 37537 -154809 -289497
9960 -289497 -366970 -422590 -437583 -391093 -287695 -170320 -79446 -6423 54900 99466 132861
9949 132861 169543 209539 234983 229456 184762 128801 108367 112417 109117 93059 59010 -1966
9937 -1966 -73920 -119747 -108824 -37208 61560 168121 273958 352050 384111 365726 313164 275942
9925 275942 298532 374228 494037 637998 753300 829370 907292 1014400 1155042 1308171
$$ packed form
10006h0734o3743l2899l4963l3091J5707N1226K9812M44J246L2886P3675J07521
9994F7087J11146Q3248L3230k4619o7838r2800j00392p2617j9728J3414L7052
9983c2817O7687P7775O0182M7275O7939R3005Q3095L5068n598j6871l0961l7222
9971D08557j4123J0297M980m848J5614J0878o3745j40979j89094j92346j34688
9960b89497p7473n5620j4993M6490J03398J17375R0874P3023O1323M4566L3395
9949A32861L6682L9996K5444n527m4694n5961k0434M050l300j6058l4049o0976
9937a966p1954m5827J0923P1616R8768J06561J05837P8092L2061j8385n2562l7222
9925B75942K2590P5696J19809J43961J15302P6070P7922J07108J40642J53129
$$ plain form
9915 1308171 1435238 1529519 1597287 1604497 1553219 1499556 1456513 1396537 1311007 1244659 1237087 1246876
9903 1246876 1241945 1216749 1167477 1100212 1014667 922082 824461 728690 639100 541192 437047
9892 437047 326544 203375 83143 1702 -25053 -11197 57155 188068 317536 395407 432022
9881 432022 431879 393275 340789 308063 301151 290587 248531 167141 60921 -34700 -88484 -114819
9869 -114819 -146924 -175431 -155878 -68205 40318 105254 124014 158184 239672 310454 309719 251540
9857 251540 197071 184246 176261 115773 17012 -60177 -89724 -76449 -28885 17445 46729 85873
9845 85873 135523 178666 198764 210669 243179 283038 304068 302792 279557 255336 271492 327452
9833 327452 385814 433990 491419 580121 654234 652662 596244 534280 479656 437821 447995 517247
$$ packed form
9915A308171J27067R4281O7768P210n1278n3663m3043n9976q5530o6348p572R789
9903A246876m931k5196m9272o7265q5545r2585r7621r5771q9590r7908j04145
9892D37047j10503j23169j20232q1441k6755J3856O8352J30913J29468P7871L6615
9881D32022j43l8604n2486l2726o912j0564m2056q1390j06220r5621n3784k6335
9869a14819l2105k8507J9553Q7673J08523O4936J8760L4170Q1488P0782p35n8179
9857B51540n4469j2825p985o0488r8761p7189k9547J3275M7564M6330K9284L9144
9845H5873M9650M3143K0098J1905L2510L9859K1030j276k3235k4221J6156N5960
9833C27452N8362M8176N7429Q8702P4113j572n6418o1964n4624m1835J0174O9252
$$ plain form
9821 517247 591476 627377 619671 589605 570344 560863 538758 512189 482000 441860 407086 413404
9809 413404 455952 480247 462989 424755 396925 392963 403783 402574 382213 380072 394258 356105
9797 356105 226129 78011 3655 15436 85771 167447 210739 171646 66808 -36006 -93934
9786 -93934 -96558 -63829 -23207 16033 55686 88939 105241 114485 115123 110294 114372 130968 146913
9773 146913 169838 219655 290957 364525 442359 518484 561473 572332 568844 543227 478370 373005
9761 373005 232491 86995 -5463 -39758 -53927 -64595 -59183 -55854 -88206 -131737 -130766 -77213
9749 -77213 -33655 -62910 -141480 -218655 -282594 -320104 -309847 -248006 -168942 -107654 -83253 -93356
9737 -93356 -108173 -116921 -115911 -78714 6518 116883 195505 196851 134978 62940 46181 109044
$$ packed form
9821E17247P4229L5901p706l0066j9261r481k2105k6569l0189m0140l4774O318
9809D13404M2548K4295j7258l8234k7830l962J0820j209k0361k141J4186l8153
9797C56105j29976j48118p4356J1781P0335Q1676M3292l9093j04838j02814n7928
9786i3934k624L2729M0622L9240L9653L3253J6302R244O38m829M078J6596J5945
9773A46913K2925M9817P1302P3568P7834P6125M2989J0859l488k5617o4857j05365
9761C73005j40514j45496r2458l4295j4169j0668N412L329l2352m3531R71N3553
9749g7213M3558k9255p8570p7175o3939l7510J0257O1841P9064O1288K4401j0103
9737i3356j4817q748J010L7197Q5232J10365P8622J346o1873p2038j6759O2863
$$ plain form
9725 109044 198549 249181 232542 169302 92791 24411 765 20857 50907 71786 71157 53859
9713 53859 28182 -6008 -51106 -108757 -157848 -182625 -206300 -264652 -348811 -394302 -370197 -300138
9701 -300138 -231904 -197412 -185847 -176133 -150250 -120499 -127926 -155225 -131279 -57916 5015 33386
9689 33386 40323 69978 133140 169181 142425 111212 117427 124114 102881 63193 41747 69180
9677 69180 126358 171542 205850 247366 308328 391268 450784 459588 458199 467166 478510 486138 481683
9664 481683 483699 532727 610912 669755 720923 792591 894197 1006727 1075478 1058073 966605
9653 966605 852498 757972 695268 665478 651947 628112 600005 574911 535650 488079 467146
9642 467146 490180 555168 662090 805458 947959 1060709 1154089 1258869 1382295 1480732
$$ packed form
9725A09044Q9505N0632j6639o3240p6511o8380k3646K0092L0050K0879o29j7298
9713E3859k5677l4190m5098n7651m9091k4777k3675n8352q4159m5491K4105P0059
9701c00138O8234L4492J1565R714K5883K9751p427k7299K3946P3363O2931K8371
9689C3386O937K9655O3162L6041k6756l1213O215O687k1233l9688k1446K7433
9677F9180N7178M5184L4308M1516O0962Q2940N9516Q804j389Q967J1344P628m455
9664D81683K016M9028P8185N8843N1168P1668J01606J12530O8751j7405r1468
9653I66605j14107r4526o2704k9790j3531k3835k8107k5094l9261m7571k0933
9642D67146K3034O4988J06922J43368J42501J12750R3380J04780J23426R8437
$$ plain form
9632 1480732 1502187 1444740 1372459 1340456 1367680 1451109 1584281 1760399 1954701 2130496 2272940
9621 2272940 2418127 2601866 2789203 2930096 3008914 3039375 3036070 3005796 2954065 2890382 2820232
9610 2820232 2751837 2660760 2533422 2403918 2257480 2060037 1824504 1598317 1432035 1332687
9600 1332687 1267899 1213492 1171692 1138292 1091471 1034795 1003114 1016690 1052634 1073464 1059053
9589 1059053 1013570 950901 885623 842677 797139 700613 575692 448208 308105 169616 96410
9578 96410 132170 221630 286054 317502 339573 369819 419554 453855 456444 459435 485970 512263
9566 512263 503848 460437 415317 395774 375269 329612 292814 297670 350035 435413 496967 479512
9554 479512 390745 287511 217246 199037 207516 221607 256146 337367 480407 667201 874076
$$ packed form
9632A480732K1455n7447p2281l2003K7224Q3429J33172J76118J94302J75795J42444
9621B272940J45187J83739J87337J40893P8818L0461l305l0274n1731o3683p0150
9610B820232o8395r1077j27338j29504j46438j97443k35533k26187j66282r9348
9600A332687o4788n4407m1800l3400m6821n6676l1681J3576L5944K0830j4411
9589A059053m5483o2669o5278m2946m5538r6526j24921j27484j40103j38489p3206
9578I6410L5760Q9460O4424L1448K2071L0246M9735L4301K589K991K6535K6293
9566E12263q415m3411m5120j9543k0505m5657l6798M856N2365Q5378O1554j7455
9554D79512q8767j03234p0265j8209Q479J4091L4539Q1221J43040J86794K06875
$$ plain form
9543 874076 1063136 1201962 1295577 1376843 1510009 1730885 2003692 2317355 2701789 3173263
9533 3173263 3732310 4399239 5220426 6243584 7533200 9127944 10981045 12919401 14573467
$$ packed form
9543H74076J89060J38826R3615Q1266J33166K20876K72807L13663L84434M71474
9533C173263N59047O66929Q21187J023158J289616J594744J853101J938356J654066
$$ [...]
##END NTUPLES=NMR SPECTRUM
##END=
