##TITLE=C13_LR-785-M1_2
 CDCl3, 22100 sc

 3.4.2024
##JCAMPDX= 6.0         $$ Bruker NMR JCAMP-DX V2.0
##DATA TYPE= NMR SPECTRUM
##DATA CLASS= NTUPLES
##ORIGIN= UXNMR, Bruker Analytische Messtechnik GmbH
##OWNER= root
$$ XWIN-NMR		Version 3.5
$$ Wed Apr  3 16:20:37 2024 Russian Standard Time (UT+4h)  she@DPX200
##.OBSERVE FREQUENCY= 50.327896
##.OBSERVE NUCLEUS= ^13C
##.ACQUISITION MODE= SIMULTANEOUS
##.ACQUISITION SCHEME= undefined
##.AVERAGES= 1601
##.DIGITISER RES= 17
##SPECTROMETER/DATA SYSTEM= spect
##.PULSE SEQUENCE= zgpg30
##.SOLVENT NAME= CDCl3
##.SHIFT REFERENCE= (INTERNAL, CDCl3, 0, 222.646)
##AUDIT TRAIL= $$ (NUMBER, WHEN, WHO, WHERE, WHAT)
$$ ##TITLE= Audit trail, XWIN-NMR		Version 3.5
$$ ##JCAMPDX= 5.01
$$ ##ORIGIN= Bruker BioSpin GmbH
$$ ##OWNER= she
$$ F:/spectra/data/she/nmr/c13/1/pdata/1/auditp.txt
$$ ##AUDIT TRAIL=  $$ (NUMBER, WHEN, WHO, WHERE, WHAT)
(   1,<2024-04-03 16:19:36.21 +0400>,<she>,<DPX200>,
      <created by zg, POWCHK disabled, PULCHK disabled
       terminated by command 'halt'
       configuration hash MD5:
       00 E9 B6 7A A2 85 ED C7 34 08 36 98 17 FE 4E 26
       data hash MD5: 32K
       83 40 ED 87 97 EE 91 59 9A BA 55 92 8D 89 78 38>)
(   2,<2024-04-03 16:19:38.71 +0400>,<she>,<DPX200>,
      <Start of raw data processing
       efp BC_mod = 2 LB = 2 FT_mod = 6 PKNL = 1 PHC0 = -395.1057 PHC1 = 19.1862 SI = 32K 
       data hash MD5: 32K
       63 32 3F 44 70 DF 7F B3 97 5E 7C E0 77 91 43 3D>)
(   3,<2024-04-03 16:19:41.37 +0400>,<she>,<DPX200>,
      <abs ABSG = 5 
       data hash MD5: 32K
       30 93 C7 26 7C 1A 12 43 24 AF 4B F6 BE EB 33 15>)
(   4,<2024-04-03 16:20:05.15 +0400>,<she>,<DPX200>,
      <pk PHC0 = -3.129113 PHC1 = 6.400002 
       data hash MD5: 32K
       98 4F 6F 3D E7 A4 A7 8A 54 C8 6A C6 87 A4 CA 13>)
(   5,<2024-04-03 16:20:08.79 +0400>,<she>,<DPX200>,
      <abs ABSG = 5 
       data hash MD5: 32K
       D4 65 C9 19 1F C2 B2 FE 62 5B CE BC 81 16 14 09>)
$$ ##END=
$$ 
$$ hash MD5
$$ 9A D8 4F 8E 0C AA EA 6D BB 19 01 B5 36 EA 4F 5B
##$RELAX= 
##$RELAX= 
##$RELAX= 
##$RELAX= 
##$RELAX= 
##$RELAX= 
##$RELAX= 
##$RELAX= 
$$ Bruker specific parameters
$$ --------------------------
##$DU= <F:/spectra>
##$EXPNO= 1
##$NAME= <c13>
##$PROCNO= 1
##$TYPE= <nmr>
##$USER= <she>
##$AMP= (0..31)
100 100 100 100 100 100 100 100 100 100 100 100 100 100 100 100 100 100 
100 100 100 100 100 100 100 100 100 100 100 100 100 100 
##$AQSEQ= 0
##$AQ_mod= 1
##$AUNM= <au_zg>
##$AUTOPOS= <>
##$BF1= 50.322709
##$BF2= 200.13
##$BF3= 50.322709
##$BF4= 500.13
##$BF5= 500.13
##$BF6= 500.13
##$BF7= 500.13
##$BF8= 500.13
##$BYTORDA= 1
##$CFDGTYP= 0
##$CFRGTYP= 5
##$CHEMSTR= <none>
##$CNST= (0..31)
1 1 145 1 1 1 1 1 1 1 1 1 1 1 1 1 1 1 1 1 1 1 1 1 1 1 1 1 1 1 1 1 
##$CPDPRG= <waltz16>
##$CPDPRG1= <>
##$CPDPRG2= <waltz16>
##$CPDPRG3= <>
##$CPDPRG4= <mlev>
##$CPDPRG5= <mlev>
##$CPDPRG6= <mlev>
##$CPDPRG7= <mlev>
##$CPDPRG8= <mlev>
##$CPDPRGB= <>
##$CPDPRGT= <>
##$D= (0..31)
$$ [...]
##$SUBNAM4= <"">
##$SUBNAM5= <"">
##$SUBNAM6= <"">
##$SUBNAM7= <"">
##$SUBNAM8= <"">
##$SUBNAM9= <"">
##$SW= 239.972175391363
##$SWIBOX= (0..15)
0 1 3 0 0 0 0 0 0 0 0 0 0 0 0 0 
##$SW_h= 12077.2946859903
##$TD= 32768
##$TD0= 1
##$TE= 0
##$TE2= 300
##$TE3= 300
##$TEG= 300
##$TL= (0..7)
120 120 120 120 120 120 120 120 
##$TP= (0..7)
150 150 150 150 150 150 150 150 
##$TP07= 0
##$TPNAME0= <>
##$TPNAME1= <>
##$TPNAME2= <>
##$TPNAME3= <>
##$TPNAME4= <>
##$TPNAME5= <>
##$TPNAME6= <>
##$TPNAME7= <>
##$TPOAL= (0..7)
0.5 0.5 0.5 0.5 0.5 0.5 0.5 0.5 
##$TPOFFS= (0..7)
0 0 0 0 0 0 0 0 
##$TUNHIN= 0
##$TUNHOUT= 0
##$TUNXOUT= 0
##$USERA1= <user>
##$USERA2= <user>
##$USERA3= <user>
##$USERA4= <user>
##$USERA5= <user>
##$V9= 5
##$VALIST= <valist>
##$VCLIST= <CCCCCCCCCCCCCCC>
##$VD= 0
##$VDLIST= <DDDDDDDDDDDDDDD>
##$VPLIST= <PPPPPPPPPPPPPPP>
##$VTLIST= <TTTTTTTTTTTTTTT>
##$WBST= 1024
##$WBSW= 4
##$XGAIN= (0..3)
0 0 0 0 
##$XL= 0
##$YL= 0
##$YMAX_a= 10549155
##$YMIN_a= -9374425
##$ZGOPTNS= <>
##$ZL1= 120
##$ZL2= 120
##$ZL3= 120
##$ZL4= 120
##$ABSF1= 222.646
##$ABSF2= -17.35081
##$ABSG= 5
##$ABSL= 3
##$ALPHA= 0
##$AQORDER= 0
##$ASSFAC= 0
##$ASSFACI= 0
##$ASSFACX= 0
##$ASSWID= 0
##$AUNMP= <proc_1d>
##$AZFE= 0.1
##$AZFW= 0.5
##$BCFW= 0
##$BC_mod= 2
##$BYTORDP= 0
##$COROFFS= 0
##$CY= -3
##$DATMOD= 1
##$DC= 0
##$DFILT= <>
##$DTYPP= 0
##$F1P= 0
##$F2P= 0
##$FCOR= 0.5
##$FTSIZE= 32768
##$FT_mod= 6
##$GAMMA= 0
##$GB= 0
##$INTBC= 1
##$INTSCL= 4.134877e-10
##$ISEN= 128
##$LB= 2
##$LEV0= 0
##$LPBIN= 0
##$MAXI= 10000
##$MC2= 0
##$MEAN= 0
##$ME_mod= 0
##$MI= 0.1934396
##$NCOEF= 0
##$NC_proc= -2
##$NLEV= 6
##$NOISF1= 120.0001
##$NOISF2= 80.00006
##$NSP= 0
##$NTH_PI= 0
##$NZP= 0
##$OFFSET= 222.646
##$PC= 1.4
##$PHC0= -398.2348
##$PHC1= 25.5862
##$PH_mod= 1
##$PKNL= yes
##$PPARMOD= 0
##$PSCAL= 0
##$PSIGN= 0
##$REVERSE= no
##$SF= 50.3227304925793
##$SI= 32768
##$SIGF1= 140
##$SIGF2= 120
##$SINO= 11.81781
##$SIOLD= 32768
##$SREGLST= <13C.CDCl3>
##$SSB= 0
##$STSI= 32768
##$STSR= 0
##$SW_p= 12077.2946859903
##$SYMM= 0
##$S_DEV= 0
##$TDeff= 32768
##$TDoff= 0
##$TI= <>
##$TILT= no
##$TM1= 0
##$TM2= 0
##$TOPLEV= 0
##$USERP1= <user>
##$USERP2= <user>
##$USERP3= <user>
##$USERP4= <user>
##$USERP5= <user>
##$WDW= 1
##$XDIM= 32768
##$YMAX_p= 305074741
##$YMIN_p= -8142069
$$ End of Bruker specific parameters
$$ ---------------------------------
##NTUPLES= NMR SPECTRUM
##VAR_NAME=  FREQUENCY,     SPECTRUM/REAL,   SPECTRUM/IMAG
##SYMBOL=    X,             R,               I
##VAR_TYPE=  INDEPENDENT,   DEPENDENT,       DEPENDENT
##VAR_FORM=  AFFN,          ASDF,            ASDF
##VAR_DIM=   32768,         32768,           32768
##UNITS=     HZ,            ARBITRARY UNITS, ARBITRARY UNITS
##FACTOR=    0.368581032318806, 1,           1
##FIRST=     11204.1544566776, 0,            0
##LAST=      -873.140229312654, 0,           0
##MIN=       -873.140229312654, -8142069,    0
##MAX=       11204.1544566776, 305074741,    0
$$ Real data points
##PAGE= N=1
##DATA TABLE= (X++(R..R)), XYDATA
$$ [...]
15361b335375K2766R1384K66241M49152N88964O59704P71040P58499K40255l33674
15351A178956m02510l34562l68825l21786j64520j1593J01186r7772n28630p81818
15341a731874o53803m17792m88943m10310p3830J61538L70522M67401K53932k66036
15331b789195p45581p65894k36726M44782O99396O07946K50665j3754J93825M94179
15321a860357L69888j71072m30035l99449l35829j76706j03714j92865k00277
15312c500416J29557O86516J048284R43267N04920K24415K55620K67250P6901
15303F36314o8072J55422N31538N82069O1485l42323p9945K00712J37750K05899
15293B020849M94003O48788N95558K45447l72092o03340k85585l3930j64856l75010
$$ y = [-2335375, -2312609, -2221225, -1954984, -1505832, -916868, -257164, 513876, 1272375, 1512630, 1178956, 776446, 441884, 73059, -248727, -413247, -424840, -323654, -421426, -950056, -1731874, -2385677, -2803469, -3292412, -3702722, -3776552, -3615014, -3244492, -2777091, -2523159, -2789195, -3534776, -4300670, -4537396, -4092614, -3393218, -2785272, -2534607, -2548361, -2354536, -1860357, -1490469, -1661541, -2091576, -2491025, -2826854, -3003560, -3107274, -3300139, -3500416, -3370859, -2684343, -1636059, -692792, -187872, 36543, 292163, 559413, 636314, 568242, 723664, 1255202, 1837271, 1898756, 1556433, 1476488, 1677200, 1814950, 2020849, 2514852, 3163640, 3759198, 4004645, 3632553, 3029213, 2743628, 2709698, 2544842, 2169832]
15283B169832l20110j29014J25791L56709M98171N12795O7753n43165q71889j063439
15273H03434j297245j403998j114637o84996l61083R8251M50258M86001L85460
15264b638555J10815m61745r31829j122555j212974r67276n41696k84968r1286
15255h142069L32419P83669R10476Q52369R95649J128228P60485J34974k85225
15246b529025k63858N4622R8390l88075q17854n82426N351M87092O67513O15606
15236b652664P00050Q44164P57270M39023K15030O8663j68861m26469o76189n13061
15226a413044J30914P04474P79418M64187N4838k32930j10144J11374K62621M71781
15216A223489N14062N33622O64652P21228N68554L04464l6947n82536j091631
$$ y = [2169832, 1849722, 1720708, 1846499, 2203208, 2701379, 3214174, 3281927, 2738762, 1866873, 803434, -493811, -1897809, -3012446, -3697442, -4058525, -3960274, -3510016, -3024015, -2638555, -2527740, -2989485, -3921314, -5043869, -6256843, -7224119, -7765815, -8050783, -8142069, -7809650, -7025981, -6115505, -5263136, -4267487, -3139259, -2378774, -2243800, -2529025, -2792883, -2738261, -2639871, -3027946, -3845800, -4428226, -4422875, -3935783, -3268270, -2652664, -1952614, -1108450, -351180, 87843, 302873, 371536, 202675, -223794, -899983, -1413044, -1282130, -577656, 201762, 665949, 720787, 487857, 377713, 489087, 751708, 1223489, 1737551, 2271173, 2935825, 3657053, 4225607, 4530071, 4493124, 3910588, 2818957]
15207B818957j245190j194396j328956j508287j240548m61038L94436Q46661Q13378
15198b104983O91494O09458M55024K45145q7602l22106j68456L87984R79918R98742
15188A684618N09680j0070j49466p3145l23588o22211o75746n78995m19003j66092
15178h24018Q8189J37854j08115l56637l22712j11652M7436N1367n9103m2233
15168a499624K01956L14875L50585M03538K40890k85569r05301j300007j148944
15159c627601l10417M47450M23089K6313n9355J06640L59573L87618N2772m7393
15149b241311J2711k43926k59636j1761m3678m6727J9137J16419L88515P10548
15139a599709P49520M28141R9797K51275O83827Q01380N24671K39320O7293p0049
$$ y = [2818957, 1573767, 379371, -949585, -2457872, -3698420, -4159458, -3765022, -2918361, -2104983, -1413489, -804031, -349007, -103862, -191464, -513570, -682026, -294042, 685876, 1684618, 2194298, 2184228, 2034762, 1961617, 1638029, 1015818, 340072, -238923, -657926, -824018, -735829, -597975, -706090, -1062727, -1385439, -1497091, -1449655, -1398288, -1457391, -1499624, -1297668, -982793, -632208, -228670, 12220, -273349, -1178650, -2478657, -3627601, -3938018, -3490568, -3067479, -3041166, -3100521, -2993881, -2634308, -2246690, -2193918, -2241311, -2228600, -2472526, -2732162, -2743923, -2787601, -2834328, -2815191, -2698772, -2310257, -1599709, -850189, -422048, -322251, -70976, 612851, 1414231, 1938902, 2178222, 2245515, 2175466]
15129B175466j08749j10216k60479m22624j30299L04529L11438K01026K89664
15120B249756L51745J26227l83917r26687j260177r01571O7375R07605J238960
15111A469316J090771P31752N11605L68154r1677q90890j503289j522761j102639
15102i39658n68651k5462L06024M49944M01265J80730p5444k06407j90514k20774
15092h88947l90629p04314p39663l24312P8724L88682P18888Q03880N07406O4103
15082d86182l00683o09863q89855r50193n30065J14777M85106N24147N38255P18543
15072a386013Q09249M92762Q6216n2012j27397l7377K68028M24486K57207o7131
15062F68018m20928n32536m21107n22589r25175r96831n27354R9464M56357N72308
$$ y = [2175466, 2066717, 1956501, 1696022, 1273398, 1143099, 1447628, 1759066, 1960092, 2249756, 2601501, 2727728, 2343811, 1417124, 156947, -744624, -677249, 230356, 1469316, 2560087, 3291839, 3803444, 4171598, 4079921, 3189031, 1685742, 162981, -939658, -1508309, -1533771, -1227747, -777803, -376538, -195808, -271252, -477659, -668173, -888947, -1279576, -1983890, -2723553, -3047865, -2969141, -2580459, -1861571, -1057691, -550285, -486182, -786865, -1396728, -2286583, -3236776, -3766841, -3652064, -3166958, -2642811, -2104556, -1386013, -576764, -84002, 2214, -49798, -177195, -214572, 53456, 477942, 735149, 668018, 247090, -285446, -706553, -1229142, -2154317, -3151148, -3678502, -3579038, -3122681, -2550373]
15052b550373O89361P49479P86103Q93929Q95524O51229L90883J23835j94815
15043B435155m41941o64379n60692k6955L38878K29225j03971k66294k16835l5296
15033F86895L01892O46847P74533N87436J23924k54565l61146k40383N3273J10236
15023B428942l23684q24394q10134l74380j20070j16358k01953k60439l25848
15014i28318l33019L5219M24491M45542K87712J61208L9035k14504m01350j33320
15004f17304K69945L69197J60095k72542n43250m18028j71358j41346o1625J78071
14994a248145M57272O95422N83411J92389n7645j93846l61469k41430J88813O40982
14984F55754P05666K74990j50541k39797r4882j39698l36577k62841J11846M70288
$$ y = [-2550373, -1861012, -1111533, -325430, 568499, 1464023, 2115252, 2506135, 2629970, 2435155, 1993214, 1328835, 768143, 741188, 1080066, 1309291, 1205320, 939026, 722191, 686895, 988787, 1635634, 2410167, 2997603, 3121527, 2866962, 2505816, 2265433, 2318706, 2428942, 2105258, 1280864, 470730, 96350, -23720, -140078, -342031, -602470, -928318, -1261337, -1226118, -801627, -356085, -68373, 92835, 131870, -82634, -483984, -617304, -347359, 21838, 181933, -90609, -633859, -1051887, -1223245, -1364591, -1426216, -1248145, -790873, -95451, 487960, 680349, 622704, 428858, 67389, -174041, 14772, 655754, 1361420, 1636410, 1485869, 1246072, 1151190, 1011492, 674915, 412074, 523920, 994208]
14974I94208O82629N52879N5761j59099J15923N42881R73340J160841Q30718J11777
14964E861858m39717o11369o46847n46982n92807r51911j108189r44190p27239
14955g07393n41607m22181l31264o0809L95468O02199L27664J21528J13355j79385
14945f82425m27832j22561L34246M48576J89959q8494n2791J28472K06128L75349
14935C08627Q06710J104848Q03860J69482l19711n52330l01284K4160n5849j36869
14925A851644l6235O1735J72444M56521P97724R62085Q74156N48073J24174m11325
14915E400996r31497j194949j169215p80668k32589R2527J59863m5699m98950
14906G99819j009779j165225q68508n70637m69959l14675N0304L63759N47693
$$ y = [994208, 1676837, 2229716, 2285477, 2126378, 2242301, 2785182, 3758522, 4919363, 5750081, 5861858, 5422141, 4810772, 4163925, 3616943, 3024136, 2072225, 964036, 19846, -707393, -1249000, -1671181, -2002445, -2063254, -1667786, -1065587, -737923, -616395, -503040, -682425, -1110257, -1232818, -898572, -449996, -260037, -348531, -401322, -272850, -66722, 308627, 1115337, 2220185, 3024045, 3193527, 2873816, 2321486, 2020202, 2044362, 1988513, 1851644, 1815409, 1877144, 2049588, 2506109, 3303833, 4265918, 5140074, 5688147, 5812321, 5400996, 4469499, 3274550, 2105335, 1324667, 1092078, 1184605, 1344468, 1298769, 799819, -209960, -1375185, -2243693, -2814330, -3284289, -3598964, -3548660, -3184901, -2637208]
14897b637208N84480L24433J65328L26941N84296O30274K30709k90372m39703
14888e20822m08090o42450o80051j85125N52140R89235P57976L99536L54308L61916
14878I78573L03741L92113N78561N34128L36462L61460M33813K10668j93505n43147
14868C392867q50658j066366r81313p65946m74246k03970o8014J25371J47898
14859g44377J00360K65318N25555N75430L75969J95444j8538j79629p9833j4791
14849A000908k92484m30006l1726K88662O8697l34012o13500n44505j58032J50153
14839h95845K13128J06808J19840L85230P14193Q43209N33318Q2489j18288k15184
14829A768898l50306l76958l66633m97036n93066l62100K00873O63667O77803
$$ y = [-2637208, -2052728, -1728295, -1562967, -1236026, -651730, -21456, 209253, -81119, -520822, -928912, -1571362, -2251413, -2436538, -1884398, -895163, -137187, 262349, 616657, 978573, 1282314, 1674427, 2252988, 2787116, 3123578, 3485038, 3918851, 4129519, 3936014, 3392867, 2542209, 1475843, 494530, -271416, -745662, -949632, -1017646, -892275, -744377, -644017, -378699, 146856, 722286, 1098255, 1293699, 1275161, 1095532, 1015699, 1000908, 708424, 278418, 246692, 535354, 604051, 270039, -343461, -887966, -1045998, -895845, -682717, -575909, -456069, -70839, 643354, 1486563, 2019881, 2102370, 1984082, 1768898, 1418592, 1041634, 675001, 177965, -415101, -777201, -576328, 87339, 765142]
14820G65142L04505k56525n47777l58880q9242O421J48424K69594K11720R3300
14810E46682K05177M94979M69415q031m59150o31828n73555l16348m4821J46952
14800a70528M8724m11178o48527m73461j16271J38662K9558k25039m22393m75743
14790b726196j46192L76652M53694J72925P2622K45915O01443O67002J87919j28942
14780b23158K12354N32197M13126J41771m7596L0305L41486O34829N98108Q3896
14770B717318n72108j006459j013420n24723j08781P7409M61551O87937L54838
14761A073562J4616j31470l21880m82116o44202p50595o91919o25370n19795j86620
14751c265789J96853L85731M31842O26783R63968J078087P10783J44457j60801
$$ y = [765142, 1069647, 813122, 265345, -93535, -182777, -176356, -27932, 241662, 453382, 546682, 751859, 1246838, 1716253, 1708222, 1249072, 617244, 43689, -272659, -317480, -170528, -121804, -532982, -1181509, -1654970, -1771241, -1632579, -1603021, -1828060, -2250453, -2726196, -2872388, -2495736, -2042042, -1869117, -1796495, -1550580, -949137, -282135, -94216, -223158, -10804, 521393, 934519, 1076290, 1028694, 1058999, 1400485, 2035314, 2633422, 2717318, 2145210, 1138751, 125331, -399392, -508173, -430764, 30787, 718724, 1073562, 1088178, 956708, 634828, 152712, -491490, -1242085, -1934004, -2559374, -3079169, -3265789, -3068936, -2683205, -2251363, -1624580, -660612, 417475, 1128258, 1272715, 1111914]
14742A111914j62433k20220n03304p02216m10569K90794P11482M25405j20028
14733D20825l90824k24196J64596L44483N8386k52919j20826K84798N58590M69992
14723A312905K50380n1589o41977j242272j345342j019900o27014j37045L93507
14714c108347M60549K28812K87512L22028P7864j17663r4013Q9851K49349K99990
14704a304068L60527M78452O52438O59145L67517N0576j03425p9829k5593R9447
14694A155187K93001K68899J9851j66073k12062l08459k49737j41224k48513l95080
14684A5790m41311m41149o48248r08155r42898o92642l38626j94530j53085J45622
14674d599232N41146O04896J22624k29520j72539n5370M8535J49537K65461K23822
$$ y = [1111914, 949481, 729261, 225957, -476259, -886828, -596034, 115448, 540853, 420825, 30001, -194195, -29599, 314884, 373270, 120351, -475, 284323, 842913, 1312905, 1563285, 1511696, 869719, -372553, -1717895, -2737795, -3364809, -3501854, -3108347, -2647798, -2418986, -2131474, -1809446, -1731582, -1849245, -1943258, -1853407, -1604058, -1304068, -943541, -465089, 187349, 846494, 1214011, 1264587, 1161162, 1081333, 1055740, 1155187, 1448188, 1717087, 1736938, 1570865, 1358803, 1050344, 800607, 659383, 410870, 15790, -425521, -866670, -1514918, -2423073, -3365971, -4058613, -4397239, -4591769, -4744854, -4599232, -4058086, -3453190, -3330566, -3560086, -3732625, -3787995, -3739460, -3589923, -3324462, -3100640]
14664c100640o4485l97697n66555k78938K42569K36849k77704o61499n19494Q9357
14654e298237L82126L48953O22985R27105N43148j72383n30408m79326l66368
14645d022405k83240p4160L15377O58303P04014M38977J49405L02911O46260N11828
14635f52730M6817k21688j53260K8864J50582K78858M25041O49461Q22398Q10578
14625B184921M42644j31334n36626p70179o91098l53174j97114k47401K4900N48669
14615B74208Q48829Q34227N13105r2893o90028j098133j154537r78373n45972
14606b089567N5468L27029K4069m55584n96545m40933k41971J9047M54359O35533
14596b309095M64594J53531j60170k82384j21805J09185O6789j86649l60505l89027
$$ y = [-3100640, -3165125, -3562822, -4129377, -4408315, -4165746, -3928897, -4206601, -4868100, -5387594, -5298237, -4916111, -4567158, -3944173, -3017068, -2473920, -2646303, -3176711, -3656037, -4022405, -4305645, -4379805, -4064428, -3406125, -2702111, -2263134, -2113729, -1810818, -1164558, -652730, -605913, -827601, -980861, -951997, -801415, -522557, -97516, 551945, 1374343, 2184921, 2627565, 2496231, 1959605, 1189426, 498328, 145154, -51960, -299361, -274461, 274208, 1123037, 1957264, 2470369, 2377476, 1687448, 589315, -565222, -1543595, -2089567, -2034099, -1707070, -1683001, -2138585, -2735130, -3176063, -3418034, -3398987, -2944628, -2309095, -1844501, -1690970, -1851140, -2133524, -2255329, -2146144, -2079355, -2266004, -2626509, -3015536]
14586c015536k59773r1385q3133j12325p1255O7374J68189J46385J36471K39887
14576b875101O03581J101654J180085N63134k24572o36669m87507j48241k03721
14567a127357n05702n56440k82435J13611M20060M73737K21457j04907n0813K90178
14557a108611L96363K58185k4796l38763l43035j46625K2696K40718L90909M08927
14547b44032K79961l6250k8062L69912M36120J78143N825j13052k82370l09082
14537B57113J6050L34709N48679P97666Q03591N13077L07210L37123N32198O36980
14527E084396L10492j93919n32326p80467j057072j141513j021023o12012N2112
14518A08668L93954M53003M73878K83595o4726k31747k56658l04531l44403j30649
$$ y = [-3015536, -3275309, -3366694, -3449827, -3562152, -3633407, -3566033, -3397844, -3251459, -3114988, -2875101, -2271520, -1169866, 10219, 573353, 348781, -287888, -775395, -923636, -1127357, -1633059, -2189499, -2471934, -2358323, -1938263, -1464526, -1243069, -1347976, -1398789, -1108611, -712248, -454063, -478859, -817622, -1160657, -1307282, -1284586, -1043868, -652959, -244032, 35929, -321, -28383, 341529, 777649, 955792, 961617, 848565, 566195, 257113, 273163, 607872, 1156551, 1954217, 2757808, 3270885, 3578095, 3915218, 4447416, 5084396, 5394888, 5200969, 4668643, 3888176, 2831104, 1689591, 668568, 56556, 108668, 502622, 955625, 1429503, 1713098, 1648372, 1416625, 1159967, 855436, 511033, 380384]
14508C80384K65948M69892L99729Q5960m48025r36173j050797r04764o83855m66529
14498b888230l85077k81216K48686Q24730R19493M96619j19951l83385m49990
14489b018321n55399k72581L19273N87103M78838J59864j18599p4135p3656k22706
14479a790319k97221j64485J55106J40270l31828o36199n61312m76383m37109
14470d399480l8774Q02586J689212K077898J724767J072167N89753K10731O442
14461C735302N201L8635K8886j09730j23213P6710r894k00213o9653J00564n5506
14450C417089n10838r30116r95915o07391J42831N48280K53937k0581J75923N01774
14440A974993N54157J22689l86898m92047m02149n40265p01954n88236n32264
$$ y = [380384, 646332, 1116224, 1515953, 1601913, 1153888, 217715, -833082, -1737846, -2421701, -2888230, -3273307, -3554523, -3305837, -2481107, -1561614, -1064995, -1184946, -1568331, -2018321, -2573720, -2846301, -2527028, -1939925, -1461087, -1301223, -1419822, -1493957, -1567613, -1790319, -2087540, -2252025, -2096919, -1956649, -2288477, -2924676, -3485988, -3962371, -4399480, -4438254, -3635668, -1946456, 131442, 1856209, 2928376, 3518129, 3728860, 3735302, 3740503, 3779138, 3808024, 3698294, 3575081, 3651791, 3641897, 3441684, 3372031, 3472595, 3417089, 2906251, 1976135, 980220, 372829, 515660, 1063940, 1317877, 1297296, 1473219, 1974993, 2529150, 2651839, 2264941, 1772894, 1370745, 830480, 128526, -459710, -991974]
14431i91974q42861j054351q00051k17632K82832K42039j01168j23976J77948
14422c429194L85669K82008J50140K39214K07108P4433K03935K74447J60925L1263
14412a420052n8304N0947K10881K55095K35989J02557p2943q3109Q1001K51559
14402d46379J86033j09327k61709j59745J40524L12108J58420r166o8326K676
14392b54891J89190Q4490j86634K4400M48663M90066K06472l11566p79320p27093
14382h16223m14214m37178o42845m65381P7487N60221Q96568J120767J121951
14373A001153Q69949M69450R3883j96038n39851p91567n87459m5408M38084N86080
14363A298276L27125j8763J9926K62005K14936o4091k49063j91100p2322p8127
$$ y = [-991974, -1834835, -2889186, -3689237, -3906869, -3624037, -3381998, -3483166, -3607142, -3429194, -3043525, -2761517, -2611377, -2372163, -2165055, -2090622, -1886687, -1612240, -1451315, -1420052, -1478356, -1427409, -1216528, -961433, -725444, -622887, -695830, -778939, -697938, -446379, -260346, -369673, -631382, -791127, -650603, -338495, -180075, -189241, -257567, -254891, -65701, 18789, -167845, -143445, 305218, 795284, 1001756, 690190, -89130, -816223, -1230437, -1667615, -2310460, -2775841, -2698354, -2138133, -1241565, -120798, 1001153, 1871102, 2340552, 2434435, 2238397, 1698546, 906979, 319520, 274112, 712196, 1298276, 1625401, 1606638, 1626564, 1888569, 2103505, 2039414, 1790351, 1599251, 1526929, 1448802]
14353A448802j9322J51751M81751N46612J37577k83650m83219p22717j029783
14344B27802j040754o75275l53718l01237k98827j55049J33189M57000M81641
14335a525228M02280L15187L4475o0371K76687O56393R27180J045751P21805J96820
14325B990979k03440n00382m97732j76209q9855k62390m08329m98884n02244k52833
14315d01319R0852K40489L17063L77980J14701k24302o7611K47123L21716K66296
14305A282988O9899k37141l78191l72009l50994l03443j15936J37410J60891j39957
14295b46483k89064k62687k50414j8152L08948L41304M4738l33315m55666j63201
14285a323992M33197J003185J023727M00848p7038Q406J87578J24215j54775m06754
$$ y = [1448802, 1429480, 1581231, 2062982, 2609594, 2747171, 2463521, 1980302, 1257585, 227802, -812952, -1488227, -1841945, -2143182, -2442009, -2597058, -2463869, -2006869, -1525228, -1122948, -807761, -773286, -833657, -556970, 99423, 1026603, 2072354, 2794159, 2990979, 2787539, 2287157, 1789425, 1613216, 1523361, 1260971, 852642, 353758, -148486, -401319, -310467, -69978, 247085, 625065, 739766, 515464, 447853, 694976, 1016692, 1282988, 1352887, 1115746, 737555, 365546, 14552, -288891, -404827, -267417, -106526, -246483, -535547, -798234, -1048648, -1066800, -757852, -416548, -371810, -705125, -1160791, -1323992, -890795, 112390, 1136117, 1536965, 1459927, 1468333, 1655911, 1780126, 1625351, 1218597]
14275A218597n54195o00736n20217m64568m47096l24334j71526O9523K9494m8396
14265a813454K97501P66317R55009P66817M78162J31004k11006m21654n18758
14256D29938m28701j86514p4477N34J09655P9293m1811j16440k26111l65223k97215
14245a117072J88492Q24581J143480Q92348M06181P7369m04852q48826o40227
14236E21474j02134L16700N39951N39682L39151n5039m62977n00214n7781M18310
14226A497123L95108O1583n2145R036K11644N00548O42417N17652J14575l53899
14216C543642o25113n14538k67853j62187j69194l25141m34688k19547J01890
14207I27271J63624o4161k79715n32712q25681p17669j88744J36525J09976J45973
$$ y = [1218597, 664402, 63666, -456551, -921119, -1368215, -1692549, -1864075, -1794552, -1765058, -1813454, -1515953, -749636, 205373, 972190, 1450352, 1581356, 1370350, 948696, 429938, 1237, -185277, -259754, -259220, -149565, -70272, -112083, -228523, -454634, -819857, -1117072, -928580, -103999, 1039481, 1931829, 2338010, 2415379, 2010527, 1161701, 521474, 419340, 736040, 1275991, 1815673, 2154824, 2099785, 1636808, 1136594, 1078813, 1497123, 1892231, 1953814, 1901669, 1910705, 2122349, 2622897, 3265314, 3782966, 3897541, 3543642, 2918529, 2403991, 2136138, 1973951, 1804757, 1479616, 1044928, 825381, 927271, 1090895, 1026734, 747019, 214307, -611374, -1329043, -1517787, -1381262, -1271286, -1125313]
14197a125313J94706L1493l16926o36493n83165l7957O34481P85692K71246l55844
14187a138080o33179m52746j91571p123R3144k20234p69933r39701n29586p0659
14177d859668J63533K96940M73109Q11157R33354P99853O62351M49059K61160
14168i152j5518l81221n73282k86704K84998M58271m0345o15022n24610n3232
14158a755817K07935M1470k80599k96497l516J97177M78908R43499J243612J117207
14148A893379N88422K21102K69833K22873r0766n40311q38106q03624o26913m84210
14138a88321k68233j6329l3127l16972o87775p61386k33122M53531Q76738R03852
14128b71144O44800L38630J31141M8988k1932j19688n8590J87771K34586O6869
$$ y = [-1125313, -930607, -899114, -1216040, -1852533, -2435698, -2473655, -1839174, -1053482, -782236, -1138080, -1771259, -2224005, -2415576, -2422699, -2329555, -2549789, -3319722, -4259423, -4789009, -4859668, -4696135, -4399195, -3926086, -3114929, -2181575, -1381722, -719371, -270312, -9152, -24670, -405891, -979173, -1265877, -980879, -522608, -562953, -1177975, -1702585, -1755817, -1547882, -1506412, -1787011, -2083508, -2087024, -1889847, -1410939, -467440, 776172, 1893379, 2481801, 2702903, 2972736, 3195609, 3104843, 2564532, 1726426, 922802, 295889, -188321, -456554, -472883, -506010, -822982, -1510757, -2272143, -2505265, -2051734, -1174996, -271144, 373656, 712286, 843427, 892415, 870483, 750795, 692205, 879976, 1114562, 1181431]
14118A181431k18237n54506o58051l31583J67140L17759K27775J70681J10182
14109D12591M9969k05214o44408p70689m42558l0193J71846J59870N3583j04840
14099a350043j88331l30552l86061p3486J47551M8329J2550M6109M8071m1369
14089b067232j37733J09745N67691Q16855M72437k22152o23717o28271m31176
14080b143553k59627l07569j67962L80789P45505N22721m9044o68054j159899
14071c106693j338303j196568p53273o6917N38917R70128J085647P18215K35737
14062b913110J19959M13890Q72027R75537M92757j10593m11845m63206m64338
14053a488922m85587m84489n28240l71687k0357J01527Q6568J41883J38411o5931
$$ y = [1181431, 963194, 408688, -249363, -580946, -413806, -96047, 131728, 302409, 412591, 462560, 257346, -387062, -1157751, -1600309, -1630502, -1458656, -1298786, -1245203, -1350043, -1538374, -1868926, -2254987, -2328473, -2180922, -2132593, -2120043, -2073934, -2025863, -2067232, -2204965, -2095220, -1527529, -710674, -238237, -460389, -1084106, -1712377, -2143553, -2403180, -2710749, -2878711, -2497922, -1752417, -1229696, -1278740, -1946794, -3106693, -4444996, -5641564, -6394837, -6461754, -5922837, -4952709, -3867062, -3148847, -2913110, -2793151, -2379261, -1507234, -531697, -38940, -149533, -561378, -1024584, -1488922, -1974509, -2458998, -2987238, -3358925, -3379282, -3277755, -3191187, -3049304, -2910893, -2976824]
14043b976824m43884p48707p33665m99733j91385M9400L08738O47767R37779R34883
14033b715631O16751L95238M42100O04660P25357O32579L97421K04621n4707m23439
14023H24950q48350j198861j302499r08456k06355M53300O90895J79430n73284
14014b889230p11606k04992L09304M11421J84490q3308j35235J04234M93212P21868
14004a799842M11089r8913j54255M87556J120273R27930l9936j183662j862230
13995b191990j807545j304662n95202J34300P56880J003657J130399J158933P71027
13986i44203L23995m6944l69357l19187p9324N9787j6901j37947o1213j13528
13976a704822l35626l17156M6991M29549L95910K49143N11703Q74604Q33745N25574
$$ y = [-2976824, -3420708, -4169415, -4903080, -5402813, -5594198, -5544798, -5236060, -4588293, -3650514, -2715631, -2098880, -1703642, -1261542, -656882, 68475, 701054, 1098475, 1303096, 1248389, 824950, -23400, -1222261, -2524760, -3433216, -3639571, -3186271, -2495376, -2315946, -2889230, -3600836, -3805828, -3496524, -3085103, -2900613, -2983921, -3119156, -3014922, -2521710, -1799842, -1388753, -1487666, -1641921, -1154365, -34092, 893838, 853902, -329760, -2191990, -3999535, -5304197, -5899399, -5765099, -5008219, -4004562, -2874163, -1715230, -944203, -620208, -667152, -1036509, -1355696, -1435020, -1375233, -1392134, -1530081, -1591294, -1704822, -2040448, -2357604, -2310613, -1881064, -1485154, -1236011, -724308, 150296, 984041, 1509615]
13966A509615K50722J13513M31087O96991L06032m38958r16793r59881q19909
13957A72419o73262o08279p53123r61749p17569o2991R7486m2799L77901R92103
13947b179863J254852J087593O46183K92150m8784l72741l14385o4874J29246
13938D29377J76447p6913o75842j227835j252355q56490m43756m3904K57632K85001
13928c428638K83853M03400M76891L52768K91076O78291R83145P07858K77619
13919A026263L2355k98462p27102r40832j025873r49084o15155j85001J33784
13910c549107M80038Q47063Q72718N66624J98198k13469n99159p85502p73056
13901b955652n31979j83251r1107n7277R5021n583m27689n83504l69498k21765
$$ y = [1509615, 1760337, 1873850, 2304937, 3001928, 3307960, 2869002, 1952209, 992328, 172419, -500843, -1109122, -1862245, -2823994, -3541563, -3604554, -3507068, -3549867, -3171966, -2179863, -925011, 162582, 808765, 1100915, 1052131, 679390, 365005, 300131, 429377, 605824, 528911, -146931, -1374766, -2627121, -3483611, -3927367, -3971271, -3713639, -3428638, -3144785, -2741385, -2264494, -1911726, -1620650, -942359, 40786, 748644, 1026263, 1058618, 760156, 33054, -907778, -1933651, -2882735, -3497890, -3682891, -3549107, -3069069, -2222006, -1349288, -782664, -584466, -797935, -1397094, -2182596, -2955652, -3487631, -3670882, -3761989, -3819266, -3724245, -3729828, -4157517, -4741021, -5110519, -5332284]
13891e332284L2178L94221N51323M53048K84377L65503M57346L98780N82475P50216
13881a062817M59098J0170R513L05796M92982O49727O93009N80931M95900J50625
13871B784934l43483l23366J60364O27346O99764M87664L28039K97660J05525
13862D824447l42869o69607q29830r15523p34480l81869q4803J84259K98464M6742
13852A394931k48820k72856j34172l6214M969J53725L54573M75240M07260J40825
13842B239461p3646j58542m39285q38525q40486m56710j53989k4743q518j04972
13832h59955k46922l14790j72481O5750J45662K31114L48336J83065j49841m18417
13822a188479m50983k57061k24441n32310q36367q47531m72177K05971O58122
$$ y = [-5332284, -5300106, -4905885, -4354562, -3901514, -3617137, -3251634, -2794288, -2395508, -1813033, -1062817, -603719, -593549, -584036, -278240, 214742, 864469, 1557478, 2138409, 2634309, 2784934, 2441451, 2118085, 2278449, 2905795, 3605559, 4093223, 4421262, 4718922, 4824447, 4481578, 3811971, 2982141, 2066618, 1332138, 950269, 865466, 1049725, 1348189, 1394931, 1146111, 873255, 739083, 702869, 707838, 861563, 1216136, 1691376, 2098636, 2239461, 2165815, 2007273, 1567988, 729463, -111023, -567733, -721722, -746465, -754983, -859955, -1106877, -1421667, -1594148, -1528398, -1382736, -1151622, -803286, -620221, -770062, -1188479, -1639462, -1896523, -2120964, -2653274, -3489641, -4337172, -4809349, -4603378, -3945256]
13813c945256O79018N29433N26190N39124L44295K59745L72948O01593O88424
13804E95514N37211N21315N13775K00259k92061o17350n17796k15264j5580J27707
13794H37730K39360Q1616r8660j48667j08643o8363l12626o24821n81555k94088
13784a078717k14613k56947j15060k9617k17448m18094l01749M0260K84140L98977
13774a908868L21673K00038L03748L11934n216k96918l18706k06604o9567J31028
13764a537458L78904N10035M43511K38496J45721M52182Q91837R82028N87156
13755C092412n7530m81828p33186p46647m02410p0238K69832N71056M42182J08400
13745A992043j50414k52569j54612J40265L51525R5467m24889o63828m92208q1313
$$ y = [-3945256, -3266238, -2736805, -2210615, -1671491, -1327196, -1067451, -694503, -92910, 595514, 1132725, 1654040, 2167815, 2368074, 2076013, 1458663, 940867, 725603, 710023, 837730, 1077090, 1158706, 1060046, 911379, 802736, 734373, 421747, -203074, -784629, -1078717, -1293330, -1550277, -1665337, -1694954, -1912402, -2330496, -2632245, -2591985, -2307845, -1908868, -1587195, -1387157, -1083409, -771475, -776691, -1073609, -1392315, -1598919, -1668486, -1537458, -1158554, -648519, -205008, 33488, 179209, 631391, 1523228, 2505256, 3092412, 3034882, 2553054, 1819868, 1073221, 670811, 600573, 870405, 1441461, 1883643, 1992043, 1841629, 1589060, 1434448, 1574713, 1926238, 2021705, 1596816, 932988, 440780, 359467]
13735C59467L12823L50424K05614J17360J3560k33727o63968q54933o03336k01898
13725a198614J21132L02472M10668L84146J76205k27194n62462l83891J29124
13716h48414O87373Q68404M05974j69712l12799l89420p51784r70836o78285o5409
13706b224908M11827L39919k77988p99325p60293m20324K530M38221N94796L24971
13696b370574r6528k63398K1341N18724N91469K04845k49297n26593m70883j58220
13686b799114J25457Q5119j12254k61107m29282m87576l76280j00402K15639L36019
13676c803781M61986P10445P94948N74681J38112m2841L08808O83999M15940k97946
13666e5649q88009j048415o95969J0876P26698R73898O82826O03955Q13104O98119
$$ y = [359467, 672290, 1022714, 1228328, 1345688, 1359248, 1125521, 461553, -393380, -996716, -1198614, -1077482, -775010, -364342, 19804, 196009, -31185, -593647, -977538, -848414, -161041, 707363, 1113337, 943625, 630826, 241406, -510378, -1481214, -2159499, -2224908, -1813081, -1473162, -1751150, -2550475, -3310768, -3731092, -3728562, -3290341, -2695545, -2370574, -2467102, -2730500, -2709159, -2190435, -1598966, -1394121, -1643418, -2170011, -2640894, -2799114, -2673657, -2588538, -2700792, -2961899, -3391181, -3878757, -4255037, -4355439, -4139800, -3803781, -3341795, -2631350, -1836402, -1261721, -1123609, -1166450, -857642, -173643, 242297, -55649, -943658, -1992073, -2688042, -2677166, -1950468, -976570, -293744, 310211, 1123315, 1821434]
13656A821434K14179k07242l55929p3905M84995P35762L24632l04468o46418n87356
13646A405684l49653j51719j45031l7906K36322K04483q1978k90835m09188o00213
13636b20034o30948j28195N54520Q60580P46396N45874M60921J31204r0208K5524
13626B255634J78138K97139M34421M20663J33210k69514o03207q42625q13769
13617A190090n80787l48518j65367m7973K4132j9195k37135o95222j065757q93075
13607b838807j99963M76359N79013N4486k49588J5684L41288L42336P2829n1430
13597a457793J15826K61028K94448J69186n7630Q4103L71969L28301l0482m90529
13587d11573p65928o35906l65671k05772L9829K70001J50207p1923k0282J69465
$$ y = [1821434, 2035613, 1828371, 1472442, 1398537, 1883532, 2619294, 2943926, 2639458, 1993040, 1405684, 1056031, 904312, 759281, 721375, 957697, 1162180, 1080202, 789367, 380179, -220034, -850982, -979177, -424657, 435923, 1182319, 1728193, 2189114, 2320318, 2230110, 2255634, 2433772, 2730911, 3165332, 3585995, 3719205, 3449691, 2846484, 2003859, 1190090, 609303, 260785, 95418, 47445, 71577, 52382, -184753, -879975, -1945732, -2838807, -3038770, -2562411, -1983398, -1928912, -2178500, -2162816, -1821528, -1479192, -1406363, -1457793, -1341967, -1080939, -786491, -617305, -674935, -590832, -218863, 109438, 78956, -411573, -1177501, -1813407, -2179078, -2384850, -2345021, -2075020, -1924813, -1996736, -2017018, -1847553]
13577a847553J91558R476j26425K7720M06553O38312N76294M29663J17886k83443
13567A40041l48388O034M00679N19174L29733j52237p16796o79716k28521k209
13557g32206j01312k86447m19817m70501j93184J44130L15070K28592L0439L0492
13547a454744J05737J3599j97181j75239K25740O42999Q67585Q08550N15101L56350
13537A708497K79637j39183o97695q40677m46556j05641o7839J39759O15914R53109
13527A399325Q04868P9795p32009r31861n26373L3868N25445O68674L20472N0457
13517A692661K61852O87569R28750O85786O6661n70713q65256p29529k47090L37717
13507B248408Q30176J163731J094676P29391K31772r4174K1909K69117L82038
$$ y = [-1847553, -1655995, -1646519, -1772944, -1745224, -1338671, -700359, -124065, 305598, 423484, 140041, -208347, -202313, 198366, 717540, 1047273, 895036, 178240, -501476, -729997, -732206, -833518, -1119965, -1539782, -2010283, -2203467, -2059337, -1744267, -1515675, -1485236, -1454744, -1349007, -1335408, -1532589, -1707828, -1482088, -839089, 28496, 837046, 1352147, 1708497, 1988134, 1848951, 1151256, 310579, -135977, -241618, -309457, -169698, 446216, 1399325, 2204193, 2283988, 1551979, 620118, 93745, 127613, 653058, 1321732, 1642204, 1692661, 1954513, 2642082, 3570832, 4256618, 4323279, 3752566, 2887310, 2157781, 1910691, 2248408, 3078584, 4242315, 5336991, 6066382, 6298154, 6203980, 6225889, 6495006, 6877044]
13498F877044L56936J96000k2102o2285K05504P37805J125113J102998O25280
13489A1142293j07763p68893j046926q33199m13417k8555J88123M27123P37612
13480I296398P04592J0097p39909q79020n62857j83236j6901J8271J00175N7918
13470G805528j40161k32139j19717m298o4330j71387j53965l41132r65832j380641
13460D231926j201277q26239o71367q32041j015428r82812n00974L13441Q47996
13451f36775R62784J014170R61616P18968M22519p5682p15801r00641m76383L8890
13441A313665M04127Q08286J112384R18536K22144m18928q02931j015768j045515
13432A496000q32759n27803k48293l1992j3604l8281O0777r641l87439o08667
$$ y = [6877044, 7233980, 7429980, 7407878, 7345593, 7551097, 8288902, 9414015, 10517013, 11142293, 11034530, 10265637, 9218711, 8385512, 7972095, 7943540, 8131663, 8558786, 9296398, 10000990, 10011087, 9271178, 8392158, 7829301, 7646065, 7629164, 7647435, 7747610, 7805528, 7665367, 7433228, 7313511, 7309213, 7244883, 7073496, 6919531, 6578399, 5612567, 4231926, 3030649, 2204410, 1533043, 701002, -314426, -1297238, -1798212, -1484771, -636775, 326009, 1340179, 2301795, 3020763, 3443282, 3367600, 2651799, 1751158, 1274775, 1313665, 1717792, 2526078, 3638462, 4556998, 4779142, 4360214, 3557283, 2541515, 1496000, 663241, 135438, -112855, -144847, -158451, -196732, -135955, -145596, -533035, -1141702]
13422a141702m37105r3729J4971l28749n74089k77601l5693l27998n74594k58539
13412d034828L01481O44585Q86257J067435J052824O96510L17329J39399J03652
13403A174644L99781P66047P63968K51014l94389p45286o30206l59761j44887
13394A080925K90865O38493M56260p981l44453n45850q03674p60908k17069L97125
13384A83733N32572K2642n43981o20556k18079M08969Q08345P93162M21964k9776
13374A758995k10536j10385n7187j70107k08718j72983k10075l24160j80744K85118
13364C99218P44055Q07247N11229R9983m17519o91921m13794O0097L69678L99614
13354A867887L11913K38693K25442L24242K79868k1742k63417k39609j95430j80282
$$ y = [-1141702, -1578807, -1672536, -1657565, -1986314, -2560403, -2838004, -2873697, -3201695, -3776289, -4034828, -3733347, -3088762, -2202505, -1135070, -82246, 614264, 931593, 1070992, 1174644, 1574425, 2340472, 3104440, 3355454, 2961065, 2215779, 1585573, 1225812, 1080925, 1371790, 2010283, 2466543, 2458562, 2114109, 1568259, 764585, 3677, -213392, 183733, 716305, 738947, 194966, -425590, -643669, -234700, 573645, 1366807, 1788771, 1758995, 1548459, 1438074, 1380887, 1210780, 1002062, 829079, 619004, 294844, 114100, 399218, 1143273, 1950520, 2461749, 2561732, 2144213, 1452292, 1038498, 1098595, 1468273, 1867887, 2179800, 2418493, 2643935, 2968177, 3248045, 3226303, 2962886, 2723277, 2527847, 2347565]
13344B347565m8057J50405R5142k82557n16548m75292k76824K59263Q38613J027607
13334C119317R28358N06266k60426q43759j032314j223662j560895j715624j226883
13325c309622k87458M29525P30068Q30707R29213Q25013M78722N7156k73469k10080
13315A99775K6066O7826j16742l09869l72232k78062J52659N73150O24837M90663
13305A058071L69003O3974k79232k54473o2730J13327L37840M52583L61903K34902
13295B395168K63543L85932K48123k31526o56580p62109n68433k17331K42005
13286A098792O15700Q60390Q73464K86541n89888j043106r46422n63941l30191
13277B61339j81057p910p2414m62863p87956o67590n34973o40558n07962n3668
$$ y = [2347565, 2299508, 2449913, 2545055, 2262498, 1745950, 1270658, 993834, 1253097, 2091710, 3119317, 4047675, 4553941, 4293515, 3449756, 2417442, 1193780, -367115, -2082739, -3309622, -3597080, -3167555, -2437487, -1606780, -677567, 147446, 626168, 683324, 409855, 199775, 225841, 293667, 176925, -132944, -505176, -783238, -630579, -57429, 567408, 1058071, 1427074, 1491048, 1211816, 957343, 894613, 1007940, 1345780, 1798363, 2160266, 2395168, 2658711, 3044643, 3292766, 3061240, 2404660, 1642551, 1074118, 856787, 1098792, 1714492, 2574882, 3448346, 3734887, 3144999, 2101893, 1155471, 591530, 261339, 80282, 72372, -42, -462905, -1250861, -1918451, -2453424, -3093982, -3601944, -3655612]
13267c655612N95318J133788J067213N39230K81455K14175J77919K73622Q3658
13258G10766k25998m03634m47255m60088n17397m69008l90447m36849m73330m01923
13248c515163k33259j3781K89997O36788P67918N34034K31027J43851K19388K59955
13238f79245m148m70071n60580j38547M30841P96378P78263L91372k30385o75913
13228c62035p96653r43657j143379j008339n41671r6422J39287L77855Q11133
13219c563881J136129J114198R64044Q99912P74340M90547K40330J45961L8102
13210B239682J7052O6650j00506k21700r7102j11723l84100m65159k50934k66099
13200D26061l96245k76978j29391j26910r0719j2771q3753j98464J7921M79053
$$ y = [-3655612, -3060294, -1926506, -859293, -320063, -38608, 175567, 353486, 627108, 710766, 484768, 81134, -366121, -826209, -1343606, -1812614, -2203061, -2639910, -3113240, -3515163, -3748422, -3762203, -3472206, -2835418, -2067500, -1533466, -1302439, -1158588, -939200, -679245, -683393, -1153464, -1714044, -1852591, -1421750, -625372, 152891, 544263, 313878, -362035, -1158688, -2102345, -3245724, -4254063, -4795734, -4892156, -4752869, -4375014, -3563881, -2427752, -1313554, -349510, 550402, 1324742, 1815289, 2055619, 2201580, 2239682, 2256734, 2323384, 2222878, 2001178, 1904076, 1792353, 1408253, 943094, 692160, 426061, 29816, -247162, -376553, -503463, -594182, -606953, -690706, -889170, -871249, -392196]
13190c92196P17664M87261j26215o10158o21177m38067j95363J70118N15079O44232
13180A51178M20876K29976J71842q1178l01884l90450m71420n98660o51524m33461
13170a954705J6150L53795L34557J47664l784j58741k36604j08561J77777N08060
13160i24392N41351N6218n04847p55165p23615l88381K4181K00718J11695l9684
13150b401921j00605j35111r081L23798N29171L11763p1494r3188J28198N4280
13140a464190k34869k82105P8466N01603Q48666R97600N49836l44010r30022q53577
13130a132602m80727r5947L22491O79523P84633K55986n76272o12624K19515Q66341
13120B30317P39548M63907M19189K61134n1911k86155k81661k49982l81029l52864
$$ y = [-392196, 325468, 812729, 686514, 76356, -544821, -982888, -1178251, -1008133, -493054, 151178, 572054, 802030, 973872, 892694, 590810, 200360, -271060, -869720, -1521244, -1954705, -1938555, -1584760, -1250203, -1102539, -1106323, -1265064, -1501668, -1610229, -1432452, -924392, -383041, -326823, -831670, -1586835, -2310450, -2698831, -2674650, -2473932, -2362237, -2401921, -2502526, -2637637, -2646718, -2322920, -1793749, -1481986, -1553480, -1646668, -1518470, -1464190, -1699059, -1981164, -1902698, -1401095, -552429, 445171, 995007, 650997, -279025, -1132602, -1613329, -1709276, -1386785, -707262, 77371, 333357, -242915, -855539, -636024, 230317, 969865, 1433772, 1852961, 2114095, 2062184, 1776029, 1494368, 1244386, 863357, 510493]
13110E10493n3914L66209P40675O83567J70667m05391p14671o05021k59918m1912
13100C90784J32789K08819k01l17850n27276m13495j01141k2403k83932o85778
13090a619684q75429o11046j64560K19564N80021P85046P42893M65149Q6452j96240
13080e87834l74242k79070L17888Q62676O09048q2534m98405n08388m75795n78433
13070a595089o72869n26148j68949K97981M03516Q8000k3818j2145k21653n57320
13060b988494n54473j29797K93728N01970M41419L21304J70704k967J6999Q5732
13050a843875j10403m24860n03351m09272j5325M34474M73672L21857J19786p9104
13040b036401j29331J658N5807R9816K39169J57044N4564J57220L17108L80672
$$ y = [510493, 456579, 822788, 1563463, 2247030, 2417697, 2012306, 1297635, 692614, 432696, 390784, 523573, 732392, 732191, 414341, -112935, -526430, -627571, -649974, -933906, -1619684, -2495113, -3106159, -3270719, -3051155, -2471134, -1686088, -943195, -478046, -391594, -587834, -962076, -1241146, -923258, -60582, 548466, 465932, -32473, -540861, -1016656, -1595089, -2267958, -2794106, -2963055, -2665074, -2261558, -2173558, -2197376, -2209521, -2431174, -2988494, -3542967, -3672764, -3379036, -2877066, -2435647, -2114343, -1943639, -1946606, -1929607, -1843875, -1954278, -2379138, -2882489, -3291761, -3307086, -2872612, -2398940, -2077083, -1957297, -2036401, -2165732, -2164074, -2108267, -2008451, -1769282, -1612238, -1557674, -1400454, -1083346, -702674]
13030g02674L63326L83690K70885l2833j71887J11341M42456K39189l55176n17370
13020C0947j81556R6191J52890k9350j31835J3577K21389M77245M95846m384n04906
13009F36054m85802j97187K7951j07108l89493k99798N4337K93897M38094L23972
12999B94917O6353L2899J47757J80826q9027n43753q86103q91453n75418j21989
12989b384991L35453P90232J052146Q56209L06302q5716k12780k85146k44786
12980A26923k53650m10517m29002j86741P9869K53070M80565O04857N55230M05071
12970A225675J47076j01938l34113m50955l64985k62088m15387p14043p04157
12961a974915l95522k99199m02450l77058r5647K96999N00387M29170J52568q7971
$$ y = [-702674, -339348, 44342, 315227, 282394, 110507, 221848, 664304, 903493, 548317, 30947, -150609, -54418, 98472, 69122, -62713, -49136, 172253, 649498, 1145344, 1140960, 636054, 150252, -46935, -18984, -126092, -515585, -815383, -761046, -467149, -29055, 294917, 361270, 394169, 541926, 722752, 633725, 89972, -796131, -1687584, -2263002, -2384991, -2049538, -1259306, -207160, 649049, 955351, 869635, 656855, 371709, 126923, -126727, -537244, -966246, -1152987, -1073118, -820048, -339483, 265374, 820604, 1225675, 1372751, 1270813, 936700, 485745, 120760, -141328, -556715, -1270758, -1974915, -2370437, -2669636, -3072086, -3449144, -3544791, -3247792, -2747405, -2318235, -2165667, -2253638]
12951b253638j48253j34593k13645k74262o4906L97919R95731J194926P98593
12942B97872L62386K30426L02936L49505O01990J001786Q29106k02677j275107
12933B498223j430769q02591J9298N85596N64324K00205L8696j1812k20860m10425
12923A029885m40567n21036n85957n27688m14521j42149n0712l09597m39699k54288
12913b656329P2599L08201L21227J86633O4678J56320M23020O82195R36648Q87286
12903A382478L98097k18809n28327j75870O51457J147326R18278L91614Q617p7142
12893C897719R2527K3108l95477p47655p21078l18807K56633O93744N30240r7742
12883C213212n74397n70935j88607K10975J99087j52699l83133l39974k54142
$$ y = [-2253638, -2401891, -2536484, -2750129, -3024391, -3089297, -2691378, -1695647, -500721, 297872, 660258, 890684, 1193620, 1543125, 2145115, 3146901, 3976007, 3773330, 2498223, 1067454, 264863, 284161, 869757, 1434081, 1634286, 1672982, 1661170, 1440310, 1029885, 589318, 68282, -517675, -1045363, -1459884, -1602033, -1652745, -1962342, -2402041, -2656329, -2583730, -2275529, -1954302, -1767669, -1702991, -1546671, -1123651, -441456, 495192, 1382478, 1780575, 1561766, 1033439, 857569, 1509026, 2656352, 3574630, 3966244, 3974861, 3897719, 3990246, 4013354, 3617877, 2870222, 2149144, 1830337, 2086970, 2780714, 3310954, 3213212, 2638815, 2067880, 1879273, 2090248, 2289335, 2136636, 1753503, 1413529, 1159387]
12874A159387j78434l10215n35553k87264K16140K61645k42706n96739k68318
12865g82057K59983O09833P46754L80452l31166o82474m84378k07434m9240J25575
12855d14152N15072P37660M14471j5370J19210O27824Q74787O72639P3230n75201
12845C030170q96258r79763r59499p91026l95513J04629N47710Q91380J068512
12836A620342Q41206K32232k30705k61830r4837P0476K22158M00860N98158M15664
12826C813724m8817l30352k99038r6479O2344N4474q8294l62638o55428m91617
12816A557879n3621N2857R21q3622q0580R3369J90047K17565L18078M91901M38152
12805C142946J48010k2692l3253j81609l81188l20060j1851L62567O19474N85499
$$ y = [1159387, 980953, 670738, 135185, -152079, 64061, 325706, 83000, -513739, -782057, -522074, 87759, 834513, 1214965, 883799, 201325, -283053, -490487, -539727, -414152, 100920, 838580, 1253051, 1237681, 1356891, 1984715, 2859502, 3532141, 3605371, 3030170, 2133912, 1154149, 194650, -596376, -991889, -887260, -339550, 551830, 1620342, 2461548, 2693780, 2463075, 2201245, 2106408, 2176884, 2399042, 2799902, 3398060, 3813724, 3764907, 3434555, 3135517, 3039038, 3101382, 3155856, 3067562, 2704924, 2049496, 1557879, 1504258, 1557115, 1558036, 1474414, 1393834, 1487203, 1677250, 1894815, 2212893, 2704794, 3142946, 3290956, 3268264, 3235011, 3053402, 2672214, 2352154, 2340303, 2702870, 3322344, 3907843]
12795C907843M57696O31014P12869L20543l00552o88788o91433o35193o08980
12786C105019m45094k53080j96065k62122m49510p04234q06208n86938k56629
12777h54861k39278m45205l44614N8924L93271N62753O47129O92379O35154M43117
12767A548769K62542J88143L12787M65198O27916O96194M49134J47105n1885p0066
12757D575837J64822O49285R50188R48638P84419M65050P693n83115r73346r37424
12747F052047q18840p18189l56064J76159M67845L27786J65903J80920K69062
12738E746629M29607M17898K49234J81618K48269J45921l40903p40632m62257
12729E875384J64677M92750M30042L95621N26670N62207M77908J80646k84745
$$ y = [3907843, 4365539, 4996553, 5709422, 6029965, 5729413, 5040625, 4349192, 3713999, 3105019, 2659925, 2406845, 2210780, 1948658, 1499148, 794914, -11294, -598232, -854861, -1094139, -1539344, -1883958, -1825034, -1431763, -869010, -221881, 470498, 1105652, 1548769, 1811311, 1999454, 2312241, 2777439, 3405355, 4101549, 4550683, 4697788, 4645903, 4575837, 4740659, 5389944, 6340132, 7288770, 8073189, 8538239, 8545932, 7962817, 6989471, 6052047, 5233207, 4515018, 4158954, 4335113, 4802958, 5130744, 5296647, 5477567, 5746629, 6176236, 6594134, 6843368, 7024986, 7273255, 7419176, 7078273, 6337641, 5875384, 6040061, 6532811, 6962853, 7358474, 7885144, 8447351, 8925259, 9105905, 8821160]
12720H821160l84769q4516L56344Q90712J354729J566522J620350J594294J337348
12711A7072174R03888N93574M08619M64880R59878J552135J868107J827402J749309
12702B7399966J963617K117341K166201K398777K927813L828006M781468N327059
12694E2910248N604701O195140P410353R013115J0818392J2654466J4419358J6046205
12686A35071978J7748276J9844532K2104403K3640909K3755809K2191859J8278683
12679B82636449J1337731J887815p831294j5614850k0591211k2844433k2924118
12672B06056089k1803585k0228701j8271831j6029039j4051984j2351194j0622413
12665I2697342r093856p806008o513279n499939m955947m556606m111659l554427
$$ y = [8821160, 8436391, 8351875, 8708219, 9598931, 10953660, 12520182, 14140532, 15734826, 17072174, 17976062, 18569636, 18978255, 19443135, 20403013, 21955148, 23823255, 25650657, 27399966, 29363583, 31480924, 33647125, 36045902, 38973715, 42801721, 47583189, 52910248, 58514949, 64710089, 72120442, 81133557, 91951949, 104606415, 119025773, 135071978, 152820254, 172664786, 194769189, 218410098, 242165907, 264357766, 282636449, 293974180, 295861995, 288030701, 272415851, 251824640, 228980207, 206056089, 184252504, 164023803, 145751972, 129722933, 115670949, 103319755, 92697342, 83603486, 75797478, 69284199, 63784260, 58828313, 54271707, 50160048, 46605621]
12657D6605621k691496k045670k037038k267592k357933k020604j348207q07565
12649C1029516p59904j048028j123613q65009m33904j02196m5860j34368j08747
12640B6407887P4624J11220j77700l35868j66424k24862o52388q79877o79580
12631B3477032l51398r290K30120K16833K20103N27541Q03265Q25866Q89532J069649
12621B7899253J130908J045085J131186J311563J357029J328996J300276J511366
12613C8015662J911444K299253K680753L122880L821607M803194N822475O822854
12605F9300122Q230691J0200617J2286463J4019458J5467095J7164819J9352843
12598A66022108K1614512K3393194K4465727K4145511K1496457J6044391P892841
$$ y = [46605621, 43914125, 41868455, 39831417, 37563825, 35205892, 33185288, 31837081, 31029516, 30269612, 29221584, 28097971, 27232962, 26799058, 26696862, 26651002, 26516634, 26407887, 26482511, 26593731, 26416031, 26080163, 25913739, 25688877, 25036489, 24156612, 23477032, 23125634, 23116344, 23346464, 23563297, 23783400, 24310941, 25114206, 25940072, 26829604, 27899253, 29030161, 30075246, 31206432, 32517995, 33875024, 35204020, 36504296, 38015662, 39927106, 42226359, 44907112, 48029992, 51851599, 56654793, 62477268, 69300122, 77530813, 87731430, 100017893, 114037351, 129504446, 146669265, 166022108, 187636620, 211029814, 235495541, 259641052, 281137509, 297181900, 305074741]
12591C05074741j908359j1451817j8816709k2907121k3996953k3418548k2050343
12584A80524891k0133636j7965571j5857300j3617266j1283980r577275q505909
12577H3583954p491359o419189n323841m631099m400909m083286l772978l613113
12569D3848180l295117k706239k119868j698288j477718j338581j129613r14139
12561B9168617q32436p95367n81678l80839n42405q43894o93386k68646p8125
12552B4151841J01605J68561k42416r14671j277696j047455p24024p66880r88827
12543A8460038r95835n86923J0296L57520L81428M83484J017659J386542J136996
12534B1651205Q94033J045927J474038J901934K122837K099753K000647K179688
$$ y = [305074741, 303166382, 291714565, 272897856, 249990735, 225993782, 202575234, 180524891, 160391255, 142425684, 126568384, 112951118, 101667138, 92089863, 83583954, 76092595, 69673406, 64349565, 59718466, 55317557, 51234271, 47461293, 43848180, 40553063, 37846824, 35726956, 34028668, 32550950, 31212369, 30082756, 29168617, 28336181, 27540814, 26959136, 26578297, 26035892, 25191998, 24498612, 24229966, 24151841, 24253446, 24422007, 24179591, 23264920, 21987224, 20939769, 20215745, 19448865, 18460038, 17464203, 16877280, 16887576, 17245096, 17626524, 18110008, 19127667, 20514209, 21651205, 22545238, 23591165, 25065203, 26967137, 29089974, 31189727, 33190374, 35370062]
12526C5370062K721165L389235L949395M324775M678563N121212N634112O552772
12518G1741291Q126971J0142902J2073211J3825478J5540692J7231413J9146515
12511A67828473K1138056K2735681K3742502K3554542K0895533J5110449O613078
12504C01618314l310655j2682514j9725227k3516023k4294023k3425518k1858250
12497A72806104j9756144j7377685j5227130j3353776j1469353r689818q207113
12490G7725085p173555o643993o170620n277606m132036l325433l026396k853540
12482C9121906k750396k707097k479600k207388j857219j305544r11375r83726
12474B3919561j320234j670897j746823j332587p22788k69021j39872k11612m26667
$$ y = [35370062, 38091227, 41480462, 45429857, 49754632, 54433195, 59554407, 65188519, 71741291, 79868262, 90011164, 102084375, 115909853, 131450545, 148681958, 167828473, 188966529, 211702210, 235444712, 258999254, 279894787, 295005236, 301618314, 298307659, 285625145, 265899918, 242383895, 218089872, 194664354, 172806104, 153049960, 135672275, 120445145, 107091369, 95622016, 85932198, 77725085, 70551530, 63907537, 57736917, 52459311, 48327275, 45001842, 41975446, 39121906, 36371510, 33664413, 31184813, 28977425, 27120206, 25814662, 24903287, 23919561, 22599327, 20928430, 19181607, 17849020, 17126232, 16857211, 16717339, 16505727, 16079060]
12465A6079060o36912p12364p95782r05081r13065q05279n00527Q297J97152k62244
12455A0753255p29772n95672j08981J7878k12435k55800n8645P7723m4039l34897
12445H508615q20562j271748j262234r39693l09679M99284Q34799M24388l54781
12436E308389q87064p23054o6315N55262P98984N64554J86450N9510R2689q1466
12426E807939l62960l61223j18160r2475r0153r1213j47237J12748M34285M83856
12416E575407J60576m52658j011667j160827q48793l56153m8431J19150K07463
12407B184067l5558k84223L471O66125J177686J121026N64516K1230m29953q78036
12397D110351r33247o02443k95349o8398K49411M68880N15631K55536k20651m95693
$$ y = [16079060, 15442148, 14729784, 13934002, 13028921, 12115856, 11310577, 10810050, 10818347, 11015499, 10753255, 10023483, 9427811, 9318830, 9336708, 9124273, 8868473, 8809828, 8887551, 8843512, 8508615, 7688053, 6416305, 5154071, 4214378, 3904699, 4403983, 5238782, 5663170, 5308389, 4421325, 3698271, 3631956, 4187218, 4986202, 5550756, 5737206, 5796716, 5889405, 5807939, 5444979, 5083756, 4965596, 4873121, 4782968, 4691755, 4544518, 4657266, 5091551, 5575407, 5735983, 5283325, 4271658, 3110831, 2262038, 1905885, 1857454, 1976604, 2184067, 2148509, 1864286, 1867757, 2533882, 3711568, 4832594, 5397110, 5418340, 4988387, 4110351, 3177104, 2574661, 2279312, 2210914, 2460325, 2929205, 3444836, 3700372, 3479721, 2984028]
12387B984028n26954n62459p22366q34163m92058K99315R85483J122654R98789
12378C252269R95190Q69521K76086o19687j213272j151510o24234n9716M47466
12369B172113N32437J99110r2142j83688Q0702K47567k14006q82870j057567n67859
12359B33797P022J79346J19026J06997J76551J63765J05877J01316J64870L0212
12349A388779k90389o76147q75168o29262k44438m4858m7549j00177N1324K72886
12339a194999L60792M43447M99290M81498L99104J45871l32156o25278m20794
12330b43225J83763Q57576J217797J191190R73779P03737K86890k45908o84367
12321D241232p82692o80283m50012n613K62479J20645j26552r4122K73001M88440
$$ y = [2984028, 2457074, 1894615, 1172249, 338086, -153972, 145343, 1130826, 2253480, 3252269, 4247459, 5116980, 5393066, 4773379, 3560107, 2408597, 1784363, 1724647, 2172113, 2704550, 2903660, 2811518, 2627830, 2708532, 2956099, 2742093, 1859223, 801656, 233797, 240819, 420165, 539191, 646188, 822739, 986504, 1092381, 1193697, 1358567, 1388779, 1098390, 422243, -452925, -1082187, -1326625, -1371483, -1419032, -1519209, -1467885, -1194999, -834207, -390760, 108530, 590028, 989132, 1135003, 802847, 177569, -243225, -59462, 798114, 2015911, 3207101, 4180880, 4884617, 5171507, 4925599, 4241232, 3458540, 2778257, 2328245, 2322632, 2585111, 2705756, 2579204, 2485082, 2758083, 3246523]
12311C246523J71749m71983j103862j443297j388198j123728n80192L40906R51042
12302a401040R26159N07481P9232k0119J93631L59320K50700k9728j57653J6992
12292G24975K94636N29203N99971O15532O77675M47312q1957m30066m88163o68901
12282B220217r03838p94128k50521K42140M30266M78146N24057N26774K25821
12273B698934k62823m66300k40931J07221L69637N48957P85692P07735N6906n19651
12263C785377m44431l1530M6160k32459n22500n51556m41119m32551m28692k21365
12253E25334J19471K47492o1898n48716r75362j125298q56100k94393K61988M62578
12243b244904M25137L11693J06731J01890J52775J09310L21525M26749O7715j83635
$$ y = [3246523, 3418272, 2946289, 1842427, 399130, -989068, -2112796, -2692988, -2352082, -1401040, -474881, 32600, 111832, 91713, 285344, 644664, 895364, 865636, 707983, 724975, 1019611, 1548814, 2148785, 2764317, 3441992, 3889304, 3807347, 3377281, 2889118, 2220217, 1316379, 522251, 271730, 513870, 944136, 1422282, 1946339, 2473113, 2698934, 2436111, 1969811, 1728880, 1836101, 2205738, 2754695, 3540387, 4248122, 4305028, 3785377, 3340946, 3309416, 3355576, 3123117, 2600617, 2049061, 1607942, 1175391, 746699, 525334, 644805, 892297, 830399, 281683, -693679, -1818977, -2675077, -2969470, -2707482, -2244904, -1819767, -1508074, -1401343, -1299453, -1146678, -1037368, -715843, -289094, -221379, -405014]
12233d05014k8921L93465O50807N19724J89397j74039l83219l13265m9671m8037
12223C51227k29960l03367k58889J38623N77741N35167J87833j00424n9818J88755
12213A026888J53775m09275j152788j440142j112470m71532Q0670J57908P8761
12204c088205J73172J26070K2546K28823M96108N61937N76737L58947j78328o61660
12194a383853o47115j62556M33650P21461M53188J1441j18019j46965l21224m88941
12184a648933m04386N6436L56042J35119r3373L118K84728M25698K63646J06343
12174e15562j0306k19642m25628n19107m17432j62388J18712L55303M58915J92072
12164a145063k70156n22868m14688m0092L88289O74749P58311P02081N46367L76892
$$ y = [-405014, -433935, -40470, 610337, 1130061, 1319458, 1145419, 762200, 448935, 399264, 351227, 121267, -182100, -440989, -302366, 275375, 810542, 998375, 897951, 838133, 1026888, 1180663, 771388, -381400, -1821542, -2934012, -3405544, -3324874, -3166966, -3088205, -2915033, -2788963, -2766417, -2537594, -2041486, -1479549, -902812, -543865, -722193, -1383853, -2030968, -2193524, -1759874, -1038413, -585225, -573784, -691803, -838768, -1159992, -1648933, -2053319, -1996883, -1640841, -1505722, -1599095, -1595977, -1311249, -885551, -621905, -515562, -525868, -745510, -1171138, -1690245, -2107677, -2270065, -2151353, -1796050, -1337135, -1145063, -1415219, -1938087, -2352775, -2392867, -2004578, -1329829, -571518, 130563, 676930, 1053822]
12154A053822J78656n5948k06335k86291l20719k51876j49405n3758J03494O8287
12144G9927j23723r7935O3217N015k53986m54379m26267k99825m71031n63915
12134b542902r0405O64688J118092R77363N37768q68l67739l89218k76189j74085
12124e43495j34715l50122o41508m58323k3295K34984M56329O30871M60124M049
12114c65101l51658m03381k32351L1444K28340P0536k90859m75718n22078n23400
12104b834226l49147j68359k50643l73740j89100K77785O35433P35069P20692
12095a796236O23484L22439q8654k90807l14349k88108l24544n10127m38054K00417
12085b904539P45623P39956L59257o5434j70507o5135j8086k2524J26917N33372
$$ y = [1053822, 1232478, 1176530, 970195, 683904, 363185, 111309, -38096, -91854, 11640, 79927, -43796, -141731, -78514, -73499, -327485, -781864, -1208131, -1507956, -1978987, -2542902, -2633307, -1968619, -850527, 126836, 664604, 663736, 295997, -93221, -369410, -543495, -678210, -1028332, -1669840, -2128163, -2151458, -1916474, -1460145, -829274, -369150, -365101, -716759, -1120140, -1352491, -1321047, -1092707, -1022171, -1313030, -1788748, -2310826, -2834226, -3183373, -3351732, -3602375, -3976115, -4165215, -3887430, -3251997, -2516928, -1796236, -1172752, -850313, -938967, -1229774, -1544123, -1832231, -2156775, -2666902, -3104956, -2904539, -2158916, -1418960, -1059703, -1125137, -1295644, -1360779, -1378865, -1401389, -1274472, -741100]
12075g41100R04295J030885P80127K99277m9025k47277l03206k75958l79783m96743
12065E21492l15844N2695M46768O87697O89301J68458o48595j121661q72065J6245
12055c75509P20408N75315q8688m34298k17162Q3372R2345n5462J04685K57300
12045F62306n6144m83757m07256M4730K96192K36747N2913m21920j056108j124397
12035b256694n88819q3033J44407K48882L84113L28665J8649k48186m03263m96869
12025b952148m72122o0753N60997Q35631P68318Q40639J027655R25155N81389
12016B054761K56062J16942K6343n4679k21342l37239k01090l7065j66514n34790
12006I01389p39989l89614K32456M93180K28237k38743o73408p37950o4948R31261
$$ y = [-741100, 163195, 1194080, 1974207, 2273484, 2224459, 1977182, 1673976, 1398018, 1018235, 521492, 205648, 258343, 705111, 1392808, 2082109, 2250567, 1601972, 480311, -391754, -375509, 344899, 920214, 831526, 397228, 180066, 263438, 355783, 300321, 405006, 662306, 606162, 122405, -284851, -240121, 56071, 292818, 345731, -76189, -1132297, -2256694, -2845513, -2928546, -2784139, -2535257, -2151144, -1822479, -1803830, -2052016, -2455279, -2952148, -3424270, -3485023, -2924026, -2088395, -1320077, -479438, 548217, 1473372, 2054761, 2310823, 2427765, 2454108, 2399429, 2178087, 1840848, 1639758, 1602693, 1436179, 901389, 161400, -228214, 4242, 497422, 725659, 486916, -186492, -924442, -989390, -58129]
11996e8129J293777Q80826L43103J78999J72779J87105K80088M3909n37766q49169
11986A935522o37113k76975j56714l29104l67229j60139J3312J95817M53150N06610
11976A177137J82596j09892k2579L35255O58386N18200Q8047o7049k144J32637
11966B890594K16539J47805R1857K4339r2487k76523n45087r37193j203096j252129
11956i35381j143862q42245o26655n34051j71299K31091L79655O45602J030073
11947a967072J216400J282243J346211R54616J50611k74833k37646j12181m1648
11938B316701j7706P7612P6430j59598l50561j76617K86765M89119K09029j59863
11928B591311j98827j6822P1450O9771K1895j83280n10347q25503j167549j531009
$$ y = [-58129, 1235648, 2116474, 2459577, 2638576, 2811355, 2998460, 3278548, 3322457, 2784691, 1935522, 1298409, 1021434, 864720, 535616, 168387, 8248, 21560, 217377, 670527, 1177137, 1359733, 1249841, 1227262, 1562517, 2220903, 2739103, 2827150, 2760101, 2757957, 2890594, 3107133, 3254938, 3346795, 3371134, 3278647, 3002124, 2457037, 1519844, 316748, -935381, -2079243, -2921488, -3548143, -4082194, -4253493, -4022402, -3642747, -2997145, -1967072, -750672, 531571, 1877782, 2832398, 2983009, 2708176, 2470530, 2358349, 2316701, 2298995, 2376607, 2453037, 2293439, 1942878, 1766261, 2053026, 2542145, 2751174, 2591311, 2392484, 2375662, 2447112, 2516883, 2538778, 2355498, 1845151, 1019648, -147901, -1678910]
11918a678910j457817n91271O25462J319375J412531J099133M34969k01435m64468
11909D97569l73330j28146q182J84518N07058N98628L28712j76588p00046p29914
11899B79l56040j00069J22672K91635J36776j89047j43161J29548K01397K11092
11889C05082K52810K22637J83486m5496m43466m36132K00696P53791O24113J34354
11879A751875k09789l55000l31551j98644j79225k58567m80081q57052j060944
11870b178978q65084n62864l84641k14395J7142K32238L92731N54996P17397P53043
11860a538415N05317K83839K73821J65074j54433o47410j159862j134303n40651
11851c947023Q4851N10690N84464K55672j94187l83889l03254l43802n18488k87866
$$ y = [-1678910, -3136727, -3727998, -3102536, -1783161, -370630, 728503, 1163472, 962037, 497569, 124239, -3907, -12089, 172429, 679487, 1278115, 1606827, 1430239, 730193, 279, -355761, -455830, -333158, -41523, 95253, -93794, -236955, -107407, 93990, 305082, 557892, 780529, 964015, 918519, 475053, 38921, 239617, 993408, 1617521, 1751875, 1542086, 1187086, 855535, 656891, 477666, 219099, -260982, -1118034, -2178978, -3044062, -3606926, -3991567, -4205962, -4188820, -3956582, -3563851, -3008855, -2291458, -1538415, -1033098, -749259, -475438, -310364, -464797, -1112207, -2272069, -3406372, -3947023, -3862172, -3351482, -2767018, -2511346, -2705533, -3089422, -3392676, -3736478, -4254966, -4542832]
11841d542832L27569O66560N65772K06376K995J66071K98014k6237l55943l81477
11831c073132k59006k16655k10262J6846K45962M36386N05261O05091Q84817R84393
11821h0299N97342K63278M04210M15520L5168j76986j28190j50391l74481n77126
11811B28045n98153l85695k09885l4972M22314Q73433P44036l1602p96143j021897
11801h10519r27995p81099m69161l07965n22408p50167q20929o44235j10152O20926
11791e523704J088252R25598M07701R1597K64518N59320O76398J041714J529259
11782A060653J606936J199449O72397L08187r0995n91628p28062m46514j23115
11773B867308j13391m36442n92491l52610j19708n9692J4797O1912P7805J53721
$$ y = [-4542832, -4215263, -3548703, -2982931, -2776555, -2773560, -2607489, -2309475, -2335712, -2691655, -3073132, -3332138, -3548793, -3759055, -3742209, -3496247, -3059861, -2554600, -1949509, -1064692, -80299, 517043, 780321, 1184531, 1600051, 1635219, 1458233, 1330043, 1179652, 805171, 228045, -370108, -755803, -965688, -1000660, -578346, 295087, 1039123, 1007521, 211378, -810519, -1738514, -2519613, -2988774, -3296739, -3819147, -4569314, -5390243, -6034478, -6144630, -5523704, -4435452, -3509854, -3102153, -3010556, -2746038, -2186718, -1510320, -468606, 1060653, 2667589, 3867038, 4539435, 4847622, 4756627, 4164999, 3436937, 2990423, 2867308, 2753917, 2317475, 1724984, 1372374, 1252666, 1192974, 1207771, 1269683, 1347488, 1501209]
11763A501209J25727J26542K20493K0965l16144l59218k13281j06100Q7006O8116
11753A155315l47284o68530n84596l57868j32016K47581P04203R77246Q95845
11744A889896M72787j40535m65011k50760J38074J81103l8448j8244J09098J8431
11734A896391k77650n58948o75522n99337k78439J84524K64988k5028l14313o40339
11724a023673r25357q82835m69792K73005J039028J291294Q21479J08451l03978
11715g2378l81463l51023o17890q37802m84168m1208K03217L49314M01764N75656
11705a255981Q82511R14622O46476L27968j2534k48244j76029l1993p8767k63152
11695G04877m52526p48016j024321q92457l44589M0655J45512L68541P07943O36186
$$ y = [1501209, 1626936, 1753478, 1973971, 1994936, 1678792, 1319574, 1106293, 1000193, 1087199, 1155315, 808031, 139501, -445095, -802963, -934979, -687398, 16805, 994051, 1889896, 2362683, 2222148, 1757137, 1506377, 1644451, 1825554, 1787106, 1768862, 1877960, 1896391, 1618741, 1059793, 384271, -215066, -493505, -308981, -43993, -69021, -383334, -1023673, -1949030, -2831865, -3301657, -3028652, -1989624, -698330, 123149, 231600, -72378, -453841, -804864, -1422754, -2260556, -2744724, -2785932, -2582715, -2233401, -1831637, -1255981, -373470, 541152, 1187628, 1515596, 1503062, 1254818, 1078789, 1046796, 968029, 704877, 252351, -495665, -1519986, -2412443, -2757032, -2716377, -2570865, -2202324, -1494381, -858195]
11685h58195j10858p14084p26957m10944k36839j93285R2461L40485L65528K75468
11675b177220J67158J01846J32444M41328P02445N62333L10317L8461L1440N50261
11665H60813Q71843N19881j96170o66331p62618q07355p32872k93894K43309M27860
11655e35534K52846p3578j58073J58758K23434k6210j2118J54591R3589k5949
11645E1756j84575m53057n91395p36055j015872j136056q27700k89349Q6825M28219
11635d667259R54169J284104J215476R47887M31011J7825p3156j18701k57807
11626b66451m43125m62100k11781J62083M52065P15984O68356J59833m14476o08763
11616b48375m3796P50522J010969N73724k05484p82709j032032j061251j092355
$$ y = [-858195, -969053, -1683137, -2410094, -2821038, -3057877, -3251162, -3158701, -2818216, -2452688, -2177220, -2010062, -1908216, -1775772, -1334444, -631999, -69666, 240651, 279112, 310552, 860813, 1732656, 2252537, 2056367, 1390036, 627418, -179937, -912809, -1206703, -963394, -535534, -282688, -356266, -514339, -355581, -132147, -158357, -170475, -15884, 77705, 51756, -132819, -585876, -1177271, -1913326, -2929198, -4065254, -4892954, -5182303, -5095478, -4667259, -3713090, -2428986, -1213510, -265623, 165388, 183213, 110057, -8644, -266451, -709576, -1171676, -1383457, -1221374, -769309, -53325, 615031, 774864, 360388, -248375, -292171, 458351, 1469320, 2043044, 1837560, 1054851, 22819, -1038432, -2130787]
11607b130787j068757q19207m79971j76964P4186J95607K28063L33214N76496
11598c268120P50748O95869O21492N38218L98351J97850j27083l80959m79854
11589a053488n77643n63441k13067K20271N46994Q44319J061259J076814P57211
11580B099229J30447n48111q33798o93125l19998J9687J3899j96392k82992m45895
11570a057049m81433r076N99459O94009K88637Q4264J47787L28555O30692O94557
11560A920402K95609l09775p89913j037691j203928j303081q96872k0111P90475
11551b554885J245630J162140P33246M79830K86598j26113k68359j53237k38837
11542E66013k66852R5423L73209K52864m0380l33863l83774K409M44356N83170
$$ y = [-2130787, -3199544, -4018751, -4498722, -4675686, -4601500, -4405893, -4177830, -3844616, -3268120, -2517372, -1821503, -1200011, -661793, -263442, -65592, -192675, -573634, -1053488, -1631131, -2194572, -2407639, -2187368, -1640374, -796055, 265204, 1342018, 2099229, 2229676, 1681565, 847767, 154642, -165356, -145669, -131770, -328162, -611154, -1057049, -1538482, -1547558, -948099, -254090, 34547, 118811, 266598, 595153, 1225845, 1920402, 2216011, 1906236, 1116323, 78632, -1125296, -2428377, -3325249, -3345360, -2554885, -1309255, -147115, 586131, 1065961, 1352559, 1226446, 958087, 804850, 566013, 299161, 394584, 767793, 1020657, 980277, 646414, 262640, 265049, 709405, 1292575]
11532A292575M49127K31615K6336m06071r23485q61348j73330N45451O08023K15837
11522A004730Q7928L35360O23976N53936j5966p74129j173453r72862o05749m32514
11512a368743l66896k85400k12228O3727O66537J093958Q48697J55667n60142
11503C5177r96239r53899p06634l19603K76924P83080J073787Q77782K93274k95137
11493F8512o96972o76460m10396k77387l62369m84627n18407n03849m97492l08034
11483d667481J20987N57187P87552P97636N54198r4999p91681p59817r6925L66966
11473c226377M16250K94789K12189K85583M31046M40514M94302M34801J56321
11464f0582l689N8368K02419L46762N94288O95006N10882K93793O8306k48437
$$ y = [1292575, 1741702, 1973317, 1999653, 1593582, 670097, -191251, -364581, 180870, 788893, 1004730, 1092658, 1428018, 2051994, 2605930, 2589964, 1815835, 642382, -330480, -936229, -1368743, -1735639, -2021039, -2233267, -2169540, -1503003, -409045, 439652, 595319, 35177, -961062, -1914961, -2621595, -2941198, -2664274, -1881194, -807407, 70375, 363649, 68512, -628460, -1304920, -1715316, -1992703, -2355072, -2839699, -3358106, -3861955, -4359447, -4667481, -4546494, -3989307, -3201755, -2404119, -1849921, -1944920, -2736601, -3496418, -3593343, -3226377, -2810127, -2515338, -2303149, -2017566, -1586520, -1146006, -651704, -216903, -60582, -64271, -5903, 196516, 543278, 1137566, 1832572, 2343454, 2637247, 2705553, 2457116]
11454B457116q11470j183689q40755k80094L5882J34544K00372K29681J63372
11445A04959O3370j84852m00313j89805L04848N97540M80840k509m84966n73947
11435b84835m18892k25413p3473L04024R20913J027526K85863l92712n36354l93258
11425B13389j57948j20033k30106l54278m10088j63188J63976M86203P27339P37390
11415H92656P66707P46813Q02594J063974J084641P46047L54384l839r7468J63380
11405F519889L98652K04960m22826r18795r01155q34943r17670r56742j022085
11396A149285j138165j150863r89730p04532k43613M73343J141094J067832M22296
11387B6947O6394J82924J68804l9672P8531K08891j37939p31198q57369l04057
$$ y = [2457116, 1645646, 461957, -378798, -658892, -623010, -488466, -288094, -58413, 104959, 168329, -16523, -416836, -606641, -301793, 295747, 776587, 774078, 289112, -284835, -703727, -929140, -1002613, -698589, 222324, 1249850, 1535713, 1143001, 606647, 213389, 55441, -64592, -294698, -648976, -1059064, -1222252, -1058276, -572073, 155266, 892656, 1659363, 2406176, 3208770, 4272744, 5357385, 6103432, 6457816, 6453977, 6356509, 6519889, 6918541, 7123501, 6700675, 5781880, 4880725, 4045782, 3128112, 2171370, 1149285, 11120, -1139743, -2129473, -2834005, -3077618, -2604275, -1463181, -395349, 26947, 93341, 276265, 445069, 405397, 483928, 692819, 554880, -176318, -1033687, -1337744]
11377a337744M05334P43140P02597N37496L69007L50593O49820Q86180O56730
11368C963153R2267k97711l08342k22060l56721m61281j51635J43996J30255j34447
11358B397474l69827n55353p21886q48502p93617m95787P0545O11732Q12408P62378
11348H69565O95350O46253N69060L18979n4991k46694j62745J3270l4135l25208
11338B288704m61391k06222l9351l30025o70108n91384k09293Q1815K05703M53178
11328E21626P10825O65689N83502M87991L06235L97770O10957M48612K21619K50939
11318E205765L00259L77094N02095L36616j10467m98577o71869m16622K19198
11309E243492P16106R54795R64702R01679R11063P98747M93338M75714R16095
$$ y = [-1337744, -932410, -189270, 513327, 1050823, 1419830, 1770423, 2420243, 3306423, 3963153, 4055420, 3757709, 3449367, 3227307, 2870586, 2409305, 2257670, 2401666, 2531921, 2397474, 2027647, 1472294, 750408, -98094, -891711, -1387498, -1316953, -705221, 107187, 869565, 1564915, 2211168, 2780228, 3099207, 3044216, 2797522, 2634777, 2648047, 2613912, 2288704, 1827313, 1621091, 1581740, 1251715, 581607, -9777, -219070, -137255, 68448, 521626, 1232451, 1898140, 2481642, 2969633, 3275868, 3673638, 4284595, 4733207, 4954826, 5205765, 5506024, 5883118, 6385213, 6721829, 6611362, 6112785, 5440916, 5024294, 5243492, 5959598, 6914393, 7879095, 8780774, 9691837, 10490584, 10983922, 11459636, 12375731]
11300A2375731J290145J309105J095148Q45274O05831J63644n27701j246449j734755
11291A4175973j812749j448864q03453j66718L36966L88251r7774n97562p43294
11282I230776m41884m4478N2798r2971k59184l04406l17014p9518L14004L11221
11272H369344j25477m47524l82361J06500O12648Q42716P20501L26003k5064l66415
11262I630871n55102n53603l94958O2611M71092M26359Q2250k60948n14894m25217
11252G968461j53305o9875r0973j90390k60006l02258k09658Q2264K98384K81982
11242G354626J14780q6704l74528n15874n18462m86522m18547l84884m57243p05421
11232C521221q79499o92717m14417l07636j79707k4623J07337K02763L19977L65531
$$ y = [12375731, 13665876, 14974981, 16070129, 16915403, 17521234, 17684878, 17157177, 15910728, 14175973, 12363224, 10914360, 10110907, 9944189, 10281155, 10669406, 10571632, 9974070, 9230776, 8788892, 8744414, 8797212, 8704241, 8445057, 8140651, 7823637, 7744119, 8058123, 8369344, 8243867, 7796343, 7413982, 7520482, 8133130, 8975846, 9696347, 10022350, 9997286, 9630871, 9075769, 8522166, 8127208, 8189819, 8660911, 9087270, 9169520, 8908572, 8393678, 7968461, 7815156, 7745281, 7654308, 7463918, 7203912, 6901654, 6691996, 6774260, 7072644, 7354626, 7469406, 7382702, 7008174, 6492300, 5973838, 5487316, 5068769, 4683885, 4226642, 3521221, 2641722, 1949005, 1534588, 1226952, 1047245, 1022622, 1129959, 1332722, 1652699, 2018230]
11222B018230K32851N0577j60693m29277o10021m90124o3632M62402P80980P32882
11212B524175L52583j62221m08696m79651o30638p35242m96882O0585L78479K77197
11202F79689M16235N83542J59568m05573n06792k57239j6093M3689j23621m97205
11192G6200o74486k77171L77421Q43482Q46922K70014l86803n80454l97042k4351
11182G3732L4567l28712m00150K161M38831M92811J42576j64884j28229K7668
11172A90371q4076l64899m07413j88185J2173J75768L34850L54449L27918K63835
11162F14791L02897M81087M88920K63144q6685m05731l04320j8909M0378O3588
11152A439160J46420K36736K54903L82290M06633J76162j19578m34743o26339
$$ y = [2018230, 2251081, 2301658, 2140965, 1711688, 1101667, 611543, 547911, 1010313, 1791293, 2524175, 2876758, 2714537, 2305841, 1826190, 1195552, 460310, -36572, 24013, 402492, 679689, 1095924, 1679466, 1839034, 1433461, 926669, 669430, 653337, 697026, 573405, 76200, -598286, -875457, -498036, 345446, 1192368, 1462382, 1075579, 495125, 98083, 73732, 108299, -220413, -620563, -618402, -179571, 313240, 455816, 290932, 162703, 190371, 106295, -258604, -666017, -854202, -842029, -666261, -331411, 23038, 350956, 614791, 917688, 1398775, 1887695, 2150839, 2064154, 1658423, 1354103, 1335194, 1375572, 1439160, 1585580, 1822316, 2077219, 2459509, 2866142, 3042304, 2922726, 2487983, 1861644]
11143A861644m92523m48277n95574o52006o37000m60309P7766N59621N30024R7981
11133a58653j54247N407K93686M31260M38201K07392j73342n40225q92098j131198
11123a673817q72898J4537P64504P88872L85167J98142N12450Q98291O12266o009
11113A621505m08465o63340o58638m19333j87351K10567O95561O35805J99740
11104A026051N9805q5139n03159n55384j65578Q8968J83348K57835J30772k78764
11094A58755q33014j306006j320957q90574o25792p45372n22189J70420N54398
11085e360331M08143k7743l54058m04504k01517L08333J019831J294471P80107
11076b537268J61820O9875K87434K84734K80040O34900Q14782L17891n49838r88947
$$ y = [1861644, 1369121, 920844, 325270, -326736, -963736, -1424045, -1346279, -786658, -256634, -158653, -312900, -307493, -13807, 417453, 855654, 1063046, 889704, 349479, -542619, -1673817, -2546715, -2532178, -1767674, -978802, -593635, -395493, 116957, 1015248, 1627514, 1621505, 1213040, 549700, -108938, -528271, -715622, -505055, 190506, 826311, 1026051, 1085856, 1000717, 497558, -57826, -223404, -134436, 48912, 306747, 437519, 158755, -674259, -1980265, -3301222, -4191796, -4817588, -5562960, -6085149, -5914729, -5360331, -4952188, -4979931, -5333989, -5738493, -5940010, -5631677, -4611846, -3317375, -2537268, -2375448, -2305573, -2018139, -1733405, -1453365, -818465, -3683, 314208, -235630, -1224577]
11066a224577p43286l12148j81560r8880K25579M31027M10543L98567N45980N74413
11056B5658K78854j96857l87529l21030l23022k53382K7998K25695K47262K42383
11046d33970L3501j00452J9276K7417j22016k21503k60093j88961o5009j07211
11036a419021j59573L5893K76632K5976m75003o05519n54085n79187j89183N37894
11026c105176R20770J040677J023509P20360O01764P31613O43047M46551K48937
11017C272052j65209p34615j075529q81536n10218k08019J0245P5988K25792L79580
11007C88531R8930l52161m82585l70679k88795j18321K65596O61139P28643K83846
10997H14144j84759k78970l86041o04583n19243j86319M5506K21564K52227N6783
$$ y = [-1224577, -1967863, -2280011, -2461571, -2560451, -2334872, -1903845, -1493302, -1094735, -548755, 25658, 304512, 107655, -279874, -600904, -923926, -1177308, -1149310, -923615, -676353, -433970, -400469, -500921, -481645, -454228, -576244, -797747, -1057840, -1246801, -1311810, -1419021, -1578594, -1542701, -1266069, -1240093, -1715096, -2320615, -2874700, -3453887, -3643070, -3105176, -2184406, -1143729, -120220, 600140, 1201904, 1933517, 2576564, 3023115, 3272052, 3106843, 2372228, 1296699, 415163, -95055, -303074, -292829, -216841, 8951, 388531, 487461, 135300, -347285, -717964, -1006759, -1125080, -859484, -198345, 530298, 814144, 629385, 350415, -35626, -640209, -1159452, -1345771, -1300265, -1078701, -826474, -769691]
10987g69691j97890m65158n62877l67124j13187J27527L20727M09910L45341J58899
10977a113523P4244J57833K46327K14318K13512L88367M18467j38699r35591j163095
10967a637840n98377J36317O98947Q24987L65366j46947m69086n15182j31478
10958a473293K27472K16682J56867K23704K75521K40074N1889j72537q1857K16044
10948a19434K61972J94026K12844L49812O25841R27302Q64272N71871O08002N34151
10938E030659j64088j022362j362767j334256j312649j041035m60533o106j6102
10929a689239j95380j52239L3812J56246J98293n7565l54553q8435N32383P73610
10919h43067O75033L53019j80705m49139j20229L76297M02621K5053j20017J52868
$$ y = [-769691, -967581, -1432739, -1995616, -2362740, -2475927, -2348400, -2027673, -1617763, -1272422, -1113523, -1039279, -881446, -635119, -420801, -207289, 181078, 599545, 460846, -474745, -1637840, -2236217, -2099900, -1400953, -575966, -210600, -357547, -826633, -1341815, -1473293, -1245821, -1029139, -872272, -648568, -373047, -132973, -81084, -253621, -335478, -119434, 142538, 336564, 549408, 899220, 1525061, 2452363, 3316635, 3888506, 4496508, 5030659, 4866571, 3844209, 2481442, 1147186, -165463, -1206498, -1667031, -1673137, -1689239, -1884619, -2036858, -2003046, -1846800, -1648507, -1706072, -2060625, -2149060, -1616677, -843067, -168034, 184985, 4280, -444859, -565088, -188791, 213830, 238883, 118866, 271734]
10909B71734N21947O45245L87023L8204j72093k85976k01338L87252J015009R13965
10899C520972K31667k53179k67378j37368l5811p3229l48451n66192q23412j200792
10889D6827j229215r26518o03238j78392L51490N41196M52123L58525N7687m51186
10879a580701m55382L10805J038571J129376Q03977M01208o2576l51530k64053
10870I69695L6441K04123J96408j4835l88961o58739n50650m38425o06383n88039
10860a839365o5833N60802Q23777Q90044R32189P91820M00202J35489J36111m2556
10850B722680l13350k72511o4556j60155m43253l28543k1716j66076o87021q65746
10840f00247l92576K80190M85085O6074m34046m01503r8579n5817k11433j47798
$$ y = [271734, 793681, 1438926, 1825949, 1864153, 1692060, 1406084, 1204746, 1591998, 2607007, 3520972, 3752639, 3499460, 3232082, 3094714, 3058903, 2985674, 2637223, 2071031, 1247619, 46827, -1182388, -2108906, -2712144, -2890536, -2539046, -1997850, -1545727, -1187202, -1129515, -1580701, -2036083, -1725278, -686707, 442669, 1246646, 1647854, 1585278, 1233748, 969695, 1006136, 1210259, 1406667, 1391832, 1002871, 344132, -206518, -644943, -1251326, -1839365, -1905198, -1344396, -520619, 369425, 1301614, 2093434, 2493636, 2629125, 2765236, 2722680, 2409330, 2136819, 2072263, 1912108, 1468855, 1140312, 1118596, 952520, 265499, -600247, -992823, -712633, -227548, -161474, -595520, -997023, -1095602, -1151419, -1362852, -1510650]
10830a510650J1467M9361K06478M57679N84467O68186P58696O76146K28040l63687
10820A766183n89359m82094k77992j37025k98472o87329r72524r99309n98922
10811c276843N6709O86822J060282J120343Q02869Q7798n74270n13607K379L04758
10801b42760K49721p3810k41206k42131k18460j82237j14825r5787j55183j90825
10791a507503k62177o1030K36222J51073k11750m57943l10876J76640N71159N79825
10781a096360L84691J03542q2222M2814K56093L43681M13588O64520Q05902O42501
10771B478750K18593j78396k31870l0826L60914O44051L27565j70395j83060j8384
10761C216942k75110p78460p89534k66704K36834K32664p9541l93728p96822j095609
$$ y = [-1510650, -1499183, -1449822, -1243344, -785665, -201198, 466988, 1225684, 1901830, 2129870, 1766183, 1176824, 694730, 416738, 279713, -18759, -706088, -1678612, -2677921, -3276843, -3220134, -2533312, -1473030, -352687, 450182, 537980, -36290, -549897, -547518, -242760, 6961, -66849, -308055, -550186, -768646, -950883, -1065708, -1161495, -1316678, -1507503, -1769680, -1830710, -1594488, -1443415, -1655165, -2113108, -2423984, -2247344, -1676185, -1096360, -711669, -608127, -690349, -647535, -391442, -47761, 365827, 1030347, 1836249, 2478750, 2697343, 2518947, 2287077, 2256251, 2617165, 3261216, 3588781, 3418386, 3235326, 3216942, 2941832, 2163372, 1373838, 1107134, 1343968, 1576632, 1497091, 1103363, 306541, -789068]
10751g89068j065469o67074j65701J3319j61450m11242m07113j48258Q4762J64326
10741c552968J28415K16350K55384o2045k60332r5080K67216N35072P00798P74412
10731a092778P15390M56148J12641p1488n2041J38017K86912K96322J20766n3438
10721H56451k3651K00263M11442J04808p43977j211752q28110l48906j98578j70939
10711a952949j62060o9074J72283J94037j89167o93111p91151k50881N22609J076284
10701b143180J197892Q83661L68746n2184j9360L36720O92548R22081Q24322L44687
10691C355933j92247n45377p02624o55546m77020k03014l119r4778m28750o70545
10681f17087n33282l87038m49045l56424q1509p396r4650k67123m19585n08158
$$ y = [-789068, -1854537, -2521611, -2687312, -2673993, -2835443, -3246685, -3653798, -3802056, -3717294, -3552968, -3424553, -3208203, -2952819, -3014864, -3275196, -3370276, -3103060, -2567988, -1867190, -1092778, -377388, 78760, 191401, 119913, 67872, 205889, 492801, 789123, 909889, 856451, 832800, 1033063, 1444505, 1549313, 805336, -406416, -1234526, -1583432, -1782010, -1952949, -2115009, -2184083, -2011800, -1817763, -2006930, -2700041, -3491192, -3742073, -3219464, -2143180, -945288, -61627, 307119, 254935, 235575, 572295, 1264843, 2186924, 3011246, 3355933, 3163686, 2618309, 1915685, 1260139, 783119, 580105, 576986, 482208, 53458, -617087, -1150369, -1537407, -1986452, -2342876, -2424385, -2431781, -2526431, -2793554, -3213139, -3721297]
10671c721297n33533l03680K655K12687K38600J74290J51732Q7758J79022L73546
10661c138220K80738J75971K39831K54396L27368K85482q3534l11987k22840K435
10651b190360K25101L53526J76599j54765l77900m65845k79613J36200L18451
10642b258606L40903M54896O44009Q83164Q92149L51195k80381l60875j05202
10633E61252K12292M97284N43933K65216m3969l49358n21511k12221K62379J52900
10623A368197m55993p92287n85119j72203J70919K62372J03k25851k60012k91658
10613i81532j86768r4097k71400l05459j47770j02793j11462j75174k51102j84837
10603b812394J73558O98233R34115P90510N27782Q2598n27660q46226q22763q12199
$$ y = [-3721297, -4254830, -4558510, -4555855, -4343168, -4104568, -3930278, -3778546, -3690788, -3511766, -3138220, -2857482, -2681511, -2441680, -2187284, -1859916, -1574434, -1657968, -1969955, -2192795, -2190360, -1965259, -1611733, -1435134, -1589899, -1967799, -2433644, -2713257, -2577057, -2258606, -1917703, -1462807, -818798, 64366, 956515, 1307710, 1027329, 666454, 561252, 773544, 1270828, 1814761, 2079977, 2036008, 1686650, 1165139, 952918, 1215297, 1368197, 912204, 119917, -465202, -637405, -466486, -204114, -204011, -429862, -689874, -981532, -1168300, -1262397, -1533797, -1839256, -1987026, -2089819, -2201281, -2376455, -2627557, -2812394, -2638836, -1940603, -1006488, -215978, 311804, 394402, -133258, -979484, -1802247, -2614446]
10593b614446q33857p20308m69321k450N67995Q98682P50776L86892J00063k8235
10583a964209n5688k40920n28048o42489o26943p60957j049177j019628m62464
10574g350523K67938P77740J120071J354065J187443P55891L66424R477r5866
10565a607340J8980J12142J36655j05223n23256o53283n19583l46673j09573J24609
10555c472545L00040N50428Q00656O93090M19587L95631N21907N04354P0305m68333
10545C15120m14759K66211R57776J013771M49779j77017l82636k14424n9819j06568
10535A647434k46329l69967n23682o29586m79504k23546K27630Q77921J088517
10526A368888O97994J60794m01675p67241o77967m05270k98381l05051l75949
$$ y = [-2614446, -3448303, -4168611, -4637932, -4640382, -4072387, -3173705, -2422929, -2036037, -1935974, -1964209, -2019897, -2260817, -2788865, -3431354, -4058297, -4819254, -5868431, -6888059, -7350523, -7082585, -6304845, -5184774, -3830709, -2643266, -1887375, -1520951, -1511474, -1607340, -1588360, -1476218, -1339563, -1444786, -1968042, -2621325, -3140908, -3487581, -3597154, -3472545, -3172505, -2622077, -1821421, -1128331, -708744, -313113, 208794, 713148, 783453, 315120, -99639, 166572, 1124348, 2138119, 2587898, 2410881, 2028245, 1813821, 1754002, 1647434, 1401105, 1031138, 507456, -122130, -601634, -825180, -597550, 280371, 1368888, 2066882, 2227676, 1826001, 1058760, 380793, -24477, -322858, -627909, -1003858]
10517a003858o61085q74091o75634k92266l20835m66013j50888J42079N4523j465
10507d249533j8908J8252L98022R67316J165133P76230J82094l81026n75569o02037
10497b320026o63738k51761O06482J206803J103354P34089L82770J16586K31891
10488A146450N30957N74357N20750M59844J39257k58324l44601m40082p90067
10479A538541j113129j235062r31581l77631J15163L69210L90603M50799M15914
10470c77173P924o15048r01045n36199M0233K09600J46470K77464L79234L46846
10460a021694L97053L07720r0640m14071k50888J81401L90725J46410l97842p91741
10450a543567o62032j86367R2468P9188J21982K79002L34366K72878K54123J50420
$$ y = [-1003858, -1664943, -2539034, -3214668, -3506934, -3827769, -4293782, -4444670, -4302591, -4248068, -4249533, -4268441, -4250189, -3852167, -2884851, -1719718, -943488, -761394, -1142420, -1717989, -2320026, -2983764, -3235525, -2629043, -1422240, -318886, 415203, 797973, 914559, 1146450, 1677407, 2251764, 2772514, 3232358, 3371615, 3113291, 2768690, 2328608, 1538541, 425412, -809650, -1741231, -2118862, -2003699, -1634489, -1243886, -793087, -377173, -369249, -984297, -1885342, -2421541, -2381308, -2171708, -2025238, -1747774, -1368540, -1021694, -624641, -316921, -407561, -821632, -1072520, -891119, -500394, -353984, -751826, -1543567, -2205599, -2391966, -2299498, -2220310, -2098328, -1819326, -1484960, -1212082, -957959, -807539]
10440h07539J28845M16881N49428L94620K68164K20323O7207j84597m67815n34121
10430E1396n59557p99277q41864k92678M35259Q85796R23305O22761K06814p3574
10420E58381j64294m06102p03779p30739o79222p40801p16026m12048J61658O32296
10410c200676P17689M23599J34080J42688L11858L06959O9297j53310j85557j29490
10400a562863r0320O2402M42968P50139N92500K79537K59345J16454m52182p41139
10390c43159m23821M9132L14657L73683K33793k4308p3345Q3744L47159N13278
10380A050813K02107l49079p20386n11304J07574M14029K28114m1310N1694L46327
10370G78579L11467p785j46137q5104j93231n24635o92091l97548O0778K92129
$$ y = [-807539, -678694, -261813, 287615, 682235, 950399, 1170722, 1237929, 1053332, 585517, 51396, -508161, -1307438, -2149302, -2441980, -2006721, -1120925, -197620, 425141, 631955, 558381, 394087, -12015, -715794, -1446533, -2125755, -2866556, -3582582, -3994630, -3832972, -3200676, -2482987, -2059388, -1925308, -1782620, -1470762, -1163803, -1094506, -1247816, -1433373, -1562863, -1653183, -1590781, -1147813, -397674, 194826, 474363, 733708, 850162, 397980, -343159, -766980, -717848, -403191, -29508, 204285, 179977, 106632, 190376, 537535, 1050813, 1252920, 903841, 183455, -327849, -220275, 193754, 421868, 380558, 432252, 778579, 1090046, 1082261, 936124, 851020, 657789, 133154, -558937, -956485, -895707, -603578]
10360f03578Q6491k76091l80582k11742P9936N77722J095387J134994O86907K04934
10350B394378j13060n20432j069410j184008o69202j22628K06775M15551M21643
10341b40393L41130L37921L64795K11680l51889r17792r51260n26790j50080q4974
10331a967652k27097k58759j16967L4795J00851K8653p605j34488m43665o47265
10321c639199m89096j90415l6506k0900k816J98026N67402R55945J204777J180983
10311b71799R99630P96637M55995L715m18023n65566o41267q32658p06269l15934
10301a495539k43155o01947p84348m97236m5938L82786N88172N33858M70894M51489
10291a240964N45459N79845K42499j47305l65074m96956m55876k49696M5518K12620
$$ y = [-603578, -517087, -793178, -1173760, -1385502, -1305566, -727844, 367543, 1502537, 2189444, 2394378, 2281318, 1760886, 691476, -492532, -1161734, -1284362, -1077587, -662036, -240393, 100737, 438658, 803453, 1015133, 663244, -254548, -1205808, -1732598, -1882678, -1967652, -2194749, -2453508, -2570475, -2535680, -2434829, -2406176, -2413781, -2548269, -2991934, -3639199, -4128295, -4318710, -4355216, -4376116, -4378932, -4180906, -3613504, -2657559, -1452782, -271799, 727831, 1524468, 1980463, 1984178, 1566155, 1000589, 359322, -473336, -1179605, -1495539, -1738694, -2340641, -3124989, -3622225, -3668163, -3285377, -2697205, -2163347, -1692453, -1240964, -695505, -115660, 126839, -20466, -385540, -882496, -1338372, -1588068, -1542550, -1329930]
10281a329930K44843K25109J64691J50330J67728K02541L5424j75014m7780K80067
10271h1991M06939M97317N20171R5250n71159q38971m32979L33429Q64559R66077
10261A758642P58322M22372L1410l83233o57896n22612j77974j2637J05060K84200
10251A605654J38583l11732m45193l65406l81023l79406k24015q5521l9616M9078
10241d38597J00002M2056P4892O4939j048L6721J71032M42327P06960Q88173J080448
10230C167905R61711M13018k32029p06228r72452r94930o19628j30471L8815p0325
10220H55386p3023n6554j45401l08356n43990o12822m06607r3077J67036J80832
10210a036576O5348j05196l91824k61011K97682O22984L05824j61860m7099L90033
$$ y = [-1329930, -1085087, -859978, -695287, -544957, -377229, -174688, -139264, -314278, -362058, -81991, 324948, 822265, 1342436, 1437686, 866527, 27556, -405423, -71994, 792565, 1758642, 2516964, 2939336, 2970746, 2587513, 1929617, 1407005, 1229031, 1216394, 1321454, 1605654, 1744237, 1432505, 987312, 621906, 240883, -138523, -362538, -448059, -487675, -438597, -338595, -296539, -221647, -156708, -157756, -121035, 49997, 492324, 1199284, 2087457, 3167905, 4129616, 4542634, 4310605, 3604377, 2631925, 1636995, 1017367, 886896, 925711, 855386, 782363, 725809, 580408, 272052, -271938, -884760, -1291367, -1384444, -1217408, -1036576, -971228, -1076424, -1468248, -1729259, -1431577, -808593, -502769, -664629, -711728, -321695]
10200c21695O97484P29212L60980j52826l85968l26051r3485J07372K08202J92776
10190A016001Q9666K55570N30293L65686j75603m77667m04129m31397o92913q85477
10180h09970q74013o77905l10288K36598P24140O53485J73133l54983o79891l92335
10170b312029K69871Q28927R75620O89457L27614N7378j06240o2709Q4568K19497
10160I71954M87965P43322R17047J072646R23507L78874k52079o71714p10496
10151C861026p26195r27880j072744r87958p72593n65124k10273L11663P39582
10142c50496Q01244M78681L3626l72769o48496o15590m90336l15555M6117N01089
10132i32485P47586M49761j42754l22638j70013k4908J61501K02080N9101q0248
$$ y = [-321695, 375789, 1105001, 1465981, 1313155, 927187, 601136, 507651, 615023, 823225, 1016001, 1105667, 1361237, 1891530, 2257216, 2081613, 1603946, 1199817, 768420, 75507, -809970, -1683983, -2361888, -2672176, -2435578, -1711438, -1057953, -884820, -1239803, -1919694, -2312029, -2042158, -1213231, -237611, 451846, 779460, 836838, 730598, 667889, 752457, 971954, 1459919, 2203241, 3120288, 4192934, 5116441, 5495315, 5243236, 4571522, 3861026, 3134831, 2206951, 1134207, 146249, -626344, -1191468, -1401741, -1090078, -350496, 450748, 929429, 963055, 590286, -58210, -673800, -1164136, -1479691, -1433574, -932485, -184899, 264862, 122108, -200530, -370543, -395451, -233950, -31870, 27231, -53017]
10122e3017j15410o3490l1088L875R8408J68398J00176r4548k11449r0810L11173
10111B2218N94837L78859l38911r83159r73562o35565l07801j19329j54799l74552
10101b891764o69534o96140k51841M24084Q86296Q77930O76282N84221N34736
10092e25730L33436p1497l58964l76935l92117n61022o10691l13961P8388L22583
10082b476510N77751R03705Q01356J85872l44772n11993n13275m25991k29981
10073b033838m3132n5353k56089j86499J59772M34620O19977O63300N24813L27166
10063A54737K78433M68946N21163L18320k4544m86589p43360p46918m02266J70970
10053d91108M46987L07468j41482o28947p59389n94193m94371k96972K23273Q43479
$$ y = [-53017, -168427, -231917, -263005, -259130, -160722, 7676, 107852, 13304, -198145, -288955, 22218, 617055, 995914, 657003, -326156, -1299718, -1935283, -2243084, -2362413, -2517212, -2891764, -3561298, -4257438, -4509279, -4085195, -3198899, -2320969, -1644687, -1060466, -525730, -192294, -263791, -622755, -999690, -1391807, -1952829, -2563520, -2877481, -2799093, -2476510, -1898759, -995054, -193698, -7826, -352598, -864591, -1377866, -1803857, -2033838, -2076970, -2132323, -2388412, -2574911, -2415139, -1980519, -1360542, -697242, -172429, 154737, 433170, 902116, 1423279, 1741599, 1717055, 1230466, 487106, -259812, -662078, -491108, -44121, 263347, 121865, -507082, -1266471, -1860664, -2355035, -2652007, -2428734, -1585255]
10043a585255J111949P09121j19578p08591o58670l56384k16707j25647J49491
10034a800271O64651J126018J093861M49144k35644m36737j93944M1264M0021
10025G48363m6684j30768j50346p0615p0729k38041l76909k15010J93497K53532
10015a03710j26963l00643J2208M66499P83573Q44242N59939Q3042j25953k8984
10005B063250J58380J29962k86569p08740p66905m39604O3449N97735R58049Q05844
9995B574851N7497q03173r33887l00940L10480M86076J95140k60971m31070m08903
9985D85100m01685m22207l93406Q2407P17267Q02456M03220k2274j66345j14993
9975I69540O1825L84652M56833J7648m67001m76167l57988m94197o61822l51065
$$ y = [-1585255, -473306, 235815, 116237, -592354, -1251024, -1607408, -1824115, -1949762, -1800271, -1135620, -9602, 1084259, 1533403, 1297759, 861022, 667078, 708342, 748363, 701679, 570911, 420565, 349950, 279221, 41180, -335729, -550739, -357242, -103710, -230673, -531316, -519108, -52609, 730964, 1575206, 2135145, 2218187, 2092234, 2063250, 2221630, 2351592, 2065023, 1356283, 589378, 149774, 213223, 810958, 1769007, 2574851, 2632348, 1829175, 895288, 594348, 904828, 1390904, 1586044, 1325073, 894003, 485100, 83415, -338792, -732198, -649791, 67476, 869932, 1273152, 1250878, 1084533, 969540, 1031365, 1416017, 1872850, 1890498, 1423497, 947330, 589342, 95145, -566677, -917742]
9965i17742M21946R40549J019225R66447Q44163Q52199Q45637N41835L24959L89830
9955F229048N29515M87273J60675j97730l70984m90290o76003q27732q32366p71258
9945C240148p55166n90074k56525j4530J44407L54516N04522J63741m66257p35595
9935A589187o22905m33168l79337m96717o06362l46229J56764N43037P82504Q15664
9925A002438Q02953P17400L43352r4419j53236M1696m3315l92699m26651K2694
9915A820213M02471M06433J79668r0428k43895j69911j38654k36730j99637m2307
9905A687223j0783k68402n36180l91286j65620j05249Q4689M25690N20017M21612
9895A661711M55441L97973K34028L63327L92970L4771m10359q75998r00298n00587
$$ y = [-917742, -495796, 444753, 1463978, 2430425, 3274588, 4126787, 4972424, 5514259, 5839218, 6229048, 6758563, 7245836, 7406511, 7208781, 6837797, 6347507, 5671504, 4843772, 4011406, 3240148, 2484982, 1894908, 1638383, 1623853, 1768260, 2122776, 2627298, 2791039, 2324782, 1589187, 966282, 533114, 153777, -342940, -949302, -1295531, -1138767, -595730, 186774, 1002438, 1805391, 2522791, 2866143, 2771724, 2618488, 2660184, 2616869, 2224170, 1797519, 1820213, 2222684, 2629117, 2808785, 2718357, 2474462, 2304551, 2165897, 1929167, 1729530, 1687223, 1676440, 1408038, 871858, 480572, 314952, 209703, 294392, 720082, 1240099, 1661711, 2117152, 2515125, 2749153, 3112480, 3505450, 3540221, 3129862, 2253864, 1353566, 852979]
9885H52979r3161o37M1581L34855N37827M50106Q1726m40435o75980k02349M71319
9874A357831O47314O51268N71423P4765l80727n14629m23968j77855R4672K97934
9864B198028K67361L05054M89017L72370k3531k79465r2762K03334J13201k91126
9854C261481n97433n90992l72475k04802l42294n19352m92154l08947J26003O29897
9844E88932Q74982Q70325O39055L93923K80168J07507j38985l26138k80087r1391
9834B918291m3704P2060M80710P05370M55842J36474J75406L87399M36742L62616
9824F087206J73414j62131m80588l06943K48329K23385n06770j142644j467018
9815B666240j446149r12158k17731J87172J92296q2910l96797n69094n34505k73567
$$ y = [852979, 759818, 759181, 800762, 1135617, 1673444, 2123550, 2205276, 1764841, 1088861, 886512, 1357831, 2005145, 2656413, 3227836, 3302601, 2921874, 2407245, 1983277, 1805422, 1900094, 2198028, 2465389, 2770443, 3259460, 3631830, 3608299, 3328834, 3236072, 3439406, 3552607, 3261481, 2664048, 2073056, 1700581, 1495779, 1153485, 634133, 141979, -166968, -40965, 588932, 1463914, 2334239, 2973294, 3367217, 3647385, 3754892, 3615907, 3289769, 3009682, 2918291, 2874587, 2946647, 3427357, 4132727, 4588569, 4725043, 4900449, 5287848, 5724590, 6087206, 6260620, 6098489, 5617901, 5310958, 5559287, 5782672, 5275902, 4133258, 2666240, 1220091, 307933, 90202, 277374, 469670, 386760, -10037, -579131, -1113636, -1387203]
9805a387203J83615O37485P97754O84403M32217J98451Q286j85138l80981o56782
9795C32107q15259o01729N8767P49791J065616J068434P26615M4439m76534m82929
$$ y = [-1387203, -1203588, -566103, 231651, 916054, 1348271, 1546722, 1555008, 1369870, 988889, 332107, -483152, -1084881, -1026114, -276323, 789293, 1857727, 2584342, 2628781, 2152247, 1669318]
$$ [...]
##END NTUPLES=NMR SPECTRUM
##END=
