##TITLE=C13_LR-783-OK1
 CDCl3, 22400 sc

 6.3.2024
##JCAMPDX= 6.0         $$ Bruker NMR JCAMP-DX V2.0
##DATA TYPE= NMR SPECTRUM
##DATA CLASS= NTUPLES
##ORIGIN= UXNMR, Bruker Analytische Messtechnik GmbH
##OWNER= root
$$ XWIN-NMR		Version 3.5
$$ Thu Mar  7 13:37:29 2024 Russian Standard Time (UT+4h)  she@DPX200
##.OBSERVE FREQUENCY= 50.327896
##.OBSERVE NUCLEUS= ^13C
##.ACQUISITION MODE= SIMULTANEOUS
##.ACQUISITION SCHEME= undefined
##.AVERAGES= 15250
##.DIGITISER RES= 17
##SPECTROMETER/DATA SYSTEM= spect
##.PULSE SEQUENCE= zgpg30
##.SOLVENT NAME= CDCl3
##.SHIFT REFERENCE= (INTERNAL, CDCl3, 0, 222.646)
##AUDIT TRAIL= $$ (NUMBER, WHEN, WHO, WHERE, WHAT)
$$ ##TITLE= Audit trail, XWIN-NMR		Version 3.5
$$ ##JCAMPDX= 5.01
$$ ##ORIGIN= Bruker BioSpin GmbH
$$ ##OWNER= she
$$ F:/spectra/data/she/nmr/c13/1/pdata/1/auditp.txt
$$ ##AUDIT TRAIL=  $$ (NUMBER, WHEN, WHO, WHERE, WHAT)
(   1,<2024-03-07 09:31:16.07 +0400>,<she>,<DPX200>,
      <created by zg, POWCHK disabled, PULCHK disabled
       terminated by command 'halt'
       configuration hash MD5:
       00 E9 B6 7A A2 85 ED C7 34 08 36 98 17 FE 4E 26
       data hash MD5: 32K
       DF BA 6E 73 AD B7 8A 9B 18 A9 E6 3C E6 22 1C B0>)
(   2,<2024-03-07 13:35:49.32 +0400>,<she>,<DPX200>,
      <Start of raw data processing
       efp BC_mod = 2 LB = 2 FT_mod = 6 PKNL = 1 PHC0 = -378.0063 PHC1 = 24.92011 SI = 32K 
       data hash MD5: 32K
       CA 28 F7 FF 4E 10 34 B1 D3 7C B6 F5 B5 6C 77 94>)
(   3,<2024-03-07 13:35:51.96 +0400>,<she>,<DPX200>,
      <abs ABSG = 5 
       data hash MD5: 32K
       54 74 C3 10 C1 C6 8B C7 18 95 4F 0E 8C E3 E7 B4>)
(   4,<2024-03-07 13:36:45.01 +0400>,<she>,<DPX200>,
      <pk PHC0 = -9.837309 PHC1 = 16.8 
       data hash MD5: 32K
       F5 E0 44 DB C5 90 E3 FE 92 53 5D E7 4B C1 1D 7E>)
(   5,<2024-03-07 13:36:48.54 +0400>,<she>,<DPX200>,
      <abs ABSG = 5 
       data hash MD5: 32K
       DE F6 3C 93 76 70 7C 91 EA 9D A8 CC F9 1B AF EE>)
$$ ##END=
$$ 
$$ hash MD5
$$ E2 DD 6F C3 EC 93 92 04 B9 1F 7A BD 0A BC 72 17
##$RELAX= 
##$RELAX= 
##$RELAX= 
##$RELAX= 
##$RELAX= 
##$RELAX= 
##$RELAX= 
##$RELAX= 
$$ Bruker specific parameters
$$ --------------------------
##$DU= <F:/spectra>
##$EXPNO= 1
##$NAME= <c13>
##$PROCNO= 1
##$TYPE= <nmr>
##$USER= <she>
##$AMP= (0..31)
100 100 100 100 100 100 100 100 100 100 100 100 100 100 100 100 100 100 
100 100 100 100 100 100 100 100 100 100 100 100 100 100 
##$AQSEQ= 0
##$AQ_mod= 1
##$AUNM= <au_zg>
##$AUTOPOS= <>
##$BF1= 50.322709
##$BF2= 200.13
##$BF3= 50.322709
##$BF4= 500.13
##$BF5= 500.13
##$BF6= 500.13
##$BF7= 500.13
##$BF8= 500.13
##$BYTORDA= 1
##$CFDGTYP= 0
##$CFRGTYP= 5
##$CHEMSTR= <none>
##$CNST= (0..31)
1 1 145 1 1 1 1 1 1 1 1 1 1 1 1 1 1 1 1 1 1 1 1 1 1 1 1 1 1 1 1 1 
##$CPDPRG= <waltz16>
##$CPDPRG1= <>
##$CPDPRG2= <waltz16>
##$CPDPRG3= <>
##$CPDPRG4= <mlev>
##$CPDPRG5= <mlev>
##$CPDPRG6= <mlev>
##$CPDPRG7= <mlev>
##$CPDPRG8= <mlev>
##$CPDPRGB= <>
##$CPDPRGT= <>
##$D= (0..31)
$$ [...]
##$SUBNAM4= <"">
##$SUBNAM5= <"">
##$SUBNAM6= <"">
##$SUBNAM7= <"">
##$SUBNAM8= <"">
##$SUBNAM9= <"">
##$SW= 239.972175391363
##$SWIBOX= (0..15)
0 1 3 0 0 0 0 0 0 0 0 0 0 0 0 0 
##$SW_h= 12077.2946859903
##$TD= 32768
##$TD0= 1
##$TE= 0
##$TE2= 300
##$TE3= 300
##$TEG= 300
##$TL= (0..7)
120 120 120 120 120 120 120 120 
##$TP= (0..7)
150 150 150 150 150 150 150 150 
##$TP07= 0
##$TPNAME0= <>
##$TPNAME1= <>
##$TPNAME2= <>
##$TPNAME3= <>
##$TPNAME4= <>
##$TPNAME5= <>
##$TPNAME6= <>
##$TPNAME7= <>
##$TPOAL= (0..7)
0.5 0.5 0.5 0.5 0.5 0.5 0.5 0.5 
##$TPOFFS= (0..7)
0 0 0 0 0 0 0 0 
##$TUNHIN= 0
##$TUNHOUT= 0
##$TUNXOUT= 0
##$USERA1= <user>
##$USERA2= <user>
##$USERA3= <user>
##$USERA4= <user>
##$USERA5= <user>
##$V9= 5
##$VALIST= <valist>
##$VCLIST= <CCCCCCCCCCCCCCC>
##$VD= 0
##$VDLIST= <DDDDDDDDDDDDDDD>
##$VPLIST= <PPPPPPPPPPPPPPP>
##$VTLIST= <TTTTTTTTTTTTTTT>
##$WBST= 1024
##$WBSW= 4
##$XGAIN= (0..3)
0 0 0 0 
##$XL= 0
##$YL= 0
##$YMAX_a= 80539542
##$YMIN_a= -74167331
##$ZGOPTNS= <>
##$ZL1= 120
##$ZL2= 120
##$ZL3= 120
##$ZL4= 120
##$ABSF1= 222.646
##$ABSF2= -17.35081
##$ABSG= 5
##$ABSL= 3
##$ALPHA= 0
##$AQORDER= 0
##$ASSFAC= 0
##$ASSFACI= 0
##$ASSFACX= 0
##$ASSWID= 0
##$AUNMP= <proc_1d>
##$AZFE= 0.1
##$AZFW= 0.5
##$BCFW= 0
##$BC_mod= 2
##$BYTORDP= 0
##$COROFFS= 0
##$CY= -3
##$DATMOD= 1
##$DC= 0
##$DFILT= <>
##$DTYPP= 0
##$F1P= 0
##$F2P= 0
##$FCOR= 0.5
##$FTSIZE= 32768
##$FT_mod= 6
##$GAMMA= 0
##$GB= 0
##$INTBC= 1
##$INTSCL= 4.134877e-10
##$ISEN= 128
##$LB= 2
##$LEV0= 0
##$LPBIN= 0
##$MAXI= 10000
##$MC2= 0
##$MEAN= 0
##$ME_mod= 0
##$MI= 0.1934396
##$NCOEF= 0
##$NC_proc= 1
##$NLEV= 6
##$NOISF1= 120.0001
##$NOISF2= 80.00006
##$NSP= 0
##$NTH_PI= 0
##$NZP= 0
##$OFFSET= 222.646
##$PC= 1.4
##$PHC0= -387.8436
##$PHC1= 41.72011
##$PH_mod= 1
##$PKNL= yes
##$PPARMOD= 0
##$PSCAL= 0
##$PSIGN= 0
##$REVERSE= no
##$SF= 50.3227304925793
##$SI= 32768
##$SIGF1= 140
##$SIGF2= 120
##$SINO= 11.81781
##$SIOLD= 32768
##$SREGLST= <13C.CDCl3>
##$SSB= 0
##$STSI= 32768
##$STSR= 0
##$SW_p= 12077.2946859903
##$SYMM= 0
##$S_DEV= 0
##$TDeff= 32768
##$TDoff= 0
##$TI= <>
##$TILT= no
##$TM1= 0
##$TM2= 0
##$TOPLEV= 0
##$USERP1= <user>
##$USERP2= <user>
##$USERP3= <user>
##$USERP4= <user>
##$USERP5= <user>
##$WDW= 1
##$XDIM= 32768
##$YMAX_p= 445053953
##$YMIN_p= -2890090
$$ End of Bruker specific parameters
$$ ---------------------------------
##NTUPLES= NMR SPECTRUM
##VAR_NAME=  FREQUENCY,     SPECTRUM/REAL,   SPECTRUM/IMAG
##SYMBOL=    X,             R,               I
##VAR_TYPE=  INDEPENDENT,   DEPENDENT,       DEPENDENT
##VAR_FORM=  AFFN,          ASDF,            ASDF
##VAR_DIM=   32768,         32768,           32768
##UNITS=     HZ,            ARBITRARY UNITS, ARBITRARY UNITS
##FACTOR=    0.368581032318806, 1,           1
##FIRST=     11204.1544566776, 0,            0
##LAST=      -873.140229312654, 0,           0
##MIN=       -873.140229312654, -2890090,    0
##MAX=       11204.1544566776, 445053953,    0
$$ Real data points
##PAGE= N=1
##DATA TABLE= (X++(R..R)), XYDATA
$$ [...]
15756c53710J029J05076R4078R720l8532k5263P1134J99492K14452P5601r4890
15745B58187j70051j77387k57026k93240k29253k12650j72903r7417r7J61463
15735a190374K55278J72811j7817j06428n2951l1577m6496r371P0221J24526J29215
15724g02963J48423J84646K09991J51446L3003m7131q6988p0431k4283r8177l38538
15713f41002m63927k96002n6572J7053k5353k0280M6022Q9672P9898N8226N4497
15702a157768N1775P0961R5311M668j26641j84980o9731J52693K88916K88730
15692e86066J12043j23116j88607q5638P3552J58323N8150q5492j35716j28689
15682i31256j01399m8953n211l693o7874j29025j7854K96138N99867P03357O11622
$$ plain form
15756 -353710 -352681 -247605 -153527 -143807 -182339 -207602 -136468 63024 277476 353077 258187
15745 258187 88136 -89251 -346277 -639517 -868770 -1081420 -1254323 -1351740 -1351837 -1190374
15735 -1190374 -935096 -762285 -780102 -886530 -939481 -971058 -1017554 -1026925 -956704 -832178 -702963
15724 -702963 -554540 -369894 -159903 -8457 24546 -22585 -109573 -180004 -204287 -302464 -641002
15713 -641002 -1104929 -1400931 -1457503 -1440450 -1465803 -1486083 -1440061 -1350389 -1270491 -1212265 -1157768
15702 -1157768 -1105993 -1035032 -939721 -935053 -1061694 -1246674 -1316405 -1163712 -874796 -586066
15692 -586066 -474023 -597139 -785746 -871384 -797832 -639509 -581359 -666851 -802567 -931256
15682 -931256 -1032655 -1081608 -1086819 -1090512 -1158386 -1287411 -1305265 -1009127 -409260 294097 905719
15671I05719L99164K03898J04362l6455k78352m87470n32025m36783l18099k68588
15661g44629j67737P1185K97122L67323L20358K57201J78369N2949q4536j89394
15651C58211k08130j69995j34857o458K75778M94898M45764L18848J96454k0242
15641A550271k43029l45016k78587j53463p2199J596L7353M6128J03880J43671
15631G90605Q8907m3876j33767j05102o1033k1136L6369J6483o4316o7686J3292
15620D48740P2784O756j64396k24462j33650j9287j6478q3535j12405j10757r6154
15609d32844o3512l7601q9160j87047j32986O0190K07228K42805K18942J34279
15599g9706k7681j78279k26861j06972L6474O5712L7025j0547j4735M8049J65638
$$ plain form
15671 905719 1304883 1508781 1613143 1576688 1298336 810866 278841 -157942 -476041 -744629
15661 -744629 -912366 -841181 -544059 -176736 143622 400823 579192 632141 547605 358211
15651 358211 150081 -19914 -154771 -161229 114549 609447 1055211 1374059 1570513 1550271
15641 1550271 1307242 962226 683639 530176 457977 459573 496926 543054 646934 790605
15631 790605 879512 835636 701869 596767 535734 514598 550967 567450 503134 435448 448740
15620 448740 521524 528280 363884 139422 5772 -13515 -29993 -113528 -225933 -336690 -432844
15609 -432844 -496356 -533957 -623117 -810164 -943150 -882960 -675732 -432927 -213985 -79706
15599 -79706 -107387 -285666 -512527 -619499 -583025 -517313 -480288 -490835 -505570 -457521 -291883
15588b91883J82055R5033J09636J67070J9769k90647n10298n99224n92653n08268
15578b219410l56244k04943j09493J09049M26741N39475L02240o1607j90397m2559
15568a807148J60338K87003L03374K14930Q7209n1490j55810o3842J29143K82578
15558f13715M03886M15990K48552R0449J10891J32003M7331j14392k53590k03113
15548B64292m2041K5549M5533J25875K54897K49584L4149j66667j44380O7039
15538G13830K89337K98571O4595j17725r5690p5485j00598n7396L7530J17767
15528A074736N1971r7381j39188j13437j45493j73315m0535J92161K41788N9533
15518I10840j30219j43444p6793j35502k82125l56731k42643k0777R4139P8435
$$ plain form
15588 -291883 -109828 -14795 94841 261911 281680 -8967 -519265 -1118489 -1711142 -2219410
15578 -2219410 -2575654 -2780597 -2890090 -2781041 -2354300 -1814825 -1512585 -1574192 -1764589 -1807148
15568 -1807148 -1646810 -1359807 -1056433 -841503 -754294 -805784 -961594 -1025436 -896293 -613715
15558 -613715 -209829 206161 454713 545162 656053 788056 835387 720995 467405 264292
15548 264292 222251 247800 293333 419208 674105 923689 957838 791171 646791 713830
15538 713830 1003167 1301738 1366333 1248608 1152918 1077433 976835 919439 956969 1074736
15528 1074736 1126707 1029326 890138 776701 631208 457893 417358 609519 851307 910840
15518 910840 780621 637177 560384 424882 142757 -213974 -456617 -477394 -383255 -304820
15508c04820Q1953Q6403J06849J43894J04312P992m3011n4846p7592j20340j43861
15497b13067p0942L4861M8707m2501r9744K3972J82362K00321J66985J41281K7902
15486D00137j37562k93985l54097k36418n5870M4694J2475l9096p5686j75431
15476i10839k15059j22276l3210N2520J92556K47268J40869N1029J14882K42597
15466b39663K23323Q9553L3608K5087P2427R3381R893p3396o8758j2639O6368
15455B19184R6843N2485K687k392l3723j13881j78511j96630j76175j30933j3795
15444d74841J50052J69115l876r5839N7108K58255K64156J21242J1827l9335m3551
15433C74313O326p131j61109l95870m43803k72461m5327K26127L99411M49672
$$ plain form
15508 -304820 -222867 -136464 -29615 114279 218591 226583 183572 128726 51134 -69206 -213067
15497 -213067 -284009 -249148 -200441 -242942 -342686 -318714 -136352 63969 230954 372235 400137
15486 400137 262575 -31410 -385507 -621925 -677795 -633101 -620626 -659722 -735408 -910839
15476 -910839 -1125898 -1248174 -1281384 -1228864 -1036308 -789040 -648171 -597142 -482260 -239663
15466 -239663 -16340 73213 106821 131908 204335 297716 307609 234213 165455 152816 219184
15455 219184 316027 368512 371199 368807 335084 221203 42692 -153938 -330113 -461046 -474841
15444 -474841 -324789 -155674 -159550 -255389 -198281 59974 324130 445372 457199 417864 374313
15433 374313 380639 373508 212399 -183471 -627274 -899735 -945062 -718935 -319524 130148
15423A30148M07663K22828J01880J75918K54385J97408N3485q2418j19067j22964
15413A219266j75600k64917l10213k54965j93034j78356j86962j28388L203J14129
15403c55837J22802p163j44210j26416j5318Q2232J59912R9908m3254j09928r0344
15392d27616m5744l0420K6648J01562J19905J06738O6197K1354K3280O7796J67708
15381A97408K25463J40859R8144K10037L35156L29318J48184o4570j31069r9074
15371A389856m8788L0834J06845J75712K58614K46659Q6517j09481k72645l75109
15361A489014l50671k32436r8799l3994r8903k03524k06435r1830O7450J16297
15351C56169K9331j25917l12950l88455k52268k0177J14201J19955J31399K09040
$$ plain form
15423 130148 537811 760639 862519 1038437 1292822 1490230 1543715 1461297 1342230 1219266
15413 1219266 1043666 778749 468536 213571 20537 -157819 -344781 -473169 -469966 -355837
15403 -355837 -233035 -240198 -384408 -510824 -526142 -443910 -283998 -184090 -227344 -337272 -427616
15392 -427616 -473360 -503780 -477132 -375570 -255665 -148927 -82730 -61376 -38096 29700 197408
15381 197408 422871 563730 661874 871911 1207067 1536385 1684569 1619999 1488930 1389856
15371 1389856 1341068 1371902 1478747 1654459 1913073 2159732 2246249 2136768 1864123 1489014
15361 1489014 1138343 905907 807108 773114 674211 470687 264252 172422 239872 356169
15351 356169 385500 259583 -53367 -441822 -694090 -714267 -600066 -480111 -348712 -139672
15341a39672K79238K55134J94011J28071P6067Q5888P8937L5046M5694L4313k0564
15330A052163J3875M1828m9349j59989k37868k93589k72548j75047j21999k07000
15320d09523k81999j42239J16639L11564L15902J95318O8466l0173k9670M3206
15310A57491N7423j2314l4540R498o0881k61483l29253j97911o7358J7690O0803
15299f60835P2595O9956L5619M6866J15149J06346L0637k6610o8393n5807K3901
15288c10576R6878J02272J56454K85130L15659J37570j26584k53673k76943k37702
15278a11515j20326n5057q3151r2096o9687l0794N8415N9979j5356j00067r1618
15267f51273K8701J21635K06931K63132K05184N0448k5077Q4439J59749J16653
$$ plain form
15341 -139672 139566 394700 588711 716782 792849 878737 957674 992720 1038414 1072727 1052163
15330 1052163 1066038 1107866 1058517 898528 660660 367071 94523 -80524 -202523 -409523
15320 -409523 -691522 -833761 -717122 -405558 -89656 105662 174128 143955 114285 157491
15310 157491 214914 202600 168060 177558 116677 -144806 -474059 -671970 -739328 -721638 -660835
15299 -660835 -588240 -518284 -482665 -435799 -320650 -214304 -183667 -210277 -278670 -334477 -310576
15288 -310576 -213698 -111426 45028 330158 645817 783387 656803 403130 126187 -111515
15278 -111515 -231841 -286898 -370049 -462145 -531832 -562626 -504211 -444232 -459588 -559655 -651273
15267 -651273 -622572 -500937 -294006 -30874 174310 224758 199681 284120 443869 560522
15257E60522P3894P2445M3861l5409j07450j01739l7420p1359k12326k80187j92188
15246b87356o1242J0169j7874m9745J8046N9673l3278o0338M9135J10038J35079
15235a27693J37549P7809p1632k62810l37551k28229n8213j1731q3088m2786J48500
15224h59875L10110L91513L15024R036k43370k62750j80833j02440k1639Q5795
15214e59429K10158K45192J41006J5173R414J76460L12822K78694J55164K8486
15204A013140q0120j80585k83055l64733l07249j00301J11256K16211Q3270j35774
15194b7940k00980j35754o2439o7206j12002j32061j49543j44163j18905j19685
15184a270678j31921j03404J6611J72546K45466J29136p1128j03500O2231K57831
$$ plain form
15257 560522 634416 706861 750722 715313 607863 506124 468704 397345 185019 -95168 -287356
15246 -287356 -348598 -338429 -356303 -406048 -388002 -328329 -361607 -421945 -372810 -262772 -127693
15235 -127693 9856 87665 16033 -246777 -584328 -812557 -870770 -882501 -965589 -1008375 -859875
15224 -859875 -549765 -158252 156772 165808 -77562 -340312 -521145 -623585 -645224 -559429
15214 -559429 -349271 -104079 36927 52100 61514 237974 550796 829490 984654 1013140
15204 1013140 933020 752435 469380 104647 -202602 -302903 -191647 24564 107834 -27940
15194 -27940 -228920 -364674 -427113 -494319 -606321 -738382 -887925 -1032088 -1150993 -1270678
15184 -1270678 -1402599 -1506003 -1489392 -1316846 -1071380 -942244 -1013372 -1116872 -1054641 -796810
15174g96810L56262L12393J19702j39828k84401k59200j16456J08394K67372K78785
15164a53787K18549J28342j4226j22337r7881r5659j73877j75077m8144J40808
15154c93289L16981M61312N27851M50682J85231j25755k38134j79486j03073l0564
15144H71756P6454J95641K17497Q6715j65801l94652m59791l35325j16600K6401
15134B295M6544L3809L6439J15102J50197K2214p5635j03229j38570j78125j79732
15123b68691j69594k06149k55908k52562j88635k00295k43654j83190r3287k7644
15113b089609L3252J49250K49160K58662K31319K67524L43032L50712L09078J65690
15103B68070j6832j13044j64497k25917k33632k04694j79649o8016R1453J38326
$$ plain form
15174 -796810 -440548 -128155 -8453 -148281 -432682 -691882 -808338 -699944 -432572 -153787
15164 -153787 64762 193104 178878 56541 -41340 -136999 -310876 -485953 -534097 -393289
15154 -393289 -76308 385004 912855 1363537 1548768 1423013 1184879 1005393 902320 871756
15144 871756 948210 1143851 1361348 1448063 1282262 887610 427819 92494 -24106 2295
15134 2295 48839 82648 119087 234189 384386 406600 330965 227736 89166 -88959 -268691
15123 -268691 -438285 -644434 -900342 -1152904 -1341539 -1541834 -1785488 -1968678 -2061965 -2089609
15113 -2089609 -2056357 -1907107 -1657947 -1399285 -1167966 -900442 -557410 -206698 102380 268070
15103 268070 251238 138194 -26303 -252220 -485852 -690546 -870195 -938211 -846758 -708432
15093g08432M7124L9447J46864J64627M1670p2591j08450j28842j22029o8178
15083g68790J5089P5595Q4692P1889O5155P1312J10386J54083J55461J47020J22895
15072C04787Q3098K2500o0774j03723j30454j29485k3960K7624j18098k31505
15062c59990n8942J56597J28432l0082j56359j81474j26059j9332R3035J40874
15052d13300Q4451m9555j51779j78141j91003j27454j2486J205L3780J60447K70103
15041e73732K72356J69948J02810Q6251L2528n4122j12503j26429j37967j81473
15031e22333k61209l05157k35832o9834P4818J51652J40065J59066L38518M66139
15021f4107L43392Q7207j24780j78590n0241R3642J02247K2625P7424K20791J91443
$$ plain form
15093 -708432 -661308 -621861 -474997 -310370 -268700 -341291 -449741 -578583 -700612 -768790
15083 -768790 -753701 -678106 -593414 -521525 -456370 -385058 -274672 -120589 34872 181892 304787
15072 304787 387885 410385 349611 245888 115434 -14051 -38011 -10387 -128485 -359990
15062 -359990 -418932 -262335 -133903 -163985 -320344 -501818 -627877 -647209 -554174 -413300
15052 -413300 -328849 -378404 -530183 -708324 -899327 -1026781 -1039267 -1038062 -1004282 -843835 -573732
15041 -573732 -301376 -131428 -28618 57633 90161 36039 -76464 -202893 -340860 -522333
15031 -522333 -783542 -1088699 -1324531 -1394365 -1319547 -1167895 -1027830 -868764 -530246 -64107
15021 -64107 279285 366492 241712 63122 12881 106523 208770 231395 308819 529610 721053
15010G21053M0999N563P9244J14137M3646j36840k81273k58206j49108p8037j54547
14999e3369k24909q4184Q3352J39637R7580q862r0218j17705r3641l3112M7390
14988c38041J53888K47147K25535R0136r5484k33327k42585j41905q7531j22292
14978e44459j22722m7048M0120O8306J0816j06229j90723k07622j45068K8074
14968a216555J03890J2342n6284p1885O8050M48780Q17893P89118L81691r1318
14958A185722l16028k14134j0484L9707p6480k20176k02762m5833J17167K49056
14948E05755K12622l7527k45957k83827j94883j4884J11236Q2000m2443q3410
14938H682j6173R533J5490R0642J46970J18633R1660J68176J81315K6512j22824
$$ plain form
15010 721053 762052 767615 846859 960996 1004642 867802 586529 328323 179215 101178 -53369
14999 -53369 -278278 -362462 -279110 -139473 -41893 -50755 -140973 -258678 -352319 -385431 -338041
14988 -338041 -184153 62994 288529 378665 283181 49854 -192731 -334636 -422167 -544459
14978 -544459 -667181 -714229 -674109 -605803 -594987 -701216 -891939 -1099561 -1244629 -1216555
14968 -1216555 -1112665 -1100323 -1156607 -1228492 -1160442 -711662 106231 895349 1277040 1185722
14958 1185722 869694 655560 645076 684783 608303 388127 185365 139532 256699 505755
14948 505755 718377 680850 434893 151066 -43817 -58701 52535 134535 92092 8682
14938 8682 -7491 2042 17532 108174 255144 373777 465437 633613 814928 841440 718616
14927G18616k13879k47948k02113o3613J17198K04786J88969J17429k8507j40043
14917D50895j02006J9953O5417q28o9047n8688j3305k1140m3528M3186J55653
14906D26562J65315J71026K17844K03387J02783o812l9679J7018L4185j6035j03524
14895A172070k40838l31925l02399j92299j19497j09743m4140N8923J04830J25852
14885A20834J30332O0610p9090j17094m0801J2862P9223R8654K2272k548P557
14874B92811n5620p0921O7453J88491J52228O2132K434m5353q2290j55776k47716
14863A07873k50619j04045N2934J3550j01497j54302j92885j87067j47737r9968
14853a063763j7488O9625J30460J74705J72452J24760J12517R5410M8331L9981
$$ plain form
14927 718616 504737 256789 54676 -8937 108261 313047 502016 619445 590938 450895
14917 450895 348889 368842 434259 433431 364384 305696 292391 271251 227723 270909 426562
14906 426562 591877 762903 980747 1184134 1286917 1280105 1240426 1257444 1291629 1275594 1172070
14895 1172070 931232 599307 296908 104609 -14888 -124631 -168771 -109848 -5018 120834
14885 120834 251166 311776 232686 115592 74791 87653 166876 265530 287802 285254 292811
14874 292811 237191 166270 233723 422214 574442 636574 639008 593655 511365 355589 107873
14863 107873 -142746 -246791 -193857 -180307 -281804 -436106 -628991 -816058 -963795 -1063763
14853 -1063763 -1081251 -1011626 -881166 -706461 -534009 -409249 -296732 -201322 -152991 -113010
14843a13010J31034K53291L24999K75775P9538j05985j25407o6483o9385j32971
14833D51396j61492j80538j67837L044K61723M07996L24283J42682J2476m7923
14823A045810q6269j43603j95908j78147o1640l388r8864j58432j48695j11464
14813a40600j2329Q3797J54289K64119K89119J63491N2738j9053n4323n3089r8528
14802F29631j67561k11187j91879j23305p4036J335J07980J74061Q5493n5446
14792A75086j10176o8148l1664p4390j21364r8718o457M0440J6621J2622J8188
14781b47960L0672P099r3464j15997K6016J28917J52001J81978Q3844r2780j52012
14770i1686l7829J08050J81251J63278R0771P8965J68292J92015P6459o7437j11906
$$ plain form
14843 -113010 18024 271315 596314 872089 951627 845642 720235 653752 584367 451396
14833 451396 289904 109366 -58471 -55427 206296 614292 938575 1081257 1093733 1045810
14823 1045810 959541 815938 620030 441883 380243 376855 277991 119559 -29136 -140600
14813 -140600 -152929 -69132 85157 349276 638395 801886 854624 835571 781248 728159 629631
14802 629631 462070 250883 59004 -64301 -138337 -137002 -29022 145039 230532 175086
14792 175086 64910 -3238 -34902 -109292 -230656 -329374 -335831 -295391 -278770 -266148 -247960
14781 -247960 -217288 -210189 -303653 -419650 -393634 -264717 -112716 69262 153106 60326 -91686
14770 -91686 -129515 -21465 159786 323064 413835 492800 661092 853107 929566 862129 750223
14759G50223m9458O3372K15955L21667L19614J71366k9303j23089j38941n7264
14749A444142P7898J5235k58937m25704l35450j18503L3090O2518O4940L9760
14739E98989k8492p3421p2310r4839j57751j58415j27132q5270J7383R0403O7754
14728b3101N078j8364L1250P9744L2294p5968j38726j00690j8534M8079O3209
14717a15729K4421l8752p6217j55J16118J24983P0726J6782r0381j40190J8893
14706h9501K15734K83242K40065J25520o0628j39091p1315o7222j48204j81997
14696A06603r8066J4266K2214o7817j14729j7808O5607Q5249N7591o6574j47171
14685a60635p4778j1230j7222K7830J07893J28293J58719J90670J10116p1955
$$ plain form
14759 750223 700765 764137 980092 1301759 1621373 1792739 1763436 1640347 1501406 1444142
14749 1444142 1522040 1537275 1278338 852634 517184 398681 431771 494289 559229 598989
14739 598989 570497 497076 424766 329927 172176 13761 -113371 -198641 -181258 -90855 -23101
14728 -23101 -18023 -36387 -5137 74607 106901 30933 -107793 -208483 -227017 -178938 -115729
14717 -115729 -91308 -130060 -206277 -206432 -90314 34669 105395 122177 31796 -108394 -89501
14706 -89501 126233 409475 649540 775060 714432 575341 504026 436804 288600 106603
14696 106603 8537 22803 45017 -22800 -137529 -155337 -89730 -4481 53110 -13464 -160635
14685 -160635 -235413 -246643 -263865 -236035 -128142 151 158870 349540 459656 387701
14675C87701k71528m05332l58136o6736J99443J64203r9743l27095m01199k52206
14665a430628M9087K13251J82754J98203L22374L58397K32139R1767k896p4047
14655A40401r9966o1683L2668J56508K15966J34118j0035p9398J9439J91686K52013
14644H91717J79839K6838r8641p0058O96K3258M2538j8649j53677k01071j80620
14633D42170j39195m8688P2424O8091r1143j87559q3032J14410K36255K47465
14623F31198J62811J7706j40453k67555l04668j53977L539m0347r7334p1222k8676
14612b88978j4061o2855j88385k41077j57146o1460K2642J03448J44753J35333
14602f07786Q4434K5320m579N4285K11074K87523K53196K12968K28222K82438
$$ plain form
14675 387701 116173 -289159 -647295 -714031 -514588 -350385 -450128 -777223 -1178422 -1430628
14665 -1430628 -1381541 -1168290 -985536 -787333 -464959 -106562 125577 217344 214448 140401
14655 140401 40435 -21248 11420 167928 383894 518012 507977 428579 448018 639704 891717
14644 891717 1071556 1098394 999753 929695 930391 953649 996187 977538 823861 622790 442170
14633 442170 302975 254287 326711 394802 303659 116100 33068 147478 383733 631198
14623 631198 794009 811715 671262 403707 99039 -54938 -51399 -91746 -189080 -260302 -288978
14612 -288978 -303039 -365894 -554279 -795356 -952502 -1013962 -991320 -887872 -743119 -607786
14602 -607786 -523352 -498032 -502611 -448326 -237252 50271 303467 516435 744657 1027095
14592A027095L26367L26862K38117J04110N531q8368j67753l01302m99424n67455
14582D03780l98433k21247j41846r3005n3491K7850Q7463O9916J9332m6556j58762
14571e04999k10695o2654J85957K40406Q3818r0499j23397l9107l5151q1793p4514
14560g12628l6591N0001J87844K48917J52648R933m3135l7975j2979N8952J36926
14549A913J42515J34304J25661P5142p7648k43278l11604k93288j89645j7328
14539f53256J22857K15318K18339J14553O7067O527r3587J75K04175K85085J38170
14528F25423j45865l09667j92683N7502J73935J38513R0876R0869M8883m7088
14518E30698j17476m4741J20458J39953K9221n0017q3623j71009k68016k80754
$$ plain form
14592 1027095 1353462 1680324 1918441 2022551 2028082 1939714 1771961 1470659 971235 403780
14582 403780 5347 -215900 -357746 -450751 -504242 -476392 -388929 -319013 -299681 -346237 -504999
14571 -504999 -715694 -778348 -592391 -351985 -268167 -358666 -482063 -521170 -556321 -638114 -712628
14560 -712628 -749219 -699218 -511374 -262457 -109809 -99876 -143011 -180986 -193965 -135013 1913
14549 1913 144428 278732 404393 479535 401887 158609 -152995 -446283 -635928 -653256
14539 -653256 -530399 -315081 -96742 17811 84878 91405 -2182 -2007 202168 487253 625423
14528 625423 479558 169891 -22792 34710 208645 347158 438034 528903 577786 530698
14518 530698 413222 368481 488939 628892 658113 608096 524473 353464 85448 -195306
14508a95306k67633k46906j90359q7662n726J0679l0906r0246l8333J03863K07973
14497h30562K47649K49265K15707J59625J46226J98498J95707O2564r5067j46791
14487D02821j22242j34321j54310j01511O6734J94749J78825J00679L7446k447
14477D66423k339P3796J50020M6100k61421n50530n93062m97035m32563l09946
14467a910557j19283L8252K30191M08206M69553N16710N41509M63687L25847K02660
14457A166775P0288l0244r5723j66594j70902q3984O8418J01956l7510j14929
14447G07551r2804q0217p3939j01353j58484j82586j59300j70530j97974j64020
14437f73656q1564O0591J41408R3741N0084J04190J23260K129r7932o8514j3844
$$ plain form
14508 -195306 -462939 -709845 -900204 -987866 -993592 -982913 -1013819 -1104065 -1142398 -1038535 -830562
14497 -830562 -582913 -333648 -117941 41684 187910 386408 582115 644679 549612 402821
14487 402821 280579 146258 -8052 -109563 -42829 151920 330745 431424 468870 466423
14477 466423 464084 537880 687900 734000 472579 -77951 -671013 -1168048 -1600611 -1910557
14467 -1910557 -2029840 -1991588 -1761397 -1353191 -883638 -366928 174581 638268 964115 1166775
14457 1166775 1237063 1206819 1111096 944502 773600 689616 758034 859990 822480 707551
14447 707551 614747 534530 460591 359238 200754 18168 -141132 -311662 -509636 -673656
14437 -673656 -755220 -694629 -553221 -459480 -409396 -305206 -181946 -179817 -277749 -346263 -360107
14426c60107n0532r9377j19952j44414j74541k11637j68609l5030J23481K35196
14416a005522K16575J67237J27512L5734j4138L9929L8772m5147j07095j35209
14406f81352j10632n1278l95N2853J28126J29018N5683K0107K8988K2354o810
14395d13338n6057j2377J95052L72171L32655J46123O4932J36038J38649L8337
14385I42185q9208j95649k44768k67928j93539n8752L3956P6057l3104j63269
14375a94019j25260j7645R4333J96792K01988J02293K6391k8829l3004Q1222J69800
14364D74062P1017j20728k33738k40993j54855j4461L96j67009l47155l62675
14354a096139j68734M4106J41279J96512K03038J02422k1873j21249j90988j53518
$$ plain form
14426 -360107 -410639 -510016 -629968 -774382 -948923 -1160560 -1329169 -1364199 -1240718 -1005522
14416 -1005522 -788947 -621710 -494198 -458464 -472602 -432673 -393901 -439048 -546143 -681352
14406 -681352 -791984 -843262 -843657 -790804 -662678 -533660 -477977 -457870 -428882 -406528 -413338
14395 -413338 -469395 -481772 -286720 85451 418106 564229 629161 765199 903848 942185
14385 942185 852977 657328 412560 144632 -48907 -107659 -73703 2354 -30750 -194019
14375 -194019 -319279 -336924 -242591 -45799 156189 258482 284873 256044 223040 304262 474062
14364 474062 545079 424351 190613 -50380 -205235 -219696 -219300 -386309 -733464 -1096139
14354 -1096139 -1264873 -1220767 -1079488 -882976 -679938 -577516 -599389 -720638 -911626 -1065144
14344a065144j0604O1726K0243p3705j48341j15588o2713n8787l7129n731J02527
14333a393246L78172N89721N20622L33219K55620K81176K43479M0966j56423k39825
14323H53481k71878k65170j91172j33470j95582k87336k35611j2749J96547L27775
14313b15165L96999L17628J66894J45633K28284K13113J62930J69058J83861J61779
14303A931014R6792O1596M9567M6402R4556J00590K9305o8958j34839j41229j39074
14292A925722j15788p0528n8015q2910j55735k21735k21547j57715j1908Q0682
14282I10523J05240J17112K4652j81053l22419k71659j31470p9551j10982j25227
14272f4834p9033P5052J74847J07246R345o0941j31130j51130j66977k18771j64701
$$ plain form
14344 -1065144 -1075748 -1014022 -993779 -1067484 -1215825 -1331413 -1394126 -1452913 -1490042 -1495773 -1393246
14333 -1393246 -1015074 -425353 95269 428488 684108 965284 1208763 1249729 1093306 853481
14323 853481 581603 316433 125261 -8209 -203791 -491127 -726738 -739487 -542940 -215165
14313 -215165 181834 499462 666356 811989 1040273 1253386 1416316 1585374 1769235 1931014
14303 1931014 2027806 2089402 2138969 2185371 2279927 2380517 2409822 2340864 2206025 2064796 1925722
14292 1925722 1809934 1739406 1681391 1598481 1442746 1221011 999464 841749 829841 910523
14282 910523 1015763 1132875 1157527 976474 654055 382396 250926 171375 60393 -64834
14272 -64834 -143867 -68815 106032 213278 222623 161682 30552 -120578 -287555 -506326 -671027
14261f71027K7065J90881K32566J77721R9245J5918k3352L5797N0344m1443j16773
14250b3058j62447k31384k65223k53854k18394j72691r4876P922Q2476N5099l100
14239a279530p0401j29179o1592O4594J91029K65117J92623J5056l0991Q8264
14229g55010K16060K95186K58446J97872J75930N1983j72394l33376l00297p7213
14219d42813J41853K65108L23769L80955L77381K37389K4418j18771j04355l5118
14209A049816k4862l5251L3189P3460L142o417P0638J32492J22847O8447m0114
14198A447387k09320l40049l26859k40642j93508j81151j56219p8655m1811j88654
14188e09481l51244l16192j35228Q0058J84961J10509L6872Q5535J19384K5540
$$ plain form
14261 -671027 -643962 -453081 -220515 -42794 56451 72369 49017 84814 135158 93715 -23058
14250 -23058 -185505 -416889 -682112 -935966 -1154360 -1327051 -1421927 -1414005 -1331529 -1276430 -1279530
14239 -1279530 -1349931 -1479110 -1540702 -1476108 -1285079 -1019962 -827339 -812283 -843274 -755010
14229 -755010 -538950 -243764 14682 212554 388484 440467 268073 -65303 -365600 -442813
14219 -442813 -300960 -35852 287917 668872 1046253 1283642 1308060 1189289 1084934 1049816
14209 1049816 1024954 989703 1022892 1096352 1099494 1093077 1163715 1296207 1419054 1487501 1447387
14198 1447387 1238067 898018 571159 330517 137009 -44142 -200361 -279016 -320827 -509481
14188 -509481 -860725 -1176917 -1312145 -1232087 -1047126 -936617 -899745 -814210 -694826 -669286
14178f69286p9652n157J74413L36004M16577M28390L72627K00903J8710j18828
14168A074701j71388j15062j34530l06085m81184m93658k95837j5540R9730J23311
14158g15542K19807K67074J67742k934j18329j23379m5401Q2726K08820K11085
14148A51669O9368j05528k25883k33865j26557N148Q3220J10033J04176Q6541
14138h1678L7924N5780J68484K19523J83764J07981N6953P4607M6163m6265j14001
14127G09235j31771p7168k2189k025M9561J17492K40786K99475K40350J94295
14117A618041J12397k294o8122r2415j34094k12005k25830j84877j85622j42637
14107D82542J0219J00743J06724J69087J83280K2747j39705q6144O6416M7568
$$ plain form
14178 -669286 -748938 -754095 -579682 -243678 172899 601289 973916 1174819 1193529 1074701
14168 1074701 903313 788251 653721 347636 -133548 -627206 -923043 -938583 -838853 -715542
14158 -715542 -495735 -228661 -60919 -63853 -182182 -305561 -350962 -268236 -59416 151669
14148 151669 221037 115509 -110374 -344239 -470796 -465648 -382428 -272395 -168219 -81678
14138 -81678 -43754 12026 180510 400033 583797 691778 748731 823338 869501 823236 709235
14127 709235 577464 500296 478107 476082 525643 643135 883921 1183396 1423746 1618041
14117 1618041 1730438 1728144 1660022 1567607 1433513 1221508 995678 810801 625179 482542
14107 482542 492761 593504 700228 869315 1052595 1075342 935637 849493 915909 963477
14097I63477j57206k76910j76583q2874j21034j89840k42597k13531p5570K0013
14087e52655L2349R9936J53833Q8597J1155j9637q9489k38250l75812k66813K5985
14076a130801J98155J17539M4492J26540J90035J88153J79948J61471J24443O2030
14066B62005m6595j41664j53211q7228K37Q7739J35735J49475J38548M2769q0346
14055C07464j36713p2496R3725K27716K25178J39199J13705J14619J9811j34118
14045H98090k33263k47183j29178M5222J52078J62681O9432l6226r6798n0027
14035E34828J64287M10189M76623L33854J92332O6580r7381k34884l10282l81828
14025A154318m62460m61127k80661j8138J95877K86738J27792j27480k24309k05761
$$ plain form
14097 963477 806271 529361 352778 269904 148870 -40970 -283567 -497098 -572668 -552655
14087 -552655 -520306 -420370 -266537 -177940 -166785 -186422 -275911 -514161 -889973 -1156786 -1130801
14076 -1130801 -932646 -815107 -770615 -644075 -454040 -265887 -85939 75532 199975 262005
14066 262005 215410 73746 -79465 -166693 -166456 -78717 57018 206493 345041 387810 307464
14055 307464 170751 98255 191980 419696 644874 784073 897778 1012397 1032208 898090
14045 898090 664827 417644 288466 333688 485766 648447 717879 681653 584855 534828
14035 534828 699115 1109304 1585927 1919781 2112113 2178693 2081312 1846428 1536146 1154318
14025 1154318 691858 230731 -49930 -68068 127809 414547 542339 414859 190550 -15211
14015a5211j31434K033J17258J66357J24452N0742M2249K7975p8057k20725l13624
14004b27985k78576j00591O7183J03695O8724N0413j6129k06690l67743l20860
13994a228559q3685J65935K11788P2748p279j3853j5691N5046J91911K36303J34871
13983b80465k6054j21217n8517m675p5121r2283q8202j42553k02701k97430l54868
13972a744086k95702j77041r1617p0925p0149m1290N1563K23731L04546K52346
13962a658624K03950J84497J95311J44795L0627j9711J1167P7710J53052K19685
13952d57541K87836L50761L39515J57950q8506j92699j34133l4846M6915J03960
13942C79212N3734q2579k06264k52143j73021n9712L7989J26454J16553L6768
$$ plain form
14015 -15211 -146645 -144612 -27354 139003 263455 314197 356446 384421 306364 85639 -227985
14004 -227985 -506561 -607152 -539969 -436274 -367550 -317137 -333266 -539956 -907699 -1228559
13994 -1228559 -1312244 -1146309 -934521 -861773 -869052 -882905 -898596 -843550 -651639 -415336 -280465
13983 -280465 -306519 -427736 -486253 -490928 -566049 -658332 -746534 -889087 -1091788 -1389218 -1744086
13972 -1744086 -2039788 -2216829 -2308446 -2379371 -2449520 -2490810 -2439247 -2215516 -1910970 -1658624
13962 -1658624 -1454674 -1270177 -1074866 -930071 -899444 -919155 -907988 -830278 -677226 -457541
13952 -457541 -169705 181056 520571 678521 590015 397316 263183 228337 275252 379212
13942 379212 432946 350367 144103 -108040 -281061 -340773 -302784 -176330 -59777 -23009
13932b3009o4671k22496k57565j05774O784L5772N3128O6027L8809m2055r1179
13921f06229j14218p3904J3426L4411L6688J01700J13331J1150p194J22352K66309
13910a02178K51137N8483k07051m25927m12240j94557N5841L00907M10719K89402
13900B4536M4463j49377j01655J09402K36753K04048J16594l2659k02494l82881
13890a33270o06968o24804m12393j52789O3468K46692M36310N16784M81200L50027
13880A64257J37571n0691j24379p5444K230P9264J61501J87861J87094J92492
13870H61756J23591l9059j29279j31863j55365j51876j16530j31066j79418k63074
13860c12183l38342k90930j79963j01570n3466j2514k4120p4724q3037l4494Q3354
$$ plain form
13932 -23009 -87680 -310176 -567741 -673515 -666731 -630959 -577831 -511804 -472995 -515050 -606229
13921 -606229 -720447 -794351 -780925 -746514 -709826 -608126 -494795 -483645 -490839 -368487 -102178
13910 -102178 148959 207442 391 -425536 -837776 -1032333 -976492 -675585 -264866 24536
13900 24536 68999 -80378 -182033 -72631 164122 368170 484764 452105 249611 -133270
13890 -133270 -740238 -1365042 -1777435 -1930224 -1866756 -1620064 -1183754 -666970 -185770 164257
13880 164257 301828 251137 126758 51314 53544 132808 294309 482170 669264 861756
13870 861756 985347 946288 817009 685146 529781 377905 261375 130309 -49109 -312183
13860 -312183 -650525 -941455 -1121418 -1222988 -1276454 -1288968 -1313088 -1387812 -1470849 -1505343 -1421989
13849a421989J56387Q8052O2758R9978J36567K18302K85962K21987O5697q5429
13839a71728j81436j22801R3009K39709J94532M9067l7640l6048n5817j37718
13829a66871k62552k58037o8186R8792Q5771p4292j27654J8238J73650K74272
13819c06869L03847K56434J19796k00230n07847m87083k16270O8814K44930L44977
13809c79501L39484K34268J32364O7847l6930j51301j13946K1835J07626J10495
13799C32241M5030l0864n2082l8045k1224l5164k9375N8297J74358J46082Q782
13788E58036q1958p5546q1454j47483j96284k09575k16616k13738j82649j60461
13778a007728j47417r8784j2065M7993P8397Q4105P5794L9785j30475k00162K9965
$$ plain form
13849 -1421989 -1265602 -1177550 -1114792 -1014814 -878247 -659945 -373983 -151996 -86299 -171728
13839 -171728 -353164 -475965 -382956 -143247 51285 100352 62712 26664 -29153 -166871
13829 -166871 -429423 -687460 -755646 -656854 -571083 -645375 -773029 -754791 -581141 -306869
13819 -306869 -3022 253412 373208 172978 -334869 -821952 -1038222 -969408 -724478 -379501
13809 -379501 -40017 194251 326615 394462 357532 206231 92285 114120 221746 332241
13799 332241 377271 346407 294325 256280 235056 199892 170517 228814 403172 549254 558036
13788 558036 476078 400532 319078 171595 -24689 -234264 -450880 -664618 -847267 -1007728
13778 -1007728 -1155145 -1253929 -1265994 -1218001 -1139604 -1055499 -979705 -939920 -1070395 -1270557 -1240592
13767a240592K77433L42185K76263J65665M7242n0611o8598Q26M2604l0126o4138
13756c01847l5141l5772l6561r9766j21133r624R8575J46961J03282M2976M9264
13745a98786O0870k1550j33610j53689p3555L2821P0482L7122J2939j7933q404
13734c93293J9247l5694j77892k53971j44247O2377J91542K65165K89523J49804
13724b7439l7251j23645j42607q9689O0708K49932L72051L47783K11198Q0532
13714I01573k6503k24968l00159j04769N7887M555n8257m783Q8430O7808r8958
13703C01856k82857l51591k98516k67893l62515m77845l81646p2263K40836L80167
13693a572267L54823K44519J13472L6844l575m3473k806R8181Q9959j6894n5934
$$ plain form
13767 -1240592 -963159 -620974 -344711 -179046 -131804 -182415 -251013 -250187 -207583 -237709 -301847
13756 -301847 -336988 -372760 -409321 -509087 -630220 -639844 -541269 -394308 -291026 -248050 -198786
13745 -198786 -137916 -159466 -293076 -446765 -520320 -487499 -417017 -379895 -366956 -384889 -393293
13734 -393293 -374046 -409740 -587632 -841603 -985850 -923473 -731931 -466766 -177243 -27439
13724 -27439 -64690 -188335 -330942 -420631 -359923 -109991 262060 609843 821041 901573
13714 901573 875070 650102 349943 245174 303061 307616 249359 244576 333006 400814 301856
13703 301856 18999 -332592 -631108 -899001 -1261516 -1739361 -2121007 -2193270 -1952434 -1572267
13693 -1572267 -1217444 -972925 -859453 -822609 -826184 -869657 -872463 -774282 -684323 -701217 -757151
13682g57151k2153j2222k5350M8077K23761L46012L72805L50449K14127N9515
13672G97870m1305j66896k64569k66516j26384J08114K27941J02116o1762k4415
13662B84194R6323P3290p0621j51105p3834M6187Q2480r639j37562j89887j84533
13651b34707j73361k05637k27376j75343j43749j09031j06028j63011j14566N9934
13641a592875K38230L90196M95069L65914L0316j40064r1683k388P2670J32119
13631a02496R5022k634J8964Q5833P5021L9861j3541l4743O4169J54139J85329
13620E64924K28331K65004K29428M9213j29739j50615j17805m5543Q6615J81143
13610A160956R2178n8558j11960r0846q3925q9972m3180k2909r5709k55338l71261
$$ plain form
13682 -757151 -779304 -791526 -816876 -768799 -545038 -199026 173779 524228 738355 797870
13672 797870 756565 589669 325100 58584 -67800 40314 268255 370371 308609 284194
13662 284194 380517 453807 383186 232081 158247 204434 286914 277275 139713 -50174 -234707
13651 -234707 -408068 -613705 -841081 -1016424 -1160173 -1269204 -1375232 -1538243 -1652809 -1592875
13641 -1592875 -1354645 -964449 -469380 -103466 -73150 -213214 -304897 -307285 -234615 -102496
13631 -102496 -7474 -10108 8856 94689 169710 209571 196030 161287 225456 379595 564924
13620 564924 793255 1058259 1287687 1336900 1207161 1056546 938741 893198 979813 1160956
13610 1160956 1253134 1194576 1082616 991770 907845 817873 774693 751784 656075 400737 29476
13599B9476l77473k87844j26785L307k564K5216J63412K43515K05723J02021n3293
13588g5289j68892j79705q8630R721K3417J01464K63216L29178K80519J84875
13578F79874Q2738K3355K669K4795L7027k7256m7956m734P5937J64630J22019
13567A133098m3003j99887k90944l14909k13296p5995j04319j64555j821L07681
13557C2050M91408M32948K27075M2121p2651j48492k07754k07042j46487j65135
13547B78041j79872l9833R5488M5692o4693j07338j20522j14716j46966j72182
13537e26901j03638k2822k1411l8545l6168o7157o2606J888J11776K30543L16263
13526b18778L17237K58444K24291J67514M4755j20077k52381k28741j26429r6690
$$ plain form
13599 29476 -347997 -635841 -762626 -759319 -761883 -736667 -573255 -329740 -124017 -21996 -75289
13588 -75289 -244181 -423886 -512516 -502795 -479378 -377914 -114698 214480 494999 679874
13578 679874 762612 785967 788636 813431 850458 823202 775246 770512 846449 1011079 1133098
13567 1133098 1090095 890208 599264 284355 71059 -4936 -109255 -273810 -275631 32050
13557 32050 523458 956406 1183481 1225602 1152951 1004459 796705 589663 443176 278041
13547 278041 98169 58336 153824 199516 134823 27485 -93037 -207753 -354719 -526901
13537 -526901 -630539 -653361 -674772 -713317 -749485 -816642 -879248 -877360 -765584 -535041 -218778
13526 -218778 98459 356903 581194 748708 793463 673386 421005 192264 65835 -30855
13516c0855j02083o6563l2604K6277O2993K4894L7520J91444K81762J27539j54454
13505C65870k73409k16783j51892j21983m0265J62101L73542M06494K51647P5926
13495H31248l0551o8879k7831P4977K04453L12400L00612L10416L34418K28738
13485B470001J1768j35225j74039k60880k97903j67983j08830j24473q3759q7155
13475A041522j17016j10698j11122j46115j21109o5278n5563o0549o3523m3244
13465A47305n0194m8186J4468J39662J86029N4053n0901n2723o2693j01661j66577
13454H582j91402n3878J11322Q6520o9730j56147j14845O9809K69467K63687L9344
13443B62729j42174j58502j63194j89600j00828M4835R8945R0528O8494J21812
$$ plain form
13516 -30855 -132938 -199501 -232105 -205828 -142835 -117941 -80421 111023 392785 520324 365870
13505 365870 92461 -124322 -276214 -398197 -438462 -276361 97181 503675 755322 831248
13495 831248 800697 731818 703987 778964 983417 1295817 1596429 1906845 2241263 2470001
13485 2470001 2481769 2346544 2172505 1911625 1613722 1445739 1336909 1212436 1128677 1041522
13475 1041522 924506 813808 702686 556571 435462 370184 314621 254072 190549 147305
13465 147305 97111 48925 63393 203055 389084 443137 392236 339513 276820 175159 8582
13454 8582 -182820 -236698 -125376 -38856 -108586 -264733 -379578 -309769 -40302 223385 262729
13443 262729 120555 -37947 -201141 -390741 -491569 -446734 -347789 -257261 -188767 -66955
13433f6955K76298L18466J14820n3540l148J31203K65793K56116P0202l1350L4472
13422A312377P3288J3808r0691j98687j84575r3976j1659O1069Q9665O6014j0125
13411A026508j05151k20262k50061j55915n2950P8320J92496K07240J70940J69035
13401A060200K31924K89384K06602K5046j44335k02578j76752j37792l6017J04043
13391A219725J21114k3134j98956l54254l95984l20145k40675j78225j69284j27389
13381f67207J6542J36414J57201J63212K82892L90388L44920J88544m464j84123
13371H24319j82237o3993o2745j33000j00560N7729K45944K27532O038j35039
13361F83988j33742o3395L7204J27400J35505M2732j09902k33329j92719m8594
$$ plain form
13433 -66955 209343 527809 642629 589089 585941 717144 982937 1239053 1309255 1277905 1312377
13422 1312377 1385665 1399473 1308782 1110095 925520 831544 819885 880954 970619 1036633 1026508
13411 1026508 921357 701095 451034 295119 242169 320489 512985 720225 891165 1060200
13401 1060200 1292124 1581508 1788110 1813156 1668821 1466243 1289491 1151699 1115682 1219725
13391 1219725 1340839 1317705 1118749 764495 368511 48366 -192309 -370534 -539818 -667207
13381 -667207 -650665 -514251 -357050 -193838 89054 479442 824362 1012906 1008442 824319
13371 824319 642082 578089 515344 382344 281784 339513 585457 812989 819027 683988
13361 683988 550246 486851 524055 651455 786960 829692 719790 486461 293742 245148
13351B45148j2511q6291q5475N1950J95182K70043K35051M7800j68067k95257
13341C97573l38589k95801j12179J22717K04275J28933N2257j2554p5480m5891
13331B5261Q1048K56051M39091L94949P6128k04960k78956k46218k32388j97060
13321A12946p7018J46142K96750K18465L8802j6971J48259L15869K73339J06266
13311A562849m1718o3555r704L0764J1657L8427J61063K23875J14850m3177j55469
13300A829862l25767m55665l70134k15690j62908j28059L878J14497J37777J37640
13290E65431O7841M520L0707J63784L53143L95043K65995Q6451m7669p6155r3420
13279A715671j37610k00878k40854j72130n2813R926M326m8541j14503q2861R7017
$$ plain form
13351 245148 232637 146346 60871 112821 308003 578046 813097 860897 692830 397573
13341 397573 58984 -236817 -348996 -226279 -22004 106929 159186 146632 71152 25261
13331 25261 106309 362360 801451 1196400 1272528 1067568 788612 542394 310006 112946
13321 112946 35928 182070 478820 697285 736087 719116 867375 1183244 1456583 1562849
13311 1562849 1521131 1457576 1447872 1478636 1490293 1528720 1689783 1913658 2028508 1985331 1829862
13300 1829862 1504095 1048430 678296 462606 299698 171639 175517 290014 427791 565431
13290 565431 633272 637792 668499 832283 1185426 1580469 1846464 1932915 1885246 1809091 1715671
13279 1715671 1578061 1377183 1136329 964199 911386 921312 925638 877097 762594 679733 776750
13268G76750J96532M9151j29902j41534q3933n5248J0656J08021J61829K05876
13258A098198L08263L70454K83491Q4880o6519q4534j05621j92544k40261k72567
13248A183240l19604k30594L5535K72182L73526L61211J57800o9187j31563q5402
13238A547144k1146J0256K700o0934j35171j64502j14498j9163J2959k0587q8804
13227I48254j74926k06603p8733P4868N9466q1469k08693j92357q9906N3993J75335
13216B79229K54228K94623K14902Q4264N3832J08910J36085J16161J31494J74147
13206A847875M3886k43106l72007k53235j04939j7967L5513K5420k7478k4981
13196I08981N3843M3588j21591k02837k9192K14863K85359K16099J73912K36554
$$ plain form
13268 776750 973282 1022433 892531 750997 667064 611816 622472 730493 892322 1098198
13258 1098198 1406461 1776915 2060406 2145286 2078767 1994233 1888612 1696068 1455807 1183240
13248 1183240 863636 633042 668577 940759 1314285 1675496 1833296 1764109 1632546 1547144
13238 1547144 1525998 1536254 1538954 1478020 1342849 1178347 1063849 1044686 1057645 1037058 948254
13227 948254 773328 566725 487992 562860 622326 540857 332164 139807 49901 103894 279229
13216 279229 533457 828080 1042982 1127246 1181078 1289988 1426073 1542234 1673728 1847875
13206 1847875 1891761 1648655 1276648 1023413 918474 900507 936020 961440 933962 908981
13196 908981 962824 1006412 884821 681984 652792 867655 1153014 1369113 1543025 1779579
13186A779579L52315K95807K3389k35935l06427k40362j59034k9571J47662K03356
13176A830779J22279L3986l3905o9385p9783j03488j61040j98669j53634p6123
13166A111017j0187M3642P8251L2189j24186j90342l3310K12390L52473L28847
13156A800784J81877j812j54109k66713k85487j07526J65215L77450L75719J17872
13146B203270k02004l81654l41627k20097j35963O700J57942J79323J21442N1092
13136A438424J3974J25010K79964K72219R4047j47296l39953l67784k27541o8591
13126A072473J4423M7867K8778J6471Q3277K05757J85968q656j62625j66172o9268
13115A248293J3427M4920J09376J77065J46778M7447j9779l8841n7400j6626J08993
$$ plain form
13186 1779579 2131894 2427701 2451090 2215155 1908728 1668366 1509332 1479761 1627423 1830779
13176 1830779 1953058 1987044 1953139 1883754 1803971 1700483 1539443 1340774 1187140 1111017
13166 1111017 1100830 1144472 1222723 1254912 1130726 940384 907074 1119464 1471937 1800784
13156 1800784 1982661 1980849 1826740 1560027 1274540 1167014 1332229 1709679 2085398 2203270
13146 2203270 2001266 1619612 1277985 1057888 921925 928625 1086567 1265890 1387332 1438424
13136 1438424 1452398 1577408 1857372 2129591 2223638 2076342 1736389 1368605 1141064 1072473
13126 1072473 1086896 1134763 1163541 1180012 1263289 1469046 1655014 1646358 1483733 1317561 1248293
13115 1248293 1261720 1306640 1416016 1593081 1739859 1787306 1767527 1728686 1671286 1654660 1763653
13104A763653K47536K83750K49791K00391Q5569q1967p2052J05082J33760j5120
13094B900393j45139j34670k0968J43059L19812M16807L75657K16851K5018k3802
13084D073018J06421J62011N8454q1670j34720l2013N0673k9728j62299k58180
13074C751967k28017q0549L4308Q3792R7363O0213N5745P5181P5611R3578J50662
13063D169854J67406J09732P3740M686j00235p0955J10398K74758K72285J93247
13053E204916J52844R0372M5011P7754M4325l5030j2831L6391N269l6872m90J44216
13041E715875L55140M23285K67736N2781l3152K5279R2271J41367J88123K93786
13031G522491M79640M87491K98723J19702J5319N0148J50495K10696K41264K70113
$$ plain form
13104 1763653 2011189 2294939 2544730 2745121 2830690 2748723 2676671 2781753 2915513 2900393
13094 2900393 2755254 2620584 2599616 2742675 3062487 3479294 3854951 4071802 4096820 4073018
13084 4073018 4179439 4341450 4399904 4318234 4183514 4151501 4202174 4172446 4010147 3751967
13074 3751967 3523950 3443401 3477709 3561501 3658864 3719077 3774822 3850003 3925614 4019192 4169854
13063 4169854 4337260 4446992 4520732 4525418 4425183 4354228 4464626 4739384 5011669 5204916
13053 5204916 5357760 5448132 5493143 5570897 5615222 5580192 5567361 5603752 5609021 5572149 5571659 5715875
13041 5715875 6071015 6494300 6762036 6814817 6781665 6806944 6899215 7040582 7228705 7522491
13031 7522491 8002131 8489622 8788345 8908047 8923366 8973514 9124009 9334705 9575969 9846082
13021I846082L33670M26490M67062M09246L77932M38934N79188P87432Q79556
13012A4545592Q05959P58899P46304P86386R67942J107080J112458J135873J182938
13003B3149431J285014J505494J810270K132618K436869K780880L253491L774621
12995D2128688M228423M780100N547728O444532P429776Q492100R787603J1550960
12987A00389910J3742104J6329009J9344520K2988530K7479471L2737628L8386657
12980B71397829M3605961M6471902M3004308K8562497L110198k4987407m4729907
12973C66435381n1908146m9573081m2802863l5315928k8790107k3480184j9121412
12966A15443660j5530915j2607046j0218733q297969o867610n840066n088395
$$ plain form
13021 9846082 10179752 10606242 11073304 11482550 11860482 12299416 12878604 13666036 14545592
13012 14545592 15351551 16110450 16856754 17643140 18611082 19718162 20830620 21966493 23149431
13003 23149431 24434445 25939939 27750209 29882827 32319696 35100576 38354067 42128688
12995 42128688 46357111 51137211 56684939 63129471 70559247 79051347 88838950 100389910
12987 100389910 114132014 130461023 149805543 172794073 200273544 233011172 271397829
12980 271397829 315003790 361475692 404480000 433042497 436152695 411165288 366435381
12973 366435381 314527235 264954154 222151291 186835363 158045256 134565072 115443660
12966 115443660 99912745 87305699 77086966 68788997 61921387 56081321 50992926
12959E0992926m474806l879958l301966k905054k644260k369091k055488j662972
12951B7699331j276433r88983p78208o79868o85176p36615q11618p93568p30010
12942B0218852p71945q29106p50962n43845l17042j85369j38816j0357J56236
12933A6827646J83927K04010L17570M25329N21495O69487Q26171R15159R04871
12924B1795665Q03727P43696Q50279J119988J463359J667782J532488J145556
12916C1122540Q79107R35768J154830J465593J905450K367278K805006L228398
12908D5863970L660709M184696M983788O174837P633017R124976J0628641J2287411
12900A04542045J4273752J6819004K0114601K4320498K9334474L4924439M0758967
$$ plain form
12959 50992926 46518120 42638162 39336196 36431142 33786882 31417791 29362303 27699331
12951 27699331 26422898 25433915 24655707 23975839 23290663 22554048 21742430 20948862 20218852
12942 20218852 19446907 18617801 17866839 17322994 17005952 16820583 16681767 16671410 16827646
12933 16827646 17011573 17215583 17533153 17958482 18479977 19149464 19975635 20890794 21795665
12924 21795665 22599392 23343088 24193367 25313355 26776714 28444496 29976984 31122540
12916 31122540 32001647 32937415 34092245 35557838 37463288 39830566 42635572 45863970
12908 45863970 49524679 53709375 58693163 64868000 72501017 81625993 92254634 104542045
12900 104542045 118815797 135634801 155749402 180069900 209404374 244328813 285087780
12893B85087780M5921448M8003730M2190282K3850713m825583l2841429m9546998
12886C57839943n3317201m8961970m1658036l4301135k7800623k2410892j8113980
12879A11276106j4596417j1715793r538752p923304o661212n612370m750693m211539
12871D6266026l887457l515816k923678k237208j809556j713078j661805j498600
12863B7018828j326136j220473j195971j213682j234004j129534r03810o68191
12855A8127027m34105k47811j96108k19183k08553j85607k18391k44680j34757
12846A6037832L905O0469N0772p004Q856K17847N05421O44628O65351P08971P64814
12835A9661862Q27309R28175J045139J064026J059911J163258J372219J671394
$$ plain form
12893 285087780 331009228 379012958 421203240 445053953 440228370 407386941 357839943
12886 357839943 304522742 255560772 213902736 179601601 151800978 129390086 111276106
12879 111276106 96679689 84963896 75425144 67501840 60840628 55228258 50477565 46266026
12871 46266026 42378569 38862753 35939075 33701867 31892311 30179233 28517428 27018828
12863 27018828 25692692 24472219 23276248 22062566 20828562 19699028 18795218 18127027
12855 18127027 17692922 17445111 17249003 17029820 16821267 16635660 16417269 16172589 16037832
12846 16037832 16041737 16102206 16152978 16145974 16154830 16372677 16878098 17522726 18188077 18897048 19661862
12835 19661862 20489171 21417346 22462485 23526511 24586422 25749680 27121899 28793293
12827B8793293J978278K159830K259904K446241K850808L490454M207462M891653
12819E3077923N727698O881290Q220887R662025J1239157J3055122J5221236J7858600
12811A40943938K1148716K5213488K9986977L5325310M0874360M5364930M5627060
12804C84484779L6854483J5958952j2456176l7025955m9843487n1384771m6448858
12797B40138967l9298346l2188476k6001201k1014334j7157684j4106477j1613027
12790G8759422r525013p828157o556442n570888m769414m217962l829251l412916
12782C3049379k978906k603345k264343j993965j821796j668158j496669j258006
12774A6964191r81150p41092o31688p32712r04010r11754p84995o33982m37402
$$ plain form
12827 28793293 30771571 32931401 35191305 37637546 40488354 43978808 48186270 53077923
12819 53077923 58805621 65686911 73907798 83569823 94808980 107864102 123085338 140943938
12811 140943938 162092654 187306142 217293119 252618429 293492789 338857719 384484779
12804 384484779 421339262 437298214 424842038 387816083 337972596 286587825 240138967
12797 240138967 200840621 168652145 142650944 121636610 104478926 90372449 78759422
12790 78759422 69234409 61406252 54849810 49278922 44509508 40291546 36462295 33049379
12782 33049379 30070473 27467128 25202785 23208820 21387024 19718866 18222197 16964191
12774 16964191 15983041 15241949 14610261 13877549 12973539 12061785 11276790 10642808 10205406
12765A0205406k28536j94502l04902l69758m60246n83118n50830m24354m33926
12756F655234m54418l37257j74341p9015q0370j00473j57575l17038m47393m07518
12746D099836k57814j43730n0005k5943j29485k04373j81993p8330N0512Q1283
12736C159958j5055j02574p2289N8669J92165K12784P0637k08637m25504l51955
12726B518199j41357p4678q5267l4427K0092K1940P36k7927m0267M5861K21556
12715B424461K99464K36695J67857J28429L9523r0281r5233K038l0492j59519
12705B922942k31279j30120Q0198J68846J02696r300j21123j72435j50407j80652
12695B279366k57275j96074o5764k1761K345O7673J54828J72696J54013J19695
$$ plain form
12765 10205406 9976870 9782368 9477466 9107708 8647462 8064344 7513514 7089160 6655234
12756 6655234 6200816 5863559 5689218 5610203 5529833 5429360 5271785 4954747 4507354 4099836
12746 4099836 3842022 3698292 3648287 3622344 3492859 3288486 3106493 3028163 3078675 3159958
12736 3159958 3144903 3042329 2970040 3028709 3220874 3433658 3504295 3295658 2870154 2518199
12726 2518199 2376842 2302164 2216897 2182470 2202562 2224502 2225238 2197311 2157044 2202905 2424461
12715 2424461 2723925 2960620 3128477 3256906 3296429 3206148 3110915 3112953 3082461 2922942
12705 2922942 2691663 2561543 2641741 2810587 2913283 2903983 2782860 2610425 2460018 2279366
12695 2279366 2022091 1826017 1760253 1738492 1740837 1808510 1963338 2136034 2290047 2409742
12685B409742M3551q1860j89422k21751k72036l21982l19854k74401j15923O0215
12675G16279N1375j482J02836K64447K92647K32930J83997L2449j92529k16612
12665A466337r7245j0607O5840Q6684r080j84169l42687l15222r2324J14381J82698
12654H64606J42704O6980r303j2411K1025K1523J4754L4988O1702k477j04255
12643A099836j38142j18386p5109j6344m0311k35069m95936n10077j91074J51846
12633e68766L10263J57320j37628l07914k93115j80539m4541J44944L22030L92989
12623b04957L79256L89679M69026M28767K41896Q8631k45P530M7661l0983k07994
12612A608267k91536k34403j66210r5164o047K4238n4979j53279k53119k95124
$$ plain form
12685 2409742 2453293 2371433 2182011 1960260 1688224 1366242 1046388 771987 656064 716279
12675 716279 767654 766172 869008 1133455 1426102 1659032 1843029 1875478 1682949 1466337
12665 1466337 1369092 1358485 1424325 1511009 1501929 1317760 975073 659851 567527 681908 864606
12654 864606 1007310 1074290 1064987 1052576 1073601 1095124 1109878 1144866 1206568 1204091 1099836
12643 1099836 961694 843308 768199 751855 711544 476475 -19461 -529538 -720612 -568766
12633 -568766 -258503 -101183 -238811 -546725 -839840 -1020379 -1064920 -919976 -597946 -204957
12623 -204957 174299 563978 1033004 1461771 1703667 1792298 1792053 1799583 1847244 1816261 1608267
12612 1608267 1316731 1082328 916118 820954 814907 839145 784166 630887 377768 82644
12602H2644j68921L0616R6682o529j67828k00669o8344Q9147K41673K79528J85465
12591C93464J73699K90919L39527J63020j35471l67646m27585l27256j19668N0702
12581C3705Q5143J01370J71028K06331J80750R5472m6750j16750j16194j02918
12571D91187p9127m0827l3220n1661K5966K07029K99605K24713Q1318k0219n0693
12560A054071m7961j22602j96232j67032q7513o6628q0750j0591R0618J47135
12550E12515J19319L6882j09251k03513j20329R9256L14089L33362J83185M1384
12540A206899Q974n2494j40009r9880J3547M1032n3920j81420j53587J7714N6661
12529F63517q9375k38297k30209j31516j20256j99679j74533J8275K51701L65007
$$ plain form
12602 82644 -86277 -55661 41021 34492 -133336 -334005 -402349 -313202 -71529 207999 393464
12591 393464 567163 858082 1197609 1360629 1225158 857512 429927 102671 -16997 33705
12581 33705 118848 220218 391246 597577 778327 873799 827049 710299 594105 491187
12571 491187 412060 371233 338013 286352 312318 519347 818952 1043665 1124983 1104764 1054071
12560 1054071 1006110 883508 687276 520244 432731 366103 285353 274762 365380 512515
12550 512515 631834 668716 559465 355952 235623 334879 648968 982330 1165515 1206899
12540 1206899 1215873 1163379 1023370 923490 937037 978069 924149 742729 589142 606856 663517
12529 663517 574142 335845 105636 -25880 -146136 -345815 -520348 -502073 -250372 114635
12519A14635L50126K49367J52171J05575K9675p8952q3726P9245K09945J18103
12509A246164m1461o8724M7213J33718L9663p3684k3396J53395K69189J99832
12499A881909o775j42943o4194P1481O8672n8121k22478l83415m83295m65251
12489A95590k75166n8411j7385m5090Q427P1274M3133k5971k5064J34965L62185
12478C68487M78758L57963J51765P3622K197j36697k03500j39181Q405J05666
12468A067485J24550Q9177m8489k24809l92515m69222m02897l12786j83748k0537
12458g73791J42506L33299M41506L55435J79093N0865L0534J54455L30639L71445
12448A615986K47762M0345j51935k03044j46833j82347k69190l04427l37407l52862
$$ plain form
12519 114635 464761 714128 866299 971874 1001549 922597 838871 918116 1128061 1246164
12509 1246164 1204703 1135979 1183192 1316910 1356573 1282889 1259493 1412888 1682077 1881909
12499 1881909 1875134 1732191 1667997 1739478 1808150 1750029 1527551 1144136 660841 195590
12489 195590 -79576 -137987 -155372 -200462 -192035 -120761 -77628 -103599 -128663 6302 368487
12478 368487 847245 1205208 1356973 1430595 1432792 1296095 1092595 953414 961819 1067485
12468 1067485 1192035 1281212 1232723 1007914 615399 146177 -256720 -569506 -753254 -773791
12458 -773791 -631285 -297986 143520 498955 678048 728913 759447 913902 1244541 1615986
12448 1615986 1863748 1904093 1752158 1549114 1402281 1219934 950744 646317 308910 -43952
12438d3952k64976j06167L0300J14571J37122Q2618N9879J17269J44642O1797
12428C33103q7204j78855j82978j28208k5782J7723J1799k0935j36939j88766
12418e87042o0577J15379K16458K36615K24739K23786K27976K62519K83143K03840
12408A346836R3237k944r2080j94582l60283m35452l22566j13885J11692K46365
12398B76338J85541K8990o983N5260P1463N1476K411k1114O1864K7359k05388
12387E27217l54756k44300k5115J55185K66916K21992O370j37419j42926j65327
12377A07837j89072j35800k4181K929q6703j78497j69541o6135O1404J58672J95002
12366c24085J19212o5311j82154j32640J2835J89479K80832K23882N0692p6025
$$ plain form
12438 -43952 -308928 -415095 -384795 -270224 -133102 -50484 9395 126664 271306 333103
12428 333103 245899 67044 -115934 -244142 -269924 -252201 -240402 -261337 -398276 -587042
12418 -587042 -647619 -532240 -315782 -79167 145572 369358 597334 859853 1142996 1346836
12408 1346836 1440073 1437129 1345049 1150467 790184 354732 32166 -81719 29973 276338
12398 276338 461879 490869 483886 539146 610609 662085 664496 643382 705246 732605 527217
12387 527217 172461 -71839 -96954 58231 325147 547139 553509 416090 273164 107837
12377 107837 -81235 -217035 -241216 -238287 -324990 -503487 -673028 -739163 -677759 -519087 -324085
12366 -324085 -204873 -270184 -452338 -584978 -572143 -382664 -101832 122050 172742 96717
12356I6717q7954j01030j53451j75100j02539k919n419q8939n9881P5046J80088
12345d25381K34276K07331J36058R5840P9464R1344J57335J12721l2877n5714
12335F00397K9159L4936K6738J56151K22630J5069l06093m82198m13031k69890
12325c86132k34732k32598r2261J06857J48995M3473p8459n8113J73261M06336
12315b03373M00947K40571J12610p0711k90225l44975k96977k57942j66791j19634
12305i96500r9387m1627J7624O7253L5168m0129N1487K32533K72442J92139P8179
12294b30818n431n6421j16580j72520j17540j7661N1366O7428q173p3065q8206
12283g67621o8895J5025Q4451N4978m0629o6575L4193R5155K1920n5517n5330
$$ plain form
12356 96717 8763 -92267 -245718 -420818 -523357 -526276 -531695 -620634 -680515 -605469 -425381
12345 -425381 -191105 16226 152284 248124 327588 418932 576267 688988 656111 600397
12335 600397 629556 664492 691230 847381 1070011 1085080 778987 296789 -116242 -386132
12325 -386132 -620864 -853462 -945723 -838866 -689871 -646398 -724857 -782970 -609709 -203373
12315 -203373 197574 438145 550755 480044 189819 -155156 -452133 -710075 -876866 -996500
12305 -996500 -1095887 -1137514 -1119890 -1052637 -1017469 -1057598 -1006111 -773578 -501136 -308997 -230818
12294 -230818 -236249 -292670 -409250 -581770 -699310 -716971 -665605 -598177 -606350 -679415 -767621
12283 -767621 -836516 -821491 -737040 -682062 -722691 -789266 -755073 -659918 -637998 -693515 -748845
12272g48845k8655p898l6031l5694O8060J46462J21182N1901J6622K9426R1038
12261c32432J01098L2376m6714j28757j85921j55249R355J10250M5406M3213J61288
12250c46087K62295K71729K30142J61855K7846j03382j38065q5500K450L2445
12240C15728m8639j31174j39761l0038K11757M10464L43744Q137l40855m10894
12230A88469j63858J40849K49371J66665R633j12992j34128n6914L9844L0314
12220C57253o6799j85671k75392k22612k9732J61500K60013K49745J62171M4568
12210D55044q798L5843P9084M4708j8888m7558r4452j96691k36352j07990Q1967
12199a4083J66320J33368J15383J81248J89266Q4435m7188j78280k72866k61769
$$ plain form
12272 -748845 -777500 -785398 -821429 -857123 -789063 -642601 -521419 -469518 -452896 -423470 -332432
12261 -332432 -231334 -198958 -245672 -374429 -560350 -715599 -706244 -595994 -550588 -507375 -346087
12250 -346087 -83792 187937 418079 579934 607780 504398 366333 280833 283283 315728
12240 315728 267089 135915 -3846 -33884 177873 588337 932081 940218 599363 188469
12230 188469 24611 165460 414831 581496 591129 478137 344009 287095 326939 357253
12220 357253 290454 104783 -170609 -393221 -422953 -261453 -1440 248305 410476 455044
12210 455044 446246 482089 561173 605881 586993 539435 444983 248292 11940 -96050 -14083
12199 -14083 152237 285605 400988 582236 771502 855937 808749 630469 357603 95834
12189I5834j28837Q2050K23373J94128P9672n656j3168o481m4054r2248p8009
12178C06604J9801N5303M4446M9317N9736M5229M1118R9271R2195l2584j66085
12167F14351k20863j72521q3499k2455J24537K92034K14075l207j07979q8752
12157E45721l5866m9924q5351k2891K8005l2521j47124j67416j0472J98260L36970
12146E57391K60747J2006j57888j56152r1991m9665J180N2540L5721n1847j39636
12135B72406j68984j36233q8884n8532o2031r4779q1566O291K1915j3829M0213
12124c64013J35965K32753L17517K72615J39722O6013k3744q5913k511J06153
12114G94557l1585l19185m26498k79377p9781l8854j43856j83277j14467m2091
$$ plain form
12189 95834 -33003 49047 272420 466548 546220 540564 527396 520915 476861 384613 306604
12178 306604 326405 381708 426154 475471 535207 580436 621554 720825 813020 780436 614351
12167 614351 393488 220967 137468 115013 239550 531584 745659 742452 634473 545721
12157 545721 509855 459931 374580 351689 379694 347173 200049 32633 22161 220421 557391
12146 557391 818138 830144 672256 516104 424113 374448 375628 428168 463889 412042 272406
12135 272406 103422 -32811 -121695 -180227 -242258 -337037 -418603 -412312 -390397 -404226 -364013
12124 -364013 -228048 4705 322222 594837 734559 800572 776828 690915 688404 794557
12114 794557 762972 443787 17289 -262088 -341869 -380723 -524579 -707856 -822323 -864414
12104h64414j4368r6075j71479q0054P3519J43953J07872R329q2893k05900l88811
12093a569321l30653O3669K64286J52980Q4491Q0940J6386m745J32333K75204
12083h34430L17874K35302M7080o0276Q038J70286K66559J79835R6093J48094
12073E74455J67478J93502K42634J30842r8849k65150l13166l15345k69598j64413
12063a17610o5827n576L2390L443m8522M9304K34150K57109J35032N5376N9666
12052E88935P6147N3728j3087j15289k10278k34689k14221j96675j90718j36948
12042e93095k347J59499L08369K97572J72025M8781q141L5439Q9043O5759k7859
12031E45045j54366j42931M9998K25704J76121k0764q8709n1950m7269p0984q4020
$$ plain form
12104 -864414 -878782 -974857 -1146336 -1226390 -1152871 -1008918 -901046 -891717 -974610 -1180510 -1569321
12093 -1569321 -1899974 -1836305 -1572019 -1419039 -1334548 -1253608 -1237222 -1241967 -1109634 -834430
12083 -834430 -516556 -281254 -234174 -294450 -286412 -116126 150433 330268 426361 574455
12073 574455 741933 935435 1178069 1308911 1210062 944912 631746 316401 46803 -117610
12063 -117610 -183437 -189013 -156623 -153180 -201702 -152398 81752 338861 473893 529269 588935
12052 588935 665082 718810 705723 590434 380156 145467 -68754 -265429 -456147 -593095
12042 -593095 -595442 -435943 -127574 169998 342023 390804 382663 418102 507145 572904 545045
12031 545045 390679 247748 297746 523450 699571 678807 590098 538148 490879 419895 335875
12020C35875L999J05813J9016j49111j37107p432L5399K8052m7916j56389r6278
12009f6079Q5680J43805K3304n7684R810J36640K08017J14231m8065j25541j46574
11998B77544j59393j50013j46719j66602j77937j21028R699J74771K86089K39110
11988F5521J32400L7485o2036j05058J4785K47737K31210q3002l49213m59340
11978c29511n17054m84946l20944j16842N9996K33713L54136K25307o6950j83954
11968a147049n6363M2621M8931J26621K66075K59394J67438J49374L6488j76077
11958b82547j51106M5662R2012J6050l1779n1402p9057p6964l7585k3486q7597
11947f67799j35001q1624J9279J19041J82214K60529L36398K85610J20452J1543
$$ plain form
12020 335875 339874 445687 464703 315592 178485 171053 206452 234504 186588 30199 -66079
12009 -66079 19601 163406 186710 129026 138836 275476 483493 597724 549659 424118 277544
11998 277544 118151 -31862 -178581 -345183 -523120 -644148 -634449 -459678 -173589 65521
11988 65521 197921 235406 173370 68312 83097 330834 562044 479042 129829 -329511
11978 -329511 -846565 -1331511 -1652455 -1769297 -1709301 -1475588 -1121452 -896145 -963095 -1147049
11968 -1147049 -1203412 -1160791 -1111860 -985239 -719164 -459770 -292332 -142958 -106470 -282547
11958 -282547 -433653 -387991 -295979 -279929 -311708 -363110 -442167 -519131 -556716 -580202 -667799
11947 -667799 -802800 -884424 -865145 -746104 -563890 -303361 33037 318647 439099 450642
11937D50642J0368N1474O8178Q2099J68321K20353J88783R0956o0533j34216j14420
11926A022005j24190k01998k59247j99314n4716K4118p4090k12931j63443n2474
11916b96280p9405j72932j69155n5054N6823J00605O4233Q2959J59522J45089
11906a63595M2965P4491K05809K06299l8771l56747m39464l28131j76596l5230
11896a008970P5553J23258M7165n5247q7304j10043j36503m0824K28658N26379
11886d37878N55574K06262j99652l64607k59229r9274m5569k509Q5604J35251
11876d26027K40012L48482K49708K3544j12988j77879k14937j10230P9333J31112
11866C0130J8514p0858j14337j88201l08039l59082l00966k25856q7712J05639
$$ plain form
11937 450642 461010 512484 580662 662761 831082 1051435 1240218 1331174 1270641 1136425 1022005
11926 1022005 897815 695817 436570 237256 182540 206658 132568 -80363 -243806 -296280
11916 -296280 -375685 -548617 -717772 -772826 -716003 -615398 -551165 -468206 -308684 -163595
11906 -163595 -120630 -46139 159670 365969 327198 -29549 -469013 -797144 -973740 -1008970
11896 -1008970 -933417 -810159 -762994 -818241 -905545 -1015588 -1152091 -1192915 -964257 -437878
11886 -437878 117696 323958 124306 -240301 -499530 -598804 -644373 -646882 -561278 -426027
11876 -426027 -186015 162467 412175 435719 322731 144852 -70085 -180315 -100982 30130
11866 30130 48644 -22214 -136551 -324752 -632791 -991873 -1292839 -1518695 -1606407 -1500768
11856a500768J92213J69237J70382J95000J67842Q2504m6168j18187n9692j1848
11846g59485j09850j96260j01356J30584L14698M11985M17850K30170o5283k44907
11836B8146k31663j90660k40788k32384j16668r1082j68370k28966k98910l48489
11826b119834k03580R2694L53896M74101L92761K20092J51219J27332O7132N5601
11816c88586P9031R4918O3159l9445j09448k7439J35489J97370J31446P4232N359
11805B16086j41091k84221k65319o7005J22429J69981J77108K41254K53476K39485
11795F62183K49268K07388N0572j62087l24711l77974l24509k45032j72158j43667
11785e80727j50447j06278p5480n1463K0710K8922k3411l3714n1323q0586m4779
$$ plain form
11856 -1500768 -1308555 -1139318 -968936 -773936 -606094 -523590 -569758 -687945 -747637 -759485
11846 -759485 -869335 -1065595 -1166951 -1036367 -721669 -309684 108166 338336 273053 28146
11836 28146 -203517 -394177 -634965 -867349 -984017 -1075099 -1243469 -1472435 -1771345 -2119834
11826 -2119834 -2323414 -2230720 -1876824 -1402723 -1009962 -789870 -638651 -511319 -444187 -388586
11816 -388586 -309555 -214637 -151478 -190923 -300371 -327810 -192321 5049 136495 210727 216086
11805 216086 74995 -209226 -474545 -541550 -419121 -249140 -72032 169222 422698 662183
11795 662183 911451 1118839 1169411 1007324 682613 304639 -19870 -264902 -437060 -580727
11785 -580727 -731174 -837452 -912932 -964395 -943685 -914763 -938174 -971888 -1023211 -1103797 -1148576
11774a148576k4957r4632r2939J6182J42536J78993J27005M8566o1899r8400n3946
11763a062067j8265K8060Q3528P4135J1213p5261q9313l5690N2166J83874J70789
11752f76831r2340m41407n14810k95445m5833J67000L33347M99994P13769P90508
11742D37952O19542M38814L01065Q1466j19671j92974k21613k45164j52825l9946
11732I06646n2046j20664j84618j85320j18451p4341o8266L9951J65357K10072
11722E18320K00086J48149J2457j64165k46520j76426j6352P4445J22224J46819
11712F19037J26014J51953K06304J85668O5720j12284k67007l43259k38244p4470
11702C19432k3860k8006j18195j93896q3506O6156L4513r2217j22635k9225J01659
$$ plain form
11774 -1148576 -1173533 -1268165 -1361104 -1344922 -1202386 -1023393 -896388 -847822 -909721 -1008121 -1062067
11763 -1062067 -1080332 -1052272 -968744 -894609 -883396 -958657 -1047970 -1083660 -1031494 -847620 -676831
11752 -676831 -769171 -1210578 -1725388 -2020833 -2066666 -1899666 -1566319 -1066325 -352556 437952
11742 437952 1057494 1496308 1797373 1878839 1759168 1566194 1344581 1099417 946592 906646
11732 906646 854600 733936 549318 363998 245547 171206 102940 142891 308248 518320
11722 518320 718406 866555 879012 714847 468327 291901 275549 349994 472218 619037
11712 619037 745051 897004 1103308 1288976 1354696 1242412 975405 632146 393902 319432
11702 319432 295572 267566 149371 -44525 -128031 -61875 -27362 -119579 -242214 -271439 -169780
11691a69780K25440K82655L13766K86982J61728M8292L5147O2564j712p2703k8548
11680A143831Q847r1642j94804j19080p837K4390N2669J66981K64357J31734j59041
11669A220405m10000m75173l87879k31001l6733J34304K28842K41110J10846r0522
11659C04199j21976P8803K59927J68376r1015k24513k23023k32736j97167k0518
11649b99643J49070J71711J46274J24479j8325q7233K4570J15734N5078j9192
11639C62523P1332K28545K36064N3673j22318j86470k58662k59849n9839J61413
11629B26412K71987L10811K98038J66562P73j11836j40352j00420J1183J07262
11619A040420J67947L25478M80104M91516N24991O24335O40314N74009M92323
$$ plain form
11691 -169780 55660 338315 652081 939063 1100791 1149083 1184230 1246794 1245082 1172379 1143831
11680 1143831 1152678 1061036 866232 747152 739315 763705 816374 983355 1247712 1379446 1220405
11669 1220405 810405 335232 -52647 -283648 -320381 -186077 42765 283875 394721 304199
11659 304199 182223 261026 520953 689329 598314 373801 150778 -81958 -279125 -299643
11649 -299643 -150573 21138 167412 291891 273566 186333 210903 326637 381715 362523
11639 362523 433855 662400 898464 952137 829819 643349 384687 124838 64999 226412
11629 226412 498399 809210 1107248 1273810 1274583 1162747 1022395 921975 933158 1040420
11619 1040420 1208367 1533845 2013949 2505465 3030456 3654791 4295105 4869114 5361437
11610E361437M75483M86708L72827J61660J8644M7764J13502Q2693m0124k90756
11600F789838n71131o85675n91211m35715k95651k23301k77836l64924m39716
11591B904678m39823l85107l10195j64672K3446J90971K80199K87385K08599J83495
11581B778976K51955K79098K03286J8770j86249k92431k19018l0825J58658L41984
11571C304204N23436O68290P74675Q59304Q81854Q21165P82726Q77700J053849
11562A0547203J169375J214958J382928J770024K231578K602554K850314L013570
11554B6782504L154715L242863L207931L115197L085871K944220K302645J072758
11546D8908704k30394j095434j654792k363400l258414l909849m121757m059209
$$ plain form
11610 5361437 5836920 6323628 6696455 6858115 6876759 6924523 7038025 7120718 7080594 6789838
11600 6789838 6218707 5533032 4941821 4506106 4210455 3987154 3709318 3344394 2904678
11591 2904678 2464855 2079748 1769553 1604881 1628327 1819298 2099497 2386882 2595481 2778976
11581 2778976 3030931 3310029 3513315 3532085 3345836 3053405 2834387 2803562 2962220 3304204
11571 3304204 3827640 4495930 5270605 6129909 7011763 7832928 8615654 9493354 10547203
11562 10547203 11716578 12931536 14314464 16084488 18316066 20918620 23768934 26782504
11554 26782504 29937219 33180082 36388013 39503210 42589081 45533301 47835946 48908704
11546 48908704 48678310 47582876 45928084 43564684 40306270 36396421 32274664 28215455
11538B8215455l718585l153041k610436k224249j946702j722088j509855j312767
11530A0017732j181119j011063p03653m70059n32149o87321p11518n90098m10989
11521C719763l22634l83095m46203l71202j85713l1298M583L8836J09096J61774
11511B293907J34171J8073j14082j52893n6490N6270O5315m5266k29164l31372
11501A638469l05620k97148k88652k23669j70944k02174j61888m0696K6908N2416
11491B7002Q0151J54462K37399K22519J14537o9879k21306k09073j91312k54012
11481a09512k24431k6588J52880J35860k846j43239j49696k4794L548K3214R8317
11470b67287O8135q5843j87107j68579m9961R1707J09589m5068k31565j92238
$$ plain form
11538 28215455 24496870 21343829 18733393 16509144 14562442 12840354 11330499 10017732
11530 10017732 8836613 7825550 7121897 6651838 6119689 5432368 4720850 4130752 3719763
11521 3719763 3397129 3014034 2567831 2196629 2010916 1979618 1984201 2023037 2132133 2293907
11511 2293907 2428078 2446151 2332069 2179176 2122686 2178956 2244271 2199005 1969841 1638469
11501 1638469 1332849 1035701 747049 523380 352436 150262 -11626 -52322 -25414 27002
11491 27002 107153 261615 499014 721533 836070 766191 544885 335812 144500 -109512
11481 -109512 -333943 -360531 -207651 -71791 -74637 -217876 -367572 -392366 -388818 -365604 -267287
11470 -267287 -199152 -284995 -472102 -640681 -690642 -598935 -489346 -534414 -765979 -958217
11460i58217k4037m7221k06346j91365R2118L69874M84907L92234J20739n1101
11450a8415J8769J29466N0265j79160k69950j02257K18840M48466N01768K30513
11440A028305r2846r0838m4520J9496J25711R1102j34515l88301m52231l36768
11430b75405k35373j95397j36911j6816J36306K68309K52686J07187P7536K22973
11420B05095K80535K18271J52853J08293N1502J3945P722n0909j63040j73451
11410F50816j11293k5263J6495J0655K3323k4517r9898j24526j35054j04545n0492
11399B5701k1778J18244K93598K75636J49626M6889j4399r1194k58942m34134
11389H9247m86942l48963j08217Q3816J71578P0236p9511o0378L5301R5853J09157
$$ plain form
11460 -958217 -982254 -1029475 -1235821 -1427186 -1335068 -965194 -480287 -88053 32686 -18415
11450 -18415 354 129820 180085 925 -269025 -371282 -152442 296024 797792 1028305
11440 1028305 935459 844621 800101 819597 945308 1036410 901895 513594 61363 -275405
11430 -275405 -510778 -706175 -843086 -859902 -723596 -455287 -202601 -95414 -17878 205095
11420 205095 485630 703901 856754 965047 1016549 1030494 1038216 987307 824267 650816
11410 650816 539523 514260 530755 541410 564733 540216 440318 315792 180738 76193 25701
11399 25701 3923 122167 415765 691401 841027 887916 873517 782323 523381 89247
11389 89247 -397695 -746658 -854875 -771059 -599481 -529245 -608756 -669134 -633833 -537980 -428823
11378d28823J66103K66184L38246K83450J02052K6793K8237j29493k93707k50281
11368A08761j15654j06036j76943j76619r3447O3701K62831L61827K48172Q6024
11358D62617j5020o2946n588Q8879Q0429L7080p622q8205j42139j61090j61009
11347B5386q6428k912l9204j12932r4384m8309l5816j9266O965l246k6087K7850
11335d08383J26989J12301M6276k566q0730j51666j77428n5098R7829Q9743R765
11324c92968M2500Q5579k357k8071J06418K09650K26089K78426L30562K84903
11314A140731J62959n2221l03811l84981k71734o6689K6948j4973l3746o4936
11304A37547q8943p7655j59720j99641j11164l4925l1175k5785O358m3207q9489
$$ plain form
11378 -428823 -262720 3464 341710 625160 727212 754005 782242 652749 359042 108761
11368 108761 -6893 -112929 -289872 -466491 -559938 -496237 -233406 128421 376593 462617
11358 462617 447597 384651 379063 467942 548371 585451 577829 489624 347485 186395 25386
11347 25386 -61042 -63954 -103158 -216090 -310474 -358783 -394599 -413865 -406900 -410146 -436233 -408383
11335 -408383 -281394 -169093 -122817 -125383 -206113 -357779 -535207 -590305 -492476 -402733 -392968
11324 -392968 -350468 -264889 -267246 -295317 -188899 20751 246840 525266 855828 1140731
11314 1140731 1303690 1251469 947658 562677 290943 224254 251202 236229 202483 137547
11304 137547 48604 -29051 -188771 -388412 -499576 -534501 -565676 -591461 -585103 -628310 -717799
11293g17799j0205O4992J00880J61066J38454P1766J01820J48333Q8544k6696
11283A21155j21854j68081j69817j19416k8256J07751J66910P7661m0573o1693
11273b36213K6169J12725J28475L9115n3932n6601l4573K7608J68706L13789K94007
11262G29275Q6860j21848k23595k69189k71858j84085q9291q7631p9608K27o738
11251e17481j23370j54183l1959J97322L66472L32348J49227r1101k44593k13539
11241c30857j05300J7292J17770J24108J00203J60112J48648O6198L5797O7733
11231D01704J45158J85273R8580r3533j74671j48549o0254J33954L22075L74186
11221A183923K28709j9559j41271r9633q9022j40928j33368r2206j27384j15648
$$ plain form
11293 -717799 -728004 -663012 -562132 -401066 -262612 -190846 -89026 59307 147851 121155
11283 121155 -699 -168780 -338597 -458013 -486269 -378518 -211608 -133947 -174520 -236213
11273 -236213 -210044 -97319 31156 70271 16339 -40262 -74835 -47227 121479 435268 729275
11262 729275 816135 694287 470692 201503 -70355 -254440 -343731 -431362 -510970 -510743 -517481
11251 -517481 -640851 -795034 -826993 -629671 -263199 69149 218376 127275 -117318 -330857
11241 -330857 -436157 -418865 -301095 -176987 -76784 83328 231976 298174 333971 401704
11231 401704 546862 732135 830715 737182 562511 413962 353708 487662 809737 1183923
11221 1183923 1412632 1393073 1251802 1152169 1063147 922219 788851 696645 569261 453613
11211D53613K8363J10691J9955j61757l50564m30849l81527k49230q1764J7378
11201a025691N1459J13651K01753K46138K49272J48571M635Q692J08274J70342
11191B77096R4669q249K6326Q6425J8694j53133k53166j78280j6114O9332O4412
11180B8012m2561j69290p4562J49027K20719J86626J63522J27777Q1063L3593
11170G03926n873o9865j11943j37982j40170n9864j2275m3652m5953M3160K26121
11159C45630L84570M02059L34594J96175o2326k47939k70672k24256j83093j60437
11149E14305j71647j85015q2105K0175N3377M3619k6105q4379j2944J50769K18102
11138D38152J01787j9252J2006J72253K76153J65293j08322k75766k52523j88455
$$ plain form
11211 453613 481976 592667 612622 450865 100301 -330548 -712075 -961305 -1043069 -1025691
11201 -1025691 -974232 -860581 -658828 -412690 -163418 -14847 -10212 -1520 106754 277096
11191 277096 371765 363516 389842 476267 494961 341828 88662 -89618 -105732 -36400 28012
11180 28012 -14549 -183839 -258401 -109374 111345 297971 461493 589270 670333 703926
11170 703926 698053 628188 516245 378263 238093 178229 165954 122302 76349 119509 345630
11159 345630 730200 1132259 1466853 1663028 1600702 1352763 1082091 857835 674742 514305
11149 514305 342658 157643 75538 95713 149090 192709 166604 82225 69281 220050 438152
11138 438152 539939 520687 532693 704946 981099 1146392 1038070 762304 509781 321326
11128C21326k22406k96633j87932J19049L17584K83792J37455k0465j64765k68421
11118A8584j75151m4567k1513L260J2212n2731j40885j33608l2080N3398J74413
11107c38668L04486K58051J02676q37k7191l5552j02235j94593j87898n636J68728
11096e8669J89510J36994L4940j30412k91321k69395j30090q178O9094J01902
11086c55625J03649R0752J55132K13464J24751k5899j13664o3111N0075Q8335
11076B67859J03743J62214K14533J97139R7480k4700j00689j29328j39459k13254
11066D35538k83966j55828K9524Q4603K006j42868j97940k20808k58277j80775
11056h88791j2050K9358m3619j01888j09502j05154j47104j89292j31229N4941
$$ plain form
11128 321326 98920 -197713 -385645 -266596 50988 334780 472235 451770 287005 18584
11118 18584 -156567 -201134 -222647 -219387 -207175 -259906 -400791 -534399 -566479 -513081 -338668
11107 -338668 -34182 223869 326545 325708 298517 262965 160730 -33863 -221761 -227397 -58669
11096 -58669 130841 267835 302775 172363 -118958 -388353 -518443 -526621 -457527 -355625
11086 -355625 -251976 -161224 -6092 207372 332123 306224 192560 129449 179524 267859
11076 267859 371602 533816 748349 945488 1042968 1018268 917579 788251 648792 435538
11066 435538 151572 -4256 25268 109871 111877 -30991 -228931 -449739 -708016 -888791
11056 -888791 -900841 -871483 -915102 -1016990 -1126492 -1231646 -1378750 -1568042 -1699271 -1644330
11046a644330K18997K76942K39649O3662j85809k37054o107K65014M01032M07536
11036b00468L34670K57833K07498J49888L3802j47593k92357l07126k84745l55853
11026f04451m28197l04065o8242M2102L5552P8627J39786J31380J01773J31281
11016g44454J56425J08020P441k1255M1469P5882R9136J37584J00495l2711j65590
11005b37558k29191j39042J3380J08913K02606K69345K21338O4815J1036R0033
10995C75675K9548j20601p3727O6643N0025q0305j57937j83468k13575j34101
10985d41823L5835Q3304m368r5612j67402j32677j9293M1931N7297O9699R2140
10974d80969P2081K2537J8826K4538M9556J5245j08393j41036q5216o8534j74423
$$ plain form
11046 -1644330 -1425333 -1148391 -908742 -845080 -1030889 -1267943 -1274050 -1009036 -608004 -200468
11036 -200468 134202 392035 599533 749421 783223 635630 343273 36147 -248598 -604451
11026 -604451 -1032648 -1336713 -1404955 -1362853 -1327301 -1248674 -1108888 -977508 -875735 -744454
11016 -744454 -588029 -480009 -472568 -493823 -452354 -376472 -277336 -139752 -39257 -71968 -237558
11005 -237558 -466749 -605791 -592411 -483498 -280892 -11547 209791 274606 285642 375675
10995 375675 405223 284622 210895 277538 327563 247258 89321 -94147 -307722 -441823
10985 -441823 -405988 -322684 -327052 -422664 -590066 -722743 -742036 -700105 -642808 -573109 -480969
10974 -480969 -408888 -386351 -367525 -342987 -293431 -278186 -386579 -527615 -612831 -681365 -855788
10963h55788k48365j15793N3075J04502M7962L4523J65000K60950J73434J6485
10953c64015o5328q5061m3205J03975K57108K46790P3004m7561n2537l6901M4127
10942C0396J76307J86049J03260L4239K5707J03292K11386K79405K69618J39196
10932A558855j15249l33871l31224j96583o6244K5101l0870k21106l21223k55754
10922b88168j24242l7286m4755n1555K7411P0042M2877L9564Q9638J93040K47309
10911A63875K02218J42993L7844j88015l08281j70396O5404K56877K80326J18741
10901F01586p4735j42218l0856J05324R4666j9937j37207k33101k17814l9483
10891i3775J04551J04170L6930q2832k14441k35981p8350N2615L5658Q26J1547
$$ plain form
10963 -855788 -1104153 -1219946 -1166871 -1062369 -1014407 -979884 -814884 -553934 -380500 -364015
10953 -364015 -429343 -514404 -557609 -453634 -196526 50264 123268 75707 23170 -13731 30396
10942 30396 206703 392752 496012 530251 555958 659250 870636 1150041 1419659 1558855
10932 1558855 1443606 1109735 778511 581928 515684 540785 509915 288809 -32414 -288168
10922 -288168 -412410 -449696 -494451 -546006 -518595 -448553 -405676 -366112 -276474 -83434 163875
10911 163875 366093 509086 546930 358915 50634 -119762 -54358 202519 482845 601586
10901 601586 526851 384633 353777 459101 553767 533830 396623 163522 -54292 -93775
10891 -93775 10776 114946 151876 69044 -145397 -381378 -459728 -407113 -371455 -370629 -359082
10880c59082L7022m561m2157p696R0194J85698J90702J28486O8090M9999O399
10869C43094k3103Q3194J48644K1204j68981k18678n6530O5188l2514j23336k3014
10858A5168J50438K88751L16727K07538O130j64843k16901k21459k50228k04372
10848g3051l3659J25236J37409M3491K1146J31624K20348J29185j35120l52665
10838B13944k58057M4121K36471K04985R6140O9822r409j78752k81828l21089
10828a83652l37026k82712j54936j9077N6256J01161J39656J77647K87770L49422
10818A34509K14469q0940l22946l12224j08209O7195J37048J28411P0835l0325
10808a02177r9158r1414m3892L0593P7688O3752q5951j76025o0836N4894L0892
$$ plain form
10880 -359082 -322060 -326621 -368778 -376474 -286280 -100582 90120 218606 286696 336695 343094
10869 343094 319991 403185 551829 573033 404052 185374 128844 194032 161518 38182 15168
10858 15168 165606 454357 771084 978622 984752 819909 603008 381549 131321 -73051
10848 -73051 -106710 18526 155935 199426 220572 352196 572544 701729 566609 213944
10838 213944 -44113 8 236479 441464 537604 607426 598017 419265 137437 -183652
10828 -183652 -520678 -803390 -958326 -977403 -921147 -819986 -680330 -502683 -214913 134509
10818 134509 348978 268038 -54908 -367132 -475341 -408146 -271098 -142687 -71852 -102177
10808 -102177 -201335 -292749 -336641 -306048 -228360 -164608 -250559 -426584 -487420 -432526 -401634
10797d01634N106M6580P2242N0866L3292N9847Q1167L3689m3582j04831j94726
10786c61984j93838j18313j52211k09655j15323o188k578L476L7130N1584j6185
10775a084085j83765l23390k49489N355K39136M02272M78425L65421J51646Q838
10765a89636p6519j51900j99247j60675l6643O113p4703r3276o679L9912L8394
10754i04859K8481m7445k1480P1286O7557O5886J59184K82207L87135M31648L59824
10743H79424J30833j12524j75567k18436l16194k89645r6092M4791Q9135J61739
10733I7464K10368R7180j80290l86552l31049p4932J98869L13479K02297N7296
10723B04130L8458J05189J79108J87967O6766q3683j20761p2696l0430J9132R1123
$$ plain form
10797 -401634 -396528 -349948 -277706 -226840 -193548 -133701 -52534 -18845 -62427 -167258 -361984
10786 -361984 -555822 -674135 -826346 -1036001 -1151324 -1157512 -1160090 -1156614 -1119484 -1067900 -1084085
10775 -1084085 -1267850 -1591240 -1840729 -1835374 -1596238 -1193966 -715541 -350120 -198474 -189636
10765 -189636 -266155 -418055 -617302 -777977 -814620 -808507 -883210 -976486 -983165 -943253 -904859
10754 -904859 -876378 -923823 -945303 -874017 -806460 -740574 -581390 -299183 87952 519600 879424
10743 879424 1010257 897733 722166 503730 187536 -102109 -198201 -153410 -64275 97464
10733 97464 307832 405012 224722 -161830 -492879 -567811 -368942 -55463 146834 204130
10723 204130 242588 347777 526885 714852 781618 697935 577174 504478 474048 493180 584303
10712E84303O9732n9435j72986j17665o3776j82202l18965l36069k33663r2602
10702i23328o94P4197J55526J58732J37079J56799J14409j5883j39450j63773
10692d46386j35541p7327J12121L12758L00413J59269J02774J42929K23932K92984
10682I87926K55769J12357l5880r9057p5930j9856l5327j56885k35072k49726
10672D48319k33125j82806j43724j50903j52221o4377Q1136J95412K26389J41383
10662A65483M512n1388l4455P918O1884J14703J30720P6966k2454p5332j19074
10651B59483k15954k35959j49811m4823P4672J83330K65210L11452L09402J93734
10641I50736Q6424Q7639Q1220R052j10580j74052j82738j52619j0297J67620J70111
$$ plain form
10712 584303 654035 594600 421614 303949 240173 57971 -260994 -597063 -830726 -923328
10702 -923328 -924022 -849825 -694299 -535567 -398488 -241689 -127280 -143163 -282613 -446386
10692 -446386 -581927 -659254 -547133 -234375 66038 225307 328081 471010 694942 987926
10682 987926 1243695 1356052 1320172 1221115 1145185 1125329 1090002 933117 698045 448319
10672 448319 215194 32388 -111336 -262239 -414460 -478837 -397701 -202289 24100 165483
10662 165483 169995 118607 84152 92070 153954 268657 399377 476343 453889 378557 259483
10651 259483 43529 -192430 -342241 -387064 -312392 -129062 136148 447600 757002 950736
10641 950736 1037160 1124799 1206019 1215071 1104491 930439 747701 595082 584785 752405 922516
10630I22516K6590j58689l02311l16957k15879r1107o486L9053p527j78826k83529
10619e73152k15522j36672k4337J68395K26039J47862J18208J96111K81155K75518
10609D63605K14344K06083K33104J06995j54158l13690l56763l58379k84255j39730
10599c82844j7398J3849j8617p8625j14642m092K26953L37418K79126J82070J19775
10588E42973L3590n7861l5634J9921K9598M3005M7015K6257j4789o7958j33787
10577D32330j66600j26879n1024L3860J10455J47988J07860n6362k45447k85616
10567i9435j62907l3344l183m3729p5438q0617j11079j57328k01379k22743j94654
10556a385836p2271R5113J90040J47843K1841o4879j15836j71071k32234j75255
$$ plain form
10630 922516 949106 790417 488106 171149 -44730 -135837 -142323 -103270 -110797 -289623 -573152
10619 -573152 -788674 -925346 -949683 -781288 -555249 -407387 -289179 -93068 188087 463605
10609 463605 677949 884032 1117136 1224131 1069973 756283 399520 41141 -243114 -382844
10599 -382844 -400242 -386393 -405010 -483635 -598277 -602369 -375416 -37998 241128 423198 542973
10588 542973 576563 518702 483068 502989 532587 575592 622607 648864 634075 566117 432330
10577 432330 265730 138851 87827 121687 232142 380130 487990 431628 186181 -99435
10567 -99435 -262342 -295686 -298869 -342598 -418036 -498653 -609732 -767060 -968439 -1191182 -1385836
10556 -1385836 -1458107 -1362994 -1172954 -1025111 -1003270 -1068149 -1183985 -1355056 -1587290 -1762545
10546a762545m889J47059J89086J41708J20955J46195K40521L44227L01016J40732
10536D065P7852J77088K41726K70858L13914K70309J82025J69124J76924R3857
10526A977742j2455o5532j80968l41194m25720l68115k72041k29285j80069j72641
10516b70278k26415k15519o2642N6758K5326l1272k3365J7174M1843L1359J10944
10505e46087K76147L56209L24597K18994O5868o7702j28759j25263j33696j23387
10495A16921o0207N145p892p3535q941J54643J66704J2438j34041j94422j71728
10484a94915p7630K3668Q2647O1036l6733r2980j0932P0956J6538o5167k1733
10473b45245J28826J53882l638j10162j04412n4332p127K9173R8670J74960J49395
$$ plain form
10546 -1762545 -1767434 -1620375 -1431289 -1289581 -1168626 -1022431 -781910 -437683 -136667 4065
10536 4065 81917 259005 500731 771589 1085503 1355812 1537837 1706961 1883885 1977742
10526 1977742 1965287 1899755 1718787 1377593 951873 583758 311717 82432 -97637 -270278
10516 -270278 -496693 -712212 -774854 -718096 -692770 -724042 -747407 -730233 -688390 -657031 -546087
10505 -546087 -269940 86269 410866 629860 695728 628026 499267 374004 240308 116921
10495 116921 56714 61859 53967 -19568 -28509 126134 292838 305276 171235 -23187 -194915
10484 -194915 -272545 -248877 -166230 -105194 -141927 -234907 -245839 -174883 -158345 -223512 -245245
10473 -245245 -116419 37463 33825 -76337 -180749 -235081 -242208 -213035 -114365 60595 209990
10462B09990o7070k98971l16274j96472n6915J26657K95177L69760L38340J67474
10452E71696j33137l23780k49385p8258k3454q9603j64185j65850p0859L0589
10442f96226L3682J3289L0162M2156Q1430J15679R1209N1945P2470J12045O8316
10431A6157j7580p3010o238J13996J47164J37097O9472j44115l45719l19689j72850
10420e95315j21501j30226n0075P8508R0147j02779l07693k51793K6012K54616
10410a110099K53711N8475p9100j9220J14899K03965L15257M14178M25977L09409
10400H87452l731k81659k87352k22039j98197j37792l6395N0427J20687R5749
10390a2850K3188j0009K6100Q4268K8313m8156j7155J27617K62517K28388O9373
$$ plain form
10462 209990 142920 -156051 -472325 -668797 -725712 -599055 -303878 65882 404222 571696
10452 571696 438559 114779 -134606 -212864 -236318 -325921 -490106 -655956 -726815 -696226
10442 -696226 -662544 -649255 -619093 -576937 -495507 -379828 -288619 -236674 -164204 -52159 16157
10431 16157 -1423 -74433 -80671 33325 180489 317586 387058 242943 -102776 -422465 -595315
10420 -595315 -716816 -847042 -897117 -818609 -728462 -831241 -1138934 -1390727 -1364715 -1110099
10410 -1110099 -856388 -797913 -877013 -896233 -781334 -577369 -262112 152066 578043 887452
10400 887452 883721 602062 314710 92671 -105526 -243318 -279713 -229286 -108599 -12850
10390 -12850 10338 329 26429 110697 139010 90854 73699 201316 463833 692221 761594
10379G61594j7919J1783J00188J84660J64644L5367r7434j41985p5040p674m8352
10368H69832o9373K6190P3931n149j52369k93412k98354j64447l8846O9978J61797
10357A79778J37751M6627k862k1189n5855r1225o9164L9732J20287J35279J77317
10346E96476J68731J01521Q111q9038j80846k06899j54960r7403q1341j15771
10336e1419j27677j14743j60826k44663k33886q1792J28713K80930L15031J92158
10326i8174n2499j78581j22333j15081j37579o6245J4736K4126o671n9662r7902
10315h95865n4829l1550J5328J90233L17715J67198j33031l25506k95650j41022
10305a186979l2186J8598P602l0086o0927o6648K690N9010O0930P7033J22971
$$ plain form
10379 761594 743675 755458 855646 1040306 1204950 1240317 1142883 1000898 925858 918184 869832
10368 869832 800459 826649 900580 895431 743062 449650 151296 -13151 -51997 17981 179778
10357 179778 317529 364156 361294 340105 284250 193025 123861 163593 283880 419159 596476
10346 596476 765207 866728 874839 785801 604955 398056 243096 145693 64352 -51419
10336 -51419 -179096 -293839 -454665 -699328 -933214 -1015006 -886293 -605363 -290332 -98174
10326 -98174 -150673 -329254 -451587 -566668 -704247 -770492 -755756 -731630 -738301 -797963 -895865
10315 -895865 -950694 -982244 -966916 -776683 -458968 -291770 -424801 -750307 -1045957 -1186979
10305 -1186979 -1219165 -1200567 -1192965 -1223051 -1283978 -1350626 -1347936 -1288926 -1227996 -1150963 -1027992
10294a027992J98913K79453L06076K23044R4682l4439r1611J0282P4240K339o2052
10283b7065p3794j07081j95178k30416k01879j54545j23645q9168P3010K35174
10273h94587J87764M6598m3718o7544j6595J10418J55095J09419P4595N0074R4501
10262a93980J27884R7720R592j23045k08294j88016j41750m0478M2382K1509J2351
10251e84125R5814J77461K05717J84975R5508r186j23508j96107j44056k3907
10241c21414K0894q0472k51087l39199k58229j45821o7139J22093M31845O34107
10231b54422O21222M71922K86954J07745l4632j39608j90757k16099l13763m17574
10221g9012l17365q2341Q5011K01878K64237K55547K43755K18298O4754j21239
$$ plain form
10294 -1027992 -829079 -549626 -243550 -20506 74176 39737 -51874 -41592 32648 34987 -27065
10283 -27065 -100859 -207940 -403118 -633534 -835413 -989958 -1113603 -1202771 -1129761 -894587
10273 -894587 -706823 -660225 -703943 -771487 -788082 -677664 -522569 -413150 -338555 -288481 -193980
10262 -193980 -66096 31624 41216 -81829 -290123 -478139 -619889 -660367 -617985 -596476 -584125
10251 -584125 -488311 -310850 -105133 79842 175350 166164 42656 -153451 -297507 -321414
10241 -321414 -300520 -380992 -632079 -971278 -1229507 -1375328 -1442467 -1320374 -888529 -254422
10231 -254422 366800 838722 1125676 1233421 1198789 1059181 868424 652325 338562 -79012
10221 -79012 -396377 -478718 -393707 -191829 72408 327955 571710 790008 854762 733523
10211G33523k19626l29240l88547k73542q3719K8424J8043j6515j7846O6899J85906
10200b96240K29746J11219n2394o9616J761k061p0034j50520k24250j96630j13247
10189h32266m2766J5467O3809J03465Q3694M9742J04489J84667J62007J12227
10179D535R3595Q4525P8974J319j34470j67347j62669j83230k04406k31681k55659
10168a076514j68919l5306L0066j5188k3545P7765K26696L34935K69027J32078
10158b48905J07402K01976K25758M9667j63962k20490j36867o9830p6529j22749
10148d54529j71715j53964j3811K13589L66455K89488Q8439j7489J1532O1534
10138B19529o950j53599k47529k51377j11305J30004K35634J43052m2029r2943
$$ plain form
10211 733523 513897 184657 -203890 -477432 -561151 -532727 -514684 -531199 -549045 -482146 -296240
10200 -296240 -66494 44725 -7669 -77285 -75524 -77585 -147619 -298139 -522389 -719019 -832266
10189 -832266 -875032 -859565 -795756 -692291 -608597 -558855 -454366 -269699 -107692 4535
10179 4535 98130 182655 261629 262948 128478 -38869 -201538 -384768 -589174 -820855 -1076514
10168 -1076514 -1245433 -1280739 -1250673 -1265861 -1289406 -1211641 -984945 -650010 -380983 -248905
10158 -248905 -141503 60473 286231 335898 171936 -48554 -185421 -255251 -331780 -454529
10148 -454529 -626244 -780208 -794019 -580430 -213975 75513 163952 146463 157995 219529
10138 219529 212579 58980 -188549 -439926 -551231 -421227 -185593 -42541 -84570 -177513
10128a77513K4846J27069J34640P4214l6247j15213j41333j63747j61366j24458
10118e59108p5838n5897q9510n7281L7524K0010p9839j14560k2442Q6552J30550
10107g79839N9880j9209l4403j17606k40782l03297j75459Q1164K31215K52416
10097a045920K44489K23949J15200k1026o4289L148L5296J5397J02312J76218
10087b15226J60531J25593O7192l4342r8841l2456J10229J58624J07960N2355
10077D01619R295p2474j47191j73676k13944k57307j57335J05650K68612K58998
10067B2247K33658J95515J75979J65646J54297J79233J17102n8870j96008k20814
10057G67985j92673j88051k06494j29088K555J7106k9434m2610k9571m7431j31509
$$ plain form
10128 -177513 -152667 -25598 109042 183256 147009 31796 -109537 -273284 -434650 -559108
10118 -559108 -634946 -690843 -780353 -837634 -800110 -780100 -859939 -974499 -996941 -910389 -779839
10107 -779839 -719959 -739168 -773571 -891177 -1131959 -1435256 -1610715 -1529551 -1298336 -1045920
10097 -1045920 -801431 -577482 -462282 -483308 -547597 -544449 -509153 -493756 -391444 -215226
10087 -215226 -54695 70898 138090 103748 4907 -27549 82680 241304 349264 401619
10077 401619 410914 338440 191249 17573 -196371 -453678 -611013 -505363 -236751 22247
10067 22247 255905 451420 627399 793045 947342 1126575 1243677 1184807 988799 767985
10057 767985 575312 387261 180767 51679 54234 71340 41906 -704 -30275 -77706 -209215
10046b09215k56431k56904k6987K13224K16751R0836J6733K4265J6621j9055J7578
10035a72584Q9534R8670Q4094J11988P2139p3107k35958l24621k50056l6652J59784
10024d76769J47059K7607N0985K13857L72604L59353J56362J8949L6542M2758
10014I49307p8461k52772l15326k35263j45253k26463l69098l08770j07340K6159
10004a063280R6004J48265J62971J44412P4275p2718k44219l23944k30014J8159
9994a290089K29877K94858K92699L34197L69252K74775L0860k16006l04759k46028
9984b30364p8675J3178l4115q5597j21676j71805j94046j28183M9874K29280K84083
9973d68046J79744o2721k15347j63558n0987K8324M6761L0697O805J1575R5999
$$ plain form
10046 -209215 -465646 -722550 -749537 -536313 -319562 -228726 -211993 -187728 -171107 -190162 -172584
10035 -172584 -83050 15620 99714 211702 283841 210734 -25224 -349845 -599901 -636553 -476769
10024 -476769 -329710 -302103 -251118 -37261 335343 694696 851058 870007 906549 949307
10014 949307 870846 618074 302748 67485 -77768 -304231 -673329 -982099 -1089439 -1063280
10004 -1063280 -967276 -819011 -656040 -511628 -437353 -510071 -754290 -1078234 -1308248 -1290089
9994 -1290089 -1060212 -765354 -472655 -138458 230794 505569 536429 320423 15664 -230364
9984 -230364 -309039 -295861 -329976 -415573 -537249 -709054 -903100 -1031283 -981409 -752129 -468046
9973 -468046 -288302 -351023 -566370 -729928 -780915 -752591 -705830 -675133 -668328 -656753 -560754
9962e60754K23763L34068L40289K34730J55345Q3739l2772o6126N3339K15718
9952I81339K85520K48260J76927P1315m0733p5195j9896L5302P3518J48012J52322
9941B036691L3275q9163q8547K1920J09783Q1070r2770l00965m36782m37555l40118
9930D96839k48479j44608J4620J13501J40630J82181J43468j2538j02703n716
9920E77195Q5699P0127O9986R0903L7923n1814k522J40215K42255L20969L13497
9909A894433K63404K48196K59487K65744L13285M61604N96437O07352N80887N41355
9899F032184M06446K27391J23103Q8987M4991l8615j95397l74188n58171p29905
9889E026826p59133p12304o32948n13687m59369m47363l29390j22773K8226M4635
$$ plain form
9962 -560754 -336991 -2923 337366 572096 727441 811180 778408 712282 765621 981339
9952 981339 1266859 1515119 1692046 1763361 1722628 1647433 1627537 1662839 1736357 1884369 2036691
9941 2036691 2069966 1980803 1892256 1914176 2023959 2105029 2012259 1711294 1274512 836957 496839
9930 496839 248360 103752 118372 231873 372503 554684 698152 685614 582911 577195
9920 577195 662894 733021 803007 893910 931833 880019 877497 1017712 1259967 1580936 1894433
9909 1894433 2157837 2406033 2665520 2931264 3244549 3706153 4302590 4909942 5490829 6032184
9899 6032184 6438630 6666021 6789124 6878111 6923102 6884487 6689090 6314902 5756731 5026826
9889 5026826 4267693 3555389 2922441 2408754 1949385 1502022 1172632 1049859 1078085 1122720
9879A122720J3082n6192j45197j27542l4510j8621n3149m2153m319O0372J44036
9868H58527J25072k3697j55057j79110r1677l6138j18145k80727k67739k1559
9858a90250J53091J19985J13103K57959L24905K14047P3142P404K5004M2834l8784
9847A102440j60803j06936J26712L01067K75471J92978J65164R5315n5939j76780
9837A758689k25839k09549j97622k00683q6554N4167J0322j02274j11059j5685
9827F73913Q8773J81351J84061P70k43639l75673l67141k16812K0775J29583M9914
9816A25875J9086R6289J21762N124j64552k49938k42417k15188j55106k688K12551
9805d49202K78625J44684M7292O3396J75584K95481L20916K67811J40834O4618
$$ plain form
9879 1122720 1135802 1079610 934413 806871 772361 753740 700591 658438 654119 714491 858527
9868 858527 983599 959902 804845 625735 534058 497920 379775 99048 -168691 -190250
9858 -190250 -37159 82826 195929 453888 778793 992840 1065982 1073386 1098390 1141224 1102440
9847 1102440 941637 834701 961413 1262480 1537951 1730929 1896093 1991408 1935469 1758689
9837 1758689 1532850 1323301 1125679 924996 838442 892609 902931 800657 689598 673913
9827 673913 762686 944037 1128098 1128868 885229 509556 142415 -74397 -53622 75961 125875
9816 125875 144961 241250 363012 368136 203584 -46354 -288771 -503959 -659065 -661753 -449202
9805 -449202 -170577 -25893 21399 84795 260379 555860 876776 1144587 1285421 1350039
$$ [...]
##END NTUPLES=NMR SPECTRUM
##END=
