##TITLE=C13_LR-782-OF1-K
 CDCl3, 22400 sc

 4.3.2024
##JCAMPDX= 6.0         $$ Bruker NMR JCAMP-DX V2.0
##DATA TYPE= NMR SPECTRUM
##DATA CLASS= NTUPLES
##ORIGIN= UXNMR, Bruker Analytische Messtechnik GmbH
##OWNER= root
$$ XWIN-NMR		Version 3.5
$$ Tue Mar  5 13:44:21 2024 Russian Standard Time (UT+4h)  she@DPX200
##.OBSERVE FREQUENCY= 50.327896
##.OBSERVE NUCLEUS= ^13C
##.ACQUISITION MODE= SIMULTANEOUS
##.ACQUISITION SCHEME= undefined
##.AVERAGES= 22401
##.DIGITISER RES= 17
##SPECTROMETER/DATA SYSTEM= spect
##.PULSE SEQUENCE= zgpg30
##.SOLVENT NAME= CDCl3
##.SHIFT REFERENCE= (INTERNAL, CDCl3, 0, 222.646)
##AUDIT TRAIL= $$ (NUMBER, WHEN, WHO, WHERE, WHAT)
$$ ##TITLE= Audit trail, XWIN-NMR		Version 3.5
$$ ##JCAMPDX= 5.01
$$ ##ORIGIN= Bruker BioSpin GmbH
$$ ##OWNER= she
$$ F:/spectra/data/she/nmr/c13/1/pdata/1/auditp.txt
$$ ##AUDIT TRAIL=  $$ (NUMBER, WHEN, WHO, WHERE, WHAT)
(   1,<2024-03-05 13:42:24.34 +0400>,<she>,<DPX200>,
      <created by zg, POWCHK disabled, PULCHK disabled
       terminated by command 'halt'
       configuration hash MD5:
       00 E9 B6 7A A2 85 ED C7 34 08 36 98 17 FE 4E 26
       data hash MD5: 32K
       EE 5D AA 54 E7 6F E7 DD 57 D6 FE 79 77 CF 77 AF>)
(   2,<2024-03-05 13:42:32.81 +0400>,<she>,<DPX200>,
      <Start of raw data processing
       efp BC_mod = 2 LB = 2 FT_mod = 6 PKNL = 1 PHC0 = -382.4843 PHC1 = 14.01886 SI = 32K 
       data hash MD5: 32K
       F8 9A 3C 5D 2A 5B A3 16 74 EF 24 D1 59 E9 74 21>)
(   3,<2024-03-05 13:43:01.01 +0400>,<she>,<DPX200>,
      <pk PHC0 = -7.247254 PHC1 = 16.6 
       data hash MD5: 32K
       EA A8 B9 E0 0B A6 DB 16 3E 83 20 EB CE 6F 80 21>)
(   4,<2024-03-05 13:43:05.18 +0400>,<she>,<DPX200>,
      <abs ABSG = 5 
       data hash MD5: 32K
       B3 4F C8 9E E6 EF E6 58 26 34 39 0A 7C 04 D0 D0>)
(   5,<2024-03-05 13:43:30.62 +0400>,<she>,<DPX200>,
      <pk PHC0 = 2.468412 PHC1 = -3.6 
       data hash MD5: 32K
       F3 B5 62 B1 D1 01 81 23 B4 40 FF BD 47 C8 CF 4E>)
(   6,<2024-03-05 13:43:34.18 +0400>,<she>,<DPX200>,
      <abs ABSG = 5 
       data hash MD5: 32K
       5B 98 0A 2E 62 1D 49 86 96 67 C9 1A D2 9B 3B 2E>)
$$ ##END=
$$ 
$$ hash MD5
$$ B8 C5 72 7A 4A 11 62 32 DF A4 8D 13 B3 F3 17 A9
##$RELAX= 
##$RELAX= 
##$RELAX= 
##$RELAX= 
##$RELAX= 
##$RELAX= 
##$RELAX= 
##$RELAX= 
$$ Bruker specific parameters
$$ --------------------------
##$DU= <F:/spectra>
##$EXPNO= 1
##$NAME= <c13>
##$PROCNO= 1
##$TYPE= <nmr>
##$USER= <she>
##$AMP= (0..31)
100 100 100 100 100 100 100 100 100 100 100 100 100 100 100 100 100 100 
100 100 100 100 100 100 100 100 100 100 100 100 100 100 
##$AQSEQ= 0
##$AQ_mod= 1
##$AUNM= <au_zg>
##$AUTOPOS= <>
##$BF1= 50.322709
##$BF2= 200.13
##$BF3= 50.322709
##$BF4= 500.13
##$BF5= 500.13
##$BF6= 500.13
##$BF7= 500.13
##$BF8= 500.13
##$BYTORDA= 1
##$CFDGTYP= 0
##$CFRGTYP= 5
##$CHEMSTR= <none>
##$CNST= (0..31)
1 1 145 1 1 1 1 1 1 1 1 1 1 1 1 1 1 1 1 1 1 1 1 1 1 1 1 1 1 1 1 1 
##$CPDPRG= <waltz16>
##$CPDPRG1= <>
##$CPDPRG2= <waltz16>
##$CPDPRG3= <>
$$ [...]
##$SUBNAM4= <"">
##$SUBNAM5= <"">
##$SUBNAM6= <"">
##$SUBNAM7= <"">
##$SUBNAM8= <"">
##$SUBNAM9= <"">
##$SW= 239.972175391363
##$SWIBOX= (0..15)
0 1 3 0 0 0 0 0 0 0 0 0 0 0 0 0 
##$SW_h= 12077.2946859903
##$TD= 32768
##$TD0= 1
##$TE= 0
##$TE2= 300
##$TE3= 300
##$TEG= 300
##$TL= (0..7)
120 120 120 120 120 120 120 120 
##$TP= (0..7)
150 150 150 150 150 150 150 150 
##$TP07= 0
##$TPNAME0= <>
##$TPNAME1= <>
##$TPNAME2= <>
##$TPNAME3= <>
##$TPNAME4= <>
##$TPNAME5= <>
##$TPNAME6= <>
##$TPNAME7= <>
##$TPOAL= (0..7)
0.5 0.5 0.5 0.5 0.5 0.5 0.5 0.5 
##$TPOFFS= (0..7)
0 0 0 0 0 0 0 0 
##$TUNHIN= 0
##$TUNHOUT= 0
##$TUNXOUT= 0
##$USERA1= <user>
##$USERA2= <user>
##$USERA3= <user>
##$USERA4= <user>
##$USERA5= <user>
##$V9= 5
##$VALIST= <valist>
##$VCLIST= <CCCCCCCCCCCCCCC>
##$VD= 0
##$VDLIST= <DDDDDDDDDDDDDDD>
##$VPLIST= <PPPPPPPPPPPPPPP>
##$VTLIST= <TTTTTTTTTTTTTTT>
##$WBST= 1024
##$WBSW= 4
##$XGAIN= (0..3)
0 0 0 0 
##$XL= 0
##$YL= 0
##$YMAX_a= 121285833
##$YMIN_a= -135448396
##$ZGOPTNS= <>
##$ZL1= 120
##$ZL2= 120
##$ZL3= 120
##$ZL4= 120
##$ABSF1= 222.646
##$ABSF2= -17.35081
##$ABSG= 5
##$ABSL= 3
##$ALPHA= 0
##$AQORDER= 0
##$ASSFAC= 0
##$ASSFACI= 0
##$ASSFACX= 0
##$ASSWID= 0
##$AUNMP= <proc_1d>
##$AZFE= 0.1
##$AZFW= 0.5
##$BCFW= 0
##$BC_mod= 2
##$BYTORDP= 0
##$COROFFS= 0
##$CY= -3
##$DATMOD= 1
##$DC= 0
##$DFILT= <>
##$DTYPP= 0
##$F1P= 0
##$F2P= 0
##$FCOR= 0.5
##$FTSIZE= 32768
##$FT_mod= 6
##$GAMMA= 0
##$GB= 0
##$INTBC= 1
##$INTSCL= 4.134877e-10
##$ISEN= 128
##$LB= 2
##$LEV0= 0
##$LPBIN= 0
##$MAXI= 10000
##$MC2= 0
##$MEAN= 0
##$ME_mod= 0
##$MI= 0.1934396
##$NCOEF= 0
##$NC_proc= 2
##$NLEV= 6
##$NOISF1= 120.0001
##$NOISF2= 80.00006
##$NSP= 0
##$NTH_PI= 0
##$NZP= 0
##$OFFSET= 222.646
##$PC= 1.4
##$PHC0= -387.2632
##$PHC1= 27.01886
##$PH_mod= 1
##$PKNL= yes
##$PPARMOD= 0
##$PSCAL= 0
##$PSIGN= 0
##$REVERSE= no
##$SF= 50.3227304925793
##$SI= 32768
##$SIGF1= 140
##$SIGF2= 120
##$SINO= 11.81781
##$SIOLD= 32768
##$SREGLST= <13C.CDCl3>
##$SSB= 0
##$STSI= 32768
##$STSR= 0
##$SW_p= 12077.2946859903
##$SYMM= 0
##$S_DEV= 0
##$TDeff= 32768
##$TDoff= 0
##$TI= <>
##$TILT= no
##$TM1= 0
##$TM2= 0
##$TOPLEV= 0
##$USERP1= <user>
##$USERP2= <user>
##$USERP3= <user>
##$USERP4= <user>
##$USERP5= <user>
##$WDW= 1
##$XDIM= 32768
##$YMAX_p= 352335934
##$YMIN_p= -1780088
$$ End of Bruker specific parameters
$$ ---------------------------------
##NTUPLES= NMR SPECTRUM
##VAR_NAME=  FREQUENCY,     SPECTRUM/REAL,   SPECTRUM/IMAG
##SYMBOL=    X,             R,               I
##VAR_TYPE=  INDEPENDENT,   DEPENDENT,       DEPENDENT
##VAR_FORM=  AFFN,          ASDF,            ASDF
##VAR_DIM=   32768,         32768,           32768
##UNITS=     HZ,            ARBITRARY UNITS, ARBITRARY UNITS
##FACTOR=    0.368581032318806, 1,           1
##FIRST=     11204.1544566776, 0,            0
##LAST=      -873.140229312654, 0,           0
##MIN=       -873.140229312654, -1780088,    0
##MAX=       11204.1544566776, 352335934,    0
$$ Real data points
##PAGE= N=1
##DATA TABLE= (X++(R..R)), XYDATA
$$ [...]
16095C3504q5905L2012R0853J8287j47057k88762k59242j48929j05523r9214j15274
16084a075250j34390p9321M5056J69093K30791K07896J07503L337k9394j2280
16074e66959K0706R3024J62260J81217J92207J94827J56628N0764p2656j23702
16064B88316j01099q7452o4734k8528n5095j19930j58587j59744j10269n3638
16054f50760o3302n9508j1117O153J700k5429n0097j0624R0552J93563K21768
16043c57101K12710K01601J57201O9752n9841j53271p7301R7472J61967J07098
16033C60287M1333m4005j38356j77928j87432j45886o3958m6943j24668j70928
16023f98484j04316Q839R8023J42177J38886J13635M4426K244O4532J48270J32853
$$ y = [33504, -52401, -20389, 70464, 88751, -58306, -347068, -606310, -755239, -860762, -959976, -1075250, -1209640, -1288961, -1243905, -1074812, -844021, -636125, -528622, -525285, -554679, -566959, -546253, -453229, -290969, -109752, 82455, 277282, 433910, 484674, 412018, 288316, 187217, 99765, 35031, 6503, -48592, -168522, -327109, -486853, -597122, -650760, -714062, -773570, -784687, -778534, -776834, -802263, -852360, -862984, -772432, -578869, -357101, -144391, 57210, 214411, 284163, 224322, 71051, -6250, 91222, 253189, 360287, 401620, 357615, 219259, 41331, -146101, -291987, -355945, -402888, -527556, -698484, -802800, -793961, -695938, -553761, -414875, -301240, -256814, -254570, -190038, -41768, 91085]
16012I1085J9597n9696l8891J9832N1321L7349l6114j12766j18922q4320j22211
16001c53736j81240j46235o1018m0336p0052j8925J19783J56427R2566O6002R3885
15990c42879J47284J63715J12296K8492m5441j68646l21696l60467k48281n8611
15980a094234Q9160J40554J47707J45579J05739M1858J9407N2799J14219J39606
15970i7606R0563J9224O1764J76694K04731J84225J08908k3304j51915k61131
15960C12153k68368j70038j12880j24278j13921p4511o2987p9467o3728l5896
15950g93921k7311K6991J51520K69867K90381K48227K11832J43210K7891j00829
15940D47858k04281k09024j37685q3532q1051j27673j73787k00189j99063j61028
$$ y = [91085, 110682, 50986, 12095, 31927, 83248, 120597, 84483, -28283, -147205, -231525, -353736, -534976, -681211, -742229, -782565, -852617, -871542, -751759, -595332, -502766, -436764, -342879, -195595, -31880, 80416, 108908, 63467, -105179, -426875, -787342, -1035623, -1094234, -1005074, -864520, -716813, -571234, -465495, -423637, -404230, -351431, -237212, -97606, -7043, 12181, 73945, 250639, 455370, 639595, 748503, 725199, 573284, 312153, 43785, -126253, -239133, -363411, -477332, -551843, -614830, -694297, -758025, -793921, -821232, -794241, -642721, -372854, -82473, 165754, 377586, 520796, 548687, 447858, 243577, 34553, -103132, -186664, -267715, -395388, -569175, -769364, -968427, -1129455]
15930a129455o0754P6965K05093K95157L23048K82096J76403J0255j57457k36446
15920b15095j82312l8151O3577J05187J21308M3344n3795j02888j32883j36195
15910e27903j04087o7445l4759M1593J40005J82240J33041N1107j7704q2179j17945
15899d04036p1125L1160J28488J41046R2283N9542K1352j850J5122O623n1775
15888c3170p4833q8423j08699l7099P2848J01639Q6984J02378J37768J54516J12743
15877D26652O0227M0373O3054J35799K03868J71789O1236k2089p3007r9423p0050
15866H98429j9320N1789J04814P9206j9942j32442j81500j50483n4971M5752q06
15855F20526j56998k27158k10793j54971j02585p6490n2181m991O9549J39652
$$ y = [-1129455, -1190209, -1113244, -908151, -612994, -289946, -7850, 168553, 178808, 21351, -215095, -397407, -435558, -371981, -266794, -145486, -102142, -155937, -258825, -391708, -527903, -631990, -699435, -734194, -692601, -552596, -370356, -237315, -186208, -203912, -286091, -404036, -475161, -444001, -315513, -174467, -82184, -22642, -1290, -3140, 11982, 18605, -33170, -108003, -196426, -305125, -342224, -269376, -167737, -80753, 21625, 159393, 313909, 426652, 486879, 527252, 590306, 726105, 929973, 1101762, 1162998, 1140909, 1067902, 968479, 898429, 879109, 930898, 1035712, 1114918, 1094976, 962534, 781034, 630551, 575580, 621332, 620526, 463528, 236370, 25577, -129394, -231979, -308469, -360650, -365641, -296092, -156440]
15845a56440J82794J82204J18697j5127j36920j32916k524J22588J72819J45160
15835D80335O1388K2076m312p7320j33727j15141r6576j18690q7383K4734J18642
15824G4026J15579O4022j464p9937j34556j24702n3688j4242n0414r8005r0101
15813c93482k0732N1489P9929N6496J626l4867p6730j72977k33600j78893l8837
15802i60578J00938J70253K03423J93993J33424R6023J20977J30124Q9900M0611
15792C19088m0508j11894j02741q8537j21350j34803j15021r0631m0977L3994
15782d93380P8377Q9684M5849j6624l7992m5175m3107J1844Q2636J05120P7292
15771a45476L9305J7047K1782J5525m8588j54501j81696o8466O3878J09281R1622
$$ y = [-156440, 26354, 208558, 327255, 312128, 175208, 42292, 39768, 162356, 335175, 480335, 541723, 563799, 559487, 482167, 348440, 233299, 136723, 18033, -69350, -44616, 74026, 189605, 253627, 252163, 172226, 37670, -87032, -140720, -154962, -205376, -303381, -393482, -414214, -362725, -282796, -226300, -224674, -259541, -336271, -509248, -742848, -921741, -960578, -859640, -689387, -485964, -291971, -158547, -62524, 58453, 188577, 278477, 319088, 278580, 166686, 63945, -24592, -145942, -280745, -395766, -486397, -527374, -493380, -415003, -325319, -279470, -296094, -334086, -379261, -422368, -410524, -327888, -222768, -145476, -106171, -89124, -67342, -51817, -100405, -254906, -436602, -505068, -441190, -331909, -240287]
15760b40287M2186j8328l1658K0092O0538J19070J98201K14505J56700N6187J5024
15749E92230M3656K0971m7934p2732o3012j00899j92752j84158k4280R4038O3120
15738A28248q4903k45039k47887j33765O046Q6587R4322O0046l7234j54475j49875
15727f77929r920J04727J00802N2331L0145J4992j4475l2783l4845J937N0773
15716d14245J4785p8466j02147P638J45068K12464J75652J08367O5940M9974J26450
15705C11480J80184O3574j26338j87768j09254m3984l5938k6309k2116l2620l5798
15694f4887m3160o5961n2565J2274O2747O3896P4630R9642R4298M4850l4204r6674
15682I4886r2362l983Q3042Q1919O1226O4798L5381q7853k83602m11441m00569
$$ y = [-240287, -198101, -216429, -248087, -227995, -167457, -48387, 149814, 364319, 521019, 577206, 592230, 635886, 656857, 608923, 536191, 473179, 372280, 179528, -4630, -28910, 65128, 128248, 43345, -201694, -449581, -583346, -577300, -490713, -396391, -336345, -373579, -528054, -677929, -687849, -583122, -482320, -429989, -399844, -384852, -399327, -432110, -466955, -465018, -414245, -399460, -477926, -580073, -572435, -427367, -214903, -39251, 69116, 135056, 185030, 311480, 491664, 555238, 428900, 241132, 131878, 87894, 51956, 25647, 3531, -29089, -64887, -108047, -174008, -226573, -214299, -151552, -87656, -13026, 86616, 180914, 225764, 191560, 94886, 2524, -1459, 81583, 163502, 224728, 289526, 324907, 237054, -46548, -457989, -858558]
15671h58558k61623q0636K3130K3442j0534j3785N0498J66319J97102J33517P0132
15660e60996L5264M8395O4356L8087k683R314J00852K11833K63940J81503k343
15649C87522j28989j48202j48147j49742j23351j14003j39751j28883j8734J05219
15639f07061J34766J29175J16280N3526l6205j02890j25061j22159j14382r6251
15629g70262P330J37258J57823Q2710k2673j15194j23218r334R8816R7186M6961
15618d12597K4509P5191J62785J65206P1268l2721j01536j05712p3979m1581o62
15607b69829M2546N6038P1259P7423O3309R0513J70857K63971K35682R1187m7375
15596H45581j41993j79164j53203q0110j5266L1352O7202L8905o0489j49736j29700
$$ y = [-858558, -1120181, -1200817, -1177687, -1154245, -1164779, -1178564, -1128066, -961747, -764645, -631128, -560996, -525732, -477337, -412981, -374894, -377577, -368263, -267411, -55578, 208362, 389865, 387522, 258533, 110331, -37816, -187558, -310909, -424912, -564663, -693546, -712280, -607061, -472295, -343120, -226840, -173314, -209519, -312409, -437470, -559629, -674011, -770262, -762932, -625674, -467851, -385141, -407814, -523008, -646226, -655560, -556744, -459558, -412597, -388088, -312897, -150112, 15094, 86362, 53641, -47895, -153607, -227586, -269167, -269829, -227283, -171245, -99986, -22563, 40746, 131259, 302116, 566087, 801769, 892956, 845581, 703588, 524424, 371221, 291111, 275845, 307197, 374399, 413304, 352815, 203079, 73379]
15585G3379o8403m8600n4915o3711m6732j6672N5853J38201J30575P0825M1635
15574B11435k7047j56576k10868j44073j5868J01059J47219J28982R5912M7729
15564A77904o817k0280O424j375j4639J2410N558K972K1315k859p0414q4892j9784
15551E523N2883R6175R0252J2242q6841j22575q9326j03018j92782j70604o1841
15540e69912r467L7180R0951J26054J38185J20252J15547J63385K14921J87107
15530F14203M0349j31894j88417j55992j09101q7888o3079k5483k6249l8355m3244
15519b15150n3351o8824r4658j11318j21156o5665P8548J77876J34994M6868k2482
15508c14318m8445j3925M3524R7285J16160O0268l4728n3081j0050J047m9817
$$ y = [73379, 4976, -43624, -98539, -162250, -208982, -225654, -169801, -31600, 98975, 169800, 211435, 184388, 27812, -183056, -327129, -342997, -241938, -94719, 34263, 130175, 177904, 171087, 150807, 157231, 155856, 141217, 153627, 159185, 162157, 183472, 180613, 110199, 25307, 5523, 58406, 154581, 244833, 257075, 170234, 47659, -41667, -144685, -337467, -508071, -569912, -579379, -542199, -451248, -325194, -187009, -66757, 48790, 212175, 427096, 614203, 654552, 522658, 334241, 178249, 69148, -18740, -81819, -107302, -133551, -171906, -215150, -268501, -337325, -431983, -543301, -664457, -730122, -651574, -473698, -338704, -291836, -314318, -362763, -376688, -333164, -235879, -119719, -59451, -94179, -147260, -157310, -156263, -206080]
15497b06080m8891P7460K25218K85937K15094P1586n5601j20134j00189m7324
15487B97076o305L1927O3987J17071Q7864n1013j06430o5692j6296k9864j21583
15476B00742j76163j26820n2460j8666o225O219j9143p8587o1735J8991N5867
15465b57980K2000l4058l9365j822M4138Q0019J12927J33018J26058J44507J29837
15454D59279J9564r0295q6063m2728q1343j07892l6141M6650P2287J7603o0689
15443A10232j01831r9572m0201L1839N9474O6175R3308J09028R7469J13562J90838
15432F30321K26814J58285N8339n8119j75058k37422j78399l6949O9329J40637
15422E97778J56925O9459p7714j92369j79035q2761l3565r320M1372P1990k218
$$ y = [-206080, -254971, -177511, 47707, 333644, 548738, 620324, 564723, 444589, 344400, 297076, 290771, 322698, 386685, 503756, 591620, 540607, 434177, 368485, 352189, 322325, 200742, 24579, -102241, -154701, -173367, -179592, -173373, -192516, -271103, -332838, -313847, -257980, -235980, -270038, -309403, -311225, -267087, -187068, -74141, 58877, 184935, 329442, 459279, 478843, 388548, 302485, 259757, 178414, 70522, 34381, 81031, 153318, 170921, 110232, 8401, -91171, -131372, -99533, -40059, 26116, 119424, 228452, 325921, 439483, 630321, 857135, 1015420, 1073759, 1015640, 840582, 603160, 424761, 387812, 457141, 597778, 754703, 824162, 746448, 554079, 375044, 292283, 258718, 249398, 290770, 362760, 360542]
15411C60542j48423k06468j38644k0093J13059J90069J68699R0491l1193j64465
15401B13574k71105l03304k44174j41071j2700J14662J39782J15381J60995J30952
15391i7008m1107j57907j59889j48760j44177j51385j37263p0593N4844J94679
15381h58566K84526K58669J19231J673m9971r5592j34465j12203m0425J9677M1213
15370e66233L519o5733j13008r1704j3328J04901K29717L02101K51004J53818
15360A95054J12699N0676k5163m9619o2579q0131m9665O2208J58372J49780J12114
15349E73746O6188j9937o0080k8292J2702M8804O5416J1067j08757j83072j89661
15338A88124j34508m1147M5864R3693N0802l7818q5578q7349q1176n8151J1441
$$ y = [360542, 212119, 5651, -132993, -153086, -40027, 150042, 318741, 409232, 378039, 213574, -57531, -360835, -605009, -746080, -758780, -644118, -504336, -388955, -227960, -97008, -138115, -296022, -455911, -604671, -748848, -900233, -1037496, -1108089, -1053245, -858566, -574040, -315371, -196140, -194467, -244438, -340030, -474495, -586698, -627123, -607446, -566233, -562714, -628447, -741455, -833159, -846487, -741586, -511869, -209768, 41236, 195054, 307753, 358429, 333266, 283647, 221068, 140937, 91272, 153480, 311852, 461632, 573746, 639934, 619997, 559917, 531625, 544327, 593131, 658547, 669614, 560857, 377785, 188124, 53616, 12469, 58333, 152026, 202828, 165010, 79432, -7917, -89093, -147244, -135803]
15327a35803P4021M9901J968J7760L4618l2668j07686j36652j21034q0796j6162
15316d52533M9670P2570P3663J18726J84425J52654n829j68607k04124j18854
15306b98239Q683Q8800J08607J09395O1963p6501k05836k04530j01256N2945J37533
15295c18436J04452N1278L1729L5099L1820O5649J06114J26402J04826K7006l1732
15284C34207k6604K1192N3230K0968o0326j28508j10035k5397J6398m9233j21513
15273g5621r7317J5204R2893Q8009M3898l884m9206j01033p2929k0349j4914L4656
15261a60593J01617O5318m0608r2034j9424O5437L9758k7353n4130l7051j5282
15250a74345p287J6895Q0176J79829K32393J87590J17934L2772n4518o5397q086
$$ y = [-135803, -61782, -11881, -9913, 7847, 42465, 9797, -97889, -234541, -355575, -436371, -452533, -402863, -330293, -256630, -137904, 46521, 199175, 193346, 24739, -179385, -298239, -289556, -200756, -92149, 17246, 79209, 2708, -203128, -407658, -508914, -455969, -318436, -213984, -162706, -130977, -95878, -64058, 1591, 107705, 234107, 338933, 365939, 334207, 307603, 328795, 382025, 402993, 342667, 214159, 104124, 78727, 95125, 45892, -75621, -172938, -157734, -64841, 23168, 67066, 63182, 13976, -87057, -159986, -180335, -195249, -160593, -58976, 6342, -34266, -126300, -145724, -80287, -40529, -67882, -122012, -159063, -174345, -181632, -164737, -84561, 95268, 327661, 515251, 633185, 665957, 611439, 546042, 537956]
15239E37956K0074m9038j11834j10144r9882j31064j75582j65447r3592o2198
15229d40751q8366o7015p165Q506l1101n3763j2054P2499R0034N4000N3119O4641
15217c57416O6488P1094R0796J12102J10216O0129l8554j24468j35168j04903
15207b49684j16379j24092m3345N5879N2987J228J136O8487J08823M5917q0432
15196b79475j83480j92484j14702j820J17766J92698J83079J06448P541o1010
15186b25439m8291P866J4886J285J8097M1686J9357j5760L2732P5838J9439o8015
15174a26319j35337j56882j21850o9873k6059J3060L5882J124n0191r5440r4319
15163h26204j4752J12646J57163J02488O4375J5104q1355j58252j16740K0033
$$ y = [537956, 558030, 508992, 397158, 287014, 187132, 56068, -119514, -284961, -378553, -440751, -529117, -596132, -603297, -594791, -625892, -679655, -691709, -619210, -529176, -475176, -422057, -357416, -290928, -219834, -129038, -16936, 93280, 153409, 114855, -9613, -144781, -249684, -366063, -490155, -533500, -477621, -424634, -423406, -422270, -353783, -244960, -199043, -279475, -462955, -655439, -770141, -771961, -654195, -461497, -278418, -171970, -164429, -225439, -273730, -265864, -250978, -249693, -231596, -189910, -170553, -186313, -153581, -77743, -58304, -126319, -261656, -418538, -540388, -610261, -636320, -623260, -587378, -586254, -636445, -731885, -826204, -840956, -728310, -571147, -468659, -404284, -389180, -470535, -628787, -745527, -725494]
15153g25494J00629O6772J131N434M0049M1199J4303J6617J13591K30077K57266
15142A61574J73470M6308l7948n9158l6690L8554J55118K28782J86371N4453l7444
15131H73390j4228m892p1534j33899j47359j39376r4684n3319q8278j68137k44303
15120b86619k61683j88666o7789K4037O667j07131k06035k08095j40309l8704
15110a474327Q5034J58254J58222J75764K28808K32415J87168J11450R163p1337
15100a99386r1619n9870K7241J39624K21488J78332K4021p9918r6122j34586k07399
15089b78194k38191j66654n8684k4905J0796Q4956J79148K30990J87599R1252
15079A8113o401m5632m6573o7430n1620J2890M7666K2403j8609M343P0651J29531
$$ y = [-725494, -624865, -558093, -556962, -551528, -511479, -470280, -455977, -439360, -325769, -95692, 161574, 335044, 381352, 343404, 284246, 247556, 286110, 441228, 670010, 856381, 910834, 873390, 859162, 854270, 782736, 648837, 501478, 362102, 267418, 214099, 125821, -42316, -286619, -548302, -736968, -804757, -780720, -774053, -881184, -1087219, -1295314, -1435623, -1474327, -1389293, -1231039, -1072817, -897053, -668245, -435830, -248662, -137212, -128049, -199386, -291005, -350875, -323634, -184010, 37478, 215810, 239831, 159913, 63791, -70795, -278194, -516385, -683039, -741723, -766628, -755832, -670876, -491728, -260738, -73139, 18113, 11712, -33920, -80493, -147923, -199543, -186653, -138987, -116584, -135193, -130850, -60199, 69332]
15067F9332J19544J8499o4212j01455j47252j93898j45081k5675M9516Q3853J04341
15056b32488Q5939P9435J25334J05570K3921k4820o2767j05509n9317Q5285K06108
15045B26691J88138Q69j89356k42568j98542j31196m1444N5373R2608O3508M1350
15034a34569L1877K6294K5310O3j9737J6881J36253K48625K43284J74446Q2957
15023H31684k6022j17190j51268j02337l309R6942J22262M9839l9504p1651n0145
15012E39301m3361o1938k8593L6220O1033P4416Q6551M3797p2358j89865k22112
15001B23091j98018j65816q4357m2384p5153n5773N6988J71970K16586J42387
14991A89521M2971K4399N5428P3292M0819n4690j78746k14394j40134l8143O1551
$$ y = [69332, 188876, 207375, 143163, 41708, -105544, -299442, -444523, -470198, -420682, -336829, -232488, -146549, -67114, 58220, 163790, 187711, 162891, 100124, -5385, -64702, 20583, 226691, 414829, 415698, 226342, -16226, -214768, -345964, -387408, -332035, -239427, -175919, -134569, -102692, -76398, -51088, -51025, -70762, -53881, 82372, 330997, 574281, 748727, 831684, 805662, 688472, 537204, 434867, 431558, 528500, 650762, 700601, 661097, 589446, 539301, 495940, 434002, 405409, 441629, 502662, 577078, 663629, 707426, 635068, 445203, 223091, 25073, -140743, -225100, -267484, -342637, -398410, -341422, -169452, 47134, 189521, 232492, 256891, 312319, 385611, 426430, 371740, 192994, -21400, -161534, -199677, -138126]
14980a38126J55360J78404J43409J32737J56762Q7006o7743j40331j36736j66380
14970B04362j80715j13584l6477J2163L8613M6888K2626l3512o2614l5804k028
14959a40082L461M4818J04821Q9881K2650l1394k7725j1950k2608j9690j2304
14948a22k7006l9831l537M0994N9734O0673Q9190J41265J30084P2932m726j09010
14936D10640j79006j50031l2146N3067Q1791J05713R1443J3659p1162j10860j45970
14925F7138j66559j73047j89595k37788k53349j47520Q411P7620O3438M0937M6327
14914h63987Q9640J35614J37742J20142J09405J28105J58412J68771J54238R3893
14904D31975j2106q9602q9180o6870j00679j73188j63270n6297M3985Q3951N4205
$$ y = [-138126, 17234, 195638, 339047, 471784, 628546, 715552, 647809, 507478, 370742, 204362, 23647, -89937, -126414, -114251, -75638, -28750, -6124, -39636, -102250, -138054, -140082, -136621, -91803, 13018, 102899, 125549, 94155, 66430, 54480, 31872, 12182, -122, -27128, -66959, -70496, -29502, 30232, 90905, 180095, 321360, 451444, 524376, 519650, 410640, 231634, 81603, 49457, 102524, 184315, 290028, 381471, 395130, 323968, 213108, 67138, -99421, -272468, -462063, -699851, -953200, -1100720, -1092309, -1014689, -951251, -910314, -863987, -774347, -638733, -500991, -380849, -271444, -143339, 15073, 183844, 338082, 431975, 419869, 330267, 241087, 174217, 73538, -99650, -262920, -319217, -275232, -191281, -137076]
14893a37076L191j7971L184O4417J23243J30718Q6017L332j03700j71402k05796
14882b21843k05792j01488K4703L5288l1282r8798j50877j58287p1158O0712J46879
14871g71943J38682P0170L8057J16526K20485K17847J58089J23220J08820M3643
14861D63596p9835j66683j88415j26297n4567k3647L0410P7586J8099p0023p5290
14850a95066n4245m8166m1314j1350M2901M9060L4068N8513O7241N9770M2341
14839C753K1163R865L3989K8969n3431j13526j32278j54134j73287k15871k14254
14828i59042r9118J4646P8646J07285P7430K7154K1029R8384J65690J34604N7820
14817b75472m990k7914j6056M0J6097O8858J62680J88487P9860o2411j72290j88432
$$ y = [-137076, -133885, -151856, -148672, -84255, 38988, 169706, 255723, 259055, 155355, -16047, -221843, -427635, -529123, -504420, -469132, -500414, -599212, -750089, -908376, -979534, -918822, -771943, -633261, -563091, -525034, -408508, -188023, 29824, 187913, 311133, 419953, 463596, 383761, 217078, 28663, -97634, -152201, -175848, -145438, -67852, -49753, -119776, -195066, -249311, -297477, -338791, -350141, -307240, -258180, -224112, -165599, -98358, -38588, 3753, 24916, 34781, 68770, 97739, 44308, -69218, -201496, -355630, -528917, -744788, -959042, -1058160, -1043514, -964868, -857583, -780153, -752999, -731970, -633586, -467896, -333292, -275472, -280462, -308376, -324432, -324392, -308295, -239437, -76757, 111730, 191590, 129179, -43111, -231543]
14805b31543j03572k3354K7047Q7181J17174J13423J19595R2943O746m3246k3329
14794A39065q793n733j2761m7429l9777K6104M9210J1998j2186q451k0354m2028
14782B8865l9597l7005q4675j56213j30725K6745J70333J90225K08822K68373
14772D45148K26828J04820M4074J6114l2875j10380j82540j98163j60676j01552
14762E0798o9896l1923J891k3229p5191r3720j04730j35504j69292j61651j05272
14751i17719j5083Q8798R3833M8464N3050R6488J86291K58450K26826J43865O1483
14740C24746K110N647L1454k4841j09036r6764k4874P227J6351M4921J6055n7391
14728A35605n7851l415O8886J07355O1670l9817j22747j51957j42125j08665n8649
$$ y = [-231543, -335115, -358469, -331422, -244241, -127067, -13644, 105951, 198894, 205640, 162394, 139065, 130272, 124539, 111778, 64349, 24572, 50676, 99886, 111884, 99698, 91247, 70893, 28865, -10732, -47737, -132412, -288625, -419350, -392605, -222272, -32047, 176775, 445148, 671976, 776796, 820870, 836984, 804109, 693729, 511189, 313026, 152350, 50798, -19098, -51021, -49130, -72359, -147550, -241270, -346000, -481504, -650796, -812447, -917719, -932802, -844004, -750171, -701707, -648657, -552169, -365878, -107428, 119398, 263263, 324746, 326856, 332503, 363957, 339116, 230080, 133316, 108442, 115669, 132020, 176941, 192996, 135605, 77754, 74339, 143225, 250580, 312250, 272433, 149686, -2271, -144396, -253061, -311710]
14717c11710N0652J62749J83933J49224P3040k7919r1653j28853j42106j26585
14707b09228r7003m7031K7653P8299Q2537O0793K4273j6298m0999n1339l0285
14696b18628K4272N5794M3158K1079m6918j31657j63747j50413o6345M0440N6093
14685e36872K7556Q3654K12925L16024K55623O4784q4113j42773j22071n8103
14675A6634j7986m2444r9241j29933j25738j01516l9447J6868P1962R8596M2554
14664c09691J2355N7749R2361Q0675N0114K3402J4851k0628p4517j30672j72696
14653c76697j01971N3042J28016J03814P6843M4558L3710P7886J09579P1903L97
14642B21080m8743q2228j41292j66938q1149J2373J9859K1135Q4689J45425J83668
$$ y = [-311710, -261058, -98309, 85624, 234848, 307888, 279969, 188316, 59463, -82643, -209228, -306231, -353262, -325609, -247310, -164773, -103980, -79707, -96005, -137004, -188343, -218628, -194356, -138562, -95404, -74325, -121243, -252900, -416647, -567060, -633405, -592965, -536872, -509316, -425662, -212737, 103287, 358910, 423694, 339581, 196808, 74737, 16634, -1352, -43796, -143037, -272970, -398708, -500224, -539671, -522803, -450841, -352245, -309691, -297336, -239587, -147226, -66551, -16437, 6965, 21816, 1188, -73329, -204001, -376697, -478668, -425626, -297610, -193796, -116953, -72395, -38685, 39201, 148780, 220683, 221080, 172337, 90109, -51183, -218121, -299270, -286897, -267038, -245903, -161214, -15789, 167879]
14631A67879J50669J3959j43579k51133k69093j95363p7373N038L5405N3838O8807
14620d40946J06381J71007J89813J20390k3412j35561q8287N7772J07910K4218
14610H9285p5196j44309j57089j41662r7485M812J22975J46017Q1284N0916Q5253
14599c5199J25263J69616K20351J99939P6297j16008k66514k66980j81876j35550
14589b10661r4121l6326P190M7680P7640O2398K0831q838k8663n2539r9978j16155
14577d31542l6876M6465M7511k0888m3364M2226J53654J97036J34215L1131o3250
14566E6318j77085k27963j57137k5888J27807K35776K16358Q6703J8767L7639
14556A91295Q7715Q0017p7434k18426k24194j47729m2087L1682N3184M7258K2993
$$ y = [167879, 318548, 332507, 188928, -62205, -331298, -526661, -604034, -598996, -563591, -509753, -440946, -334565, -163558, 26255, 146645, 123233, -12328, -100615, -42843, 65067, 89285, 14089, -130220, -287309, -428971, -526456, -521644, -398669, -252652, -171368, -120452, -35199, 90064, 259680, 480031, 679970, 756267, 640259, 373745, 106765, -75111, -210661, -304782, -341108, -333918, -286238, -208598, -146200, -125369, -134207, -162870, -215409, -315387, -431542, -468418, -421953, -374442, -395330, -438694, -396468, -242814, -45778, 88437, 119568, 56318, -120767, -348730, -505867, -531755, -403948, -168172, 48186, 134889, 153656, 191295, 279010, 359027, 281593, 63167, -161027, -308756, -350843, -319161, -265977, -218719, -195726]
14545a95726j6542n5725p8851r1294j16404j13697k9806L0955o699k1315L7873
14534f57231R4595J40081J95337J84606N2651j05035j97790j94916j71639j37346
14524g96687q9289o0363k6649K2640O9625R1574Q9130J33815K20626K27602J13923
14513d053n787j595J63441L04566K84211J75531N6518o4360j98331l02920k91273
14502A15948j88176n9419M0001P9192P1796J2193m7583p3667n0611P7268K81543
14491B58485L92253K69090L1701j06127p9260M0578Q9948k0948k06484l50541
14481C18695l84220k93346j32713L2431J72024J96750R2754Q224K6939K1650q4708
14470b5520j36512o7909j0419j1029L9926J00489P2273j9157r4799q0556O302
$$ y = [-195726, -212268, -267993, -346844, -438138, -554542, -668239, -698045, -667090, -673789, -695104, -657231, -562636, -422555, -227218, -42612, 10039, -94996, -292786, -487702, -659341, -796687, -885976, -946339, -972988, -950348, -880723, -789149, -700019, -566204, -345578, -117976, -4053, -9840, -11435, 152006, 456572, 740783, 916314, 972832, 908472, 710141, 407221, 115948, -72228, -131647, -91646, -12454, 59342, 71535, 23952, -49715, -100326, -23058, 258485, 650738, 919828, 951529, 845402, 766142, 806720, 896668, 875720, 669236, 318695, -65525, -358871, -491584, -459153, -287129, -90379, 2375, 10599, 37538, 59188, -25520, -162032, -229941, -240360, -251389, -211463, -110974, -38701, -57858, -152657, -233213, -226911]
14459b26911J5652m8831n3989j3819K0510M3542N1675M0271P8533J45892J27394
14448A79919L0108o4845j08523j06304n4041L3194J09139Q1700n1884j48144j55534
14437b55215j46422q8744P3102K32345K68553K04853J38559J24644J22880J21852
14427G96407O8792l7243q4161n2804J5680O7734N3720k4363r9142j19783o3014
14416E21823K6622L3173m4354r0635m2158J5075P802k1567j2095K8793Q321m8802
14404C81998n1309o935l348m1818j3581J5776m2466j62275k61439k54642j89945
14393f29984j44778p2717N1007J60553K41428K51502J72183Q0217M9649P2821
14383B31881R6774J05389J10219J38498J69613J15732j3986j23715j58325r5277
$$ y = [-226911, -211259, -260090, -314079, -327898, -307388, -263846, -212171, -171900, -93367, 52525, 179919, 210027, 145182, 36659, -69645, -123686, -90492, 18647, 100347, 48463, -99681, -255215, -401637, -490381, -417279, -184934, 83619, 288472, 427031, 551675, 674555, 796407, 865199, 827956, 743795, 690991, 706671, 774405, 828125, 803762, 704620, 584837, 521823, 548445, 581618, 537264, 446629, 404471, 419546, 427348, 405781, 393686, 422479, 430800, 381998, 330689, 323754, 320406, 278588, 265007, 280783, 238317, 76042, -185397, -440039, -629984, -774762, -847479, -796472, -635919, -394491, -142989, 29194, 109411, 159060, 231881, 328655, 434044, 544263, 682761, 852374, 968106, 954120, 830405, 672080, 576803]
14373E76803J0789Q2434R3721J9591j16597j96910j76318j45068j23030p5423
14363e0008J7929J40206J88999J46222N5719o6589j31251j03527o8763j5155Q2202
14352A95984J54347J42599M0518r1462j59169j83575j70874j05707p4966q2674
14342c34979p2721m1264Q395O2371J07747J48243J92853K23097J95660J08278
14332E97680K5356l394P833N1915Q6446L0649j10004k25782k06254j22267q9994
14321D2184r2741q1228r9345r8572K9386J50953J31861L2022k6430n9421r7498
14310a68829n6702k0428q9591j70091j60718r7688m7584J9832R7219J57519J26186
14299d10875L2258l1485k9295K4476M6390K9995m9785j45838j39725q611J09159
$$ y = [576803, 587592, 670026, 763747, 783338, 666741, 469831, 293513, 148445, 25415, -50008, -32079, 108127, 297126, 443348, 499067, 432478, 301227, 197700, 128937, 113782, 195984, 350331, 492930, 533448, 441986, 282817, 99242, -71632, -177339, -252305, -334979, -407700, -448964, -440569, -378198, -270451, -122208, 70645, 293742, 489402, 597680, 623036, 619642, 627475, 679390, 765836, 796485, 686481, 460699, 254445, 132178, 42184, -50557, -131785, -231130, -329702, -300316, -149363, -17502, 14520, -11910, -71331, -168829, -225531, -245959, -335550, -505641, -666359, -764047, -811631, -791799, -694580, -537061, -410875, -378617, -410102, -439397, -414921, -368531, -338536, -388321, -534159, -673884, -682495, -573336]
14288e73336J19149Q2335L3346k701k1577k9291j3455L9487J12683J76636J45052
14277F8328O010j10493j59354j33017q7148p8150l4455N6240J12335Q9258J9272
14266b51174r5898j86436j07379P8714K57310L01428J90920Q8137N1616L1771
14256C59009L2782K2493J745J9939L2917Q102p725K2287J10173J43304L7799q9376
14244F93449j70803j65780o6149N4010J14186P2991L1595L0028j6926j06164k14400
14233B56037l01405l33641l12769k21665r5393m65L9892N6550R2308J51504K24049
14222d44998K66182K27894J32412K5405j0916M7149J02051O1095k1272o5951r4284
14211B24767j08504o6364K0688J01778K04141K78607J84488n0824k39854k33710
$$ y = [-573336, -454187, -371852, -338506, -341207, -362784, -392075, -405530, -366043, -253360, -76724, 68328, 74338, -36155, -195509, -328526, -415674, -493824, -528279, -472039, -359704, -270446, -251174, -347072, -533508, -640887, -562173, -304863, -3435, 187485, 275622, 327238, 359009, 391791, 414284, 416029, 435968, 468885, 476987, 469262, 491549, 601722, 745026, 782825, 693449, 522646, 356866, 290717, 344727, 458913, 531904, 563499, 593527, 576601, 470437, 256037, -45368, -379009, -691778, -913443, -1008836, -1009301, -969409, -912859, -820551, -669047, -444998, -178816, 49078, 181490, 206895, 195979, 243128, 345179, 406274, 385002, 319051, 224767, 116263, 49899, 70587, 172365, 376506, 655113, 839601, 788777, 548923, 315213]
14201C15213p6939M4877O5485L2480o4j8022l7309j4652N6174Q2390L2625m0365
14189D41893j09106j62758k02313k18223j54749k1288O8477R0051J28848J54392
14179A5224J31529J01790J18271J38156R8442M3756K3572j0714n2356l1909p699
14168E68062l3040o6730l4788K0755L5167M656m8358p7965j13734j95161k26503
14157a67639j65294o2050O0862J55814J56395N6436q798J7935L7637L4015L1725
14146A47038j2577r2385j24310j12927p5858k8238k0483k3904L2261J34209K18202
14135D1028K27126J53581Q5750K7558l5465l2968P915j4356o6334q0288m3247
14124B70300j4228J4032O4730J01819J13342J05763O6385j4898r7537q2962l700
$$ y = [315213, 238274, 283151, 348636, 381116, 381052, 363030, 325721, 311069, 367243, 449633, 482258, 441893, 332787, 170029, -32284, -250507, -405256, -426544, -358067, -268016, -139168, 15224, 146753, 248543, 366814, 504970, 603412, 647168, 670740, 660026, 607670, 575761, 568062, 535022, 468292, 433504, 454259, 489426, 494082, 445724, 367759, 254025, 58864, -167639, -332933, -394983, -334121, -178307, -21912, 34524, 25726, 43661, 81298, 115313, 147038, 134461, 42076, -82234, -195161, -271019, -299257, -319740, -343644, -311383, -177174, 41028, 268154, 421735, 507485, 535043, 499578, 466610, 474525, 460169, 393835, 313547, 270300, 256072, 270104, 334834, 436653, 549995, 655758, 722143, 707245, 609708, 526746, 523046]
14113E23046n80j12558j62992l803J89819K39199J75181Q1596R596m2808p8870
14102H16826j28570j97014k09516j59701j06589n9625J3704Q7085P2083K6115
14092A54798J8409R982J1695J6976p509l0423j9905l875j3786l5117p0171q0396
14080d9322l2738j2919j6183N951K0378N08O843L1538K7058O933O322L2506K812
14067B9687n9800j01681j06556p0469l0322K651M0186M6998L9389M7196k3973
14056a86694j65832k31418j58012o0037j5226N822N5374J58713K51341K18353
14046a27616O0809n0274J255J40386K60571K49692J01637q0270k26251k87504
14036D2435k27959r8770R972Q2818J18462J28750J42703J26472N8413p3700j86704
$$ y = [523046, 522466, 409908, 246916, 243113, 432932, 672131, 847312, 928908, 938504, 895696, 816826, 688256, 491242, 281726, 122025, 15436, -44189, -30485, 56600, 128683, 154798, 173207, 183189, 194884, 211860, 204351, 173928, 154023, 150148, 136362, 101245, 31074, -49322, -82060, -94979, -111162, -105211, -84833, -84325, -77482, -45944, -18886, -11953, -5631, 26875, 29687, -30113, -131794, -238350, -308819, -339141, -336490, -296304, -249306, -209917, -162721, -186694, -352526, -583944, -741956, -801993, -817219, -811397, -756023, -597310, -345969, -127616, -66807, -117081, -115826, 24560, 285131, 534823, 636460, 556190, 329939, 42435, -185524, -284294, -274322, -191504, -73042, 55708, 198411, 324883, 383296, 309596, 122892]
14025A22892j60945o7245q771J579K361k961l5916m7856l8026m9262l6147m8943
14013c69240j09916r7006k6456J3065N594P898K6541K9296K1202J2056k0322n6234
14001e63522p3731n8707j8858j3362r3597j30736l854J80320K82284K53193J58349
13990h2221O0913k0525j5129O3808P8866N723q9147j12174n144J05346R5125j2741
13978G2700r6916o1448K0097P0737O1754K0957l2742j12854j80749j88707j23554
13967e50725M855J10016J56365J84698J89254J58493J11486L8704j6172j7126
13957C69848j4075m9021j17532j54226m8332J13231J33393M7376l193l5488q8382
13946A53599j08920j28703j79175j81961j02719j5165P082p45L5390R5249J81731
$$ y = [122892, -38053, -105298, -114069, -112490, -110129, -113090, -149006, -196862, -234888, -284150, -320297, -369240, -479156, -576162, -602618, -589553, -583959, -576061, -549520, -520224, -499022, -486966, -507288, -563522, -637253, -695960, -714818, -728180, -821777, -952513, -956367, -776047, -493763, -240570, -82221, -21308, -41833, -56962, 6846, 85712, 91435, 2288, -109886, -115030, -9684, 85441, 72700, -24216, -85664, -65567, 5170, 66924, 87881, 55139, -57715, -238464, -427171, -550725, -545870, -435854, -279489, -94791, 94463, 252956, 364442, 403146, 386974, 369848, 355773, 306752, 189220, 34994, -13338, 99893, 233286, 280662, 277469, 241981, 153599, 44679, -84024, -263199, -445160, -547879, -563044, -555962, -556707, -521317, -426068, -244337]
13935b44337K33691K10720J85633K11004K55865K01916O6508p2384j82493k73107
13925E93016l07583k22255n3975R3131J48572J35056J02246K7460q3010j35411
13915B97247j00521o1514o4187j08744j92302k31965j43775K1736J35701J12536
13905c35788J0140l7204L41M6060O7706O7739K9636O48l415L9717J34146K10909
13893B30635K18715J58064R9133L1144q4055j52164j35447n9801l9512j14505
13883A52207j65780j37140j03284q4737m8954l626L5503R087k5784p8641k02496
13872f53645k38614r9826J11648K29150K12331J38291O6735k8544j10420p5383
13862d48277K4066R5728O9542m4550j00820J8366J98354K19692O9826o3251p7721
$$ y = [-244337, -10646, 200074, 385707, 596711, 852576, 1054492, 1121000, 1048616, 866123, 593016, 285433, 63178, 9203, 102334, 250906, 385962, 488208, 515668, 432658, 297247, 196726, 135212, 71025, -37719, -230021, -461986, -605761, -584025, -448324, -335788, -325648, -362852, -362511, -316451, -248745, -181006, -151370, -150722, -154137, -114420, 19726, 230635, 449350, 607414, 706547, 737691, 653636, 501472, 366025, 306224, 266712, 152207, -13573, -150713, -253997, -338734, -387688, -391314, -355811, -346724, -372508, -451149, -653645, -892259, -992085, -880437, -651287, -438956, -300665, -233930, -262474, -372894, -448277, -424211, -328483, -258941, -303491, -404311, -385945, -187591, 32101, 101927, 38676, -39045]
13851c9045m5858j7594M8657J03341R6295P0570L8455m937l1070m7918j09675
13840F1221j44919r2266o988M5471M6316L6859M3929M6099L641k5013L4405J38321
13828A87076K23245J99936Q5337O018k7492m2160O453O9707N5578m7767j60808
13817E55123j85293j32514q3018p3848p4586j1962Q1638Q3191Q819m8752j15754
13806C044j79821j78525j07376n3341j5172N4265J03355R4601J6982n7517p3686
13795c93191m2612J7353J04386J91323J89323J26017M8063m9868j01370r2806
13785c382q7744j10232q2944L7953J91596K64430J75656K3808o2801m9463k781
13774B94096k0700j01470j89424k16938j52607j6238J12303J45617R2730M4874
$$ y = [-39045, -84903, -102497, -53840, 49501, 145796, 216366, 254821, 249884, 218814, 170896, 61221, -83698, -175964, -182952, -137481, -91165, -54306, -10377, 35722, 39363, 14350, 48755, 187076, 410321, 610257, 695594, 701612, 674120, 631960, 638413, 708120, 763698, 715931, 555123, 369830, 237316, 154298, 80450, 5864, -6098, 75540, 158731, 167550, 118798, 3044, -176777, -355302, -462678, -516019, -531191, -476926, -373571, -278970, -261988, -319505, -393191, -435803, -418450, -314064, -122741, 66582, 192599, 240662, 190794, 89424, -3382, -91126, -201358, -284302, -246349, -54753, 209677, 385333, 409141, 346340, 296877, 294096, 273396, 171926, -17498, -234436, -387043, -403281, -290978, -145361, -52631, -7757]
13764g757M4862L5468j2549q3431j22953q0009r092J8363j095l4683n5317m7761
13752c55954l8116J3092P7592R5415Q8884M1207n3160r2758n9447k1337p59M2529
13740b62812N0904O700K1819Q0729J40198J86597J30475J8059o0823n9215q359
13729B44272l83l4664o1533o7685m2403k0670n3545j47096k43030k54029j73950
13718h54716o5540l5597m5579J1133R8563J01625M982o1902J826J19770J71582
13707e53853J19942J4373l7901J0306J16130K07738K26844J83863J20003N4550
13697D61995O49j1764J4994K5526p927k3027j6569k2015k0380j2097J8741N3013
13685D61139P8595J29913J12760k2848j84478k77894l05754k86771k06139o6917
$$ y = [-7757, 37105, 72573, 60024, -23407, -146360, -226369, -235461, -217098, -218193, -252876, -308193, -355954, -394070, -380978, -303386, -207971, -119087, -77880, -131040, -223798, -283245, -304582, -305341, -262812, -211908, -205208, -183389, -102660, 37538, 224135, 354610, 372669, 311846, 252631, 244272, 243889, 209225, 147692, 80007, 37604, 16934, -36611, -183707, -426737, -680766, -854716, -920256, -955853, -1001432, -990299, -891736, -790111, -785129, -847031, -845205, -725435, -553853, -433911, -419538, -457439, -447133, -331003, -123265, 103579, 287442, 407445, 461995, 462644, 450880, 465874, 491400, 483473, 460446, 443877, 421862, 401482, 389385, 408126, 461139, 539734, 669647, 782407, 759559, 575081, 297187, -8567, -295338, -501477, -568394]
13675e68394M6100R4438J29582J46770P4252l9337p4181j10535j52379r8758n415
13664e57857K2459j3377j784O8002J86961L03792K93373J92252M4348j08582k00017
13653B29570k47106k22199j30953j694J20147J57262J17324N4018m9109j62160
13643a34900j90679j67723j19395m111J48664K17265J62176Q1488K5913j0589
13633H109j0843K5403N7049L9546P827K3691L9335J3575l7025q1673p6506n2874
13621d4386k8665N298L1595P0375J24759J29995L7288o7813r4638q9369q8702
13610a4263o8842J795J00575R5080K7493O0354J21169P4585K6365K3777l9912
13599D08176j27325j66706j27664n823J03430J14432O7886K8217j1313n1598q4433
$$ y = [-568394, -522294, -427856, -298274, -151504, -77252, -116589, -190770, -301305, -453684, -552442, -557857, -535398, -548775, -550559, -482557, -295596, 8196, 301569, 493821, 538169, 429587, 229570, -17536, -239735, -370688, -372382, -252235, -94973, 22351, 76369, 27260, -134900, -325579, -493302, -612697, -616808, -468144, -250879, -88703, -7215, 18698, 8109, -2734, 22669, 79718, 119264, 127091, 150782, 190117, 203692, 166667, 84994, 8488, -44386, -73051, -67753, -36158, 34217, 158976, 288971, 326259, 258446, 163808, 74439, -14263, -83105, -81310, 19265, 114345, 141838, 202192, 323361, 397946, 424311, 448088, 408176, 280851, 114145, -13519, -19342, 84088, 198520, 266406, 294623, 283310, 231712, 147279]
13588A47279j57335k32800k30613j09482r530k7233m3349K4485J19419J87231
13578c31928J68773M5327o7402n1617K825K3614J2892m391M559n821l0624o6811
13566c00604j33048j67334j06614K387Q1190J40465J95193K44922K69151K75595
13556E01303K96778K54609J00674r6211k37514k60825j88707j22350r3230j03619
13546E0908j09610o1724P843o099j38941k50015k27686j15171P369M3600M5158
13535g54368P6344P2870K8078m3292q4860q182J32530K14752K29173K61495L04709
13524D29249K91726K27426J37868P0500K7632o6427k27670l29404k72223j69911
13514A18766j33265j03171l7092q444l288j7165q3980p7731M276L5588O565o645
$$ y = [147279, -10056, -242856, -473469, -582951, -592481, -619714, -663063, -638578, -519159, -331928, -163155, -117828, -185230, -236847, -234022, -210408, -197516, -201907, -197348, -203169, -233793, -300604, -433652, -600986, -707600, -705213, -624023, -483558, -288365, -43443, 225708, 501303, 798081, 1052690, 1153364, 1057153, 819639, 558814, 370107, 247757, 154527, 50908, -58702, -120426, -112583, -118682, -257623, -507638, -735324, -850495, -843126, -799526, -754368, -678024, -605154, -577076, -620368, -705228, -713410, -580880, -366128, -136955, 124540, 429249, 720975, 948401, 1086269, 1156769, 1184401, 1117974, 890304, 560900, 288677, 118766, -14499, -117670, -154762, -163206, -166494, -183659, -267639, -345370, -341094, -305506, -298941, -305586]
13502c05586L3324J05265J13624Q0305R4907J34936J17056N0039k9891j34699
13492B59280j99888j76985r5324J19L8939m796n2550j07579j45338j29285j40055
13481g53462j22643M75J07383J48100J38700J04070J10910J64539J81778J06145
13471A85995o3173k00032j88309q7286n3060j31847j38294k1484O8848Q9473L2679
13460e06490n4431q6846r7104n9095J01995L15265M02190K97828J03834n2391
13450C64755j39228j88770j83157j00243n991M0247M9674R0082J20513P4334J5286
13439A37502j5907k5339L950J1882l5722m8818r127k2295j12142j41063p3145
13428c30224r042K0484M3546J6554n1784q5630p4014o1852n9328p2860q7028l6607
$$ y = [-305586, -272262, -166997, -53373, 26932, 121839, 256775, 373831, 423870, 393979, 259280, 59392, -117593, -212917, -212798, -173859, -178655, -231205, -338784, -484122, -613407, -753462, -876105, -875630, -768247, -620147, -481447, -377377, -266467, -101928, 79850, 185995, 122822, -77210, -265519, -352805, -405865, -537712, -676006, -697490, -628642, -539169, -506490, -560921, -647767, -744871, -803966, -701971, -386706, 15484, 313312, 417146, 364755, 225527, 36757, -146400, -246643, -252634, -212387, -162713, -72631, 47882, 122216, 137502, 121595, 96256, 100206, 112088, 76366, 27548, 18421, -3874, -116016, -257079, -330224, -339266, -318782, -275236, -258682, -310466, -396096, -470110, -531962, -591290, -664150, -751178, -787785]
13416g87785O8496J40100J26631Q1486r916j20422p6959L0996J0490q8014r4276
13405g19173K2328J44950J88728J78007J11093L7773L7446P1142P8825N2902K1134
13394B25155k4010n8788l9656p833m514j2505j878J2268J9698L6143L6939J2592
13382A93611J2198L6119K3804m0899p7515p3623q9716r8422j03394j17416j12648
13371d47901k8358Q7319J40750J28280R0270M5506O520J7031J9450J6174N3110
13360A28151O9045K7016K2955O0986M4362k174n6430q1158q7125o4074J7957J11207
13348A90718J18276M0568k0061k1172K7871N1758R511m5898j25751j64929r4147
13337c3256J3353P2672Q6649N2841k7207r3271j16897r1379m0881p720M4316R7152
$$ y = [-787785, -719289, -579189, -452558, -371072, -380988, -501410, -578369, -547373, -536883, -624897, -719173, -696845, -551895, -363167, -185160, -74067, -36294, 1152, 72294, 151119, 204021, 225155, 201145, 142357, 102701, 94868, 90354, 77849, 75971, 88239, 107937, 144080, 181019, 193611, 205809, 241928, 265732, 224833, 147318, 73695, -16021, -114443, -217837, -335253, -447901, -476259, -388940, -248190, -119910, -29640, 15866, 22386, 39417, 58867, 75041, 128151, 197196, 224212, 247167, 308153, 352515, 350341, 293911, 212753, 125628, 61554, 79511, 190718, 308994, 349562, 329501, 308329, 336200, 387958, 397469, 351571, 225820, 60891, -33256, -19903, 52769, 139418, 192259, 165052, 71781, -45116, -136495, -177376, -185096, -140780, -43628]
13325d3628J22612J56610J89692J59779J9229j28812j35037j3391J23508K15585
13315F66147K25065J42702J2657j07816j70900j76444j47901o9281K4403J06521
13305E05153J81859K01700J64553O9546o6367j42967j05915J4032J57735K36067
13295A215396K00865P9446n3675j23466j72222k17038j99852p9594M3573M0351
13285G33784l8638j01974j13579j02264r4530m3269N5176J36041J27943L9686
13275E98376l1971l0988k9035j22707k27845k19469j25818R209J34326J82092
13265A36170J92887J65941R0505J4007k7948j9619P23k2342l8194o493K4522K7979
13253E38138k4827o1056m1776p2775j44916j09851m760O6033J10493J41007J28154
$$ y = [-43628, 78984, 235594, 425286, 585065, 604294, 475482, 340445, 327054, 450562, 666147, 891212, 1033914, 1046571, 938755, 767855, 591411, 443510, 374229, 398632, 505153, 687012, 888712, 1053265, 1122811, 1056444, 913477, 807562, 821594, 979329, 1215396, 1416261, 1495707, 1442032, 1318566, 1146344, 929306, 729454, 649860, 693433, 733784, 695146, 593172, 479593, 377329, 282799, 239530, 294706, 430747, 558690, 598376, 566405, 535417, 506382, 383675, 155830, -63639, -189457, -180248, -45922, 136170, 329057, 494998, 585503, 599510, 571562, 551943, 552666, 530324, 492130, 485637, 510159, 538138, 513311, 452255, 410479, 337704, 192788, 82937, 78177, 144210, 254703, 395710, 523864]
13242E23864O4447K9465q807r9800j34719o8674M0876J33875J67504R3516m6871
13231F94676j41551j54990q7468J1761J05353J69626J88319J67889J13826M3537
13221A110978Q593J7471M4919N9804K6375l1376q5587j33946j71751j34894l3780
13210F76806n06l9397j5645N7550M1158k5113n8765m3120m3376n7362k1793K2997
13198D93434J6670j8992j2478K0191M8435O0661L8285N3248J03037P8550N0526
13187I31567Q1406R6019P1706M9147L85q2589j07193K8807J77651J58960J1665
13176A417531j62804k90525k51213j00945j8610l1331r4496j07524l5418M1798
13166C66463O5500N8564O5860Q0585Q4709J17154J50425J86430K17359J65799
$$ y = [523864, 588311, 617776, 608969, 509169, 374450, 305776, 346652, 480527, 648031, 741547, 694676, 553125, 398135, 310667, 322428, 427781, 597407, 785726, 953615, 1067441, 1110978, 1119571, 1137042, 1181961, 1241765, 1268140, 1236764, 1151177, 1017231, 845480, 710586, 676806, 676300, 636903, 621258, 678808, 719966, 694853, 636088, 592968, 549592, 492230, 470437, 493434, 510104, 491112, 478634, 498825, 547260, 607921, 646206, 699454, 802491, 881041, 931567, 1012973, 1108992, 1180698, 1229845, 1230230, 1147641, 1040448, 1069255, 1246906, 1405866, 1417531, 1254727, 964202, 712989, 612044, 593434, 562103, 467607, 360083, 324665, 366463, 431963, 490527, 556387, 636972, 721681, 838835, 989260, 1175690, 1393049, 1558848]
13156A558848Q9519O0358J5345m7665m5963l880Q110q935l7359n8176l6806l350
13144A490046Q134R0183K47120L27700L09467K14103N7416m9078l8030K8612O9451
13133B755124M1821k3019l5325q133J710J171j6791o738J9173j6031r8028j39321
13121B475613j39556j41100j55845j48081o2407L6452O3147M2853k687l9338k1632
13110A907419Q031N5800J11759Q8305N2099N2287J2754o2774j73074k64721k49009
13099A538876j25089M292O4133O9288Q7953J61659J74278Q2177k600l1737o2625
13088A960605r1949q6841l3762Q790K5881N3341N8420M1175K4441Q539K7925Q9985
13076B086550J75867K67070K98838K60872J66752O5203Q934j9668n4354r5902
$$ y = [1558848, 1648367, 1708725, 1724070, 1676405, 1630442, 1626562, 1634672, 1625737, 1588378, 1530202, 1493396, 1490046, 1498180, 1588363, 1835483, 2163183, 2472650, 2686753, 2744169, 2695091, 2657061, 2685673, 2755124, 2796945, 2773926, 2738601, 2730468, 2732178, 2733349, 2716558, 2709820, 2728993, 2712962, 2614934, 2475613, 2336057, 2194957, 2039112, 1891031, 1828624, 1865076, 1928223, 1971076, 1968389, 1929051, 1907419, 1915450, 1971250, 2083009, 2171314, 2223413, 2275700, 2288454, 2225680, 2052606, 1787885, 1538876, 1413787, 1418079, 1482212, 1551500, 1639453, 1801112, 1975390, 2057567, 2054967, 2023230, 1960605, 1868656, 1781815, 1748053, 1756843, 1782724, 1836065, 1894485, 1935660, 1960101, 1968640, 1996565, 2086550, 2262417, 2529487, 2828325, 3089197, 3255949, 3321152, 3330086, 3310418, 3256064, 3160162]
13066C160162j23666q8615l8938l1951m4681n3243p1562q3352l8743R3388K27547
13055B906346K34201J21305K8661K935J0448N6006P8278O2321L2706L7789J48310
13044C719306K33818K06525J36552J11416J15862N8107m6405p3984L1770J42543
13034D635510J18469N2032M8206J13749J83360J80849J34100J03563J40742K21211
13024E931791K63199K42526K18966K15682K02020J59906R1677Q6989K02500L29341
13014G944597L67329L65313L99335M57041N30184N79475N42986M43214L85248
13005A2014722M21652N47437P02842Q06562R03091J047388J172613J292061J483572
12996B0391940J727531J968164K186795K426933K750833L230465L846618M521473
$$ y = [3160162, 3036496, 2947881, 2908943, 2876992, 2832311, 2779068, 2707506, 2624154, 2585411, 2678799, 2906346, 3140547, 3261852, 3290513, 3293448, 3303896, 3359902, 3438180, 3500501, 3533207, 3570996, 3719306, 3953124, 4159649, 4296201, 4407617, 4523479, 4581586, 4535181, 4461197, 4492967, 4635510, 4753979, 4806011, 4854217, 4967966, 5151326, 5332175, 5466275, 5569838, 5710580, 5931791, 6194990, 6437516, 6656482, 6872164, 7074184, 7234090, 7325767, 7412756, 7615256, 7944597, 8311926, 8677239, 9076574, 9533615, 10063799, 10643274, 11186260, 11629474, 12014722, 12436374, 12983811, 13686653, 14493215, 15396306, 16443694, 17616307, 18908368, 20391940, 22119471, 24087635, 26274430, 28701363, 31452196, 34682661, 38529279, 43050752]
12988D3050752N340540O347278P490518Q742591J0252948J2219595J4722459J7818440
12980A25985121K1592315K6045723L1031710L5957821L9170342L7280783K6163032
12973C43226847N373135j8160158l4934150m1206055l9631920l4454330k8522260
12966A51691109k3149318j8735294j5221527j2426431j0182505q404724p049096
12959E6522214n969248n016689m204035l597358l138323k794976k539693k285259
12951B6976633j976028j616872j287076j068396r58286r34316r40735r10057q10652
12942A6474215o59489m64271k64869j77436k70526l89039l70177k16678o9943
12933A3591787k7187j3366Q1237J83842K11945K08362J62196N8791L814J08847
$$ y = [43050752, 48391292, 54738570, 62229088, 70971679, 81224627, 93444222, 108166681, 125985121, 147577436, 173623159, 204654869, 240612690, 279783032, 317063815, 343226847, 348599982, 330439824, 295505674, 254299619, 214667699, 180213369, 151691109, 128541791, 109806497, 94584970, 82158539, 71976034, 63571310, 56522214, 50552966, 45536277, 41332242, 37734884, 34596561, 31801585, 29261892, 26976633, 25000605, 23383733, 22096657, 21028261, 20069975, 19135659, 18194924, 17284867, 16474215, 15814726, 15350455, 15085586, 14908150, 14637624, 14248585, 13878408, 13661730, 13591787, 13564600, 13551234, 13632471, 13816313, 14028258, 14236620, 14398816, 14457607, 14461421, 14570268]
12923A4570268L73083O05244P31395Q70497J044299J203275J315677J333728J203212
12914B3250678R13666N67232L84104M65272P07621J017932J387129J784968K194298
12905C2672900K593279L083838L762641M585769N456244O405266P518845Q859373
12897G4938155J0555688J2755560J5563756J9045502K3146829K7804267L2916937
12890B16726694L7774033M0199185L6099990K1536032j882224k5038277l9037235
12883B86378198m2473562l9216776l3365391k7330918k2093072j7816604j4425180
12876H9656695j1770711r667830p974182o568843n400258m491938l812827l307483
12868C6662623k959990k707765k458477k132684j787583j536772j400006j278942
$$ y = [14570268, 14943351, 15548595, 16279990, 17150487, 18194786, 19398061, 20713738, 22047466, 23250678, 24164344, 24731576, 25115680, 25580952, 26288573, 27306505, 28693634, 30478602, 32672900, 35266179, 38350017, 42112658, 46698427, 52154671, 58559937, 66078782, 74938155, 85493843, 98249403, 113813159, 132858661, 156005490, 183809757, 216726694, 254500727, 294699912, 330799902, 352335934, 350453710, 325415433, 286378198, 243904636, 204687860, 171322469, 143991551, 121898479, 104081875, 89656695, 77885984, 68218154, 60243972, 53675129, 48274871, 43782933, 39970106, 36662623, 33702633, 30994868, 28536391, 26403707, 24616124, 23079352, 21679346, 20400404]
12860B0400404j135308j005976q75724p20445n76490m74145l74019l11464l16757
12851A4610076l50443m02038m31101l37159j11010P0682O3557j9549o9053j14056
12841A2909906j59031j51326o7813J07080L19113M37767M47923M21489M27497
12832A4692605M67341N24552N81442O26996P00177Q03461R06792J014668J130575
12823B1448609J316711J561945J775099K040155K470128K998654L535001M142639
12815D1288941M865900N716065O768400P992293R388596J1076475J3330865J6373126
12807A16800661K0078066K4309676K9061064L4069939L8256585L8932598L1943635
12800C33452224J4698463q938175k9488224m0136566m1298933l7152868l1270573
$$ y = [20400404, 19265096, 18259120, 17383396, 16662951, 16086461, 15612316, 15238297, 14926833, 14610076, 14259633, 13857595, 13426494, 13089335, 12978325, 13049007, 13112564, 13093015, 13023962, 12909906, 12750875, 12599549, 12531736, 12638816, 12957929, 13395696, 13843619, 14265108, 14692605, 15159946, 15684498, 16265940, 16892936, 17593113, 18396574, 19303366, 20318034, 21448609, 22765320, 24327265, 26102364, 28142519, 30612647, 33611301, 37146302, 41288941, 46154841, 51870906, 58639306, 66631599, 76020195, 87096670, 100427535, 116800661, 136878727, 161188403, 190249467, 224319406, 262575991, 301508589, 333452224, 348150687, 339212512, 309724288, 269587722, 228288789, 191135921, 159865348]
12793A59865348k5564397k0732401j6758212j3529093j0983750r019266p484156
12786E5794073o241297n269092m536071l940892l387790k917693k555400k219531
12778B4726307j909646j663158j478864j350954j276754j271630j253455j146874
12770A3374972r85314q34352o90464n90763n47489m80402l99434l94181l87445
12761H065128l14448k64362l12441m15740m52765m13972l57404k24982q0160j2903
12751E215951K4852M8811L3424l9171j08689j08052q9557j57717k66883k96225
12741D256744k42586k12921k28004k14696j37284n672Q7925N0999o8879j53410
12731C132216j33813l0609M0168m115o1959m5505j6973l3174n7177n8340j03933
$$ y = [159865348, 134300951, 113568550, 96810338, 83281245, 72297495, 63278229, 55794073, 49552776, 44283684, 39747613, 35806721, 32418931, 29501238, 26945838, 24726307, 22816661, 21153503, 19674639, 18323685, 17046931, 15775301, 14521846, 13374972, 12389658, 11555306, 10864842, 10274079, 9726590, 9246188, 8846754, 8452573, 8065128, 7750680, 7486318, 7173877, 6758137, 6305372, 5891400, 5533996, 5309014, 5228854, 5215951, 5240803, 5289614, 5323038, 5283867, 5175178, 5067126, 4977569, 4819852, 4552969, 4256744, 4014158, 3801237, 3573233, 3358537, 3221253, 3215581, 3303506, 3354505, 3285626, 3132216, 2998403, 2967794, 3007962, 3003847, 2941888, 2896383, 2879410, 2846236, 2789059, 2730719, 2626786]
12720B626786j95279k31874j73509j44879k43995l07755k30988j14071p962Q3084
12710A059558J47540J77178J39837P1545l4070j43296j60359n8609P5972J44996
12700A420292J49097R9485J7917q3003j82877j76693m1103Q3700J18614J02469
12690A507898N6684p393n8552j7130R2096J30389Q0172K6052j5910o4618j59961
12679A569727k74521k41625m3022J30432J41394l0357k46284l14591k11740p5079
12669D04334J5084K1915P271M5416R7635J53547J92955J78117R8850k5864q7145
12658A102115l2709P3338J78029K04931J47219M7139n0205p5625n6752p983O5681
12647A595178N6263m0132j01865o9745n4630j10894j89820k21369j76859p7782
$$ y = [2626786, 2431507, 2199633, 2026124, 1881245, 1637250, 1329495, 1098507, 984436, 976474, 1059558, 1207098, 1384276, 1524113, 1595658, 1561588, 1418292, 1257933, 1199324, 1275296, 1420292, 1569389, 1668874, 1686791, 1603788, 1420911, 1244218, 1203115, 1286815, 1405429, 1507898, 1564582, 1557189, 1498637, 1481507, 1573603, 1703992, 1784164, 1810216, 1794306, 1729688, 1569727, 1295206, 1053581, 1010559, 1140991, 1282385, 1252028, 1005744, 691153, 479413, 404334, 419418, 441333, 448604, 494020, 591655, 745202, 938157, 1116274, 1215124, 1189260, 1102115, 1069406, 1142744, 1320773, 1525704, 1672923, 1720062, 1669857, 1594232, 1537480, 1529497, 1595178, 1651441, 1611309, 1509444, 1439699, 1385069, 1274175, 1084355, 862986, 686127, 608345]
12637F08345N5601J90915K21000J57557J88561K40679K17754J58299M3511q8212
12627A994010j88366k18210j78740j69983j72150j42689j35533j88371k30105
12618C69863j90276j18433k3652R1349J82919K27674K20151J61782J34375J63672
12608A219424J44464K8410j13072k10361k38910k12869j32924N413Q5446M3460
12598F18481l08L3803P2155O9287L0717n397K119M3919Q0081Q0086O793q3367
12586I48369o4592k0291r7987k35370k69362j58532k665J03024J45521J46882
12576D94997J14588M1085n4250r1499l4805N5725P9354J5594m9148m2383N6061
12565E85319J47707J61679J10484n176j15074j49864j62967j39828m7767K5864
$$ y = [608345, 663946, 854861, 1075861, 1233418, 1421979, 1662658, 1880412, 2038711, 2082222, 1994010, 1805644, 1587434, 1408694, 1238711, 1066561, 923872, 788339, 599968, 369863, 179587, 61154, 37502, 128851, 311770, 539444, 759595, 921377, 1055752, 1219424, 1363888, 1392298, 1279226, 1068865, 829955, 617086, 484162, 489575, 575021, 618481, 618173, 651976, 724131, 793418, 824135, 818738, 820857, 864776, 944857, 1024943, 1031736, 948369, 883777, 863486, 765499, 530129, 260767, 102235, 99570, 202594, 348115, 494997, 609585, 650670, 596420, 504921, 470116, 525841, 605195, 620789, 571641, 529258, 585319, 733026, 894705, 1005189, 1000013, 884939, 735075, 572108, 432280, 384513, 410377]
12555D10377L1917k270k9191p324K3808L245k6434l4296l811P3780J46397K01163
12543G87361K49522K58985J95216R0311k1511j44060k59283l31110l48523k73131
12533B03777j26458K9241J42579J76171J41688R2093N8917M0190J7748n8383j56860
12522E60703k01564j43100l6001J1298L9990N2106J3489n8554j39283j76510j30351
12511b07777p0941n0035k1569k5891o7637p7749l2175O0099J62150J99851J73771
12500D2097J33077J07670J01900P8599K3788l3939p1771j13306j83812k04715
12490a20412j64017r4987j269R0581J48307J07056N3770Q1268J38796J80861J88613
12479F08567J17113L0704O520k4530r7568j61695j28155j7151M0965J3551j9124
$$ y = [410377, 442294, 440024, 410833, 403509, 427317, 430562, 404128, 369832, 366021, 439801, 586198, 787361, 1036883, 1295868, 1491084, 1581395, 1559884, 1415824, 1156541, 825431, 476908, 203777, 77319, 106560, 249139, 425310, 566998, 659091, 718008, 758198, 775946, 717563, 560703, 359139, 216039, 180038, 191336, 231326, 283432, 296921, 238367, 99084, -77426, -207777, -278718, -328753, -350322, -376213, -443850, -521599, -553774, -493675, -331525, -131674, 42097, 175174, 282844, 384744, 463343, 487131, 453192, 381421, 268115, 84303, -120412, -284429, -379416, -380685, -290104, -141797, -34741, 19029, 100297, 239093, 419954, 608567, 725680, 756384, 762904, 738374, 640806, 479111, 350956, 333805, 374770, 388321, 369197]
12468C69197r352j5620k9484l0312l8361r490L9009Q9614J31627J43791J24704
12457G65323J05402J04067N0693m2188j36035k02538k09268j87980j69993j41888
12447f4405q2779l2751k7446p4543j30968j41184j06405n2075j7269L1503J13981
12436e84341J92135K26036K23232K19828J60727L4327m2897l1361o268l1898q8674
12425B70846j11580r7611r7362j10885n3919P7162J46475J00064N5870O5576O6798
12414C11434J6659l4401k3725L6956O0055K1160L3156Q6143J12760J06957P6293
12403H03447K1461n6499o0307N7085J58549J34422M5936o6891j58401j59055p2215
12392F47532P049K7900K2312L9110M9747K331m2546n8787r9144j43704j58576
$$ y = [369197, 359845, 344225, 314741, 284429, 246068, 236578, 275587, 365201, 496828, 640619, 765323, 870725, 974792, 1025485, 983297, 847262, 644724, 435456, 247476, 77483, -64405, -147184, -179935, -207381, -281924, -412892, -554076, -660481, -712556, -729825, -698322, -584341, -392206, -166170, 57062, 276890, 437617, 471944, 429047, 397686, 391418, 359520, 270846, 159266, 61655, -35707, -146592, -200511, -123349, 23126, 123190, 179060, 244636, 311434, 328093, 293692, 269967, 306923, 366978, 388138, 421294, 507437, 620197, 727154, 803447, 824908, 768409, 708102, 765187, 923736, 1058158, 1104094, 1037203, 878802, 719747, 647532, 654581, 682481, 704793, 743903, 793650, 795981, 753435, 694648, 595504, 451800, 293224]
12381B93224j33015q2885o3090k5018N9029Q8561O2265L5708J8742J6940N4167
12370C24628J21272J47819P9764k6625o7242o7866n1010k6417n7381j28970j56973
12359I0999j21078p2697k4670J5937O9961J07229R8160R1428Q3825N6012n385
12348C89721j13974k07522k24590j96133j19630m5101j2060N5347J63276K18305
12338i2361J75102K7775j22378j20548L2450J58602J50500M4951l7664n9166o6517
12327I0746o9201m9016o408L5800P5806J05167J20259O7940l0529q6105q6143
12316A68316j5930P0081N8150n792l8760p0166j07971r8052j5681N5391P1597
12305G1183N3741M0937Q2842J19114M5561p9512j63784j94081j49624n9845O0796
$$ y = [293224, 160209, 77324, 14234, -10784, 48245, 136806, 199071, 234779, 253521, 270461, 324628, 445900, 593719, 673483, 646858, 579616, 511750, 460740, 434323, 376942, 247972, 90999, -30079, -102776, -127446, -111509, -41548, 65681, 163841, 255269, 339094, 395106, 389721, 275747, 68225, -156365, -352498, -472128, -517229, -529289, -473942, -310666, -92361, 82741, 110516, -11862, -132410, -99960, 58642, 209142, 254093, 216429, 157263, 90746, 21545, -27471, -33879, 1921, 77727, 182894, 303153, 371093, 340564, 254459, 168316, 152386, 222467, 280617, 274825, 236065, 165899, 57928, -40124, -55805, -414, 71183, 124924, 165861, 248703, 367817, 413378, 333866, 170082, -23999, -173623, -233468, -172672]
12294a72672J55705J45710R6336M9445r489n4561n0030r766K5273M1542J2502
12283B29995l4840l3622j2878r731J860j0128j15123k46932k59461j66395q1188
12272g38443o175J26134J95781J27912K5482l1497m4082p8897j25585r3705j6149
12261f59224P7340J79173J61330K9021r8549j15312n5363L1350J30744J72708
12251a46782J48996Q9183N5922M8362j6256j25553j33905j6803Q7984J05809Q1958
12240A78915M3521J7506M6429R5302J18169J70536K58286K26300L1559j36009
12230A050514j93703k30790k31300j73324j16121q8288q6655j20044r8522k995
12220b91228L5374K3221M8355P8028N1805j3472r2401j48995j03461N4602J56401
$$ y = [-172672, -16967, 128743, 225079, 274524, 265035, 210474, 160444, 150678, 175951, 217493, 229995, 195155, 161533, 148655, 138924, 140784, 130656, 15533, -231399, -490860, -657255, -738443, -744618, -618484, -422703, -294791, -269309, -300806, -344888, -423785, -549370, -643075, -659224, -581884, -402711, -241381, -212360, -310909, -426221, -481584, -450234, -319490, -146782, 2214, 91397, 147319, 195681, 179425, 53872, -80033, -96836, -8852, 96957, 178915, 222436, 239942, 286371, 381673, 499842, 670378, 928664, 1154964, 1186523, 1050514, 856811, 626021, 394721, 221397, 105276, 16988, -69667, -189711, -288233, -291228, -255854, -232633, -184278, -106250, -54445, -67917, -160318, -309313, -412774, -358172, -201771]
12209b01771J38738O5565J3577j1851o4349q9988j7603R1783J16067N1249M9575
12198A40992Q9680N3629k446o2314j58804k35617k29461j37402j3428M5320K7065
12187d82786J3965Q595J0232M6589N8948K9139M489N2585R7033M2322k7292m7811
12175a93992o1095k7555J05897K34135K42815J15191l4502q5940o6409o4237p7705
12164H6603m6799m114N8998J46029J06785p3226k26687k13697n3334Q9651J53498
12153B3707J35123Q8483O6804L1258K5868Q171r8710j93398j75141j05945m6274
12142b40054k1166l8471q9539j46054j74343j90373j49895m2927M7152R3812P5876
12131h75982M693l1420l904P6448J36287R4291N728j8394L7860J02514J06046
$$ y = [-201771, -63033, 2532, 16109, 4258, -60091, -150079, -167682, -75899, 40168, 91417, 140992, 230672, 284301, 281855, 219541, 60737, -174880, -404341, -541743, -555171, -509851, -482786, -468821, -460226, -449994, -403405, -344457, -315318, -310829, -258244, -161211, -118889, -146181, -193992, -255087, -282642, -176745, 57390, 300205, 415396, 380894, 294954, 228545, 164308, 86603, 39804, 35690, 94688, 240717, 347502, 274276, 47589, -166108, -219442, -129791, 23707, 158830, 247313, 314117, 345375, 371243, 379414, 280704, 87306, -87835, -193780, -240054, -261220, -299691, -389230, -535284, -709627, -900000, -1049895, -1092822, -1045670, -951858, -875982, -871289, -902709, -906613, -830165, -693878, -599587, -593859, -612253, -574393, -471879, -365833]
12120c65833j1024j74402j85781n8527N1750J62630L15738L65131K89013K55290
12110F43985K66894K24770Q1420q0577j90216k65269k98719k24238m6285P6909
12100A88674Q4980L3560l5602j07118j73051j84656j55917r5603k4723o1136j52096
12089f82688j52582k3446J47847K30827J87989J11026N7733p889q5224r4932j5255
12078c26594Q3932J09096N8776R009j4373j6860r544J6222R1849J53034J60002
12067C14549J65052J66709J30273L5044p0521j21891j20323q7746k1772M9263
12057D38637J6286p0978j32285j38021m8467O2669J01899P5480M7343N0845O3275
12046D66683J9346m2040p7072j33639j77074j55152j21722j18771o7322P2314
$$ y = [-365833, -376857, -551259, -737040, -795567, -743817, -581187, -265449, 99682, 388695, 643985, 910879, 1135649, 1217069, 1136492, 946276, 681007, 382288, 158050, 111765, 188674, 273654, 307214, 271612, 164494, -8557, -193213, -349130, -444733, -469456, -530592, -682688, -835270, -858716, -710869, -480042, -292053, -181027, -123294, -131183, -216407, -311339, -326594, -242662, -133566, -74790, -65781, -80154, -97014, -106558, -90336, 1513, 154547, 314549, 479601, 646310, 776583, 811627, 741106, 619215, 498892, 411146, 389374, 438637, 454923, 383945, 251660, 113639, 65172, 127841, 229740, 305220, 352563, 403408, 466683, 486029, 443989, 366917, 233278, 56204, -98948, -220670, -339441, -406763, -334449]
12036c34449J58136J09527N204m745R0360J45026J10336O0517L4113L964l5646
12025C42343k7632P516J5752M3423P2660M8732n0039j39476j22654p0821l6993
12014H2811J0243K9540q810r4271j46689j23205r7480n4336O1221J60913J47613
12003c2450J03296J14578J26978O8933K441J7709Q7965J10732K4487q7427r1091
11992D46151k9504M048M8175J29725R8667n8987j29412o0340K8325L8982j8507
11981D97323p8663o2558L4349P7486k8606j62430k16699j72534m9693N2673M7755
11970f1597k10J5274M1413K860j3141K5966N1245P1573Q6665Q3759P4782N242
11958C83831j06147j48839j36287j15792n5745P1021J41875O9156m0135p1907
$$ y = [-334449, -176313, -66786, -61582, -66327, 24033, 169059, 279395, 339912, 374025, 377989, 342343, 314711, 322227, 337979, 381402, 454062, 502794, 452755, 313279, 190625, 119804, 82811, 93054, 122594, 113784, 19513, -127176, -250381, -347861, -402197, -340976, -180063, -32450, 70846, 185424, 312402, 381335, 383776, 401485, 489450, 600182, 624669, 537242, 446151, 416647, 420695, 468870, 598595, 697262, 638275, 508863, 448523, 476848, 515830, 497323, 418660, 356102, 390451, 467937, 439331, 276901, 60202, -112332, -162025, -109352, -61597, -61807, -46533, -5120, -2260, -15401, 10565, 61810, 133383, 220048, 303807, 378589, 383831, 277684, 128845, -7442, -123234, -178979, -107958, 33917, 103073, 62938, -8969]
11948h969o0690o2695o6692l9676l2248q2597j21551j08541n1554K0236M4768
11937e70209N5965J08153J74070K00627J45089Q1800Q7358J07557J09464Q0703
11927E80577L7489L8603P2020L4240q2219j62607j49053j16638j35683j42307
11917b5578p3372o498j8580k6466j1027o3086j75092k48968j82914J5437K17793
11906e98351K68776J87562Q6156J0554n9179q5492o8153p3252p3056n4769j4618
11895d73822N5883J23713J39630Q8148K7989m252j2864K9387N6848M4390O2572
11884A37622Q7031P2381k920r4266j50718j92479j61813k1660Q4639O4699K6781
11873a50703L8081L4901N48n8634j45024j99007j56884k5195J12304J89965K07099
$$ y = [-8969, -69659, -132354, -199046, -238722, -270970, -353567, -475118, -583659, -635213, -614977, -570209, -514244, -406091, -232021, -31394, 113695, 195495, 282853, 390410, 499874, 580577, 618066, 656669, 728689, 762929, 680710, 518103, 369050, 252412, 116729, -25578, -98950, -105448, -124028, -150494, -161521, -224607, -399699, -648667, -831581, -816144, -598351, -329575, -142013, -55857, -45303, -104482, -189974, -258127, -331379, -404435, -459204, -473822, -417939, -294226, -154596, -66448, -38459, -42711, -55575, -26188, 30660, 75050, 137622, 224653, 297034, 294114, 199848, 49130, -143349, -305162, -326822, -242183, -177484, -150703, -112622, -77721, -77173, -135807, -280831, -479838, -636722, -661917, -549613, -359648, -152549]
11862a52549J77291J01288J8258n4932j39717k11948j61802j3381P1860P8908
11852b86724O1816n118j31003k39664k41070j20885P0029K17103J81788L0569
11842d63159l8287j2426L1182P2270J01817J03070N3809m8226j26046j21817q4682
11831e32495p0857m8341L024J8004j6544l9920n6549l5934M9178N7513m5791j07422
11819h26134q4627m5130j1449K3281L7555Q1297J42934J28727P810j18281j59085
11808h23102r7965N5657K02848J94105Q0479N2038J01062N6142k4195q196O6599
11797a44528J01382L6189l3358m2311k2809j7801J3442R7765J43006P9455p4043
11786A36389j49521k3941Q6754n252j10365p5949K6471P1209L6321p4869j73147
$$ y = [-152549, 24742, 126030, 144288, 89356, -50361, -262309, -424111, -437492, -365632, -286724, -224908, -230026, -361029, -600693, -841763, -962648, -892619, -675516, -493728, -463159, -501446, -513872, -482690, -410420, -308603, -205533, -151724, -199950, -325996, -447813, -532495, -603352, -651693, -648669, -630665, -647209, -687129, -743678, -779612, -730434, -672921, -718712, -826134, -910761, -955891, -967340, -944059, -906504, -825207, -682273, -553546, -545736, -664017, -823102, -921067, -865410, -662562, -468457, -387978, -335940, -234878, -178736, -202931, -211127, -144528, -43146, -6957, -40315, -82626, -105435, -123236, -109794, -12029, 130977, 210432, 136389, -13132, -37073, 49681, 44429, -65936, -141885, -115414, -44205, -7884, -82753, -255900]
11775b55900j44011o7520K6558J46103J98117J21590m6244j97772k40548k00575
11765f60202j39598m6521L7386M8012L2411o345q2768j50077k05228k45462k24288
11754a642680j27345j0063P9706J32505J48821K07988K78120K57002J71025N0135
11744d54786p6338j14443k3038J28217J62940M4605m7901l6863L336R875l5132
11733d39528p1086l470J26942K00992J64336P8301J9842j0192j5685j0796k3984
11722A5672m1327l3686j5561J3006M2515L2389N182J6678L8816J5114q5811k00128
11710a97141j88365r9460l5478O0387J53596J70496J11835K8761o6173j30710
11700a92252j37887j11402p316R8416J07464P6650M8054L2836L7029R366k2757
$$ y = [-255900, -399911, -467431, -440873, -294770, -96653, 24937, -21307, -219079, -459627, -660202, -799800, -846321, -808935, -760923, -728512, -734857, -817625, -967702, -1172930, -1418392, -1642680, -1770025, -1780088, -1700382, -1567877, -1419056, -1211068, -932948, -675946, -504921, -454786, -531124, -645567, -668605, -540388, -377448, -332843, -380744, -417607, -414271, -404396, -439528, -510614, -514084, -387142, -186150, -21814, 56487, 76329, 66137, 50452, 39656, 15672, -25655, -59341, -74902, -61896, -19381, 13008, 18190, 34868, 73684, 88798, 2987, -197141, -385506, -484966, -520444, -460057, -306461, -135965, -24130, 4631, -61542, -192252, -330139, -441541, -448857, -350441, -242977, -166327, -118273, -85437, -48408, -39042, -61799]
11689f1799m8065j03175j00743J288J08528J29356P2517j0404o2280p0270m0857
11678a85904O050P2655J37021J74648J64169M3880j13529j44572q4291n2190m9004
11667c1067O66N3013K3712o0414j21328j08893l0823N7006Q3848Q8680P3800r176
11655A9024m9241q613K6667M2262Q6222J23561N6647j2199M7045J28489J08842
11644E68706O8421J11991J58613O0388j60013l66161l95199k21406m9359M2648
11634a81371J48132K38366K39287J42284R038n0198m5130l2065m4131o5979q6832
11623B71401q8882m1503J4105O1243R8475J41200J77431J89530J72798J43873
11613A139671J14096L0335n4211p2859q6660j26768j31803n1294Q3193J91415
$$ y = [-61799, -109864, -213039, -313782, -312494, -203966, -74610, -2093, -12497, -74777, -145047, -185904, -179854, -107199, 29822, 204470, 368639, 412519, 298990, 154418, 70127, 17937, -31067, -30401, 22612, 46324, -14090, -135418, -244311, -275134, -218128, -134280, -45600, 28200, 19024, -30217, -38830, -12163, 30099, 116321, 239882, 296529, 284330, 331375, 459864, 568706, 637127, 749118, 907731, 968119, 808106, 441945, 46746, -174660, -224019, -181371, -33239, 205127, 444414, 586698, 595736, 545538, 500408, 468343, 424212, 358233, 271401, 182519, 141016, 155121, 216364, 314839, 456039, 633470, 823000, 995798, 1139671, 1253767, 1284102, 1229891, 1157032, 1070372, 943604, 811801, 760507, 843700, 1035115]
11603A035115J94675P4363n0660o4271L0928J06953P8135J5720J5681N8320J24233
11592A619192J84654J92425J81550J71796J53052J22811Q1849J7060m5498o7583
11582B611308o5080o5866o3439l3753l7969p7159q0828o8895o2706o7101l8294
11571A950218Q0357K15873K58464K13869J76851J28055L4189r438N2790J52467
11561C253695J88686K03945K94154M52526N09283M55257M64963N67307P45113
11552G134929J018348J374258J685289J870129K026494K249178K461021K336400
11544B2156046J588809K77705j169605k242505k724531k731679k463977k122446
11536A0567817j797497j495044j208195r27399o79047m67853l08468k64537k77209
$$ y = [1035115, 1229790, 1304153, 1253493, 1189222, 1220150, 1327103, 1405238, 1420958, 1436639, 1494959, 1619192, 1803846, 1996271, 2177821, 2349617, 2502669, 2625480, 2707329, 2724389, 2678891, 2611308, 2546228, 2480362, 2416923, 2383170, 2345201, 2268042, 2187214, 2118319, 2055613, 1988512, 1950218, 2030575, 2246448, 2504912, 2718781, 2895632, 3023687, 3057876, 3048438, 3101228, 3253695, 3442381, 3646326, 3940480, 4393006, 4902289, 5357546, 5822509, 6389816, 7134929, 8153277, 9527535, 11212824, 13082953, 15109447, 17358625, 19819646, 22156046, 23744855, 24022560, 22852955, 20610450, 17885919, 15154240, 12690263, 10567817, 8770320, 7275276, 6067081, 5139682, 4460635, 3992782, 3684314, 3419777, 3142568]
11527C142568k53670k23256k17045k04099j86259j86477j88736k11128k72263
11518A199635l01334k64212k04886j42102p6200m8019m4423r288O0343Q0011L6594
11507B86119j1362k9686o1562j49795k58537l06462k30274m2198R1250J56561
11497e55946J32812K4955m2137j166J39694K37297K40857K04888J55010Q9123
11487F25387J7549J8968J09057J84747J44496L6201q9298j89124j78842r9922
11477E79219n0750n4596n1231j8980l3511r2622m9107Q7612J45115N6053p7081
11466D40121j45667j15850K8153K06507K42555P8188j14794k03154k04204j22316
11456H9539P945J07989J16028K6851r0636j55291j70635j49949n3272P7151R1377
$$ y = [3142568, 2888898, 2665642, 2448597, 2244498, 2058239, 1871762, 1683026, 1471898, 1199635, 898301, 634089, 429203, 287101, 210901, 162882, 118459, 109171, 169514, 249525, 286119, 274757, 245071, 183509, 33714, -224823, -531285, -761559, -803757, -712507, -555946, -423134, -398179, -440316, -441482, -301788, -64491, 176366, 381254, 536264, 625387, 642936, 661904, 770961, 955708, 1100204, 1136405, 1047107, 857983, 679141, 579219, 528469, 473873, 422642, 403662, 370151, 277529, 228422, 316034, 461149, 517202, 440121, 294454, 178604, 206757, 413264, 655819, 734007, 619213, 416059, 211855, 89539, 97484, 205473, 321501, 348352, 257716, 102425, -68210, -218159, -271431, -194280, -102903]
11445a02903k3891p0518L1428J24784J82456K49361K41703J51178P4574J9976
11435H78148r1781k46695k98245k02235l0500N4590k779p8576r6832r8240p5180
11424b88325l0049j405k8747j12453j32716m4918P9350J47022J33195P3291O0156
11413a45599R9638J27986J43052R9353N388n8591n7541j7377n907k8241k0365
11402A41796Q16m6146j18924p9365L2208J10941J41705J45168J18506M9513r718
11391D86500l6068r2427j97493k74543k47621j01384J05058K26987J86312J20808
11381A76129J31157J24644J18544J23322P5069J987m0397l3881o624l3738j30421
11370E05791j96741j82270j31717p9416l8132m0111p5699p4235m3150l4296p2228
$$ y = [-102903, -126794, -197312, -165884, -41100, 141356, 390717, 632420, 783598, 858172, 878148, 786367, 539672, 241427, 39192, 8692, 63282, 60503, -18073, -114905, -213145, -288325, -318374, -319779, -348526, -460979, -593695, -638613, -559263, -412241, -279046, -205755, -145599, -45961, 82025, 225077, 324430, 329818, 271227, 213686, 196309, 190402, 162161, 141796, 142612, 96466, -22458, -101823, -69615, 41326, 183031, 328199, 446705, 496218, 486500, 450432, 358005, 160512, -114031, -361652, -463036, -357978, -130991, 55321, 176129, 307286, 431930, 550474, 673796, 748865, 750852, 710455, 676574, 669950, 636212, 505791, 309050, 126780, -4937, -84353, -122485, -162596, -238295, -312530, -355680, -389976, -462204]
11359d62204q4145K130J16554J53479J12242N9161K0467K5260N9847R2137R1279
11348A86207L7250o3119j22350o7105k14J8414M6274R1876J25730J69810J78945
11337F01718P0283n7287j11189j64519k28098j93970m6596Q2379J09002P9735
11327A41458K4397l7832o3625o6382l8127J3849O5641Q3704O0432P7544J00850
11316C61909Q236q9503p3390k657O4786R8436Q7264L4486l6353r4698j47199k01897
11304I420k00567j07629J8722N8878k5264j42603j59391q9171n6842r551Q8090
11293f15908J40005J06089R3700J37748J87116K25403J95400O4349p6203j27253
11283C30446p3877N083k0795j18672j09780q235L2776j914m4844o0458o0927p3317
$$ y = [-462204, -546349, -544219, -427665, -274186, -161944, -102783, -82316, -57056, 2791, 94928, 186207, 223457, 160338, 37988, -29117, -29331, -10917, 35357, 127233, 252963, 422773, 601718, 672001, 614714, 503525, 339006, 110908, -83062, -129658, -47279, 61723, 141458, 165855, 128023, 64398, -1984, -40111, -26262, 39379, 123083, 183515, 261059, 361909, 370145, 280642, 207252, 204595, 269381, 367817, 455081, 489567, 453214, 358516, 211317, 9420, -191147, -298776, -280054, -221176, -246440, -389043, -548434, -637605, -694447, -703998, -615908, -475903, -369814, -276114, -138366, 48750, 274153, 469553, 533902, 457699, 330446, 256569, 261652, 240857, 122185, 12405, 4170, 36946, 35032, -9812, -70270, -131197, -204514]
11271b04514o5610K3599J45458J94727J55261R3847Q1689J08650R1093j7083j49827
11260D57290k05102j82242j60429j76156j51866p9951j5272M5178J06551J41346
11250b20653J03750J4381j6492j6336l7688n8777j12408j72076j79327q2614O7481
11239g10759J43190J22771P4747O8810J06458J29496R0947K0123j3537P298O0338
11228I9882O6855K9379J8356L5700J8122m5118r5572r6722m0370n924l1112j6199
11216f2723M4341N6735O7065N1667m4008r1139j1277Q9337J68960K36594K07476
11205G13028J5166k22708l07463k33322j11605P634J19332J88840J45850M2273
11195C57025k4854k1369J882l2738r1718j40899j50526j47922j35351N12K14096
$$ y = [-204514, -270124, -246525, -101067, 93660, 248921, 342768, 424457, 533107, 624200, 607117, 457290, 252188, 69946, -90483, -266639, -418505, -498456, -513728, -468550, -361999, -220653, -116903, -102522, -119014, -135350, -173038, -231815, -344223, -516299, -695626, -778240, -710759, -567569, -444798, -370051, -301241, -194783, -65287, 25660, 45783, 32246, 39544, 99882, 166737, 196116, 214472, 250172, 268294, 223176, 127604, 30882, -9488, -15412, -46524, -62723, -18382, 38353, 105418, 157085, 113077, 21938, 10661, 99998, 268958, 505552, 713028, 728194, 505486, 198023, -35299, -146904, -139270, -19938, 168902, 314752, 357025, 332171, 310802, 312684, 279946, 188228, 47329, -103197, -251119, -386470, -385958, -171862]
11184a71862K94764K16326J17214L3998n4024j18450j37591j18124r4743r3313
11174a25805j29674j48479o4818O8759J47617J43562J09590J07728J67775K11832
11164D88087J43078M4990N5291J06979O5252p0274j96572k28420k22831j71299
11154A4281q8269n2210l1684k0692j2472j8448n8105p7951n4007n5590j05190
11143e60337j05314j6480P8717J12738P9897K1603j9289o3394r7608q2088l4241
11132f85796P0820J66927J94078J64033N9006l0678k2823K3571K4799K260o248
11121d0051l6152j04199j39858r0706l8094o805K1963M5008P9585J00406Q6084
11110a22819O4826M6349R479l3669l6676k3154j4908n911J8446L1276J8880r187
$$ y = [-171862, 122902, 339228, 456442, 490440, 436416, 317966, 180375, 62251, -32492, -125805, -255479, -403958, -468776, -400017, -252400, -108838, 752, 108480, 276255, 488087, 631165, 676155, 731446, 838425, 903677, 833403, 636831, 408411, 185580, 14281, -73988, -126198, -157882, -178574, -191046, -209494, -267599, -345550, -399557, -455147, -560337, -665651, -682131, -603414, -490676, -410779, -389176, -408465, -471859, -569467, -651555, -685796, -614976, -448049, -253971, -89938, -30932, -61610, -84433, -60862, -36063, -33803, -40051, -76203, -180402, -320260, -410966, -449060, -455865, -433902, -388894, -309309, -208903, -122819, -57993, -11644, -2165, -35834, -72510, -95664, -110572, -116483, -98037, -66761, -47881, -57068]
11098e7068p3663j38251j66136j48235q0389l082K2594M887r719O089M1952L2159
11086e68862l8886j22040j31832o6999M0359J18782J00620L7565J7387M2057O6059
11075e05790L9184l8057r5803n1416O2782J43360J78545K02432J89784J15888
11065B40909L1518j8513l7123o2951p7728n9092l0136m0540q6667j07496j20285
11054c68104r0848K875n182j13193j89332j70559m2388J13187K05794K15600K03030
11043b39120J99391J55234K8264p7138p0078n4876r9506j41198j09141l2352P0226
11032c70294J64802K06317J74904P6962O073k9119p1235r6439r3966l7592K0971
11021d8616K2878K3876L1953J0534k6667k7210k4541q967O3978O5930p626l2007
$$ y = [-57068, -130731, -268982, -435118, -583353, -663742, -666824, -644230, -639343, -649062, -642973, -601021, -568862, -607748, -729788, -861620, -928619, -888260, -769478, -668858, -631293, -613906, -571849, -505790, -466606, -504663, -600466, -651882, -589100, -445740, -267195, -64763, 125021, 240909, 272427, 253914, 216791, 153840, 76112, 17020, -13116, -53656, -140323, -247819, -368104, -458952, -456077, -461259, -574452, -763784, -934343, -976731, -863544, -657750, -442150, -239120, -39729, 115505, 143769, 66631, -3447, -58323, -157829, -299027, -408168, -440520, -370294, -205492, 825, 175729, 252691, 258764, 229645, 158410, 61971, -31995, -69587, -48616, -25738, -1862, 30091, 40625, 13958, -13252, -37793, -46760, 17218, 83148, 75522, 43515]
11009D3515M8718J14283N0578p0200j08599n1055j7660m847J5409j7514m7945
10998d5317n560J9924k6642o3527k2166Q4831J57210J32929N2194p371j8181N033
10986B63357N3888R7449J38679J49402O3702o2483j58582j65661j06612j02686
10976A70453j27606n6928R4801J80423J44816R9595O1774M0766N6597Q7953J28837
10965H81481J26780M0688p2501j03990o2008j9022m9281j56804k36481k06319
10955A42543j01128K680L2506l8711j09530r1537k9570J4844L3555K6405J5655
10944a02288J3726k939n141K8508J5835q1973j63857j48197q3754m2929l0553
10933f03562O972L5791N128n8372j07084r3398J1602J27713J22310J8034n9492
$$ y = [43515, 92233, 206516, 257094, 186894, 78295, 27240, 9580, 4733, 20142, 2628, -45317, -50877, -30953, -57595, -121122, -143288, -58457, 98753, 231682, 283876, 276505, 258324, 263357, 317245, 414694, 553373, 702775, 766477, 703994, 545412, 379751, 273139, 170453, 42847, -14081, 80720, 261143, 405959, 505554, 567328, 608094, 664691, 752644, 881481, 1008261, 1048949, 976448, 872458, 810450, 791428, 742147, 585343, 348862, 142543, 41415, 44095, 76601, 37890, -71640, -163177, -192747, -177903, -144348, -117943, -102288, -88562, -91501, -96642, -68134, -52299, -134272, -298129, -446326, -530080, -573009, -603562, -596590, -560799, -555671, -614043, -721127, -814525, -802923, -675210, -552900, -534866, -594358]
10922e94358l0826O6815J20437P8601K6625J188l4530r5827j32661o5003P6439
10911e83100J99723K10915Q8109k9654m2212K7078N2135k9573j50148k03069j13403
10900e73199K5996L8934r1059j54554n7184P2821J42890J82627K03449J59984
10890d9295Q0758j3342j22382j92232j99186j75354r6357M4531J57883J67945
10880c97031J14035L9681j7898n3190j12974j57661r5254j0317K7411N1946R421
10869f01831q4107j30816j45139j26520m8268L3344R1904J31370J42632J45790
10859e91641J60638J28811N8639L7992P1775Q2094M4765j6077j05523j64111j30799
10848d23437n7933j8852L318K6528L7310L1714J9676L8578R9159J59697J45979
$$ y = [-594358, -625184, -558369, -437932, -359331, -332706, -331518, -366048, -461875, -594536, -659539, -583100, -383377, -172462, -84353, -114007, -156219, -129141, -77006, -106579, -256727, -459796, -573199, -547203, -508269, -599328, -753882, -811066, -738245, -595355, -412728, -209279, -49295, 31463, 18121, -104261, -296493, -495679, -671033, -767390, -722859, -564976, -397031, -282996, -243315, -261213, -314403, -427377, -585038, -680292, -690609, -663198, -611252, -601831, -685938, -816754, -961893, -1088413, -1136681, -1103337, -1011433, -880063, -737431, -591641, -431003, -302192, -243553, -205561, -133786, -51692, -6927, -23004, -128527, -292638, -423437, -481370, -500222, -496904, -470376, -433066, -401352, -381676, -343098, -243939, -84242, 61737]
10837F1737N8426k3147o0187l0865L6379P4637J13415J24580L7682j16617k02904
10826G3136j77074j23764p2461m7639o8349q3657k7202N2394Q0259P6753Q1078
10815b36526M0369o7012j04853k1691P2017R8833Q1201O0321N9978O1124L0527
10804G4288L683K1792J4575n0442p3912k0660R1109K27147L00063K30892N1926
10793H70461r8494j76133k05841j74499j05205p1892q3537n6223J3944L9170O1899
10782A3650J08817Q1634N385k2029k1158n7721j19642j41336o0651P7718J64741
10771B9408J27287L5544m1194j28598j67122j52762j28202p0264O3549K21862
10761b10492K64831J25821m3066j45246j72794o9984K1760L7643P8125J08550
$$ y = [61737, 120163, 97016, 36829, 5964, 42343, 116980, 230395, 354975, 392657, 276040, 73136, -103938, -227702, -300163, -347802, -416151, -499808, -527010, -474616, -394357, -317604, -236526, -196157, -263169, -368022, -389713, -317696, -218863, -137662, -77341, -17363, 43761, 74288, 77971, 99763, 114338, 63896, -10016, -30676, 60433, 287580, 587643, 818535, 870461, 771967, 595834, 389993, 215494, 110289, 38397, -45140, -101363, -87419, -48249, 13650, 122467, 204101, 209486, 187457, 166299, 108578, -11064, -152400, -213051, -135333, 29408, 156695, 192239, 151045, 22447, -144675, -297437, -425639, -495903, -432354, -210492, 54339, 180160, 137094, -8152, -180946, -250930, -229170, -191527, -113402, -4852]
10751d852J19677J47603J15489Q392r2265j13716m4290Q1991J56395J03864k6039
10740D52249j36745j93990j48467m8606j2752L807K2754J6460r097K5611R2811
10729F4035R7562N3330M168l4400o3626m4229J3063J02953J58662R3769j0655
10718D34632j08115k19471k64035j57260P0920K56410K35462J20602R1115R7392
10708E57652L3420o3938j29212j13296l0058j4983j03238j72659j36439n3139
10698b25890j5631j5025l5581p6847p8129j9300O3966J06594N2669l8131r9344
10687c80649j37607j15049k0066K8696M7586J25047K11125K33244J41154J8427
10677A51908m2837q3595r6845k1544K2546j13921k62452k12232p0099j5802N780
$$ y = [-4852, 114825, 262428, 377917, 386309, 294044, 180328, 136038, 218029, 374424, 478288, 452249, 315504, 121514, -26953, -75559, -88311, -84504, -61750, -45290, -54387, -28776, 64035, 161597, 214927, 219095, 184695, 121069, 76840, 89903, 192856, 351518, 445287, 434632, 326517, 107046, -156989, -314249, -243329, 13081, 248543, 369145, 460260, 557652, 591072, 527134, 397922, 284626, 254568, 239585, 136347, -36312, -172751, -225890, -241521, -256546, -292127, -368974, -447103, -466403, -402437, -295843, -243174, -281305, -380649, -518256, -633305, -653371, -624675, -577089, -452042, -240917, -7673, 133481, 151908, 109071, 25476, -71369, -92913, -70367, -184288, -446740, -658972, -729071, -744873, -739093]
10666g39093J5289l7649o8330j8187O9876J45582J54687J09485O0111N245l4236
10655c37220l4946k1545J0287M0419k9558j03199l6646R4489J61506P7187m7359
10644b26585q2321r7693j33179j34653n2981P8658J50326J48622R9947K5433l4048
10633b58474m8631q1636j77660k25851j86735j01534K2585J25626J60866J37732
10623f33712Q8902P3179Q3861O9227O7208P4787J0225p7222r7597n3699n831O3053
10611c37619J67364K48840K89913K66761J36850K20p226J25707K43779J87632
10601A322221L6477j06984k35609k45646j17723j3063k7369m5651m5418r9250
10591D21985j10249m2679R034j602M385J4842J0157K8906L9439j3631m6142m930
$$ y = [-739093, -723804, -761453, -829783, -847970, -778094, -632512, -477825, -368340, -308229, -302984, -337220, -372166, -393711, -383424, -343005, -372563, -475762, -512408, -417919, -256413, -179226, -226585, -308906, -406599, -539778, -674431, -727412, -648754, -498428, -349806, -249859, -224426, -258474, -307105, -388741, -566401, -792252, -978987, -1080521, -1057936, -932310, -771444, -633712, -544810, -471631, -387770, -318543, -251335, -176548, -166323, -243545, -341142, -394841, -400672, -337619, -170255, 78585, 368498, 635259, 772109, 772329, 765103, 890810, 1134589, 1322221, 1358698, 1251714, 1016105, 770459, 652736, 639673, 612304, 566653, 521235, 421985, 311736, 269057, 278091, 276489, 280874, 295716, 305873, 334779, 374218, 360587, 314445, 309515]
10579C09515J0959n9940j38175j56910j30947q9796n3916j1049N9878J42056J72900
10568E4575J32008L0748j8778L6592J13336J25757P2564O649o2624j36719k12631
10557A41477k79983k93897k78669k73430j76640j6497Q1742P6236N5319O3955
10547i00387P4486O2433j2764o8493l3733M4967Q4923P9784O4249J01868J73388
10536c29279J61490Q9993N1167P1177J43221J45554M1053n7752n2608K5409N9343
10525C48768K7389M462r911r6730k01806k24789j67363k5489J70041K84066K36835
10514C45473J55863J34186O2418p0446j60401j64423n8960O6566N3602p6426j57068
10503A30384j11859L775J00422J45027J18645J6271q1244j35521j89415j83166
$$ y = [309515, 320474, 260534, 122359, -34551, -165498, -255294, -309210, -320259, -260381, -118325, 54575, 186583, 217331, 198553, 235145, 348481, 474238, 546802, 553451, 490827, 354108, 141477, -138506, -432403, -711072, -984502, -1161142, -1177639, -1095897, -1019661, -964342, -900387, -825901, -763468, -776232, -844725, -878458, -833491, -748568, -668784, -604535, -502667, -329279, -167789, -77796, -26629, 44548, 187769, 333323, 374376, 316624, 264016, 289425, 348768, 376157, 380619, 370708, 273978, 72172, -152617, -319980, -345469, -175428, 108638, 345473, 501336, 635522, 697940, 627494, 467093, 302670, 243710, 310276, 363878, 287452, 130384, 18525, 22300, 122722, 267749, 386394, 402665, 321421, 185900, -3515, -186681]
10493a86681j28724j19461o4532Q6810J71882J26514J3247o2488l6240m67j6752
10482b16892J6092J19236J61113O9174l6616l6591m875M225m2955j39148j89835
10471b97072j37520m0419J3566k6511q7449j00389n5800m735j1226l4229J1977
10460g69807J20899J56980P6242k2599m9761k6263M001J3035J4999J2375j3868
10449d83767j74P5047J31145J34659R0262N1500L7856J1241k8125r4517j53506
10438b28379j36641p8117n3900m7107p543Q6184K42035L61057L73620K99024J57210
10427I67443L7586q972q211k0772p8081j20538j25581j13948o0031L8913J10152
10416F17960R3161J5139o8943j24035j46482j55159j40985o8731K5145O9192P2560
$$ y = [-186681, -315405, -434866, -499398, -412588, -240706, -114192, -100945, -163433, -199673, -200140, -216892, -200800, -81564, 79549, 148723, 112107, 75516, 70641, 74866, 31911, -107237, -297072, -434592, -475011, -461445, -487956, -575405, -675794, -731594, -736329, -747555, -781784, -769807, -648908, -491928, -415686, -438285, -488046, -514309, -510308, -497273, -482274, -469899, -483767, -483941, -408894, -277749, -143090, -52828, -1328, 36528, 47769, 19644, -74873, -228379, -365020, -443137, -497037, -544144, -551687, -465503, -223468, 137589, 511209, 810233, 967443, 1005029, 996057, 987846, 967074, 888993, 768455, 642874, 528926, 468895, 507808, 617960, 711121, 726260, 657317, 533282, 386800, 231641, 90656, 21925, 47070, 116262, 188822]
10405A88822M9042j7538j09204j86506k10901j50651m9401N542J6261M4144M9558
10394c70832j409q5498j30431n4027Q6123J78082K10826K25676K04593J34188
10384C97291K0053n5384p0647p8417j05638j31682j33810j27378p8854K7644J04944
10373b31878J05359P2804O2184K9001r916J37L9036M1622l0928j01526j20785
10362a44890j21777j02592l1093O4935J42120J93186K40703K17692P6875p2794
10352D62365j03554k0607P2271M0179r7019j71905j72114j79046j43950r1568
10342d04948o0083m0551l403L6098N7741Q9336J29818J25539L5084n1299n6315
10331a42983q6006j71974k09432j71838q6151J9927P0834N3962L4223J4834K1290
$$ y = [188822, 237864, 220326, 111122, -75384, -286285, -436936, -486337, -480795, -464534, -420390, -370832, -372241, -457739, -588170, -642197, -556074, -377992, -167166, 58510, 263103, 397291, 417344, 361960, 291313, 212896, 107258, -24424, -158234, -285612, -364466, -336822, -231878, -126519, -53715, 8469, 37470, 27554, 27691, 66727, 108349, 77421, -24105, -144890, -266667, -369259, -400352, -335417, -193297, -111, 240592, 458284, 535159, 462365, 358811, 338204, 410475, 450654, 353635, 181730, 9616, -169430, -313380, -404948, -465031, -505582, -508985, -472887, -415146, -325810, -195992, -70453, -35369, -86668, -142983, -228989, -400963, -610395, -782233, -868384, -848457, -777623, -723661, -689438, -674604, -653314]
10320f53314P9211J07520M3973k1316l0807R42J3024k7049l0176J2461R674m0998
10308e36855k9167L2183P7161J21937J65872J42000O4173N340j2235M3653J37057
10297B11119J44007P5253N2796Q7993J05341O9174K5743l3577j42405k25254k16293
10286A53897j37374O396J31178J63947Q3289n6968j29827j05377m4260Q188K9340
10275A02429k8944j21473r4131j5967K5238N9048O8279O4846K7476l4431p0504
10264a8134j25195j63437j72472j60880m7893R6235J40919Q1290J3246L938Q114
10253c44269o049l8334j02110j63156j09593K6605J15735J20561J09229J13533
10243b77848J11236R1697O5484O7915Q1018P0142N8577M7301p837n9485n3313
$$ y = [-653314, -574103, -466583, -422610, -443926, -474733, -473791, -460767, -487816, -517992, -505531, -495857, -536855, -566022, -533839, -456678, -334741, -168869, -26869, 37304, 42644, 30409, 74062, 211119, 355126, 430379, 483175, 571168, 676509, 745683, 771426, 737849, 595444, 370190, 153897, 16523, 22919, 154097, 318044, 401333, 344365, 214538, 109161, 64901, 73089, 102429, 73485, -47988, -142119, -158086, -132848, -73800, -5521, 59325, 86801, 52370, -18134, -143329, -306766, -479238, -640118, -688011, -591776, -450857, -369567, -356321, -352383, -344269, -350318, -388652, -490762, -653918, -763511, -736906, -621171, -500610, -391381, -277848, -166612, -74915, -9431, 58484, 139502, 209644, 268221, 315522, 307685, 248200, 194887]
10232A94887r638J5869J5782K60m2320r5556q1970k8833L54L3644L2532l6462
10220a451q4646l6795L3636L2722Q767M2495P1269k803p2805j5364Q2580R7763
10208A55368O0491J1246l6171r277P2187J04344J11361J51991J61701Q6670k0404
10197H49507n4833n3361p5875j00257p3011K0329J29975J71853J17508M45j13384
10186H18896j59587j64604j45303j00259l4470l288l1115o9054r0080n1704P457
10175b3111j0079o1355o2765m0709m2407r5563j29850m9712P0974J05823N5761
10164b82993O4923J61756K17032J67791N5525k3038o5795r5602r5431m9013N9168
10153A14323J38931J15550K7600m3490r691Q8526J21112L4657q1165j48702j39780
$$ y = [194887, 185249, 201118, 216900, 217160, 174840, 79284, -2686, -31519, -31165, 2479, 35011, -1451, -86097, -122892, -89256, -56534, -47767, -5272, 65997, 63194, -9611, -24975, 57605, 155368, 215859, 227105, 190934, 181657, 253844, 358188, 469549, 621540, 783241, 869911, 849507, 794674, 741313, 665438, 565181, 492170, 512499, 642474, 814327, 931835, 932280, 818896, 659309, 494705, 349402, 249143, 214673, 211385, 180270, 111216, 21136, -30568, -23111, -33190, -94545, -157310, -198019, -240426, -335989, -465839, -515551, -444577, -338754, -282993, -218070, -56314, 160718, 328509, 384034, 360996, 295201, 199599, 104168, 55155, 114323, 253254, 368804, 396404, 352914, 343223, 431749, 552861, 587518, 506353, 357651, 217871]
10142B17871o8617k8957l2411l8459k8517l0438l8849o1076p1582k7464j4589
10131b23088n1022j11215j42473p9928k40J7885J8641N9245J09600R3762L7285
10120b71548L785o714q7523j79689j23480k2299J6079M3926L7173j5155o0160
10109f65605j00099r7595m5947k2071l3867k1401M0687J23928J91430K22922K24853
10098a82765J74566M3325j01126j38828p6254m1392k2552J5257M8405L1071k2989
10087b73282m9042k6914K1546L0014P451K4227N6489Q8944J04427J03131J02462
10076A89453J15850R3980j7118j31983j74213j50916o1624L8488O6713L3071N615
10065G316K1602K1667j1193n5574j14968j06259j851Q0725M1822m3699k8155N4177
$$ y = [217871, 149254, 120297, 87886, 49427, 20910, -9528, -48377, -109453, -181035, -208499, -223088, -274110, -385325, -527798, -607726, -607966, -590081, -571440, -512195, -402595, -308833, -271548, -267763, -274477, -362000, -541689, -665169, -687468, -671389, -627463, -590290, -605445, -665605, -765704, -863299, -909246, -931317, -965184, -986585, -945898, -821970, -630540, -407618, -182765, -8199, 35126, -66000, -204828, -281082, -322474, -345026, -329769, -281364, -250293, -273282, -322324, -349238, -327692, -297678, -290227, -266000, -209511, -120567, -16140, 86991, 189453, 305303, 399283, 382165, 250182, 75969, -74947, -136571, -98083, -31370, 1701, 7316, 28918, 50585, 39392, -16182, -131150, -237409, -239260, -158535, -116713, -160412, -188567, -134390]
10053a34390J38683K14931K29659J84435J59005J46073P5903J3473K0973M8871
10043A097616M9711j5743j17824j62443j34140m7969J9396n74m6161l9152K3608
10032F26325J9887n8616j11930j42081j69854j59136r8545m4631j9074j0613m134
10021a72402N813M5006J01258J30420R8237L7918J1368J1949J8180j2254n6305
10010B19188n5064p4679j63730k04414j40321n0136J9776M9978L0278p972j2456
9999c89552P225J6006L317p494k6238j8627L7280J04532J70725J80923J22058
9988B00155O4306N0454M114o5998o2272l6278m4571o2972r3179o0665M0843N6548
9976i515l5884p4596r559R2926J47225J42453R8889M9956J9340k178L838r947
$$ y = [-134390, 4293, 219224, 448883, 633318, 792323, 938396, 1014299, 1027772, 1048745, 1097616, 1147327, 1131584, 1013760, 851317, 717177, 669208, 688604, 688030, 641869, 602717, 626325, 646212, 587596, 475666, 333585, 163731, 4595, -93950, -138581, -157655, -168268, -172402, -166589, -121583, -20325, 110095, 208332, 246250, 257618, 269567, 287747, 275493, 219188, 164124, 89445, -74285, -278699, -419020, -469156, -449380, -399402, -369124, -377096, -389552, -382327, -366321, -363004, -370498, -396736, -415363, -378083, -273551, -102826, 78097, 200155, 264461, 314915, 319029, 253031, 190759, 154481, 109910, 46938, -46241, -106906, -66063, -9515, -45399, -119995, -129554, -36628, 110597, 253050, 351939, 401895, 421235, 419057, 422895, 412948]
9964D12948q3387j12069q3930n1458j541N8749Q3316M5517K0933J4515j7018k2235
9952B64340O0871J38934J16845M0976N576J5100M1099K4399n3338j59253k51298
9941B44251k55573j37063j9365R761l871j4976K5155J24360J67002J16641J1654
9930B67976j58587k71013j90387J0130J41887J57188J51109J54664J19034K1518
9920D03519j04302j66277j67102j46977p9850P939Q2434J14267Q8364J7542o2724
$$ y = [412948, 329561, 217492, 133562, 82104, 80563, 139312, 222628, 268145, 289078, 303593, 286575, 264340, 325211, 464145, 580990, 621966, 627542, 642642, 683741, 708140, 654802, 495549, 244251, -11322, -148385, -167750, -157989, -161860, -176836, -151681, -27321, 139681, 256322, 267976, 109389, -161624, -352011, -341881, -199994, -42806, 108303, 262967, 382001, 403519, 299217, 132940, -34162, -181139, -260989, -253050, -170616, -56349, 32015, 49557, -13167]
$$ [...]
##END NTUPLES=NMR SPECTRUM
##END=
