##TITLE=C13_LR-755-i4-p2
 , 50 sc

 23.11.2022
##JCAMPDX= 6.0         $$ Bruker NMR JCAMP-DX V2.0
##DATA TYPE= NMR SPECTRUM
##DATA CLASS= NTUPLES
##ORIGIN= UXNMR, Bruker Analytische Messtechnik GmbH
##OWNER= root
$$ XWIN-NMR		Version 3.5
$$ Wed Nov 23 16:21:32 2022 Russian Standard Time (UT+4h)  she@DPX200
##.OBSERVE FREQUENCY= 50.327896
##.OBSERVE NUCLEUS= ^13C
##.ACQUISITION MODE= SIMULTANEOUS
##.ACQUISITION SCHEME= undefined
##.AVERAGES= 50
##.DIGITISER RES= 17
##SPECTROMETER/DATA SYSTEM= spect
##.PULSE SEQUENCE= zgpg30
##.SOLVENT NAME= CDCl3
##.SHIFT REFERENCE= (INTERNAL, CDCl3, 0, 222.653)
##AUDIT TRAIL= $$ (NUMBER, WHEN, WHO, WHERE, WHAT)
$$ ##TITLE= Audit trail, XWIN-NMR		Version 3.5
$$ ##JCAMPDX= 5.01
$$ ##ORIGIN= Bruker BioSpin GmbH
$$ ##OWNER= she
$$ F:/spectra/data/she/nmr/c13/1/pdata/1/auditp.txt
$$ ##AUDIT TRAIL=  $$ (NUMBER, WHEN, WHO, WHERE, WHAT)
(   1,<2022-11-23 16:20:14.15 +0400>,<she>,<DPX200>,
      <created by zg, POWCHK disabled, PULCHK disabled
       terminated by command 'halt'
       configuration hash MD5:
       00 E9 B6 7A A2 85 ED C7 34 08 36 98 17 FE 4E 26
       data hash MD5: 32K
       1B FC DA 1D B9 25 04 5E 8B C8 3B AB 53 90 CE CF>)
(   2,<2022-11-23 16:20:27.56 +0400>,<she>,<DPX200>,
      <Start of raw data processing
       efp BC_mod = 2 LB = 1 FT_mod = 6 PKNL = 1 PHC0 = -305.6112 PHC1 = 27.96049 SI = 32K 
       data hash MD5: 32K
       E1 B3 AF EF 86 2E 73 3E 4C C9 CD 04 39 20 87 4D>)
(   3,<2022-11-23 16:20:32.25 +0400>,<she>,<DPX200>,
      <abs ABSG = 5 
       data hash MD5: 32K
       CC FA 8E D5 D7 DD BA 8B CD F1 B2 DC 6A 1E A4 83>)
(   4,<2022-11-23 16:20:44.14 +0400>,<she>,<DPX200>,
      <abs ABSG = 5 
       data hash MD5: 32K
       25 24 88 7E CE 58 70 64 A9 65 83 1E 6C C5 E4 B1>)
(   5,<2022-11-23 16:21:08.67 +0400>,<she>,<DPX200>,
      <abs ABSG = 5 
       data hash MD5: 32K
       BF 3C 4C C1 8E 36 40 AD C4 BB A2 90 E3 21 4B 93>)
$$ ##END=
$$ 
$$ hash MD5
$$ 7E A0 32 33 BC 01 75 D2 D5 F4 5C A6 37 4C 01 0B
##$RELAX= 
##$RELAX= 
##$RELAX= 
##$RELAX= 
##$RELAX= 
##$RELAX= 
##$RELAX= 
##$RELAX= 
$$ Bruker specific parameters
$$ --------------------------
##$DU= <F:/spectra>
##$EXPNO= 1
##$NAME= <c13>
##$PROCNO= 1
##$TYPE= <nmr>
##$USER= <she>
##$AMP= (0..31)
100 100 100 100 100 100 100 100 100 100 100 100 100 100 100 100 100 100 
100 100 100 100 100 100 100 100 100 100 100 100 100 100 
##$AQSEQ= 0
##$AQ_mod= 1
##$AUNM= <au_zg>
##$AUTOPOS= <>
##$BF1= 50.322709
##$BF2= 200.13
##$BF3= 50.322709
##$BF4= 500.13
##$BF5= 500.13
##$BF6= 500.13
##$BF7= 500.13
##$BF8= 500.13
##$BYTORDA= 1
##$CFDGTYP= 0
##$CFRGTYP= 5
##$CHEMSTR= <none>
##$CNST= (0..31)
1 1 145 1 1 1 1 1 1 1 1 1 1 1 1 1 1 1 1 1 1 1 1 1 1 1 1 1 1 1 1 1 
##$CPDPRG= <waltz16>
##$CPDPRG1= <>
##$CPDPRG2= <waltz16>
##$CPDPRG3= <>
##$CPDPRG4= <mlev>
##$CPDPRG5= <mlev>
##$CPDPRG6= <mlev>
##$CPDPRG7= <mlev>
##$CPDPRG8= <mlev>
##$CPDPRGB= <>
##$CPDPRGT= <>
##$D= (0..31)
0 2 0.00345 0 0 0 0 0 0 0 0 0.03 2e-05 3e-06 0 0 0 0 0 0 0 0 0 0 0 0 0 
$$ [...]
##$SUBNAM4= <"">
##$SUBNAM5= <"">
##$SUBNAM6= <"">
##$SUBNAM7= <"">
##$SUBNAM8= <"">
##$SUBNAM9= <"">
##$SW= 239.972175391363
##$SWIBOX= (0..15)
0 1 3 0 0 0 0 0 0 0 0 0 0 0 0 0 
##$SW_h= 12077.2946859903
##$TD= 32768
##$TD0= 1
##$TE= 0
##$TE2= 300
##$TE3= 300
##$TEG= 300
##$TL= (0..7)
120 120 120 120 120 120 120 120 
##$TP= (0..7)
150 150 150 150 150 150 150 150 
##$TP07= 0
##$TPNAME0= <>
##$TPNAME1= <>
##$TPNAME2= <>
##$TPNAME3= <>
##$TPNAME4= <>
##$TPNAME5= <>
##$TPNAME6= <>
##$TPNAME7= <>
##$TPOAL= (0..7)
0.5 0.5 0.5 0.5 0.5 0.5 0.5 0.5 
##$TPOFFS= (0..7)
0 0 0 0 0 0 0 0 
##$TUNHIN= 0
##$TUNHOUT= 0
##$TUNXOUT= 0
##$USERA1= <user>
##$USERA2= <user>
##$USERA3= <user>
##$USERA4= <user>
##$USERA5= <user>
##$V9= 5
##$VALIST= <valist>
##$VCLIST= <CCCCCCCCCCCCCCC>
##$VD= 0
##$VDLIST= <DDDDDDDDDDDDDDD>
##$VPLIST= <PPPPPPPPPPPPPPP>
##$VTLIST= <TTTTTTTTTTTTTTT>
##$WBST= 1024
##$WBSW= 4
##$XGAIN= (0..3)
0 0 0 0 
##$XL= 0
##$YL= 0
##$YMAX_a= 439779
##$YMIN_a= -365800
##$ZGOPTNS= <>
##$ZL1= 120
##$ZL2= 120
##$ZL3= 120
##$ZL4= 120
##$ABSF1= 222.6533
##$ABSF2= -17.34351
##$ABSG= 5
##$ABSL= 3
##$ALPHA= 0
##$AQORDER= 0
##$ASSFAC= 0
##$ASSFACI= 0
##$ASSFACX= 0
##$ASSWID= 0
##$AUNMP= <proc_1d>
##$AZFE= 0.1
##$AZFW= 0.5
##$BCFW= 0
##$BC_mod= 2
##$BYTORDP= 0
##$COROFFS= 0
##$CY= -3
##$DATMOD= 1
##$DC= 0
##$DFILT= <>
##$DTYPP= 0
##$F1P= 0
##$F2P= 0
##$FCOR= 0.5
##$FTSIZE= 32768
##$FT_mod= 6
##$GAMMA= 0
##$GB= 0
##$INTBC= 1
##$INTSCL= 4.134877e-10
##$ISEN= 128
##$LB= 1
##$LEV0= 0
##$LPBIN= 0
##$MAXI= 10000
##$MC2= 0
##$MEAN= 0
##$ME_mod= 0
##$MI= 0.1934396
##$NCOEF= 0
##$NC_proc= 0
##$NLEV= 6
##$NOISF1= 120.0001
##$NOISF2= 80.00006
##$NSP= 0
##$NTH_PI= 0
##$NZP= 0
##$OFFSET= 222.6533
##$PC= 1.4
##$PHC0= -305.6112
##$PHC1= 27.96049
##$PH_mod= 1
##$PKNL= yes
##$PPARMOD= 0
##$PSCAL= 0
##$PSIGN= 0
##$REVERSE= no
##$SF= 50.322730123286
##$SI= 32768
##$SIGF1= 140
##$SIGF2= 120
##$SINO= 11.81781
##$SIOLD= 32768
##$SREGLST= <13C.CDCl3>
##$SSB= 0
##$STSI= 32768
##$STSR= 0
##$SW_p= 12077.2946859903
##$SYMM= 0
##$S_DEV= 0
##$TDeff= 32768
##$TDoff= 0
##$TI= <>
##$TILT= no
##$TM1= 0
##$TM2= 0
##$TOPLEV= 0
##$USERP1= <user>
##$USERP2= <user>
##$USERP3= <user>
##$USERP4= <user>
##$USERP5= <user>
##$WDW= 1
##$XDIM= 32768
##$YMAX_p= 347881621
##$YMIN_p= -930754
$$ End of Bruker specific parameters
$$ ---------------------------------
##NTUPLES= NMR SPECTRUM
##VAR_NAME=  FREQUENCY,     SPECTRUM/REAL,   SPECTRUM/IMAG
##SYMBOL=    X,             R,               I
##VAR_TYPE=  INDEPENDENT,   DEPENDENT,       DEPENDENT
##VAR_FORM=  AFFN,          ASDF,            ASDF
##VAR_DIM=   32768,         32768,           32768
##UNITS=     HZ,            ARBITRARY UNITS, ARBITRARY UNITS
##FACTOR=    0.368581032318806, 1,           1
##FIRST=     11204.5221812756, 0,            0
##LAST=      -872.772504714734, 0,           0
##MIN=       -872.772504714734, -930754,     0
##MAX=       11204.5221812756, 347881621,    0
$$ Real data points
##PAGE= N=1
##DATA TABLE= (X++(R..R)), XYDATA
$$ [...]
22948A5376N0190n6410j05647r4898k9691K2759Q7896J0457M889R7709O1127M5833
$$ 15376 65566 9156 -96491 -191389 -221080 -198321 -110425 -99968 -95079 2630 63757 109590
22936A09590L2581l4284l9148p1610j01698m3932l2323j8883J6548l6903J7447
$$ 109590 142171 107887 68739 -2871 -104569 -148501 -180824 -199707 -183159 -220062 -202615
22925b02615M1059O1442j1158n3896K1811N77M5949Q0653K4721K2098J964J0079
$$ -202615 -161556 -100114 -111272 -165168 -143357 -142780 -96831 -16178 8543 30641 32605 42684
22913D2684m0291m2768l971o7422k5915M8510j7742m6990J6835j1200M519K6834
$$ 42684 2393 -40375 -44346 -111768 -137683 -89173 -106915 -153905 -137070 -148270 -143751 -116917
22901a16917j3743k9015l1171k2904K9659Q2832K0300j10006q0585r51N0443L6304
$$ -116917 -130660 -159675 -190846 -213750 -184091 -101259 -80959 -190965 -271550 -272501 -222058 -185754
22889a85754M6495O7145M5574J04123j244l3848k9348k6102o908l4554k7847o7052
$$ -185754 -139259 -72114 -26540 77583 76339 42491 13143 -12959 -19867 -54421 -82268 -149320
22877a49320N56M5806j796N811K4303K9920J3146J7871M5058J6256j01187n4210
$$ -149320 -148764 -102958 -104754 -98943 -74640 -44720 -31574 -13703 31355 47611 -53576 -107786
22865a07786Q3226J21123P2226j9185j8017k3957o8740k1098P2348P9834K8114
$$ -107786 -24560 96563 168789 149604 131587 107630 38890 17792 90140 169974 198088
22854A98088q5382j14523o505J9965L376P4251O9415n7903j392K5084Q318j3991
$$ 198088 112706 -1817 -8322 11643 15019 89270 158685 100782 99390 124474 132792 118801
22842A18801l0940k9422J8887k0216J453j03959j35162n8948N2106l481L4510
$$ 118801 87861 58439 77326 57110 58563 -45396 -180558 -239506 -187400 -190881 -156371
22831a56371P3286J9155n940L1371K760k5780l5141j0946K0734J22312J11668
$$ -156371 -83085 -63930 -69870 -38499 -35739 -61519 -96660 -107606 -86872 35440 147108
22820A47108J8724j5720Q4602J2377n4091m0497n9153m7533k1876j9214q0345
$$ 147108 165832 150112 234714 247091 193000 152503 93350 45817 23941 4727 -75618
22809g5618o7061l5886N3770R3781L9593K0493j3954j2390j0740k9560m0976k7449
$$ -75618 -142679 -178565 -124795 -31014 8579 29072 15118 2728 -8012 -37572 -78548 -105997
22797a05997m0568K8433M6829r926l1547n3413n8290N5026P1364K9407J9056M4560
$$ -105997 -146565 -118132 -71303 -81229 -112776 -166189 -224479 -169453 -98089 -68682 -49626 -5066
22785e066M1662l3715k6085J6818Q6265Q84r8450J2353O4382L8277k1572j6476
$$ -5066 36596 2881 -23204 -6386 79879 80763 -17687 -5334 59048 97325 75753 59277
22773E9277L3421n1145p2400J6149N1171M190j1865O633n606o5205l6191O8632
$$ 59277 92698 41553 -30847 -14698 36473 40663 28798 35431 29825 -35380 -71571 -2939
22761b939K5757L2183m231j5251L8518L2224J08034L6270k7236p8137j12934j28805
$$ -2939 22818 55001 50770 35519 74037 106261 214295 250565 223329 145192 32258 -96547
22749i6547K1437L9420l9737m4626M3459O7892J7324m1464o2811j18929n1937
$$ -96547 -75110 -35690 -75427 -120053 -76594 -8702 8622 -32842 -95653 -214582 -266519
22738b66519J17792R8969l7699j3725o958j7351q162M4337l97j6449J1864Q640
$$ -266519 -148727 -49758 -87457 -101182 -108140 -125491 -133653 -89316 -89713 -106162 -94298 -85658
22726h5658k3101J5347M6902k648l1306q64M2326M8207k4738l0817l1907k3035
$$ -85658 -108759 -93412 -46510 -49158 -80464 -81328 -39002 9205 -15533 -46350 -78257 -101292
22714a01292m674l0961J0205k390Q654J18815J22737P4401l8311o7545n1280p689
$$ -101292 -105966 -136927 -126722 -129112 -120458 -1643 121094 195495 157184 89639 38359 30670
22702C0670j32p2692q6265m1106O4123P7379r811J7595P4151M1580M4918R212
$$ 30670 30538 -42154 -128419 -169525 -105402 -28023 -37834 -20239 53912 95492 140410 149622
22690A49622j4695K131n7929p5772n8300m6848l9012m4483k349K8085M7778K736
$$ 149622 134927 137058 79129 3357 -54943 -101791 -140803 -185286 -187635 -159550 -111772 -109036
22678a09036q9524K055R8089J06567J5925p7095k8832N9542R6724R8576O7968
$$ -109036 -198560 -196505 -98416 8151 24076 -53019 -81851 -22309 74415 172991 240959
22667B40959O3152P6611M8644p0381j09409l6125m6983q6093r9494o1563L5753
$$ 240959 304111 380722 429366 358985 249576 213451 166468 80375 -19119 -80682 -44929
22656d4929O9388Q1681M956l3897K7683L2154k3133o145J0086m9496r3579o7732
$$ -44929 24459 106140 111096 77199 104882 137036 113903 107758 117844 68348 -25231 -92963
22644i2963o6219q3185o8273l982O4906J50221J17178N7324R0020J04870M3111
$$ -92963 -159182 -242367 -310640 -314622 -249716 -99495 17683 75007 165027 269897 313008
22633C13008j8010k2990l4652J7162J995m3290q6028r6653n2700m49j2311n4763
$$ 313008 294998 272008 237356 254518 256513 213223 127195 30542 -22158 -22607 -34918 -89681
22621h9681m3039K1984R4450K6083l8090O0913Q1553j4158l5932k5872n4391n6428
$$ -89681 -132720 -110736 -16286 9797 -28293 32620 114173 100015 64083 38211 -16180 -72608
22609g2608p3048k3788J16385N1085n8436j653j1704J5592P2443P6873o0247n0953
$$ -72608 -145656 -169444 -53059 -1974 -60410 -62063 -73767 -58175 14268 91141 30894 -20059
22597b0059k388O5764N1350o5932o0166N5188Q1762J3071m615J2437L8032K7549
$$ -20059 -22447 43317 94667 28735 -31431 23757 105519 118590 113975 126412 164444 191993
22585A91993R919p1220r9483j7607J6570l0348K9456O3845j200r980K554j6708
$$ 191993 201912 130692 31209 13602 30172 -176 29280 93125 91925 81945 84499 67791
22573F7791M808J7805m8145n7498l2864k8410K1478O409m1896r323K6432j2304
$$ 67791 72599 90404 42259 -15239 -48103 -76513 -55035 -48626 -90522 -99845 -73413 -85717
22561h5717k7244q3481o8765m0060M977J02637P0837R8705R9361J01035k3915
$$ -85717 -112961 -196442 -265207 -305267 -300290 -197653 -126816 -28111 71250 172285 148370
22550A48370j55994j03172n3172K5884N8027L3808n4767J7371R6239J4597r40
$$ 148370 -7624 -110796 -163968 -138084 -80057 -46249 -101016 -83645 12594 27191 26251
22539B6251Q806j2464k9208l6217k0370l9389Q018M4354P906l0560J29195J05776
$$ 26251 35057 22593 -6615 -42832 -63202 -102591 -94573 -50219 -42313 -72873 56322 162098
22527A62098R520k7505o2011l5539J431L5452j6530l3127n1369K6085J15252m4383
$$ 162098 171618 144113 82102 46563 47994 83446 66916 33789 -17580 8505 123757 79374
22515G9374o3428J2279m1468p5417j6206K6070P0825J12129J35896O8433k7651
$$ 79374 15946 28225 -13243 -88660 -104866 -78796 -7971 104158 240054 308487 280836
22504B80836l3924p3714j22302l3426p974J7055K9466K4279l0335J0039O7285
$$ 280836 246912 173198 50896 17470 9496 26551 56017 80296 49961 60000 127285
22493A27285L6669O6868p503j05065j53175r8725m4419n1733j9044M7426K5051
$$ 127285 163954 230822 223319 118254 -34921 -133646 -178065 -229798 -248842 -201416 -176365
22482a76365Q0040J055l3148l53O56L714K5918O1740M105q7538n2704O9439R8917
$$ -176365 -96325 -95270 -128418 -128771 -128115 -124401 -98483 -36743 -32638 -120176 -172880 -103441 -4524
22469d524J03534L2448k8546k4383J6676J7168L9792J44072Q9171m1904j00330
$$ -4524 99010 131458 102912 78529 95205 112373 152165 296237 385408 343504 243174
22458B43174j05143q7131N75q5425p0587O411J17700J20505N4263j849M2320M5950
$$ 243174 138031 50900 51475 -33950 -104537 -98126 19574 140079 194342 192493 234813 280763
22446B80763n1315q6412j30042p3480p439k6801j1855K7189M2374L3582l1576
$$ 280763 229448 143036 12994 -60486 -67925 -94726 -106581 -79392 -37018 -3436 -35012
22435c5012m8790j6361L6688K7496J7509O7185K2518l0738k0149n2337n9196l2994
$$ -35012 -83802 -100163 -63475 -35979 -18470 48715 71233 40495 20346 -31991 -91187 -124181
22423a24181m0245p30J09691J01578K3842m0887l1442o171J9586l7167o7643n2747
$$ -124181 -164426 -165156 -55465 46113 69955 29068 -2374 -8545 11041 -26126 -93769 -146516
22411a46516l7825r956j5161K8635J40850J02457k8342K0475j1776N5753M3127
$$ -146516 -184341 -194297 -209458 -180823 -39973 62484 34142 54617 42841 98594 141721
22400A41721r792k5519o8279m1639j3652J3544o6606q8147M273N0256L4734J13351
$$ 141721 131929 106410 38131 -3508 -17160 -3616 -70222 -158369 -154096 -103840 -69106 44245
22388D4245K2967q5233o0012Q7J6524K8576k3178n5721N7520P7300J4521K2510
$$ 44245 67212 -18021 -78033 -77946 -61422 -32846 -56024 -111745 -54225 23075 37596 60106
22376F0106J7565p528o8173j35586k0397L2723P0435M8706n4741m4085p2445k7050
$$ 60106 77671 70143 1970 -133616 -154013 -121290 -50855 -2149 -56890 -100975 -173420 -200470
22364b00470P0219K6526P6974J02935Q2219K5313l5275q5864o2048K5231M2616
$$ -200470 -130251 -103725 -26751 76184 158403 183716 148441 62577 529 25760 68376
22353F8376J5255m2136m9266J9608J833r4037J062L8486J8652J1717l9117l7945
$$ 68376 83631 41495 -7771 11837 13670 -80367 -79305 -40819 -22167 -10450 -49567 -87512
22341h7512J1920n2710k5189J03339J0186m4643K5916Q159j7398O0313N7064o3767
$$ -87512 -75592 -128302 -153491 -50152 -39966 -84609 -58693 -50534 -67932 -7619 49445 -14322
22329a4322K0094J15575Q5110o741r1518n6091l3669m5666m6999J9591O4399M7579
$$ -14322 5772 121347 206457 199716 108198 52107 18438 -27228 -74227 -54636 9763 57342
22317E7342N4295j00899j11452j2475R993J0160k5876M8004M5655J5713J8730
$$ 57342 111637 10738 -100714 -113189 -103196 -93036 -118912 -70908 -25253 -9540 9190
22306I190N0570P018r1244P456J28124K3826j5781J6035l2369j16838j20867n9695
$$ 9190 59760 66778 -24466 -17010 111114 134940 119159 135194 102825 -14013 -134880 -194575
22294a94575m246J2512N8147L6708o0821r7663k1348J29276N9050r8594m9260
$$ -194575 -198821 -186309 -128162 -91454 -152275 -249938 -271286 -142010 -82960 -181554 -230814
22283b30814j7126k520N1669n544N8992K16646J51085K375m5878n4726k2634O7844
$$ -230814 -247940 -250460 -198791 -204335 -145343 71303 222388 224763 178885 124159 101525 169369
22271A69369N1336K028j8082o7950j08111p4660j7607j5759J2503r013n6436o9844
$$ 169369 220705 222733 204651 136701 28590 -46070 -63677 -79436 -66933 -75946 -132382 -202226
22259b02226j7088K0265N3197N6585P9189N0986M857n6978q6332M152R6005J33896
$$ -202226 -219314 -199049 -145852 -89267 -10078 40908 45765 -11213 -97545 -93393 2612 136508
22247A36508R2589L2804K4247m0600j7338q245l8067J7941m1868j00734j02391
$$ 136508 229097 261901 286148 245548 228210 219965 181898 199839 157971 57237 -45154
22236d5154j2544O2730J01770P6314m9935r2999l8910l1969q7001j29880p214
$$ -45154 -57698 5032 106802 183116 133181 40182 1272 -30697 -117698 -247578 -254792
22225b54792R9087J08366M5065M7636J5071o8464p9701l1428J19899J17944q441
$$ -254792 -155705 -47339 -2274 45362 60433 -8031 -87732 -119160 739 118683 110242
22214A10242N849J5647L543L3391j1395o5535m7540K1457o866o9374j15704j8491
$$ 110242 116091 131738 135281 168672 157277 91742 44202 65659 58793 -10581 -126285 -144776
22202a44776O1203N0338N5052N9674K6491m922q1524r8508o7157K7936R6268O2962
$$ -144776 -83573 -33235 21817 81491 107982 103060 21536 -76972 -144129 -116193 -19925 43037
22190D3037K7130J7039M3279m0977k1292l5899q0198q256o5628N4461J28849K2781
$$ 43037 70167 87206 130485 89508 68216 32317 -47881 -56137 -121765 -67304 61545 84326
22178H4326J1714L0078k1980j17908m4344L4342k7716n5693q448p881O5534J9461
$$ 84326 96040 126118 104138 -13770 -58114 -23772 -51488 -107181 -115629 -123510 -57976 -38515
22166c8515l9821M7265J18012L9407J6311m7102j13045L7021Q6477Q6583O6699
$$ -38515 -78336 -31071 86941 126348 142659 95557 -17488 19533 106010 192593 259292
22155B59292k9752k672n8156n4067j1187m5964L477J09838K8074m7295m1915n7927
$$ 259292 229540 226868 168712 114645 103458 57494 60971 170809 198883 151588 109673 51746
22143E1746k0887J7531j2504k5128O0289Q9910j4275r6220q9472m8395P2674N2241
$$ 51746 30859 48390 35886 10758 71047 160957 146682 50462 -39010 -87405 -14731 37510
22131C7510m0239k3273j4783J3353P2476P9251M5559L0640j9263q6383j32740
$$ 37510 -2729 -26002 -40785 -27432 45044 124295 169854 200494 181231 94848 -37892
22120c7892q8162K5877J14554M4454o1349p6864j7235N4097Q9628K8920O719n9473
$$ -37892 -126054 -100177 14377 58831 -2518 -79382 -96617 -42520 47108 76028 82747 23274
22108B3274j04965K900P3736J02161Q0072k6524o1319k1347K8331j6107l6476
$$ 23274 -81691 -78791 -5055 97106 177178 150654 89335 67988 96319 80212 43736
22097D3736j403p0066k6204J08113J35178N6993j03300q0014m4061L893P2185
$$ 43736 42333 -27733 -53937 54176 189354 246347 143047 63033 18972 22865 95050
22086I5050M1917k0507P393M6659P1640M4637n8973l3530P414J8904k9008o8160
$$ 95050 136967 116460 123853 170512 242152 286789 227816 194286 201700 220604 191596 123436
22074A23436j03411r0241J5498M2819R3374O7936K5673N495n7488p1205j09891
$$ 123436 20025 -70216 -54718 -11899 81475 149411 175084 180579 123091 51886 -58005
22063e8005o6325K6769K7986Q2863L8470l1419P170J6412L1495j6652l6046j8767
$$ -58005 -124330 -97561 -69575 13288 51758 20339 27509 43921 75416 58764 22718 3951
22051C951j5371L7528O0498N4870l5692j15406j45597k7979Q5768K4447k2202
$$ 3951 -11420 26108 86606 141476 105784 -9622 -155219 -183198 -97430 -72983 -95185
22040i5185q215P0554K0688K300N9386J09239R3322J1714j1907r200N473k8897
$$ -95185 -103400 -32846 -12158 -9858 49528 158767 252089 263803 251896 242696 248169 219272
22028B19272p5428o0046j4341P573n1247o9854j39113m7529N9718N1854j843L8737
$$ 219272 143844 83798 69457 77030 25783 -44071 -183184 -230713 -170995 -119141 -120984 -82247
22016h2247J048o8684q5359O5372R5796N5375O5601o6447j59384n8668J5797J6818
$$ -82247 -81199 -149883 -235242 -169870 -74074 -18699 46902 -19545 -178929 -237597 -221800 -204982
22004b04982Q8318L1037o1592M449Q4309N2028l2631m5415L0110O0298k4019k0533
$$ -204982 -116664 -85627 -147219 -142770 -58461 -6433 -39064 -84479 -54369 5929 -18090 -38623
21992c8623o0682j30024p2970J8900O7763J22127J54584J35249J08088l598j14790
$$ -38623 -99305 -229329 -302299 -283399 -215636 -93509 61075 196324 304412 300814 186024
21981A86024j61679m3454K7789l8238p1712j1013J02484P4738k106l9755k060
$$ 186024 24345 -19109 8680 -29558 -101270 -112283 -9799 64939 62833 23078 21018
21970B1018L3689L2580N279L17K4099m9919r8027o359M6668m0728p3400l6905
$$ 21018 54707 87287 92566 92883 116982 67063 -30964 -37323 9345 -31383 -104783 -141688
21958a41688N7812J95381J88821K9952j31608j63329r7070n6579l9525j6956J6056
$$ -141688 -83876 111505 300326 330278 198670 35341 -61729 -118308 -157833 -174789 -158733
21947a58733J00330K7233J8871L3460o5897o6451M0891O8051L479J7331K3661
$$ -158733 -58403 -31170 -12299 21161 -44736 -111187 -70296 -2245 1234 18565 42226
21936D2226l0837k6044q7248j15167j04786j6731P7786O0865P698L2707K5708
$$ 42226 11389 -14655 -101903 -217070 -321856 -338587 -260801 -199936 -192238 -159531 -133823
21925a33823M2807k3932p0401Q990R5485R6014J4354m7347r7797j0355J645k6480
$$ -133823 -91016 -114948 -185349 -176359 -80874 15140 29494 -17853 -115650 -126005 -124360 -150840
21913a50840J333M7319P7945k086l4249N4059J05454P2003N9400k2600q9207n5530
$$ -150840 -149507 -102188 -24243 -26329 -60578 -6519 98935 170938 230338 207738 118531 63001
21901F3001o7854n6649j9016n259P6883J05392J26741k3080o0780k3709j1499
$$ 63001 -4853 -61502 -80518 -85777 -8894 96498 223239 200159 139379 115670 104171
21890A04171J1874p064p729n9274l5078k7144l8798k1069P5939L2785k3376L1401
$$ 104171 116045 108981 101252 41978 6900 -20244 -59042 -80111 -4172 28613 5237 36638
21878C6638K9887K9787k1508l5106J4427p663o0511k4637P4160Q7931R2416J0039
$$ 36638 66525 96312 74804 39698 54125 46462 -14049 -38686 35474 123405 215821 225860
21866B25860m1136j8815Q829k5728p6381q9607o2823l7905p392j2283R04L3647
$$ 225860 184724 165909 174738 149010 72629 -16978 -79801 -117706 -125098 -137381 -136477 -102830
21854a02830N0343L1527O0746J01414O7241q502N044m5016n4046o0849k9043K8282
$$ -102830 -52487 -20960 39786 141200 208441 199939 204983 159967 105921 45072 16029 44311
21842D4311L1779M746k8143L0135m0212M807J19095J12081N2988M2645l7620j55050
$$ 44311 76090 80836 52693 82828 42616 47423 166518 278599 331587 374232 336612 181562
21830A81562j17536k0943J0925N1071O3875l5746p6270Q235L0151n7923j24940
$$ 181562 64026 43083 54008 105079 168954 133208 56938 65173 95324 37401 -87539
21819h7539n3338R8206J18842R6596k205r0312m9866L9175P882Q209k5214q4404
$$ -87539 -140877 -42671 76171 172767 170562 80250 30384 69559 77441 85650 60436 -23968
21807b3968P744P7383J12571J44176K0530j19612j28665p9988k9647N0396L4436
$$ -23968 -16224 61159 173730 317906 338436 218824 90159 10171 -19476 30920 65356
21796F5356k5334o422j420M8691p318r8108o7659L5258M6826J180p4275n4440
$$ 65356 40022 33600 32180 80871 73553 -24555 -92214 -56956 -10130 -8950 -83225 -137665
21784a37665J7349k7659J4099J4143L5198N6599k6826p0599l0039O8360P1954
$$ -137665 -120316 -147975 -133876 -119733 -84535 -27936 -54762 -125361 -155400 -87040 -15086
21773a5086L1503L3964r146o0142L4619J24922R8262m7717r3154o8273m6338p1842
$$ -15086 16417 50381 41235 -18907 15712 140634 238896 191179 98025 29752 -16586 -88428
21761h8428L9063L3244p9578j00350m9620M6266K6159J5779P4688O9688k4237
$$ -88428 -49365 -16121 -95699 -196049 -245669 -199403 -173244 -157465 -82777 -13089 -37326
21750c7326J6438K9805l604O6674P9219q367k9716m5897k7257K7295M279L2090
$$ -37326 -20888 8917 5313 71987 151206 142839 113123 67226 39969 67264 71543 103633
21738A03633j6918m3989l7629M267j8369l8301Q9089R2564n0707q2621p281J07534
$$ 103633 86715 42726 5097 9364 -9005 -47306 41783 134347 83640 1019 -6262 101272
21726A01272L0874p4593k8097Q328j69l1738l2389j8170l5716K8954O9621O6518
$$ 101272 132146 57553 29456 37784 37615 5877 -26512 -44682 -80398 -51444 18177 84695
21714H4695K5452q2279n9689p902J3130N1177Q0470j6077n8149k9173m2321l5957
$$ 84695 110147 27868 -31821 -39723 -26593 24584 105054 88977 30828 1655 -40666 -76623
21702g6623K4279K9813j0446k9265P602J24384J34098K3615l731l767j5580o8422
$$ -76623 -52344 -22531 -32977 -62242 -54640 69744 203842 227457 223726 219959 204379 135957
21690A35957K0183M4285K2204j18698r1372p140L6839J7209q5551j10842j9184
$$ 135957 156140 200425 222629 103931 12559 5419 42258 59467 -26084 -136926 -156110
21679a56110N528k5675O9658P6709P6199K0579J4592J6552l5210M4315K7957l3080
$$ -156110 -150582 -176257 -106599 -29890 46309 66888 81480 98032 62822 107137 135094 102014
21667A02014n6912m3161N6731J20597O5237k7359j13197q8994M6240N9171K8458
$$ 102014 45102 1941 58672 179269 244506 217147 103950 14956 61196 120367 148825
21656A48825K3841j4497l2547m2818m8418n2981k5894m053L4403L2577k4723m0850
$$ 148825 172666 158169 125622 82804 34386 -18595 -44489 -48542 -14139 18438 -6285 -47135
21644d7135M013J0386k9664R6104M7873l5106n016k9900k804J0586M8479K4332
$$ -47135 -43122 -32736 -62400 33704 81577 46471 41455 11555 8751 19337 67816 92148
21632I2148l5184l1251m627m180m6645o9615n2105q9882L3238J05829Q2052P98
$$ 92148 56964 25713 21086 16906 -29739 -99354 -151459 -241341 -208103 -102274 -20222 -19424
21620a9424j07719k1076R6082O9678o1578j38721p8073j3218K7368J47517J38450
$$ -19424 -127143 -148219 -52137 17541 -44037 -182758 -260831 -274049 -246681 -99164 39286
21609C9286L293p2818j28833r2202n256R3741N7625l035q384q487K3290M6891
$$ 39286 42579 -30239 -159072 -251274 -256530 -162789 -105164 -108199 -116583 -125070 -101780 -54889
21597e4889J2507k3861L6109O5373j7380m4183l6266q0775n4671J1631r765n7796
$$ -54889 -42382 -66243 -30134 35239 17859 -26324 -62590 -143365 -198036 -186405 -196170 -253966
21585b53966l3510R660J1872J04114R6117L6019o517n8538N459M8717L9299L6530
$$ -253966 -287476 -277816 -265944 -161830 -65713 -29694 -36211 -94749 -89290 -40573 -1274 35256
21573C5256J0151j01301o4555L5401m429o3398o9854l1393j164O0043K2672M5801
$$ 35256 45407 -55894 -120449 -85048 -89477 -152875 -222729 -254122 -255286 -195243 -172571 -126770
21561a26770p417J6785R2854P5440j2005m3011n5665J6217P8220L7908k4363p4668
$$ -126770 -134187 -117402 -24548 50892 38887 -4124 -59789 -43572 34648 72556 48193 -26475
21549b6475p6634n7349j8376l6228K2877P4709Q0543l1998j09280J6453L5059
$$ -26475 -103109 -160458 -178834 -215062 -192185 -117476 -36933 -68931 -178211 -161758 -126699
21538a26699Q2305P1581o773k8090j20506p9273N3046J04710J09622L4274M19
$$ -126699 -44394 27187 20414 -7676 -128182 -207455 -154409 -49699 59923 94197 94616
21527I4616M1775L7100m8240q1867j2883J3638l1879k5165j0347M3388n7920r1223
$$ 94616 136391 173491 125251 43384 30501 44139 12260 -12905 -23252 20136 -37784 -129007
21515a29007J9748L7207K3009K0098M711j6459J972j7136p583N8460M3374M238
$$ -129007 -109259 -72052 -49043 -28945 -24234 -40693 -38721 -55857 -63440 -4980 38394 42632
21503D2632J128j4673j7961k7899L2174R27m8511m3445O206p707k6368K6580j8000
$$ 42632 43760 29087 11126 -16773 15401 16328 -32183 -75628 -69422 -77129 -103497 -76917 -94917
21490i4917K6343J3038k0364j0450j1718K8224M8810m8504n4505m6066m9191K4861
$$ -94917 -68574 -55536 -75900 -86350 -98068 -69844 -21034 -69538 -124043 -170109 -219300 -194439
21478a94439Q4611J05867K6061p2659p6737j9167k9211l4192J1943J9998o3586
$$ -194439 -109828 -3961 22100 -50559 -127296 -146463 -175674 -209866 -197923 -177925 -241511
21467b41511k2902m1306n898O8267L2598J6396K3172k210l3883P437P0842J8947
$$ -241511 -264413 -305719 -311617 -243350 -210752 -194356 -171184 -173394 -207277 -199840 -128998 -110051
21455a10051k3406j0657L9119M5798J6286o041r455l0249j2860M3183K5835o3787
$$ -110051 -133457 -144114 -104995 -59197 -42911 -48952 -58407 -88656 -101516 -58333 -32498 -96285
21443i6285j0446J31007J15908J0257n2491n6986L1259j6947R401L4550p6942
$$ -96285 -106731 24276 140184 150441 97950 40964 72223 55276 64677 99227 22285
21432B2285o6708N996L3996M7912J6345j9618M113q374n4276n3418k6735m788
$$ 22285 -44423 -38427 -4431 43481 59826 40208 44321 35947 -18329 -71747 -98482 -103270
21420a03270j8187N9833R0889M7500l3350m4166m9404j15708n5922O3436j0185
$$ -103270 -121457 -61624 29265 76765 43415 -751 -50155 -165863 -221785 -158349 -168534
21409a68534n8129K2094J7871l7443j3959L1942J52767J62766P5412n072j6586
$$ -168534 -226663 -204569 -186698 -224141 -238100 -206158 -53391 109375 184787 179715 163129
21398A63129p6223m6668j7585Q243J7583k5234m422O908J2872J4259r180o4996
$$ 163129 86906 40238 22653 30896 48479 23245 18823 25731 38603 52862 43682 -21314
21386b1314j06690r9830J8413Q5080K0187J1905k7349K660j2472q541l7709q2537
$$ -21314 -128004 -227834 -209421 -124341 -104154 -92249 -119598 -116938 -129410 -137951 -175660 -258197
21374b58197j6974J03922J53987O2518J1735m6889j32316k2973L6633Q1886J9403
$$ -258197 -275171 -171249 -17262 45256 56991 10102 -122214 -145187 -108554 -26668 -7265
21363g265j1706k0739K8337j7632k3940k269Q035M6854O2974k1485j06028o8792
$$ -7265 -18971 -39710 -11373 -29005 -52945 -55214 -47179 -325 62649 41164 -64864 -133656
21351a33656J15653J18663Q5679P1969p3205j79398j26894P818O9234J9480J7219
$$ -133656 -18003 100660 186339 258308 185103 5705 -121189 -113371 -44137 -24657 -7438
21340g438k1806r8802K2401N4307K2028P3747L9645L6506K6023o6331j10221K4243
$$ -7438 -29244 -128046 -105645 -51338 -29310 44437 84082 120588 146611 80280 -29941 -5698
21328e698M7380K5221J0888k5536p0070j1926J5479m0054l9536l0771J0098J16183
$$ -5698 41682 66903 77791 52255 -17815 -29741 -14262 -54316 -93852 -124623 -114525 1658
21316A658N3856o0557l8516L2074P6158J6234M4806n498n0537R3776L5834j00733
$$ 1658 55514 -5043 -43559 -11485 64673 80907 125713 120215 69678 163454 199288 98555
21304I8555j07880m9154O8564M5098R4950N5787l7079j4735J8340k3088k1682
$$ 98555 -9325 -58479 10085 55183 150133 205920 168841 154106 172446 149358 127676
21293A27676l8564q7274m0507Q1108N8030J2165O8020J23204J3387m5676j8113
$$ 127676 89112 1838 -38669 42439 100469 112634 180654 303858 317245 271569 253456
21282B53456K600L2605J5777q5876j14400k5173r0731l5366K4312L6142P0638
$$ 253456 256056 288661 304438 218562 104162 78989 -11742 -47108 -22796 13346 83984
21271H3984N0968p7633m3854J6391L6773P9103J1479o0188o0870N3842J9411m1138
$$ 83984 134952 57319 13465 29856 66629 145732 157211 97023 36153 89995 109406 68268
21259F8268j04199j40200q4955J9731N6903M9351N7480L7552J7994O7176L8070
$$ 68268 -35931 -176131 -261086 -241355 -184452 -135101 -77621 -40069 -22075 45101 83171
21248H3171N7254J6031k2987j2412J6657l0845o6085K2185K8140q7210j12023
$$ 83171 140425 156456 133469 121057 137714 106869 40784 62969 91109 3899 -108124
21237a08124o4619l8158Q40K5096O6571Q5287N0192L4113K3720p9006p7796L3851
$$ -108124 -172743 -210901 -210061 -184965 -118394 -33107 17085 51198 74918 -4088 -81884 -48033
21225d8033O2147K1086K9146Q4395O2702m131n6090n9812m0146j0432M1768R9544
$$ -48033 14114 35200 64346 148741 211443 207312 151222 91410 51264 40832 82600 182144
21213A82144l4626p8666p9906J3525P9759O8091N8534M6996j101o4714j08283
$$ 182144 147518 68852 -11054 2471 82230 150321 208855 255851 254750 190036 81753
21202H1753p2983K7628q8o6390n0011M5416N6610J235J874O8581N4432l5920r072
$$ 81753 8770 36398 36310 -30080 -80091 -34675 21935 23170 25044 93625 148057 112137 103065
21189A03065j8602k3260M8889M8330j735N327K0863K3355n8320p7374p4734l6338
$$ 103065 84463 61203 110092 158422 156687 162014 182877 206232 147912 70538 -4196 -40534
21177d0534r140M3330M6033O2705K4513R13r251j9257q0441q5016j5781J9455
$$ -40534 -49674 -6344 39689 102394 126907 127820 118569 99312 18871 -66145 -81926 -62471
21165f2471J2398j3742m4949K3204O8759R1246L9741K6611j233K3162P4936M8678
$$ -62471 -50073 -63815 -108764 -85560 -16801 74445 114186 140797 139564 162726 237662 286340
21153B86340n2036r6508n2573m8543r1986o5878l228K7587M5666Q6970N7564k7454
$$ 286340 234304 137796 85223 36680 -55306 -121184 -124412 -96825 -51159 35811 93375 65921
21141F5921l1964J3141M8136J3956j2022M8889J4036r0097q5782K9361M5817k3542
$$ 65921 33957 47098 95234 109190 97168 146057 160093 69996 -15786 13575 59392 35850
21129C5850k4314l7597p1622r1164k2489J4406k2800l6480q539P5526K5755m2594
$$ 35850 11536 -26061 -97683 -188847 -211336 -196930 -219730 -256210 -264749 -189223 -163468 -206062
21117b06062n593O9248P2801k704o410q115R548J8959j1932p6377j3135M4915
$$ -206062 -211655 -142407 -69606 -72310 -78720 -86835 -77287 -58328 -70260 -146637 -159772 -114857
21105a14857J05154R2044p2396m0411o4153q0284m5522J1007J8524o58j3211Q5506
$$ -114857 -9703 82341 9945 -30466 -94619 -174903 -220425 -209418 -190894 -191552 -204763 -119257
21093a19257L7589o647Q559L1078Q6618J4957k8985L4971j4391n6785q7269o9717
$$ -119257 -81668 -88315 -79756 -48678 37940 52897 23912 58883 44492 -12293 -99562 -169279
21081a69279j9062L5602l1061m8994J03708J15766j0511p0834m936K6542J5146
$$ -169279 -188341 -152739 -183800 -232794 -129086 -13320 -23831 -94665 -99601 -73059 -57913
21070e7913o8212p9696J5828O0582N9777P6766R5517K3469j9546q7945n8474J51
$$ -57913 -126125 -205821 -189993 -129411 -69634 7132 102649 126118 106572 18627 -39847 -39696
21058c9696o5273m0816P5354Q8980K0730l4711o1227j817k050N276K106j1938
$$ -39696 -104969 -145785 -70431 18549 39279 4568 -56659 -58476 -60526 -55250 -53144 -65082
21046f5082K0512m216j8003K4717L8847m7717m6300J00703J00491J1666m2700
$$ -65082 -44570 -48786 -66789 -42072 -3225 -50942 -97242 3461 103952 115618 72918
21035G2918n3267M966k2384M666m7021q1158k6258J3627M9109J3991N8074r155
$$ 72918 19651 24617 2233 6899 -40122 -121280 -147538 -133911 -84802 -70811 -12737 -21892
21023b1892r2836R240J20848O8954j4483l5088p584n3194k2843R4916P1175j8835
$$ -21892 -114728 -105488 15360 84314 69831 34743 27159 -26035 -48878 46038 117213 98378
21011I8378q5338o0145j2781L9145P9921Q2337M7227J8167j3560n5581m6133K045
$$ 98378 13040 -47105 -59886 -20741 59180 141517 188744 206911 193351 137770 91637 93682
20999I3682k9519m6166J6026P458k556j3922j7319J324l9265O2673Q9161K2404
$$ 93682 64163 17997 34023 41481 38925 25003 7684 9008 -30257 32416 121577 143981
20987A43981l1320o5489r7972o2595l494L3800M8811K2757L8817K7703q275j2760
$$ 143981 112661 47172 -50800 -113395 -116889 -83089 -34278 -11521 27296 54999 46724 33964
20975C3964J12555J18808j9281r6687r8208Q552m2474r3753k5215J9480M4949
$$ 33964 146519 265327 246046 149359 51151 59703 17229 -76524 -101739 -82259 -37310
20964c7310J9679J6738n3619l7863J8333J09565K3011J4085J1441j6534n5802
$$ -37310 -17631 -893 -54512 -92375 -74042 35523 58534 72619 84060 67526 11724
20953A1724o6677k0743K9125O4473J16937M9896n9788k7730J5648m056l8965p0428
$$ 11724 -54953 -75696 -46571 17902 134839 184735 124947 97217 112865 108809 69844 -584
20941e84k924N7394n21l9848J6898M0773N0137m0211n0360J5490j3569m6212L4904
$$ -584 -3508 53886 53365 13517 30415 71188 121325 81114 30754 46244 32675 -13537 21367
20928B1367O7137j8554n1638N4254J200r4100r6063j3986Q968N8004N0027L7172
$$ 21367 88504 69950 18312 72566 73766 -20334 -116397 -130383 -121415 -63411 -13384 23788
20916B3788j8475k7888m781L7884j2860k2565n1238l2836L2715N836M1472Q5410
$$ 23788 5313 -22575 -27356 10528 -2332 -24897 -76135 -108971 -76256 -70420 -28948 56462
20904E6462J5617J5638K5159o5070m5650j4610j9272J2730J0600O506l2563n3042
$$ 56462 72079 87717 112876 47806 2156 -12454 -31726 -18996 -8396 -1890 -34453 -87495
20892h7495L459M3385P8556P0864n5183j08851r8686n8133K9259N1127q3943j7085
$$ -87495 -84036 -40651 37905 108769 53586 -55265 -153951 -212084 -182825 -131698 -215641 -232726
20880b32726J09602L5155K1155M6206m3782J2529P3676q225m0237N3795M8847
$$ -232726 -123124 -87969 -66814 -20608 -64390 -51861 21815 13590 -26647 27148 75995
20869G5995M5443N3899o8646j9759L3293k4567j9947N6989K9019o4954q2250o55
$$ 75995 121438 175337 106691 86932 120225 95658 75711 132700 161719 96765 14515 13860
20857A3860O1936k091n8724j30738J9L6574J7555r526l9044j6967J6323L9561
$$ 13860 75796 73705 14981 -115757 -115738 -79164 -61609 -71135 -110179 -127146 -110823 -71262
20845g1262J1643l300O0604Q8795R196j4319L0705n5963p9216l1943N2154Q9735
$$ -71262 -59619 -62919 -2315 86480 95676 81357 112062 56099 -23117 -55060 -2906 86829
20833H6829k618L6473L8853j1632o6557r9123k4657Q6889O7089q3526j3935L4244
$$ 86829 84211 120684 159537 147905 81348 -17775 -42432 44457 111546 28020 14085 48329
20821D8329o2666m292K2835J8242L3275K5774Q6655Q3845k2304o9793j01650n8514
$$ 48329 -14337 -18629 4206 22448 55723 81497 168152 251997 229693 159900 58250 -264
20809b64n804R038Q9194J30234J1122j48764j00972q3022k1957N028j0344q7865
$$ -264 -6068 2970 92164 222398 233520 84756 -16216 -99238 -121195 -116167 -126511 -214376
20797b14376r7313L1755J86522J03241l7049j52358n8475J13582J54157J14712
$$ -214376 -311689 -279934 -93412 9829 -27220 -179578 -238053 -124471 29686 144398
20787A44398m2128k09262j50305O4344N1042l7318J6047O5002P6155O7012l5668
$$ 144398 102270 -106992 -257297 -192953 -141911 -179229 -163182 -98180 -22025 44987 9319
20776I319o9749M0451O9481K0792l1705m0891N2000N5265j1424M4539k2066j06500
$$ 9319 -60430 -19979 49502 70294 38589 -2302 49698 104963 93539 138078 116012 9512
20764I512n3530q67n501j2270K8775K1517r976N4425L9448k4775j8555k628n3123
$$ 9512 -44018 -44885 -50386 -62656 -33881 -12364 -22340 32085 71533 46758 28203 25575 -27548
20751b7548k6577L9663l463k707m8574r970Q7476L0306j18697n444Q9564P7054
$$ -27548 -54125 -14462 -17925 -20632 -69206 -79176 8300 38606 -80091 -85535 4029 81083
20739H1083O495q4629o7292l8196m8322n7252L3675J3680O3781P9905j6781M2626
$$ 81083 87578 2949 -64343 -102539 -150861 -208113 -174438 -160758 -96977 -17072 -33853 8773
20727H773L9742N4602Q115l1178j8396J8502O3811p4606j09279L754J1432j31
$$ 8773 48515 103117 111232 80054 61658 80160 143971 69365 -39914 -36160 -24728 -24859
20715b4859K5457O2285P0928J9417j00600m3621K1899M453k1708n785j5024j0887
$$ -24859 598 62883 133811 153228 52628 9007 30906 35359 13651 7866 -7158 -18045
20703a8045J0124K9632M3234P8411M3890k8449p7495n5663j6337l0840K3420J09192
$$ -18045 -7921 21711 64945 143356 187246 158797 81302 25639 9302 -21538 1882 111074
20691A11074J02552M1717j17121j59557k2207N8724O7087j0613L9118L7823k2437
$$ 111074 213626 255343 138222 -21335 -43542 15182 82269 71656 110774 148597 126160
20680A26160J8714l671m4848q7195n9524J2525L2535J5472n2964p0027J5318j3247
$$ 126160 144874 141203 96355 9160 -50364 -37839 -5304 10168 -42796 -112823 -97505 -110752
20668a10752J836P7026P4135L8035O393q9478q8102l0093J6204K3662k5380m9970
$$ -110752 -108916 -31890 42245 80280 86673 -2805 -90907 -121000 -104796 -81134 -106514 -156484
20656a56484M7733M6606Q1625N4925K4489k0674n1402j3799m526l4375n6614L8116
$$ -156484 -108751 -62145 19480 74405 98894 78220 26818 13019 8493 -25882 -82496 -44380
20644d4380P2391L086k5394l9561K7704m660n8273k1211j1113J8443Q8194J9562
$$ -44380 28011 31097 5703 -33858 -6154 -10814 -69087 -90298 -101411 -82968 5226 24788
20632B4788K5983N5888J36979N9431n1308j18068l0516O1425m975o9701M7204
$$ 24788 50771 106659 243638 303069 251761 133693 103177 164602 159627 89926 137130
20621A37130O0920o5234j23131j3672K8726l1656O196O9011L3657K9130k486m9347
$$ 137130 198050 132816 9685 -3987 24739 -6917 -721 68290 101947 131077 128591 79244
20609G9244l8794l2961l3596K5873J1537M9203N0770m1793o2948l0823N2946P9507
$$ 79244 40450 7489 -26107 -234 11303 60506 111276 69483 6535 -24288 28658 108165
20597A08165m3893o3490J5213K9595l6746L3675J1315j8974q6802o0108K0457
$$ 108165 64272 782 15995 45590 8844 42519 53834 34860 -51942 -112050 -91593
20586i1593j044K7522N1314R486J1271k1409o6442k5759P6838M4515N925j5280
$$ -91593 -92637 -65115 -13801 -4315 6956 -14453 -80895 -106654 -29816 14699 20624 5344
20574E344Q9161k0017j23457j5344J7215k4058p193K2542J07766M2906o047q1457
$$ 5344 94505 74488 -48969 -64313 -47098 -71156 -78349 -55807 51959 94865 88818 7361
20562G361j18445Q1732J68692L0601n9002o9599m7462P899N5927P7603P1295j9716
$$ 7361 -111084 -29352 139340 169941 110939 41340 -6122 1777 57704 135307 206602 186886
20550A86886o2542K487Q330k9824n381J4308m6510q862L3759l7516p2258M3713
$$ 186886 124344 126831 135161 105337 99956 114264 67754 58892 92651 55135 -17123 26590
20538B6590P9427J8547m5157o0537k2413L1905J6625p7774j01812q2752l4403
$$ 26590 106017 124564 79407 18870 -3543 28362 44987 -32787 -134599 -217351 -251754
20527b51754J00600J00479L8675J4518P8870j6964j15715J4697Q6127J09246j7978
$$ -251754 -151154 -50675 -12000 2518 81388 64424 -51291 -36594 49533 158779 140801
20516A40801j00550n3615M6445L1949L1047J5668L4595n973o1837k2367O2236
$$ 140801 40251 -13364 33081 65030 96077 111745 146340 140367 78530 56163 118399
20505A18399P7940K937l7801k383L3038L5339j8956q1532o9066m005M1736K1935
$$ 118399 196339 199276 161475 159092 192130 227469 208513 126981 57915 53910 95646 117581
20493A17581l911r719J7835m6926m3640J2354K6899N7007l558l0894o1170r5601
$$ 117581 113670 103951 121786 74860 31220 43574 70473 127480 123922 93028 31858 -63743
20481f3743j9238l328O847k764o3714p3381O859k0197Q7642J15519m535l9836
$$ -63743 -82981 -86309 -79462 -82226 -145940 -219321 -212462 -232659 -145017 -29498 -34033 -73869
20469g3869L5158j7426j2202J9603Q375K9848J5885K623k0450n3388n7038k7817
$$ -73869 -38711 -56137 -68339 -48736 -40361 -10513 5372 7995 -12455 -65843 -122881 -150698
20457a50698Q449M7904Q5465N4034Q412l2135R161J5598J1448j6565k4558j07663
$$ -150698 -142249 -94345 -8880 45154 53566 21431 30592 46190 57638 41073 16515 -91148
20445i1148o8777O5727J29451N4587K2069J9915p5867o8985r9202o1116J03848
$$ -91148 -159925 -94198 35253 89840 111909 131824 55957 -13028 -112230 -173346 -69498
20434f9498N1982J4116J2641J5663K2412r929k0126J1612n567n6233k7667N2171
$$ -69498 -17516 -3400 9241 24904 47316 37387 17261 28873 23306 -32927 -60594 -8423
20422h423Q6750R5745p089j27129p6201J2459j7567q2309j11856o3319O998K7045
$$ -8423 78327 174072 166983 39854 -36347 -23888 -41455 -123764 -235620 -298939 -291941 -264896
20410b64896O4666N2148R393O4734Q6235Q6198M9551M3210J22j8051r1951j9855
$$ -264896 -200230 -148082 -138689 -73955 12280 98478 148029 191239 191361 173310 81359 61504
20398F1504Q0557p3655j03355L663R4507P7433J1372m5008n8841J8872L8318Q3258
$$ 61504 142061 68406 -34949 -31286 63221 140654 152026 107018 48177 67049 105367 188625
20386A88625j4200j5358K3187m3847m7552N3238M4425J223l9552j6427K6089K6672
$$ 188625 174425 159067 182254 138407 90855 144093 188518 189741 150189 133762 159851 186523
20374A86523O370M2592O0040j073K0237l3627r8567j5617M6073M2858n6837p2260
$$ 186523 192893 235485 295525 294452 314689 281062 182495 166878 212951 255809 198972 126712
20362A26712n3249m5500l6105J1845L7199J7841J3850m8979q697P4228n9714k078
$$ 126712 73463 27963 -8142 3703 40902 58743 72593 23614 14917 89145 29431 27353
20350B7353Q866n2273m642P4785K6157O0766N2430R022l3370o0519r9014q2255
$$ 27353 36219 -16054 -20696 54089 80246 141012 193442 202464 169094 108575 9561 -72694
20338g2694m8680M527K2690p80m0781N946m9639M0622L8189N4899J07276P5011
$$ -72694 -121374 -116847 -94157 -94937 -135718 -129772 -179411 -138789 -100600 -45701 61575 136586
20326A36586o2941q5043k6231M6859K3993k5218J0064O8234N9503O0784M8555
$$ 136586 73645 -11398 -37629 9230 33223 8005 18069 86303 145806 206590 255145
20315B55145p4085r5746j6983L6519R9854m9733q609J14996O9702j2542l7995
$$ 255145 181060 85314 68331 104850 204704 154971 146362 261358 331060 318518 280523
20304B80523m6528Q40J4452q1692j54180p2983L5479Q5894P6130M6058K8577j6607
$$ 280523 233995 234835 249287 167595 13415 -59568 -24089 61805 137935 183993 212570 195963
20292A95963n3756n5143k7762Q8592J00496J24314r598j13817p8889n79k4155
$$ 195963 142207 87064 59302 147894 248390 372704 363106 249289 170400 169821 145666
20281A45666p7280j276k901J4659q690j6046l7621m2243P848J984P2864K7170
$$ 145666 68386 67110 64209 78868 70178 54132 16511 -25732 -17884 -15900 56964 84134
20269H4134k1113p5777l2077J7968l6044o5151n7366J7526J07012K5613o2734
$$ 84134 63021 -12756 -44833 -26865 -62909 -128060 -185426 -167900 -60888 -35275 -98009
20258i8009k8512K3315k6748p7243j9812N4272Q0495p761N0242Q9239j8272q0267
$$ -98009 -126521 -103206 -129954 -207197 -227009 -172737 -92242 -100003 -49761 39478 21206 -59061
20246e9061l2426L1213O9947K0591j3316k0525n4146p2012p535O2237K4258n7833
$$ -59061 -91487 -60274 9673 30264 16948 -3577 -57723 -129735 -137270 -75033 -50775 -108608
20234a08608m3873K0436L0904M929j4504l2015k9883L7678P7959L9887k0036o6054
$$ -108608 -152481 -132045 -101141 -96212 -110716 -142731 -172614 -134936 -56977 -17090 -37126 -103180
20222a03180J0643L5977l3000m1653K4154K703N5582J19547O829K8924m5170j24059
$$ -103180 -92537 -56560 -89560 -131213 -107059 -104356 -48774 70773 77602 106526 61356 -62703
20210f2703K693P3566N4865M4115J1163j9578p523p827q0478p9105O0228M9471
$$ -62703 -60010 13556 68421 112536 123699 104121 96598 88771 8293 -70812 -10584 38887
20198C8887K1714l6434M1128j3373j4165n1753n0938j8130K9242M3983J7800Q9196
$$ 38887 60601 24167 65295 51922 37757 -13996 -64934 -83064 -53822 -9839 7961 97157
20186I7157M5298J2215k7867o7895O917O7357Q70L8286j4491r3999M634J6852
$$ 97157 142455 154670 126803 58908 65825 133182 134052 172338 157847 63848 68482 85334
20174H5334k2979N131p99p4350l3862M3584P2177P4258J24777O8249m0222l5800
$$ 85334 62355 67486 66687 -7663 -41525 2059 74236 148494 273271 341520 301298 265498
20162B65498m8818m3370O6736O5243J718p075k2213Q881m2967q4652R582P719
$$ 265498 216680 173310 240046 305289 307007 299932 277719 286600 243633 158981 168563 176282
20150A76282n7113o7199j667K649N8688P4982j7485n2491j01324j02515J4293
$$ 176282 119169 51970 50303 52952 111640 186622 169137 116646 15322 -87193 -72900
20139g2900Q9884P1276L2543J08425K3361r509r443o9508o8590k0095j3556K9743
$$ -72900 16984 88260 120803 229228 252589 243080 233637 164129 95539 75444 61888 91631
20127I1631K3722n6352j12474J6862R804J9250K5798k4786k7012r062J3386R4712
$$ 91631 115353 59001 -53473 -36611 -26807 -7557 18241 -6545 -33557 -42619 -29233 65479
20115F5479O2196M8248l5101q6160q7752k1531K1477R3486J5542o0460q3730j2319
$$ 65479 127675 175923 140822 54662 -33090 -54621 -33144 60342 75884 15424 -68306 -80625
20103h0625l5248m050M7581M2848r6530p0516O3235P7229N8667Q6746O0347N1032
$$ -80625 -115873 -119923 -72342 -29494 -126024 -196540 -133305 -56076 2591 89337 149684 200716
20091B00716N416k7287j30154q5772K6411N2292K9347R3217M4966k5978k1691
$$ 200716 206132 178845 48691 -37081 -10670 41622 70969 164186 209152 183174 161483
20080A61483j5041j35099j05847m0404q735J231N1906J10320P4690n7371p849
$$ 161483 146442 11343 -94504 -134908 -143643 -142412 -90506 19814 94504 37133 29284
20069B9284K1041l9616j24182p8383Q941N6928P1649J20993Q7465o213n1207k6998
$$ 29284 50325 10709 -113473 -191856 -182915 -125987 -54338 66655 154120 147907 96700 69702
20057F9702K4005O3197j0866m0592N586N9728K4877O570r1637r4842m138Q1676
$$ 69702 93707 156904 146038 105446 111032 170760 195637 202207 110570 15728 11590 93266
20045I3266J20616P2362o7670m9376r1419l8228L6706K8750l5941P3088J35292
$$ 93266 213882 286244 218574 169198 77779 39551 76257 105007 69066 142154 277446
20034B77446M2838r9368j35565q3940n2014K0143L5571K019j4477q4103m6282
$$ 277446 320284 220916 85351 1411 -50603 -30460 5111 7130 -7347 -91450 -137732
20023a37732N8983O7691Q5802O3302l7115M8839k7957r5204j8975M6077L3300
$$ -137732 -78749 -11058 74744 138046 100931 149770 121813 26609 7634 53711 87011
20012H7011J3926o0524J1635L6767j6831n1837L3908J08884J01753l2680k9829
$$ 87011 100937 40413 52048 88815 71984 20147 54055 162939 264692 232012 202183
20001B02183M754n8290j14243q7526Q449J8552L235Q5065M0859L412k6308m4683
$$ 202183 206937 148647 34404 -53122 -44673 -26121 -22886 62179 103038 106450 80142 35459
19989C5459K9300M2388n3242m1472L9095l1418j11468l7382O9939J44465J41419
$$ 35459 64759 107147 53905 12433 51528 20110 -91358 -128740 -58801 85664 227083
19978B27083M670q0385O384K0800M07R439l2550m0428m6350j06839j02917j3878
$$ 227083 231753 151368 157752 178552 178959 188398 155848 115420 69070 -37769 -140686 -154564
19966a54564L0716J43641O4341j0666p389l768l2048j9918Q391Q5671J25377j3144
$$ -154564 -123848 19793 84134 73468 66079 62311 30263 10345 18736 104407 229784 216640
19954B16640l9922L8603K1783r228k9768p0892l4904k6116k5465l0346n8044M4865
$$ 216640 176718 215321 237104 227876 198108 127216 92312 66196 40731 10385 -47659 -2794
19942b794Q5837L091J3682K9702m1222k297M4496J3154J4622J603L1340R3688
$$ -2794 83043 86134 99816 129518 88296 85999 130495 143649 158271 159874 191214 284902
19930B84902p2603j76891n8634L5626j0018j2970L991k0316O979L4882O9772l8732
$$ 284902 212299 35408 -23226 12400 2382 -10588 -6597 -26913 -19934 14948 84720 45988
19918D5988o0441m4678m601O8204O9074R0311Q2616K8346K3936n884j2442k0239
$$ 45988 -14453 -59131 -63732 4472 73546 163857 246473 274819 298755 292871 280429 260190
19906B60190k9811L0450l7132j5510j8943k2421k6746L7138N3512J21976O6376
$$ 260190 230379 260829 223697 208187 189244 166823 140077 177215 230727 352703 419079
19895D19079K7170R314O258l8869o3392o2884J3129O6498q226l6410L6465J0045
$$ 419079 446249 455563 461821 422952 359560 296676 309805 376303 368077 331667 368132 378177
19883C78177K7936n3640m4202j405O650j24929j09399j271L4827N5568K7688k2305
$$ 378177 406113 352473 308271 306866 313516 188587 79188 77917 112744 168312 196000 173695
19871A73695j9230m0314M0664R3232J09460k7237j5564L4463j175q5740K1593
$$ 173695 154465 114151 154815 248047 357507 330270 314706 349169 347994 262254 283847
19860B83847J4745k207k0396N4771N6622o4927j66002q825O8081R2255M3122K1094
$$ 283847 298592 296385 275989 330760 387382 322455 156453 147628 215709 307964 351086 372180
19848C72180k9640j1907L3197J24479p1612o6605l4534O502K2879K0864j06248
$$ 372180 342540 330633 363830 488309 416697 350092 315558 322060 344939 365803 259555
19837B59555k3915L9246Q7545L4786J04804J04490M8741n5812m5437k6908j3230
$$ 259555 235640 274886 362431 397217 502021 606511 655252 599440 554003 527095 513865
19826E13865j1047k5396l3117N2971O9631M7095k5031J0432m1390J1808j3765
$$ 513865 502818 477422 444305 497276 566907 614002 588971 599403 558013 569821 556056
19815E56056L7677m0269n2084j27160o1707o8332O2689J18296J82227K6122q8057
$$ 556056 593733 553464 501380 374220 312513 244181 306870 425166 607393 633515 545458
19804E45458j54483j7980Q6011R7033k4148k9367o5601p0300m3383L7835k2370
$$ 545458 390975 372995 459006 556039 531891 502524 436923 366623 323240 361075 338705
19793C38705p5588j13888L8393J04757O4149p5164k6273m8953n8055j13963j2199
$$ 338705 263117 149229 187622 292379 356528 281364 255091 206138 148083 34120 21921
19782B1921O2710J17703K4895m1211j1752M8955m960l2427r6419l8929o6524k2663
$$ 21921 84631 202334 227229 186018 174266 223221 218261 185834 89415 50486 -16038 -38701
19770c8701L3371J15962K4737M5376M3166L8891M1291M7431k4905m7397q4789
$$ -38701 -5330 110632 135369 180745 223911 262802 304093 351524 326619 279222 194433
19759A94433O1494P4692l20p2000K5661p8813r9313l4016L2202M3282O4858m752
$$ 194433 255927 330619 330299 258299 283960 205147 105834 71818 104020 147302 212160 207408
19747B07408r190n1568k7807n8555l7993j2811J110K8288O7303R9085J35848K2606
$$ 207408 198218 146650 118843 60288 22295 9484 10594 38882 106185 205270 341118 363724
19735C63724l1387j8712j9955n5826N0931O0051j8969o0010k9595K1772K6649
$$ 363724 332337 313625 293670 237844 288775 348826 329857 269847 240252 262024 288673
19724B88673M0996J9566k0590q833m4440m3460j1992L7654j1847Q3257N9837o3936
$$ 288673 329669 349235 328645 319812 275372 231912 219920 257574 245727 328984 388821 324885
19712C24885j23277n2757j402K0170j4602q625M9699M5151Q626Q7622N4548n6245
$$ 324885 201608 148851 147449 167619 153017 144392 194091 239242 247868 335490 390038 333793
19700C33793n3712K6204P6425M1226n7767p5104j9317J9774K3159j3117o6606
$$ 333793 280081 306285 382710 423936 366169 291065 271748 291522 314681 301564 234958
19689B34958n2265o337q527J2783M0583J0199m2751j4179N3308N4297P4999Q1218
$$ 234958 182693 176356 167829 180612 221195 231394 188643 174464 227772 282069 357068 438286
19677D38286q0720r0074J6541O4383L2294Q2565N6343P3547P7451J4227o3628
$$ 438286 357566 267492 284033 348416 380710 463275 519618 593165 670616 684843 621215
19666F21215m5589m6263L6576r774m7858j0985R2320j3589r568o5135k8529o442
$$ 621215 575626 529363 565939 556165 508307 497322 589642 576053 566485 501350 472821 466379
19654D66379o070l5173P371k3334J1698K9646J36087R9176P7025p184K7760m3834
$$ 466379 460309 425136 432507 409173 420871 450517 586604 685780 762805 755621 783381 739547
19642G39547L4611o7744J7710M9475Q8886o0312n5481j06639O7938O460J46572
$$ 739547 774158 706414 724124 773599 862485 802173 746692 640053 707991 714451 861023
19631H61023R1414Q5165m6375k0862q0365O5593O9987K22414P268P0204j03976
$$ 861023 952437 1037602 991227 970365 890000 955593 1025580 1247994 1255262 1325466 1221490
19620A221490L8627o869J63420Q4803J73979j6458J25790L3358K26288J6921J73074
$$ 1221490 1260117 1253248 1416668 1501471 1675450 1658992 1784782 1818140 2044428 2061349 2234423
19609B234423N5847J62582k3378J89893K7440K27603P6926M26697K07964M82953
$$ 2234423 2290270 2452852 2429474 2619367 2646807 2874410 2951336 3378033 3585997 4068950
19599D068950L93970O88153M90096R82778Q05125J296739J140208J871742K022026
$$ 4068950 4462920 5151073 5641169 6623947 7429072 8725811 9866019 11737761 13759787
19590A3759787K950212L152448M469784M796737O692010P959930J1562454J5051451
$$ 13759787 16709999 19862447 24332231 29128968 35820978 43780908 55343362 70394813
19582G0394813K2573831L2055214N2500228Q0876516Q9481019j8976904j02623331
$$ 70394813 92968644 125023858 177524086 258400602 347881621 328904717 226281386
19575B26281386p3695034m6597193k8073596j9306379j2319767r612289o369479
$$ 226281386 152586352 105989159 77915563 58609184 46289417 36677128 30307649
19568C0307649n615459l819540l639732k448004k387309j489851j614786r56397
$$ 30307649 24692190 20872650 17232918 14784914 12397605 10907754 9292968 8336571
19560H336571j153925o23595q72810n02206p01929k60654n07402k23978m23500
$$ 8336571 7182646 6559051 5686241 5184035 4482106 4221452 3714050 3490072 3066572
19551C066572q4011l84714j05155k69400k0305l39140j67373k61920q9j45892
$$ 3066572 2982561 2597847 2492692 2223292 2202987 1863847 1696474 1434554 1434465 1288573
19541A288573O115k47279j6389j16822J03322o5054L7600q2827n6892j64073R6533
$$ 1288573 1294688 1047409 1031020 914198 1017520 952466 990066 907239 850347 686274 782807
19530G82807j27620p6910j90357J068o5664M4428p2155J6647j35403m1351q7475
$$ 782807 655187 578277 387920 388988 323324 367752 295597 312244 176841 135490 48015
19519D8015J24133K3741J3137l0602J13847r250P1853J70j9760j07258Q7271J08335
$$ 48015 172148 195889 209026 178424 292271 283021 354874 355044 335284 228026 315297 423632
19507D23632P8194j24088k8073n9285O5223K4588m594j60881k0602Q478J28935
$$ 423632 501826 377738 349665 290380 355603 380191 375597 214716 194114 202592 331527
19496C31527J8033l7810p6481j0693n0456J22304P6569J4978o9817m5790q437
$$ 331527 349560 311750 235269 224576 174120 296424 372993 387971 318154 272364 263927
19485B63927M6735j9070M6139M2018K1688j13364m3477j3442j6456j8839P688
$$ 263927 310662 291592 337731 379749 401437 288073 244596 231154 214698 195859 203547
19474B03547n2843P558J9104L8362m3288k4415q216Q4286R5784L8617l1773J3756
$$ 203547 150704 158262 177366 215728 172440 148025 139809 224095 319879 358496 326723 340479
19462C40479p6593n8002j67269l3417K0261k1039l8262o6742r8233K8712R5927
$$ 340479 263886 205884 38615 5198 25459 4420 -33842 -100584 -198817 -170105 -74178
19451g4178O9231N0563J05949N1272J125L8176M5107p2344o4789l3300O9941P9414
$$ -74178 -4947 45616 151565 202837 203962 242138 287245 214901 150112 116812 186753 266167
19439B66167J4403P8786J03521K1039n0472q8660o6534M6111j2425r1173m3237
$$ 266167 280570 359356 462877 483916 433444 344784 278250 324361 311936 220763 177526
19428A77526m9635j1193l7713j9296Q7503M9901K40l5219j2096m3083k7928Q213
$$ 177526 127891 116698 78985 59689 147192 197093 197333 162114 150018 106935 79007 87220
19416H7220R006K2177K2464r675J8761L3333L7233K4083q891j9193P1941L192
$$ 87220 96226 118403 140867 131192 149953 183286 220519 244602 235711 216518 288459 291651
19404B91651q6266L3441L8215m8108k9425o099L0912N563k9856n2690n74m0541
$$ 291651 205385 238826 277041 228933 199508 193409 224321 229884 200028 147338 146764 106223
19392A06223k6077R5656K7025m189O553L0206P5281l9536m5474l0896n0368r6985
$$ 106223 80146 175802 202827 198638 205191 235397 310678 271142 225668 194772 144404 47419
19380D7419q366P3554M8311l6561j6951r832M0488l692n4132o2J9055q5023l4223
$$ 47419 39053 112607 160918 124357 107406 97574 138062 134370 80238 80176 99231 14208 -20015
19367b0015J0166P4787J6821J6495R063M5250k8173m0159l1410j1713n773L7861
$$ -20015 -9849 64938 81759 98254 107317 152567 124394 84235 52825 41112 35339 73200
19355G3200o4293n2328M1251L0387k6623R1413P504n3837p6284L6580j2875O126
$$ 73200 8907 -43421 -2170 28217 1594 93007 100511 46674 -29610 6970 -5905 221
19343B21j8944p227o9157J3933J08879J4552j10159k1014K6075J7696J0285M5568
$$ 221 -18723 -25950 -95107 -81174 27705 42257 -67902 -88916 -62841 -45145 -34860 10708
19331A0708k006J2802l5869O6655J23923J29149Q1070L2660l2467m2605j45256
$$ 10708 8702 21504 -14365 52290 176213 305362 386432 419092 386625 344020 198764
19320A98764j07614r3783k8929n259J3769O267N1025N6297J06984M5997o4474
$$ 198764 91150 -2633 -31562 -36821 -23052 -16785 34240 90537 197521 243518 179044
19309A79044q5023j0780k4790k9295q4479j370j6584R5153K8862n8740l6394P9771
$$ 179044 94021 83241 58451 29156 -55323 -56693 -73277 21876 50738 -8002 -44396 35375
19297C5375J673J5850o9927m019N2117L5043q3846l410P819j890n6907l3132m5952
$$ 35375 37048 52898 -17029 -21048 31069 66112 -17734 -21144 -13325 -15215 -72122 -105254 -151206
19284a51206j4371K8208K1475l6110Q6674Q9146p560O794O907p9941j8132O2278
$$ -151206 -165577 -137369 -115894 -152004 -65330 23816 16256 23050 29957 -49984 -68116 -5838
19272e838Q9126p765k6248p7880l1691M4583O8231k7008J0505l873P7425P7758
$$ -5838 83288 75523 49275 -28605 -60296 -15713 52518 25510 36015 32142 109567 187325
19260A87325J0378l4039l649p654k4837o3744n2668k3577J1904J3111k7964K5006
$$ 187325 197703 163664 160015 152361 127524 63780 11112 -12465 -561 12550 -15414 9592
19248I592P9486n1521n4861p3935n5469k1321N8851n4390j5028N5920Q1616Q8674
$$ 9592 89078 37557 -17304 -91239 -146708 -168029 -109178 -163568 -178596 -122676 -41060 47614
19236D7614L1378L1934j0588j6596P4383N283K3427m7873n0150q2912k1180L8815
$$ 47614 78992 110926 100338 83742 158125 163408 186835 138962 88812 5900 -15280 23535
19224B3535J23138O0731l7893r5874j09232n8847l3588n4226J7539J6258M7493
$$ 23535 146673 207404 169511 73637 -35595 -94442 -128030 -182256 -164717 -148459 -100966
19213a00966j6912p2403j1632O8827J29423J23330Q724q175o1381q4798j9429
$$ -100966 -117878 -190281 -201913 -133086 -3663 119667 128391 120216 58835 -25963 -45392
19202d5392p6045q6563J4982M6298n5589k907N7310J0430k6485p769R1113O6342
$$ -45392 -121437 -208000 -193018 -146720 -202309 -205216 -147906 -137476 -163961 -171730 -80617 -14275
19190a4275k627o2758k5494N1198O3541K0634O5677L0294M7608K1778o3091q5495
$$ -14275 -16902 -79660 -105154 -53956 9585 30219 95896 126190 173798 195576 132485 46990
19178D6990p0659q0360J16543J77699J4850P566m617q5086r8943o1134j8143K4445
$$ 46990 -23669 -104029 12514 190213 205063 212629 208012 122926 23983 -37151 -55294 -30849
19166c0849M8630r139J9596J7649M1423L3140l7897m2051j04195o2999L1213O2960
$$ -30849 17781 8642 28238 45887 87310 120450 82553 40502 -63693 -126692 -95479 -32519
19154c2519k8427m8127O5001P2842j9705o2061k5708L0445p970Q099R1247P4903
$$ -32519 -60946 -109073 -44072 28770 9065 -52996 -78704 -48259 -56229 -48130 43117 118020
19142A18020J8185k921n2256r0995r143R3155N9158m397m1489p3089m5188M5868
$$ 118020 136205 133284 81028 -9967 -19110 74045 133203 128806 87317 14228 -30960 14908
19130A4908J2609m5433j6979o3346j44099k3492J7597K7131Q3174M1436k0347
$$ 14908 27517 -17916 -34895 -98241 -242340 -265832 -248235 -221104 -137930 -96494 -116841
19119a16841J18958J03289j3424p7773r185n7904n5669k4005K7068k871j638j5708
$$ -116841 2117 105406 91982 14209 5024 -52880 -108549 -132554 -105486 -108357 -109995 -125703
19107a25703j5736j5303N1729Q6932L1676K075j7241n6527m9066k1920M0202O1764
$$ -125703 -141439 -156742 -105013 -18081 13595 15670 -1571 -58098 -107164 -129084 -88882 -27118
19095b7118k5485m7465k4517n661N9414N9345J4783k344M7096N022O7609J28008
$$ -27118 -52603 -100068 -124585 -130246 -70832 -11487 3296 952 48048 53070 120679 248687
19083B48687K9416o5023n8445l9352o6340m3645k6129l5820m94j3412p0175j36437
$$ 248687 278103 213080 154635 115283 48943 5298 -20831 -56651 -57145 -70557 -140732 -277169
19071b77169m2636P0282J46906Q0945j2998q3533q8407r2762j5833J7076Q7434
$$ -277169 -319805 -249523 -102617 -21672 -34670 -118203 -206610 -299372 -315205 -298129 -210695
19060b10695J16738K4452m0222n708L8937k691J3333n1171j51202m0036L1492
$$ -210695 -93957 -69505 -109727 -115435 -76498 -79189 -65856 -117027 -268229 -308265 -276773
19049b76773L9282L4370P4688J0278Q0823R5030K521M1225N1277m9912j10086
$$ -276773 -237491 -203121 -128433 -118155 -37332 57698 60219 101444 152721 102809 -7277
19038g277m0932P3959N7013K8295j501j3483M605J0071k7624j6130o3585q5059
$$ -7277 -48209 25750 82763 111058 109557 96074 100679 110750 83126 66996 3411 -81648
19026h1648k0506J8151j1212N2780q906l2854j4708P79j7297K7570K6606L7960
$$ -81648 -102154 -84003 -95215 -42435 -51341 -84195 -98903 -98124 -115421 -87851 -61245 -23285
19014b3285R212N6449o594p288j9620p9180k7071J04556J46026J7249q7832j07661
$$ -23285 -14073 42376 35782 28494 8874 -70306 -97377 7179 153205 170454 82622 -25039
19002b5039j25160K217K3845J26661Q6816J0495M77J0134R208L781r7934o6061
$$ -25039 -150199 -147982 -124137 2524 89340 99835 100312 110446 119654 123435 25501 -40560
18990d0560p705K3717L7731J2248l1452K8671p2321j6125J35114j1382j41804
$$ -40560 -48265 -24548 13183 25431 -6021 22650 -49671 -65796 69318 57936 -83868
18979h3868o510N5654N8851M5240l2158j4915M2060k4665P454K9759l3837r0267
$$ -83868 -90378 -34724 24127 69367 37209 22294 64354 39689 47143 76902 43065 -47202
18967d7202k3155k8295k1071R301j7060p9840j6516j2132j4131r808M3568M7928
$$ -47202 -70357 -98652 -119723 -110422 -127482 -207322 -223838 -235970 -250101 -259909 -216341 -168413
18955a68413L4557J139O7750N5271M9298K9140K764j1984M417N113j00502j08911
$$ -168413 -133856 -132717 -64967 -9696 39602 68742 71506 59522 63939 69052 -31450 -140361
18943a40361n0419j6798j7808J0364P2050N0809P4455O8388P5849K9236m106n0377
$$ -140361 -190780 -207578 -225386 -215022 -142972 -92163 -17708 50680 126529 155765 151659 101282
18931A01282M177q633j21961q1687J4389L790O8038M4623k1968J649n0754n7683
$$ 101282 105459 96826 -25135 -106822 -92433 -88643 -20605 24018 2050 3699 -47055 -104738
18919a04738M317N6524L7284K9471j3179l0170J4473L53O9481J6754j15639j14160
$$ -104738 -100421 -43897 -6613 22858 9679 -20491 -6018 -5665 63816 80570 -35069 -149229
18907a49229n87R2487L1682j776J197o0843l5446M4949L2096j5432N2641J9038
$$ -149229 -149816 -57329 -25647 -27423 -26226 -87069 -122515 -77566 -45470 -60902 -8261 10777
18895A0777p2565k2129j2422p100N0828N8546m3686l2750j4827K7143K6102J6044
$$ 10777 -61788 -83917 -96339 -103439 -52611 5935 -37751 -70501 -85328 -58185 -32083 -16039
18883a6039Q2026O3129j4546k6044N2849J1176l276M4887J3984j01990j22872
$$ -16039 65987 129116 114570 88526 141375 152551 149275 194162 208146 106156 -16716
18872a6716q4520K6469M7696J4897q0106j25663j6763L4997M867Q148o798L5261
$$ -16716 -101236 -74767 -27071 -12174 -92280 -217943 -234706 -199709 -194842 -186694 -193492 -158231
18860a58231P1446k7569N317J4153k0817n7880m7428j8936l3314n4214J7046N2232
$$ -158231 -86785 -114354 -109037 -94884 -115701 -173581 -221009 -239945 -273259 -327473 -310427 -258195
18848b58195L2488l2775Q939J23570N1466o9158r4119o0967l290M6288P1225O9374
$$ -258195 -225707 -258482 -249543 -125973 -74507 -143665 -237784 -298751 -302041 -255753 -184528 -115154
18836a15154p027m4929N2176J14271Q2750J5924P6899M1845r0582j09735j4628
$$ -115154 -122181 -167110 -114934 -663 82087 98011 174910 216755 126173 16438 1810
18825A810O3829O4456m1376j6416J3247K0845j9582l6587J7786R3484N9093p458
$$ 1810 65639 130095 88719 72303 85550 106395 86813 50226 68012 161496 220589 213131
18813B13131n2740o730l42l7710j40516q4711o6375n2J9494M6000P2830J03067
$$ 213131 160391 153661 153319 115609 -24907 -109618 -175993 -176045 -156551 -110551 -37721 65346
18801F5346N0727j9719n1813j5076j8351n1789K2816O2083n1539p0943K0586M2586
$$ 65346 116073 96354 44541 29465 11114 -40675 -17859 44224 -7315 -78258 -57672 -15086
18789a5086l5821j6488M6309O3464M9121M3436k0718m8703p5977m4603k1777J1306
$$ -15086 -50907 -67395 -21086 42378 91499 134935 114217 65514 -10463 -55066 -76843 -65537
18777f5537j2282J8725m2181L362M5775K322p0066o484R0586Q7933M7005M7513
$$ -65537 -77819 -59094 -101275 -97913 -52138 -49816 -119882 -126366 -35780 52153 99158 146671
18765A46671J0648J8021m6956j28209j03114j9217N4330P8922m3410l3390P094
$$ 146671 157319 175340 128384 175 -102939 -122156 -67826 11096 -32314 -65704 -58610
18754e8610Q2559M6228p1130j41704q3555M3483J28841Q485n9633M4454R3813
$$ -58610 23949 70177 -953 -142657 -226212 -182729 -53888 -45403 -105036 -60582 33231
18743C3231N4598l802n1283k0547O008J5667P989O4005O7384l7095q6386m5944
$$ 33231 87829 84027 32744 12197 18205 33872 41861 105866 173250 136155 49769 3825
18731C825n9649K7991K2400K685L7610K5263j5807q813L9816j519J991O1915n6882
$$ 3825 -55824 -27833 -5433 -2748 34862 60125 44318 35505 75321 73802 75793 137708 80826
18718H0826j10572l1503m2813l63O3359o000J5243P9892P5368P129k641k6045
$$ 80826 -29746 -61249 -104062 -104425 -41066 -47066 -31823 48069 123437 130566 127925 101880
18706A01880k4257p6818q4272l5696m1719l4161k6660L0529L4044J8570Q5130
$$ 101880 77623 805 -83467 -119163 -160882 -195043 -221703 -191174 -157130 -138560 -53430
18695e3430J13193J30870M8699j4952l7941n5861n7676l9776Q057R01m2455n456
$$ -53430 59763 190633 239332 224380 186439 130578 72902 33126 41183 42084 -371 -5827
18683e827j9742J1972Q0719j3355n4051J9708j8554m9506k2982J0409K0769L9507
$$ -5827 -25569 -13597 67122 53767 -284 19424 870 -48636 -71618 -61209 -40440 -933
18671i33J32972O6251j750k1149j2904o6078n9309K8058M0129k8340J6206L0292
$$ -933 132039 198290 196540 175391 162487 96409 37100 65158 105287 76947 93153 123445
18659A23445J1022J9338l1662j00088n5884O2123P9678L5064J3135O8725P1530
$$ 123445 134467 153805 122143 22055 -33829 28294 107972 143036 156171 224896 296426
18648B96426K5232J8252q9262j63669j00368L4969O0568O0164Q9703j0702n0930
$$ 296426 321658 339910 250648 86979 -13389 21580 82148 142312 232015 221313 170383
18637A70383K9936N0209n9687j50911p1763n4483p4335l7838k3683L5421Q1910
$$ 170383 200319 250528 190841 39930 -31833 -86316 -160651 -198489 -222172 -186751 -104841
18626a04841M3090l499k0468l1983K7857J8906k4924m0269N1758O6482J5066k9304
$$ -104841 -61751 -65250 -85718 -117701 -89844 -70938 -95862 -136131 -84373 -17891 -2825 -32129
18614c2129l5859K0376L1069N0976M0307l8285l0848N7105p088p6622m434q29
$$ -32129 -67988 -47612 -16543 34433 74740 36455 5607 62712 55624 -20998 -25432 -26261
18602b6261K0744j5169m7467m1041n358k8885n2678k4792M869M380K5553L9150
$$ -26261 -5517 -20686 -68153 -109194 -114552 -143437 -196115 -220907 -216038 -211658 -186105 -146955
18590a46955J03755Q2015K3119L3558o4477k8237L0028N4315l2149n2318M0293
$$ -146955 -43200 38815 61934 95492 31015 2778 32806 87121 54972 2654 42947
18579D2947j8509o1500j1558M8336L9080k7142l4957J629K4650N9623N6314J3270
$$ 42947 24438 -37062 -48620 -284 38796 11654 -23303 -21674 2976 62599 118913 132183
18567A32183j127K3676K898l6513j7686Q280N7509L0229l4699q5961o6090j4630
$$ 132183 131056 154732 157630 121117 103431 111711 169220 199449 164750 78789 12699 -1931
18555a931K068M9065K2167k079p485k7037M0558P5206L3390o4823p0703l5903
$$ -1931 137 49202 71369 69290 61805 34768 75326 150532 183922 119099 48396 12493
18543A2493l8447K0786N4096J8067k1016m520K0449l2822k9748J4302M4488l3356
$$ 12493 -25954 -5168 48928 66995 45979 41459 61908 29086 -662 13640 58128 24772
18531B4772j4792O993L4650Q0475J7032Q909j2282m1369l8015q8934l1132M5990
$$ 24772 9980 16973 51623 132098 149130 158039 145757 104388 66373 -22561 -53693 -7703
18519g703M1794j6937J6015q739p8451l6687p60n4068o9719r2627K1298R5398
$$ -7703 34091 17154 33169 24430 -54021 -90708 -91468 -145536 -215255 -307882 -286584 -191186
18507a91186J00646K3230m7713o5624m5330O4090O6710K9780J4700O871k6978
$$ -191186 -90540 -67310 -115023 -180647 -225977 -161887 -95177 -65397 -50697 -43826 -70804
18496g0804O559Q2128N8180p086J68R43j2402k3922m5375j0038K1731M3736k6860
$$ -70804 -64245 17883 76063 68977 69145 70088 57686 33764 -11611 -21649 82 43818 16958
18483A6958r338j3629k6349Q4345R2958J0186Q0483J01408L2492j11424k9743
$$ 16958 7620 -6009 -32358 51987 144945 155131 235614 337022 369514 258090 228347
18472B28347M279k9524n0533p2617j10123L956L5210K2589j3480k3509Q7800K8874
$$ 228347 232626 203102 152569 79952 -30171 -26215 8995 31584 18104 -5405 82395 111269
18460A11269q9996p0414q0014n705l4857l8257M5898O4104k446K0875Q1635M8353
$$ 111269 21273 -49141 -129155 -134860 -169717 -207974 -162076 -97972 -100418 -79543 2092 50445
18448E0445l7615J6611o566n2287j6081O9148P6074M4386k365J0111K0703J305
$$ 50445 12830 29441 22875 -29412 -45493 23655 99729 144115 141750 151861 172564 173869
18436A73869k6652m7662j05635j6343O7203L2448K9853J17247N0238N287J417
$$ 173869 147217 99555 -6080 -22423 44780 77228 107081 224328 274566 279853 281270
18425B81270L1324K4086o1781l9985k3455j3120K2041L2547m41k4235r9622o2040
$$ 281270 312594 336680 274899 234914 211459 198339 220380 252927 252486 228251 128629 66589
18413F6589P358j5862j0456K2414J4025n9319k032L4911R308k0489l2469j8667
$$ 66589 73947 58085 47629 70043 84068 24749 22717 57628 66936 46447 13978 -4689
18401d689K2383L2184L7012n4863k4854J03520N4432l5774n8771J2313j2878L3380
$$ -4689 17694 49878 86890 32027 7173 110693 165125 129351 70580 82893 70015 103395
18389A03395N5062J3299M6443l6125r0284k1054j9022p8867l5228k3836l087O533
$$ 103395 158457 171756 218199 182074 91790 70736 51714 -27153 -62381 -86217 -89304 -82771
18377h2771N0630Q4859m0538o5819q7197p4560R4168Q9613L5504k8722l4651K4564
$$ -82771 -32141 52718 12180 -53639 -140836 -215396 -121228 -31615 3889 -24833 -59484 -34920
18365c4920k2173m9883R787J05076J06869J2333o5457o8869l2688o102m7577j5540
$$ -34920 -57093 -106976 -97189 7887 114756 127089 61632 -7237 -39925 -46027 -93604 -109144
18353a09144K6869M1514N2696m4715m4574O3017O2800k0284p9674o3143j2858
$$ -109144 -82275 -40761 11935 -32780 -77354 -14337 48463 28179 -51495 -114638 -127496
18342a27496N1949M5511l9375L2457M9831P4409M5909j0238k8128n1604l0423
$$ -127496 -75547 -30036 -69411 -36954 12877 87286 133195 122957 94829 43225 12802
18331A2802l0686l9253k5962k0998n0224n439o09L2169O533L213N1912L8291j5077
$$ 12802 -17884 -57137 -83099 -104097 -154321 -159760 -160369 -128200 -121667 -118454 -66542 -28251 -43328
18318d3328j1520N4846O6198n512l5363l6875k4640J9701m589p4612l0567N0254
$$ -43328 -54848 -2 66196 60684 25321 -11554 -36194 -16493 -21082 -95694 -126261 -76007
18306g6007n4791j37623J3078N3258J24422Q3616J0005l868K4982Q4828j021p1467
$$ -76007 -130798 -268421 -255343 -202085 -77663 5953 15958 12090 37072 121900 120879 49412
18294D9412l9331p555j09236j40695n7903L9259P8472O0898M078O4184O0377K4827
$$ 49412 10081 2526 -106710 -247405 -305308 -266049 -187577 -126679 -122601 -58417 1960 26787
18282B6787o316M2896L1927j00222l0196k7373j6706j0289J11228Q6598M7529
$$ 26787 20471 63367 95294 -4928 -35124 -62497 -79203 -89492 21736 108334 155863
18271A55863M2228k0132r4678p0536k8232n2278K927Q2189M6167M6443l3050L190
$$ 155863 198091 177959 83281 12745 -15487 -67765 -64838 17351 63518 109961 76911 80101
18259H0101K7024J2858Q847q313o8651r9531p3929l9225L6029k147k1516N1138
$$ 80101 107125 119983 128830 120517 51866 -47665 -121594 -160819 -124790 -126937 -148453 -97315
18247i7315K1566k4941j0801N9503M6382n769k1313n0920m3411L8830N9694R7480
$$ -97315 -75749 -100690 -111491 -51988 -5606 -11375 -32688 -83608 -127019 -88189 -28495 68985
18235F8985J7691J7456M7531r448n2903p5886n1053J0282J5862j7176p3256o4156
$$ 68985 86676 104132 151663 142215 89312 13426 -37627 -27345 -11483 -28659 -101915 -166071
18223a66071l7370j9157K7982J25043Q3310N3149M824k3231L377N5774R1547n9008
$$ -166071 -203441 -222598 -194616 -69573 13737 66886 71710 48479 51856 107630 199177 140169
18211A40169j33599q4317k7133m6073l4608j3014J3891J3297M4333J6845L6570
$$ 140169 6570 -77747 -104880 -150953 -185561 -198575 -184684 -171387 -127054 -110209 -73639
18200g3639M0043m012K3074p2001o193Q5222M8422j555k6627o2298m7905m4922
$$ -73639 -33596 -37608 -14534 -86535 -92728 -7506 40916 39361 12734 -49564 -97469 -142391
18188a42391l5649J0292N0994N1485j1389l1879J893O6625J05660K0434m6343
$$ -142391 -178040 -167748 -116754 -65269 -76658 -108537 -106644 -40019 65641 86075 39732
18177C9732r8521l5333N2709L3871K7483R438l0452j1649m1851q1092o7289N8560
$$ 39732 -58789 -94122 -41413 -7542 19941 29379 -1073 -12722 -54573 -135665 -202954 -144394
18165a44394P7487k0453p1620n437N9513N8271J3845j5535r497N2037k148o3311
$$ -144394 -66907 -87360 -158980 -164417 -104904 -46633 -32788 -48323 -57820 -5783 -7931 -71242
18153g1242k8766K6099O9009j3113l6443K9185J06009R0661J4195M7418K2054
$$ -71242 -100008 -73909 -4900 -18013 -54456 -25271 80738 171399 185594 233012 255066
18142B55066K7508p809j1896J2969q0169j29507q3977l7166J6641M1085L9078
$$ 255066 282574 274765 262869 275838 195669 66162 -17815 -54981 -38340 2745 41823
18131D1823J9884J0344m3824j07280m5183M3666R0898M3786J8629m2905l6229
$$ 41823 61707 72051 28227 -79053 -124236 -80570 10328 54114 72743 29838 -6391
18120f391R011l3291l9325K78K7143o0772J9030M0295l282K0763j7539k4975K7532
$$ -6391 2620 -30671 -69996 -69718 -42575 -103347 -84317 -44022 -47304 -26541 -44080 -69055 -41523
18107d1523J1231M5143j4467o9793N7158Q8693J2961K6446q6021j47385n2247
$$ -41523 -30292 14851 384 -69409 -12251 76442 89403 115849 29828 -117557 -169804
18096a69804N7979P5911K7639P1458j7695q7136m7474r5203r2873K8659Q1714
$$ -169804 -111825 -35914 -8275 63183 45488 -41648 -89122 -184325 -277198 -248539 -166825
18085a66825L3752P4414L7483L4125R645k8232j7171J8897j0787p5584O1962Q0035
$$ -166825 -133073 -58659 -21176 12949 22594 -5638 -22809 -3912 -14699 -90283 -28321 51714
18073E1714Q6595R8137m4440o7550j00717j68245l6193Q2641P2367k0121J4864
$$ 51714 138309 236446 192006 124456 23739 -144506 -180699 -98058 -25691 -45812 -30948
18062c0948O462j879n6276j4780O9320P1121O931j12157o8685l7483j1110J2774
$$ -30948 -24486 -26365 -82641 -97421 -28101 43020 49951 -62206 -130891 -168374 -179484 -166710
18050a66710k2211j825M4031N2987Q6980p087k7822K8067Q6443N3582J7351J8406
$$ -166710 -188921 -190746 -146715 -93728 -6748 -13835 -41657 -13590 72853 126435 143786 162192
18038A62192j1299J08774M1231j6148R3606j1917j64798j60231j00627j1427M3453
$$ 162192 150893 259667 300898 284750 378356 366439 201641 41410 -59217 -70644 -27191
18027b7191K5568P954Q2914M7227N6476M1019o0353r2586p0556m9816n3450l7734
$$ -27191 -1623 6331 89245 136472 192948 233967 173614 81028 10472 -39344 -92794 -130528
18015a30528P2674O710q5879J4550R1014K1060o1561n7723n282N4660K2126N5522
$$ -130528 -57854 -51144 -137023 -122473 -31459 -10399 -71960 -129683 -134965 -80305 -58179 -2657
18003b657J17409k5437k1680j021j6628j16964j42631l5807O8495N7305K3919
$$ -2657 114752 89315 67635 66614 49986 -66978 -209609 -245416 -176921 -119616 -95697
17992i5697N7031P9765N9733M8317K4812r0738j08638R884K9475M4056J66426
$$ -95697 -38666 41099 100832 149149 173961 83223 -25415 -15531 13944 58000 224426
17981B24426R5464m4294m9690m7213p0643m5258q194m1064r4992j3561K7995M7039
$$ 224426 319890 275596 225906 178693 108050 62792 54598 13534 -81458 -95019 -67024 -19985
17969a9985M7491j7300o3460k2698L5760J9715J11332Q5899n6146r5363l1688
$$ -19985 27506 10206 -53254 -75952 -40192 -20477 90855 176754 120608 25245 -6443
17958f443M1349P1924k6785m8371J756K8114l5738j9392O0809J26563q368j50501
$$ -6443 34906 106830 80045 31674 33430 61544 25806 6414 67223 193786 185418 34917
17946C4917r2174K2911R7432K9372j00078q7717m0692k8469j4429J7397J7221
$$ 34917 -57257 -34346 63086 92458 -7620 -95337 -136029 -164498 -178927 -161530 -144309
17935a44309K4152K7493K8635l4692k8135R4922Q3999L0108m9166o6276j7901
$$ -144309 -120157 -92664 -64029 -98721 -126856 -31934 52065 82173 33007 -33269 -51170
17924e1170K2534N6083J8474M9429J09941l431m4374N256N2433O1348q4950p2319
$$ -51170 -28636 27447 45921 95350 205291 201860 157486 162742 215175 276523 191573 119254
17912A19254o0452k3870K9997N1295j7761M4531J10319M5382p051n2032j4918
$$ 119254 58802 34932 64929 116224 98463 142994 253313 298695 291644 239612 224694
17901B24694k1245o8113m6094k4994J5570m0501q1788o8997Q29M0498O4145L8443
$$ 224694 203449 135336 89242 64248 79818 39317 -42471 -111468 -110639 -70141 -5996 32447
17889C2447j6697n7629o6536o367R3534P7583l563L43K0527k7455j1785l5239
$$ 32447 15750 -41879 -108415 -114782 -21248 56335 52772 53115 73642 46187 34402 -837
17877h37j9607M6354r302k0027P6687P2968O5262n169p5473r7348j10261l8776
$$ -837 -20444 25910 16608 -3419 73268 146236 211498 206329 130856 33508 -76753 -115529
17865a15529J4766m4272n724L8977k0263J4976j0379P950N9500J772l381L5435
$$ -115529 -100763 -145035 -150759 -111782 -132045 -117069 -127448 -119498 -59998 -58226 -61607 -26172
17853b6172k2920o1073K7969j3721k3607J13491R3631n6124K0845Q5708o0602
$$ -26172 -49092 -110165 -82196 -95917 -119524 -6033 87598 31474 52319 138027 77425
17842G7425r4636p3004l9484l7182l847M9375K1868P6529J03658p668m2748j3342
$$ 77425 -17211 -90215 -129699 -166881 -170728 -121353 -99485 -22956 80702 73034 30286 16944
17830A6944p875K9087N6398k138M234L4231L9917r082r5350l5014l785M2487k050
$$ 16944 9069 38156 94554 92416 96650 130881 170798 161716 66366 31352 27567 70054 68004
17817F8004r2732J8657O0627m4180o8505l3184j7453m5015q310L0787J2658k4422
$$ 68004 -24728 -6071 54556 10376 -58129 -91313 -108766 -153781 -162091 -131304 -118646 -143068
17805a43068k7132j7782m2756q972m1091J6450N4351M5822J07339M1917m9334
$$ -143068 -170200 -187982 -230738 -239710 -280801 -264351 -210000 -164178 -56839 -14922 -64256
17794f4256o546n2695l7901R1406P6634O6253J210l9740j8501J6277K6200j4614
$$ -64256 -70802 -123497 -161398 -69992 6642 72895 74105 34365 15864 32141 58341 43727
17782D3727k793L0685K1681M1300M6119l2315j11747q4437K7498M3181k3046j0996
$$ 43727 40934 71619 93300 134600 180719 148404 36657 -47780 -20282 22899 -147 -11143
17770a1143L7353J5608R814k8639r327J2211l5127m3263j4904L4278m443K4172
$$ -11143 26210 41818 51632 22993 13666 25877 -9250 -52513 -67417 -33139 -37582 -13410
17758a3410Q4228L1619k8449m3046k9585J9539O0105k7711l0347j423j9442o0770
$$ -13410 70818 102437 73988 30942 1357 20896 81001 53290 22943 21520 2078 -58692
17746e8692o7009p7786j6916J3712K4396j6235j1316K1310R8128J26689N7495
$$ -58692 -125701 -203487 -220403 -206691 -182295 -198530 -209846 -188536 -90408 36281 93776
17735I3776r485n5774j4357N2060M9101Q694Q549N2617N583j01476j40384j47271
$$ 93776 84291 28517 14160 66220 115321 124015 132564 185181 190764 89288 -51096 -198367
17723a98367j26382K9637R4984L7080J9262N0701N6113L6048r6783q0763J903
$$ -198367 -324749 -295112 -200128 -163048 -143786 -93085 -36972 -924 -97707 -178470 -176567
17712a76567r978l5740M0999N1996p84L5083N5690k1093m2181l9536m3376N9147
$$ -176567 -186545 -222285 -181286 -129290 -130074 -94991 -39301 -60394 -102575 -142111 -185487 -126340
17700a26340J02395R6768n6668j17801k6866k839N4123j2230K2103J1269k8831
$$ -126340 -23945 72823 16155 -101646 -128512 -131351 -77228 -89458 -67355 -56086 -84917
17689h4917O506n4725P710M6972L9634r58Q449K019K7071L4520l2881o2151q7708
$$ -84917 -78411 -133136 -125426 -78454 -38820 -39778 -31329 -29310 -2239 32281 -600 -62751 -150459
17676a50459l5909J0573R0104O6085K64Q104k099k6295l0781Q412J380l106q085
$$ -150459 -186368 -175795 -85691 -19606 -19342 -11238 -13337 -39632 -70413 -62001 -60621 -63727 -71812
17663g1812J7258O851l250j2800m6228L6020K9439O5554O5717J2088L4935k9547
$$ -71812 -54554 -47703 -50953 -63753 -109981 -73961 -44522 21032 86749 98837 133772 104225
17651A04225m4903k6157p6368p1310l4200K8770M782m4505L8962Q0355M133J2743
$$ 104225 59322 33165 -43203 -114513 -148713 -119943 -115161 -159666 -120704 -40349 -36216 -23473
17639b3473L2501m84l403J18655J28379J5493k9924q9293j05607o4440K6011N2876
$$ -23473 9028 8544 5141 123796 252175 267668 237744 148451 42844 -21596 4415 57291
17627E7291j9167K6263M4041k5343r6513o2845j094l8943k9579O728M9932n665
$$ 57291 38124 64387 108428 83085 -13428 -76273 -77367 -116310 -145889 -139161 -89229 -94894
17615i4894m3825J5250Q4195Q2455J2542m1628k9998l3429m1105J0670J8824J2552
$$ -94894 -138719 -123469 -39274 43181 55723 14095 -15903 -49332 -90437 -79767 -60943 -48391
17603d8391M0658J31495P5209p406k6842q6896j13403R22o564M5048M5810l0076
$$ -48391 -7733 123762 198971 191565 164723 77827 -35576 -34654 -41218 3830 49640 19564
17591A9564L0986R2088K4913L6605O8101K4601m9545n1117k4185J6011j2845l6548
$$ 19564 50550 142638 167551 204156 272257 296858 247313 196196 172011 188022 175177 138629
17579A38629N0809K7239p8959n4887k3058l069J9757O7329P7916N197j9624n6248
$$ 138629 189438 216677 137718 82831 59773 56704 76461 143790 221706 226903 207279 151031
17567A51031q7358k8893o5149j04909n4723M1657L0879K0274N2055N3407k6500
$$ 151031 63673 34780 -30369 -135278 -190001 -148344 -117465 -97191 -45136 8271 -18229
17556a8229L286L8900j7801N054L3471k7312j1760L0611j8001n696l6540Q573
$$ -18229 -14943 23957 6156 11210 44681 17369 5609 36220 18219 12523 -24017 -15444
17544a5444J22284M3826q0227r5467k7084n2868p8273K7203R6922P625k4383J09401
$$ -15444 106840 150666 70439 -25028 -52112 -104980 -183253 -156050 -59128 -51503 -75886 33515
17532C3515J2272p6132j3401K4675M8517K199L5341N2458o180n7019j4426kp3848
$$ 33515 45787 -30345 -43746 -19071 29446 31645 66986 119444 113264 56245 41819 41817 -32031
17519c2031K439K7527J8849l9921j07481l365K7150R6931J24517N7929j3313j15513
$$ -32031 -29592 -2065 16784 -23137 -130618 -133983 -106833 -9902 114615 172544 159231 43718
17507D3718j28011L2546R2896l6808L191N6238L783q1758k1155J1165Q741N0709
$$ 43718 -84293 -51747 41149 4341 7532 63770 67553 -14205 -35360 -24195 -15454 35255
17495C5255k0239m9293K4214j5582r1196o8667o228O7095M0717M5859M5922l6373
$$ 35255 15016 -34277 -10063 -25645 -116841 -185508 -191736 -124641 -83924 -38065 7857 -28516
17483b8516k696K4920n4158k3328M5408N3095K4905j1887K4874Q7625J13007o3525
$$ -28516 -31212 -6292 -60450 -83778 -38370 14725 39630 27743 52617 140242 253249 189724
17471A89724n9905N6392o7810j37372j22363j17888Q956M3152r961K609J11961
$$ 189724 129819 186211 118401 -18971 -141334 -259222 -250266 -207114 -217075 -214466 -102505
17460a02505J07196O2079j7489l9085j0481m2948j31086j36299p2832J00361J51051
$$ -102505 4691 66770 49281 10196 -285 -43233 -174319 -310618 -383450 -283089 -132038
17449a32038N5433J2202M326L4989M5559J3803k2506l0331k1210K8225N546o157
$$ -132038 -76605 -64403 -60077 -25088 20471 34274 11768 -18563 -39773 -11548 -6002 -12159
17437a2159k5743j5452J717O8641M7211r2746j50668j01526J01783J97883J12427
$$ -12159 -37902 -53354 -51637 17004 64215 -28531 -179199 -280725 -178942 18941 131368
17426A31368n7189n6002K0581j2967L5977O8018P8700M2658o0105m0837j2324
$$ 131368 74179 18177 38758 25791 61768 129786 208486 251144 191039 150202 137878
17415A37878p9897p9571J9042M2098J3900n0164j04907k0195L9133j88k1361j0742
$$ 137878 57981 -21590 -2548 39550 53450 3286 -101621 -121816 -82683 -82871 -104232 -114974
17403a14974P3029O6575M766j2191M0922J36375M8046j5987l459q1839o5937j10885
$$ -114974 -41945 24630 29396 17205 58127 194502 242548 226561 223102 141263 75326 -35559
17391c5559k2472M0765q301j3065l7142n948Q0651J0022m2313o3654m3352k3688
$$ -35559 -58031 -17266 -25567 -38632 -75774 -81722 -1071 8951 -33362 -97016 -140368 -164056
17379a64056j5203J4101j7662k5730j7852N5479N7185N5403R9738J3312l7459
$$ -164056 -179259 -165158 -182820 -208550 -226402 -170923 -113738 -58335 41403 54715 17256
17368A7256j8715K0561M0336j0356j5771l0751j9282P0287k7109q8579k7046K2296
$$ 17256 -1459 19102 59438 49082 33311 2560 -16722 53565 26456 -62123 -89169 -66873
17356f6873R876p1295L143R3014r967q5000o6165O3873P858j02224n5439O8705
$$ -66873 -56997 -128292 -125149 -32135 -42102 -127102 -193267 -129394 -121536 -223760 -279199 -210494
17344b10494R1110N1750O8131L9824L7727m7405r6062j02311n3646M0011M9965
$$ -210494 -119384 -67634 497 40321 78048 30643 -65419 -167730 -221376 -181365 -131400
17333a31400l97n4722n3758j6506P3336Q4267J12387P5397K9636o6762r5705n2250
$$ -131400 -131797 -186519 -240277 -256783 -183447 -99180 13207 88604 118240 51478 -44227 -96477
17321i6477m8565O7755J17716N2514J12405Q7028l1192p9619o9543k4760k8111
$$ -96477 -145042 -77287 40429 92943 205348 292376 261184 181565 112022 87262 59151
17310E9151r40N3683L829k9401n7518j0646N7782M3278m4539p2867m597P1372
$$ 59151 58211 111894 115723 86322 28804 18158 75940 119218 74679 1812 -2785 68587
17298F8587j7148o2164j32932r3472O3793M9027j13651r5123P0731J52800J25417
$$ 68587 51439 -10725 -143657 -237129 -173336 -124309 -237960 -333083 -262352 -109552 15865
17287A5865M0580q4721l6986L8965M0226J6913L1466q7449r3295O2099R8298L2818
$$ 15865 56445 -28276 -65262 -26297 13929 30842 62308 -25141 -118436 -56337 41961 74779
17275G4779M7805K3493l4028j10202j46708m5850P358j4991M7150J35709J57490
$$ 74779 122584 146077 112049 1847 -144861 -190711 -183353 -198344 -151194 -15485 142005
17264A42005L0920p7951j00612o0008j3411r74k6698m4314K4209L9520Q3033L1094
$$ 142005 172925 94974 -5638 -65646 -79057 -80031 -106729 -151043 -126834 -87314 -4281 26813
17252B6813m4336k2129j5612M2889J58667J26591o9750j03919m8980k6994P4973
$$ 26813 -17523 -39652 -55264 -12375 146292 272883 203133 99214 50234 23240 98213
17241I8213J8423o9619r114L0635k9826k3788o207n9347p0590k0149R39l6230
$$ 98213 116636 47017 37903 68538 38712 14924 8717 -50630 -121220 -141369 -140430 -176660
17229a76660K7204O7730N9474O7821L6349J157j0242l694p7422m178j1876o6240
$$ -176660 -149456 -81726 -22252 45569 81918 83075 72833 69139 -8283 -12461 -24337 -90577
17217i0577L621K6664l1394j9935l957m5895L4789P6356k6144j0843O6992M9351
$$ -90577 -86956 -60292 -91686 -111621 -115578 -161473 -126684 -50328 -76472 -87315 -20323 29028
17205B9028k2471l024j3379N307N4712O4302N4157J08624K6383n5260o8900l2956
$$ 29028 6557 3533 -9846 -4539 50173 114475 168632 277256 303639 248379 179479 146523
17193A46523L2266N6772j55k8204n2788P099l5139N75j4686n1502k9354m1638
$$ 146523 178789 235561 235406 207202 154414 161513 126374 126949 112263 60761 31407 -10231
17181a0231k4563J2956O807j5901j07774j0216P4445J06169M3490j6372K2409
$$ -10231 -34794 -21838 -15031 -30932 -138706 -148922 -74477 31692 75182 58810 81219
17170H1219J4058p257m657l6913R2060J9744q6187o5352R5968O1173m9320l8660
$$ 81219 95277 88020 83363 46450 138510 158254 72067 6715 102683 163856 114536 75876
17158G5876k191n2540p8474K5600P8204M8974J4302K8111j0922j2086k3591n6087
$$ 75876 73685 21145 -57329 -31729 46475 95449 109751 137862 126940 114854 91263 35176
17146C5176k8961L7043M0373K1470O3222M1392m7621m7117K8858m6891j47970
$$ 35176 6215 43258 83631 105101 168323 209715 162094 114977 143835 96944 -51026
17135e1026n4579J1741K2064M0314O027k9576l8115j1995N1257K2539j7075R144
$$ -51026 -105605 -93864 -71800 -31486 -25459 -55035 -93150 -105145 -53888 -31349 -48424 -39280
17123c9280M6103N1022O0315J06578J3083r9448j07972j07784m5087M8732R9669
$$ -39280 6823 57845 118160 224738 237821 138373 30401 -77383 -122470 -73738 25931
17112B5931K2974l4408o9011j1782m239j6447j9448j0781N8778O2904P0974K0544
$$ 25931 48905 14497 -54514 -66296 -70535 -86982 -106430 -117211 -58433 4471 75445 95989
17100I5989j16240l6550L7704m1181l0746P0949R5946P535r3967j11168j47093
$$ 95989 -20251 -56801 -19097 -60278 -91024 -20075 75871 83406 -10561 -121729 -268822
17089b68822o4434M8375J09555J00726O1825Q4248K8602K951N4486j1494j0057
$$ -268822 -333256 -284881 -175326 -74600 -12775 71473 100075 103026 157512 146018 135961
17078A35961N6413M0722m3688m6919m3843q0395m9049R531N0867l3960lJ06619
$$ 135961 192374 233096 189408 142489 98646 18251 -30798 -21267 29600 -4360 -4363 102256
17066A02256P7013o0857j41575r6246j7703l7639O5437Q4833L0448L9244L6537
$$ 102256 179269 118412 -23163 -119409 -137112 -174751 -109314 -24481 5967 45211 81748
17055H1748j3190n5640J92N2218P88l7837j044N5930M9852K5369J0343q5302j38696
$$ 81748 68558 12918 13110 65328 66116 28279 27235 83165 133017 158386 168729 83427 -55269
17042e5269k0542L6587q45n7009j4633K2140Q925k4434q6538q8688R6450J11744
$$ -55269 -75811 -39224 -40069 -97078 -111711 -89571 -80646 -105080 -191618 -280306 -183856 -72112
17030g2112J7679m2475p416J10299N1429n4407k5743O9248R0325M6561L2605R769
$$ -72112 -54433 -96908 -104324 5975 57404 2997 -22746 46502 136827 183388 215993 225762
17018B25762P270o3372l2740l6468n8252q5346k3668P1263P6007K2664J5849l3994
$$ 225762 233032 169660 136920 100452 42200 -43146 -66814 4449 80456 103120 118969 84975
17006H4975k0720P3224n0568o3913M6852K5227K03J9212k1909K115l4272j15148
$$ 84975 64255 137479 86911 22998 69850 95077 95280 114492 92583 94698 60426 -54722
16994e4722j4889J17641K5177P389l7296j01475J094O1064K0532M2815O3116N981
$$ -54722 -69611 48030 73207 80596 43300 -58175 -57081 3983 24515 67330 130446 136427
16982A36427p587k1893m6193r1341n8849k1909Q9508Q8825J5958l0364o1476l5581
$$ 136427 128840 106947 60754 -30587 -89436 -111345 -21837 66988 82946 52582 -8894 -44475
16970d4475k2164j4195l256M990p575k5755k8434o925j9414j7352L88K3957L5653
$$ -44475 -66639 -80834 -84090 -79100 -86675 -112430 -140864 -147789 -167203 -184555 -184167 -160210 -124557
16957a24557J42141M4615O8332P8268l1585j22913J2253R7753J4426n6447l8452
$$ -124557 17584 62199 130531 208799 177214 54301 66554 164307 178733 122286 83834
16946H3834m4816l6964r0085q4479j0866J0701J7218k8497m3458k0377J5700j2468
$$ 83834 39018 2054 -88031 -172510 -183376 -172675 -155457 -183954 -227412 -247789 -232089 -244557
16934b44557J9242R1057K3423q479n9205o1404K1064L8605J01543L7629o049l9723
$$ -244557 -225315 -134258 -110835 -119314 -178519 -239923 -218859 -180254 -78711 -41082 -47131 -86854
16922h6854m7004R1934R9838m1729q0332m3024p5355j0054J05001N0130K2201
$$ -86854 -133858 -41924 57914 16185 -64147 -107171 -182526 -192580 -87579 -37449 -15248
16911a5248P0482N7741M2740m2591j13759j01239k8046J8429L9209J3950k7671
$$ -15248 55234 112975 155715 113124 -635 -101874 -129920 -111491 -72282 -58332 -86003
16900h6003l0233L8829J4255k5871L2583J6588k3325q177J4907L5264P067k0769
$$ -86003 -116236 -77407 -63152 -89023 -56440 -39852 -63177 -71354 -56447 -21183 -14116 -34885
16888c4885K4705M08o338j8931l2516N0870R1595j5062o9200p491M5036L1544
$$ -34885 -10180 -9772 -16110 -35041 -67557 -16687 74908 59846 -9354 -16845 28191 59735
16876E9735k9540k8616J5239K2709J7443K5600K8167k2233p8570j12480o3392
$$ 59735 30195 1579 16818 39527 56970 82570 110737 88504 9934 -102546 -165938
16865a65938k309P2049Q4338q12n6628m8743k3657m675M9892M6216L1886l6320
$$ -165938 -168247 -96198 -11860 -12672 -69300 -118043 -141700 -146375 -96483 -50267 -18381 -54701
16853e4701j10606p6812Q879K0896M371N6949P6338J9514Q0254L4871p4154o4233
$$ -54701 -165307 -242119 -233240 -212344 -207973 -151024 -74686 -55172 25082 59953 -14201 -78434
16841g8434N2004L2977n2607l2225J8114o4517m319J13953M1901M0249Q5024o1469
$$ -78434 -26430 6547 -46060 -78285 -60171 -124688 -129007 -15054 26847 67096 152120 90651
16829I0651o8626l6860o694k8961m0897l2690J9170j928n8103K7503M6109j7424
$$ 90651 22025 -14835 -21529 -50490 -91387 -124077 -104907 -106835 -164938 -137435 -91326 -108750
16817a08750n1023l493K999j09850p2714R7436J82279J09581P2890N4590L6911
$$ -108750 -159773 -163266 -160267 -270117 -342831 -245395 -63116 46465 119355 173945 210856
16806B10856k9616l6104l998o5185r4492n0516k6127j1351K0834N4311J14711
$$ 210856 181240 145136 141138 75953 -18539 -69055 -95182 -106533 -85699 -31388 83323
16795H3323N6086m1300n9315j1797J2447j1052J8388J2297q5105m9209L3095j6258
$$ 83323 139409 98109 38794 26997 39444 28392 46780 59077 -26028 -75237 -42142 -58400
16783e8400j6831n59N9229Q6161M6955O0956N0497j7167m6565q5445l8504J8590
$$ -58400 -75231 -75790 -16561 69600 116555 177511 228008 210841 164276 78831 40327 58917
16771E8917N3965j701l4312p3069n2347n2469J7431P8998l1386p2712L1752K8714
$$ 58917 112882 111181 76869 3800 -48547 -101016 -83585 -4587 -35973 -108685 -76933 -48219
16759d8219N705J5954m7944l7207J3178m971m5387K2443O67L0291N5625Q779M9873
$$ -48219 -42514 -26560 -74504 -111711 -98533 -103504 -148891 -126448 -125781 -95490 -39865 -31086 18787
16746A8787N9021L3504K6601R268N6663N1908K1837k9574m6709j3045m2829q5451
$$ 18787 77808 111312 137913 147181 203844 255752 277589 248015 201306 188261 145432 59981
16734E9981K4346L0882J0965j931p6139o0581l7726m81L7264K2803K4858J9261
$$ 59981 84327 115209 126174 124243 48104 -12477 -50203 -50684 -13420 9383 34241 53502
16722E3502K1175q108P2524O6396m0796m9419K3663K2420L4607k341j17265j13663
$$ 53502 74677 66569 139093 205489 164693 115274 138937 161357 195964 193623 76358 -37305
16710c7305k9881n8171j4097K1960j100L8292L9158K8933J6517L3918m8459l8404
$$ -37305 -67186 -125357 -139454 -117494 -118594 -80302 -41144 -12211 4306 38224 -10235 -48639
16698d8639j8685j8220q092J5343O4325L2802O547m315J4737j8686p6154o2929
$$ -48639 -67324 -85544 -93636 -78293 -13968 18834 25381 21066 35803 17117 -59037 -121966
16686a21966j9430L34M2841P9083N6920J33j166l5942k0045J8079R8040P8051
$$ -121966 -141396 -141062 -98221 -19138 37782 37915 36749 807 -19238 -1159 96881 174932
16674A74932p8427n7821M1947O9240p412m9101J0245j600p416m5852k9756K3895
$$ 174932 96505 38684 80631 149871 142459 93358 103603 102003 94587 48735 18979 42874
16662D2874M6288m858p1784r1345n4675n469K8545L3548l3858m6486J3231M4433
$$ 42874 89162 84304 12520 -78825 -133500 -138969 -110424 -76876 -110734 -157220 -143989 -99556
16650i9556P1762O2345O3999L4911j5710m0557j17270q080J38508P284o4870m9112
$$ -99556 -27794 34551 98550 133461 117751 77194 -40076 -48156 90352 97636 32766 -16346
16638a6346k1771J4784L4045k4089o4764p013J1333J5755N7591N5679M9197k9041
$$ -16346 -38117 -23333 10712 -13377 -78141 -85154 -73821 -58066 -475 55204 104401 75360
16626G5360R457J25786P5181k0082l9002q5167r5832l9631k1963r2622N2422N9459
$$ 75360 84817 210603 285784 265702 226700 141533 45701 6070 -15893 -108515 -56093 3366
16614C366m2086K3645L5527Q282K1603J7226K2534O691q4990r7352k8510K6649
$$ 3366 -38720 -15075 20452 28734 50337 67563 90097 96788 11798 -85554 -114064 -87415
16602h7415L607j0288M2476J05657Q7895p2312q0636J0190J9410J9357m8165m7426
$$ -87415 -83808 -94096 -51620 54037 141932 69620 -11016 -826 18584 37941 -10224 -57650
16590e7650K9059K7773q9367o0213K9571m6130Q222J04907P6871K7058l0052p8459
$$ -57650 -28591 -818 -90185 -150398 -120827 -166957 -158735 -53828 23043 50101 20049 -58410
16578e8410l9446P0905J45848O3873q1536n9496j3661j0515M1444N7552p8724
$$ -58410 -97856 -26951 118897 182770 101234 41738 28077 17562 59006 116558 37834
16567C7834j26055j9441N3143L8076P5228Q8636K3160n6888K3148n0718j51409
$$ 37834 -88221 -107662 -54519 -16443 58785 147421 170581 113693 136841 86123 -65286
16556f5286j07257m3684Q4576J21245j1595l623R6667N9785L9574k9410r7660
$$ -65286 -172543 -216227 -131651 -10406 -22001 -25624 71043 130828 170402 140992 43332
16545D3332o8383J8115l946o9275o5719j7190N9579O4697J6838j463o7515Q961
$$ 43332 -25051 -6936 -10882 -80157 -145876 -163066 -103487 -38790 -21952 -23415 -90930 -81969
16533h1969J39348R7604k4707j03856j16867K8275L4872k9245l4013q035K6835
$$ -81969 57379 154983 130276 26420 -90447 -62172 -27300 -56545 -90558 -98593 -71758
16522g1758L462L7192L1930L5154m0952q4859j0888M7672p816j7681M2343R1137
$$ -71758 -68296 -31104 826 35980 -4972 -89831 -100719 -53047 -60863 -78544 -36201 54936
16510E4936J1574o9041K9566j9490o6767P114R877l8760K0149K69n0696R486O4071
$$ 54936 66510 -2531 27035 7545 -59222 -52108 -42231 -80991 -60842 -60573 -111269 -101783 -37712
16497c7712Q7250R9399j01258k01203j09669N818L6951K3555J6564J1995K1788
$$ -37712 49538 148937 47679 -153524 -263193 -257375 -220424 -196869 -180305 -168310 -146522
16486a46522M4918M6021L4625N2015J04547K3961j24775j00409L280P1432N6135
$$ -146522 -101604 -55583 -20958 31057 135604 159565 34790 -65619 -62339 9093 65228
16475F5228n5583l2141M8879o3457r0594P261O8524O6012L7490m4722k2713m7860
$$ 65228 9645 -22496 26383 -37074 -127668 -120407 -51883 14129 51619 6897 -15816 -63676
16463f3676o5770P5026O5185m1648J7802O187l3383J5783N049M9710M9335p5729
$$ -63676 -129446 -54420 10765 -30883 -13081 -6894 -40277 -24494 -19445 30265 79600 3871
16451C871q8119M402J6140m6666j01830J985Q2959N9285J325L165K9898R776K7051
$$ 3871 -84248 -79846 -63706 -110372 -212202 -210217 -127258 -67973 -66648 -63483 -33585 -23809 3242
16438C242R0694O0094o7030j13410n7146k1950n4894j3875J05762Q2787L8686
$$ 3242 93936 154030 87000 -26410 -83556 -105506 -160400 -174275 -68513 14274 52960
16427E2960M4000O167L0152K4883k115O4627p659j7072K08j3859m1616J3949M4195
$$ 52960 96960 103127 133279 158162 156047 220674 213015 195943 196151 182292 140676 154625 198820
16414A98820o7940j09564l7359r6495q6177j8716m0726N8300R7943J5297M1558
$$ 198820 130880 21316 -16043 -112538 -198715 -217431 -258157 -199857 -101914 -86617 -45059
16403d5059O3841O925N1431o4054j32533p1219K7121J35866R1506o608j1238k5765
$$ -45059 18782 25707 77138 13084 -119449 -190668 -163547 -27681 63825 57217 45979 20214
16391B0214k6721p8683j00802n697K0564k7090O7453J60579N1278k3033L9022
$$ 20214 -6507 -85190 -185992 -191689 -171125 -198215 -130762 29817 81095 58062 97084
16380I7084M2467m003M5935N5990n3745j69816r6710L9585J21572N7474l6845
$$ 97084 139551 135548 181483 237473 183728 13912 -82798 -43213 78359 135833 98988
16369I8988j4336j1917k0547o5950l0505L621L134k5370M2920O3970J5898K5429
$$ 98988 84652 72735 52188 -13762 -44267 -40646 -37512 -62882 -19962 44008 59906 85335
16357H5335N725m8984K9689Q2743J1978n3184m503j3961q2835k0967N909N8585
$$ 85335 91060 42076 71765 154508 166486 113302 108799 94838 12003 -8964 -3055 55530
16345E5530Q0823J5958k0277k5059p2950r0559n9812N3102J21583M9597m7542
$$ 55530 136353 152311 132034 106975 34025 -56534 -116346 -63244 58339 107936 60394
16334F0394r3297l9932N6192P0880J4130L5296l1592j0173l0946O4349l6534j31764
$$ 60394 -32903 -72835 -16643 54237 68367 103663 72071 61898 30952 95301 58767 -72997
16322g2997p480K8647p3185l1659Q0423L1361m565R735J1036O551M821L6314J1843
$$ -72997 -80477 -51830 -125015 -156674 -76251 -44890 -49455 -39720 -28684 -22133 -17312 19002 30845
16309C0845m8701j20035n647J4547J6448O2279O4931o719m0663m0303N545J27904
$$ 30845 -17856 -137891 -143538 -128991 -112543 -50264 14667 7948 -32715 -73018 -67473 60431
16297F0431J19771K2052k8548J6673r183n6315m395K1972n6472n8031j1735m057
$$ 60431 180202 202254 173706 190379 181196 124881 120486 142458 85986 27955 16220 12163
16285A2163l7019K919l4149o3645L295R7912Q3589N4705N137o5584j22547p9356
$$ 12163 -24856 -21937 -56086 -119731 -116436 -18524 65065 119770 124907 59323 -63224 -142580
16273a42580J681M0555K6773j3685k0682P797M7223j2570m4018p2660K1512N7074
$$ -142580 -140899 -100344 -73571 -87256 -107938 -100141 -52918 -65488 -109506 -182166 -160654 -103580
16261a03580K0931L3803M6915J5756k5085o4076o6063k6708K1984N4807L5926
$$ -103580 -82649 -48846 -1931 13825 -11260 -75336 -141399 -168107 -146123 -91316 -55390
16250e5390j3353m1624M3683N5164l5099l723N8951l4096r7151K0554J3355m2369
$$ -55390 -68743 -110367 -66684 -11520 -46619 -50342 8609 -25487 -122638 -102084 -88729 -131098
16238a31098j1606N9354R8596K3948n0895m0561K814O152J9436K8764M0096L4459
$$ -131098 -142704 -83350 15246 39194 -11701 -52262 -49448 -43296 -23860 4904 45000 79459
16226G9459P829o2319n7111J0398O0677R1985J7395n3353n4292o6412q1993r869
$$ 79459 87288 24969 -32142 -21744 38933 130918 148313 94960 40668 -25744 -107737 -117606
16214a17606J9505M080N8433J8968n1378R226O0055O4305j7646m2876L09K8016
$$ -117606 -98101 -94021 -35588 -16620 -67998 -58772 1283 65588 47942 5066 5375 33391
16202C3391m8772j4138O2266J8228m5149l823k9171o9298n2532k4376J5349Q3502
$$ 33391 -15381 -29519 32747 50975 5826 2003 -27168 -96466 -148998 -173374 -158025 -74523
16190g4523R6057Q680m6787p8933n0153M612Q927J0027K4006L6811L4654M2370
$$ -74523 21534 30214 -16573 -95506 -145659 -141047 -132120 -122093 -98087 -61276 -26622 15748
16178A5748Q8211L8260l9394k5215j7383l3158l9496k5352N8529N5586q1677q2294
$$ 15748 103959 142219 102825 77610 60227 27069 -12427 -37779 20750 76336 -5341 -87635
$$ [...]
##END NTUPLES=NMR SPECTRUM
##END=
