##TITLE=C13_LR-755-i3-C1
 , 150 sc

 19.10.2022
##JCAMPDX= 6.0         $$ Bruker NMR JCAMP-DX V2.0
##DATA TYPE= NMR SPECTRUM
##DATA CLASS= NTUPLES
##ORIGIN= UXNMR, Bruker Analytische Messtechnik GmbH
##OWNER= root
$$ XWIN-NMR		Version 3.5
$$ Wed Oct 19 16:19:12 2022 Russian Standard Time (UT+4h)  she@DPX200
##.OBSERVE FREQUENCY= 50.327896
##.OBSERVE NUCLEUS= ^13C
##.ACQUISITION MODE= SIMULTANEOUS
##.ACQUISITION SCHEME= undefined
##.AVERAGES= 155
##.DIGITISER RES= 17
##SPECTROMETER/DATA SYSTEM= spect
##.PULSE SEQUENCE= zgpg30
##.SOLVENT NAME= DMSO
##.SHIFT REFERENCE= (INTERNAL, DMSO, 0, 222.653)
##AUDIT TRAIL= $$ (NUMBER, WHEN, WHO, WHERE, WHAT)
$$ ##TITLE= Audit trail, XWIN-NMR		Version 3.5
$$ ##JCAMPDX= 5.01
$$ ##ORIGIN= Bruker BioSpin GmbH
$$ ##OWNER= she
$$ F:/spectra/data/she/nmr/c13/1/pdata/1/auditp.txt
$$ ##AUDIT TRAIL=  $$ (NUMBER, WHEN, WHO, WHERE, WHAT)
(   1,<2022-10-19 16:17:54.29 +0400>,<she>,<DPX200>,
      <created by zg, POWCHK disabled, PULCHK disabled
       terminated by command 'halt'
       configuration hash MD5:
       00 E9 B6 7A A2 85 ED C7 34 08 36 98 17 FE 4E 26
       data hash MD5: 32K
       C5 AC 48 52 6A 98 10 1E 8E A3 54 16 8B 32 4E 12>)
(   2,<2022-10-19 16:17:57.96 +0400>,<she>,<DPX200>,
      <Start of raw data processing
       efp BC_mod = 2 LB = 1 FT_mod = 6 PKNL = 1 PHC0 = -313.171 PHC1 = 34.88469 SI = 32K 
       data hash MD5: 32K
       BC B8 4E 9C C8 E4 CA A8 F8 CD 4B 07 74 3E 33 F9>)
(   3,<2022-10-19 16:18:16.40 +0400>,<she>,<DPX200>,
      <pk PHC0 = 0.141032 PHC1 = 2.399999 
       data hash MD5: 32K
       6D 2B 37 1A C6 A8 54 86 DA 6C BB DB 52 D4 36 9C>)
(   4,<2022-10-19 16:18:20.46 +0400>,<she>,<DPX200>,
      <abs ABSG = 5 
       data hash MD5: 32K
       30 75 58 65 BB 1A DC 8D 1F B7 0A 16 55 FA CD 71>)
$$ ##END=
$$ 
$$ hash MD5
$$ 6E 7D 72 9C F5 DE 5E 64 0B EB 03 19 91 A6 15 9F
##$RELAX= 
##$RELAX= 
##$RELAX= 
##$RELAX= 
##$RELAX= 
##$RELAX= 
##$RELAX= 
##$RELAX= 
$$ Bruker specific parameters
$$ --------------------------
##$DU= <F:/spectra>
##$EXPNO= 1
##$NAME= <c13>
##$PROCNO= 1
##$TYPE= <nmr>
##$USER= <she>
##$AMP= (0..31)
100 100 100 100 100 100 100 100 100 100 100 100 100 100 100 100 100 100 
100 100 100 100 100 100 100 100 100 100 100 100 100 100 
##$AQSEQ= 0
##$AQ_mod= 1
##$AUNM= <au_zg>
##$AUTOPOS= <>
##$BF1= 50.322709
##$BF2= 200.13
##$BF3= 50.322709
##$BF4= 500.13
##$BF5= 500.13
##$BF6= 500.13
##$BF7= 500.13
##$BF8= 500.13
##$BYTORDA= 1
##$CFDGTYP= 0
##$CFRGTYP= 5
##$CHEMSTR= <none>
##$CNST= (0..31)
1 1 145 1 1 1 1 1 1 1 1 1 1 1 1 1 1 1 1 1 1 1 1 1 1 1 1 1 1 1 1 1 
##$CPDPRG= <waltz16>
##$CPDPRG1= <>
##$CPDPRG2= <waltz16>
##$CPDPRG3= <>
##$CPDPRG4= <mlev>
##$CPDPRG5= <mlev>
##$CPDPRG6= <mlev>
##$CPDPRG7= <mlev>
##$CPDPRG8= <mlev>
##$CPDPRGB= <>
##$CPDPRGT= <>
##$D= (0..31)
0 2 0.00345 0 0 0 0 0 0 0 0 0.03 2e-05 3e-06 0 0 0 0 0 0 0 0 0 0 0 0 0 
0 0 0 0 0 
##$DATE= 1666181631
##$DBL= (0..7)
120 120 120 120 120 120 120 120 
##$DBP= (0..7)
150 150 150 150 150 150 150 150 
##$DBP07= 0
$$ [...]
##$SUBNAM4= <"">
##$SUBNAM5= <"">
##$SUBNAM6= <"">
##$SUBNAM7= <"">
##$SUBNAM8= <"">
##$SUBNAM9= <"">
##$SW= 239.972175391363
##$SWIBOX= (0..15)
0 1 3 0 0 0 0 0 0 0 0 0 0 0 0 0 
##$SW_h= 12077.2946859903
##$TD= 32768
##$TD0= 1
##$TE= 0
##$TE2= 300
##$TE3= 300
##$TEG= 300
##$TL= (0..7)
120 120 120 120 120 120 120 120 
##$TP= (0..7)
150 150 150 150 150 150 150 150 
##$TP07= 0
##$TPNAME0= <>
##$TPNAME1= <>
##$TPNAME2= <>
##$TPNAME3= <>
##$TPNAME4= <>
##$TPNAME5= <>
##$TPNAME6= <>
##$TPNAME7= <>
##$TPOAL= (0..7)
0.5 0.5 0.5 0.5 0.5 0.5 0.5 0.5 
##$TPOFFS= (0..7)
0 0 0 0 0 0 0 0 
##$TUNHIN= 0
##$TUNHOUT= 0
##$TUNXOUT= 0
##$USERA1= <user>
##$USERA2= <user>
##$USERA3= <user>
##$USERA4= <user>
##$USERA5= <user>
##$V9= 5
##$VALIST= <valist>
##$VCLIST= <CCCCCCCCCCCCCCC>
##$VD= 0
##$VDLIST= <DDDDDDDDDDDDDDD>
##$VPLIST= <PPPPPPPPPPPPPPP>
##$VTLIST= <TTTTTTTTTTTTTTT>
##$WBST= 1024
##$WBSW= 4
##$XGAIN= (0..3)
0 0 0 0 
##$XL= 0
##$YL= 0
##$YMAX_a= 1334169
##$YMIN_a= -1173055
##$ZGOPTNS= <>
##$ZL1= 120
##$ZL2= 120
##$ZL3= 120
##$ZL4= 120
##$ABSF1= 222.6533
##$ABSF2= -17.34351
##$ABSG= 5
##$ABSL= 3
##$ALPHA= 0
##$AQORDER= 0
##$ASSFAC= 0
##$ASSFACI= 0
##$ASSFACX= 0
##$ASSWID= 0
##$AUNMP= <proc_1d>
##$AZFE= 0.1
##$AZFW= 0.5
##$BCFW= 0
##$BC_mod= 2
##$BYTORDP= 0
##$COROFFS= 0
##$CY= -3
##$DATMOD= 1
##$DC= 0
##$DFILT= <>
##$DTYPP= 0
##$F1P= 0
##$F2P= 0
##$FCOR= 0.5
##$FTSIZE= 32768
##$FT_mod= 6
##$GAMMA= 0
##$GB= 0
##$INTBC= 1
##$INTSCL= 4.134877e-10
##$ISEN= 128
##$LB= 1
##$LEV0= 0
##$LPBIN= 0
##$MAXI= 10000
##$MC2= 0
##$MEAN= 0
##$ME_mod= 0
##$MI= 0.1934396
##$NCOEF= 0
##$NC_proc= 2
##$NLEV= 6
##$NOISF1= 120.0001
##$NOISF2= 80.00006
##$NSP= 0
##$NTH_PI= 0
##$NZP= 0
##$OFFSET= 222.6533
##$PC= 1.4
##$PHC0= -313.03
##$PHC1= 37.28469
##$PH_mod= 1
##$PKNL= yes
##$PPARMOD= 0
##$PSCAL= 0
##$PSIGN= 0
##$REVERSE= no
##$SF= 50.322730123286
##$SI= 32768
##$SIGF1= 140
##$SIGF2= 120
##$SINO= 11.81781
##$SIOLD= 32768
##$SREGLST= <13C.CDCl3>
##$SSB= 0
##$STSI= 32768
##$STSR= 0
##$SW_p= 12077.2946859903
##$SYMM= 0
##$S_DEV= 0
##$TDeff= 32768
##$TDoff= 0
##$TI= <>
##$TILT= no
##$TM1= 0
##$TM2= 0
##$TOPLEV= 0
##$USERP1= <user>
##$USERP2= <user>
##$USERP3= <user>
##$USERP4= <user>
##$USERP5= <user>
##$WDW= 1
##$XDIM= 32768
##$YMAX_p= 295417452
##$YMIN_p= -213039
$$ End of Bruker specific parameters
$$ ---------------------------------
##NTUPLES= NMR SPECTRUM
##VAR_NAME=  FREQUENCY,     SPECTRUM/REAL,   SPECTRUM/IMAG
##SYMBOL=    X,             R,               I
##VAR_TYPE=  INDEPENDENT,   DEPENDENT,       DEPENDENT
##VAR_FORM=  AFFN,          ASDF,            ASDF
##VAR_DIM=   32768,         32768,           32768
##UNITS=     HZ,            ARBITRARY UNITS, ARBITRARY UNITS
##FACTOR=    0.368581032318806, 1,           1
##FIRST=     11204.5221812756, 0,            0
##LAST=      -872.772504714734, 0,           0
##MIN=       -872.772504714734, -213039,     0
##MAX=       11204.5221812756, 295417452,    0
$$ Real data points
##PAGE= N=1
##DATA TABLE= (X++(R..R)), XYDATA
$$ [...]
23188b6097K6691K2554N403k5006l2581k1457M519K8463o51K230O171j8521j0664
23175c8946r790M3710L0142K253Q328k9393l9225L204J9120L2421J3295j3610
23163B1509k7419k2337k4895j3098J8881o5j2149l3287j305M2608K6966M3173
23151A8582n319l1813K6410L6573J4255l5641k5577L2785J4638k3341j0678K774
23139A3648L98l2387k6236J117Q424K0678O287m296j4545J3879N8164M0159N984
23126I1274q319j6981k7087k2083k2427k5258k3283l3947r490K3912J4767o648
23114f5570j57R081K2301K200J7820K212m8645k1710K4688J4177K7355P174j831
23101a0905J0194M4328J8415k3184k9958l3428O273J5793P353J9202J8699N244
$$ y = [-26097, 594, 23148, 28551, 3545, -29036, -50493, -45974, -17511, -18162, -15932, -9761, -28282, -38946, -48736, -5026, 25116, 27369, 35697, 6304, -32921, -29717, -10597, 21824, 35119, 21509, -5910, -28247, -53142, -66240, -47359, -47424, -59573, -92860, -94165, -51557, -24591, 18582, 13263, -18550, 7860, 44433, 58688, 23047, -2530, 30255, 44893, 21552, 10874, 13648, 14046, -18341, -44577, -43460, -35036, -14358, -8071, -12367, -26912, -13033, 45131, 85290, 91274, 82955, 65974, 38887, 16804, -5623, -30881, -54164, -88111, -97601, -73689, -58922, -65570, -65727, -56646, -34345, -32145, -14325, -12113, -60758, -82468, -57780, -43603, -16248, -9074, -10905, -711, 43617, 62032, 38848, 8890, -24538, -18265, -2472, 4881, 24083, 42782, 48026]
23089D8026j6243k9244j4714J305l775l511l632R986K4302L3938L6093j556o057
23076G4918j2276n0277l3641K4640L0473m22l6104j6244L0665L9397m257p68j1169
23063C4935l0637q396N554J3122J3673K5478K2395j6366k5804Q502J445J110J0317
23050E5328k559n419Q789j2522l1547n9826j9732K6000J8886K3309j2656j9817
23038c1766J9782j3849n1906k3021m0051Q742L2402J9616L2593L0044o356m7696
23026g1466R270J3846m257J1368l676l767j4305J8353m777k4183K5093J5672Q977
23013b3852j156j7067j6694l4184k2748P788L2502K7764M4480m319m1467n0574
23001i9527J4527N0240L9979q5n0179n7936j3725J4401O5110M5864r645j4854
$$ y = [48026, 31783, 2539, -12175, -10870, -14645, -18156, -21788, -11802, 12500, 46438, 82531, 80975, 74918, 62642, 12365, -21276, 3364, 33837, 33415, -2689, -18933, 11732, 51129, 46872, 46104, 34935, 4298, -4098, 1456, 14578, 28251, 53729, 76124, 59758, 33954, 42456, 43901, 45011, 55328, 52769, 47350, 56139, 43617, 12070, -47756, -67488, -41488, -22602, 707, -11949, -31766, -11984, -25833, -77739, -100760, -140811, -132069, -99667, -80051, -47458, -17414, -23770, -71466, -62196, -48350, -52607, -41239, -44915, -48682, -62987, -44634, -49411, -73594, -48501, -32829, -23852, -25008, -42075, -58769, -92953, -115701, -107913, -75411, -47647, -3167, -7486, -48953, -99527, -85000, -34760, 5219, 5134, -45045, -102981, -116706, -102305, -37195, 8669, -976, -15830]
22989a5830M0216J950m2924m1650m472J0133J7267L1639J2087M524j9297m6943
22977e3300J8078J2268q765O407M222J9455k213M324K9011J6330q348J8153j3264
22964D2358k7951k894k840k0205k7060l0336K284K5169K5214j9194j2766K8377
22952a9844O1681K6053j5987j7230j0146j3494P91j1135o0716l5341L5752J3523
22940d6093l808K4758m538J7710N818k3306j6536l036k631O428J5030O006K4959
22927G61K5342K3682L5713k5692n3894k9658M234N024l453j7149o485r185J6325
22914c4435J6316l5373l3832L7548K400j4313m684N049K1404K4938O695K5470
22902A7183K6216J0192j9075m2088k2511j9601k5915R459n932k0354R859M5514
$$ y = [-15830, 24386, 26336, -16588, -58238, -62710, -52577, -35310, -3671, 8416, 12940, -6357, -53300, -35222, -22954, -31719, -25312, -21090, -1635, -3848, 476, 29487, 45817, 37469, 55622, 42358, 14407, 11513, 8673, -11532, -38592, -68928, -66644, -41475, -16261, -35455, -48221, -19844, 41837, 67890, 51903, 34673, 24527, 11033, 11824, 689, -60027, -95368, -59616, -46093, -49901, -25143, -29681, -11971, -6153, -29459, -45995, -49031, -51662, -45234, -30204, -24198, 761, 26103, 49785, 85498, 59806, 5912, -23746, -19512, -14488, -17941, -35090, -41575, -50760, -34435, -18119, -53492, -87324, -49776, -47376, -61689, -66373, -61324, -39920, -14982, -8287, 17183, 43399, 53591, 34516, -7572, -30083, -49684, -75599, -66140, -72072, -92426, -82567, -37053]
22890c7053L6817M3554M0192J8968j7174m6094j3279K9946j492j3701l7494l3989
22878c0799Q57n2433m1709O0012P1616l009n1588k0639J0706R632P595j3579j0810
22865f4148J1778L5438J1620l8577l732K0309K1724N3665L2411m2026p8675k2082
22853f2295K4575p25m7583J8186P2974m136j3841j0444O418L5913J0082j470R06
22840B8560k1508P945K8858J0018K9037N759j8266l5263L502J3720j2686l4623
22828E053n4959l8414K4622M9039L3349J9281M288k654o05Q333p869k2913n050
22815A1501J6002K4537l1470m3915k384j5267l0729K3574O0619K3579j993J3925
22803D7979L5455M9858m8058p4060j0876j5185N850J5695m349J985N78j718l728
$$ y = [-37053, -236, 43318, 83510, 102478, 85304, 39210, 25931, 55877, 54385, 40684, 3190, -30799, -29942, -82375, -124084, -64072, 7544, 4535, -47053, -67692, -56986, -47354, -39759, -53338, -64148, -52370, -16932, -5312, -43889, -47621, -27312, -5588, 48077, 80488, 38462, -40213, -62295, -37720, -38445, -86028, -67842, 5132, 996, -12845, -23289, -16871, 19042, 29124, 27654, 28560, 7052, 14997, 43855, 53873, 82910, 88669, 70403, 35140, 38642, 52362, 39676, 5053, -49906, -88320, -63698, -14659, 18690, 37971, 42259, 39605, 39000, 47333, 39464, 16551, 11501, 27503, 52040, 20570, -23345, -25729, -40996, -71725, -48151, 12468, 36047, 34054, 47979, 83434, 133292, 85234, 11174, 298, -14887, -9037, 6658, 2309, 4294, 4872, 3154, -574]
22790e74P641j8208J4956j2554J4926K4185m4611l0535l81L1389K4866J63M1801
22777E3064J7103k7295n554j418k1908j2067m662J6004P192k2468q287Q416J0691
22764H811K8334K4769j005j3168j3893r791j5174J0732j0553l648K6794P593k4612
22751A5189m841r683o319l050j2844J7508J1369k1559j1129r451J0593J9194K2045
22738A7022K2423q385j9630j5007j4059l910R228q128J2755J4220L2513L0744
22726F9786k7047l4368m1461j2328q897j4069K1338K0013J4118K7704O359l17
22714B0831K5420p646j7915j6331l4910k0782J8566L0329r669j3346J3303L4752
22702B2602J0609m0830Q397K4965K6931j4254n5840l530K3060j0570l0677j1440
$$ y = [-574, 7067, -11141, 3815, -8739, 6187, 30372, -14239, -44774, -45155, -13766, 11100, 11263, 53064, 70167, 42872, 37318, 35900, 13992, 1925, -2737, 13267, 20459, -2009, -10296, -1880, 8811, 37145, 61914, 60909, 47741, 33848, 24057, 8883, 19615, 9062, 5414, 32208, 39801, 15189, 10348, 665, -5654, -8704, -21548, -4040, 7329, -14230, -25359, -34810, -24217, -5023, 17022, 39445, 31060, 11430, -3577, -17636, -21546, -12318, -20446, -7691, 6529, 39042, 69786, 42739, 8371, -33090, -45418, -54315, -68384, -47046, -27033, -12915, 14789, 21148, 20831, 46251, 38605, 20690, 4359, -30551, -51333, -32767, -2438, -12107, -25453, -12150, 22602, 33211, -7619, 778, 25743, 52674, 38420, -17420, -20950, 2110, -8460, -39137, -50577]
22690e0577O002o458k2240j0775J301k7942J003M9152M9055L6314M3167K2719
22678I0721j7236l7755j2117J2334K0108k9658j8312J9432K5940P652K3261P787
22666I2157k1256l9260l3037r329L7823K4599m411j9477j9963q486j4419k7013
22654d2072j4261j4998k206J0487L9794L1837j8971k4318k5485J6738O6766J3192
22642C6503j1309k2771k7609l5085l1860j156L0462K7121K2763K0329L2667J7251
22630E7306j3563n5649o6601l5476J7631N8008J2526k9309j863L6486L3262P582
22618B0340J5075J6102j6179j5566M673L9766l97l2121K5523J7302k248l6918
22606C5352k2692j195j5527J3793L5684j8202o1457p26q061l7982J2565L5167
$$ y = [-50577, -44575, -51033, -73273, -84048, -82747, -110689, -109686, -60534, -11479, 24835, 68002, 90721, 73485, 35730, 23613, 35947, 56055, 26397, 8085, 27517, 53457, 61109, 84370, 92157, 70901, 31641, -1396, -10725, 27098, 51697, 47286, 27809, 7846, -640, -15059, -42072, -56333, -71331, -73537, -63050, -23256, 8581, -10390, -34708, -60193, -43455, 23311, 36503, 25194, 2423, -25186, -60271, -92131, -93287, -62825, -35704, -12941, 7388, 40055, 57306, 43743, -11906, -78507, -113983, -96352, -38344, -25818, -55127, -56990, -20504, 12758, 20340, 35415, 51517, 35338, 19772, 24445, 64211, 63814, 31693, 57216, 74518, 72270, 35352, 12660, 11465, -4062, 9731, 45415, 27213, -34244, -34970, -43031, -81013, -68448, -33281]
22594c3281J7141K1603p014J983K9514j7600m5971p913J6665K6536n528j5433
22582a9298L4054L4857J1676j2967l0471l3511k1897L368r179o7059k4172L8819
22570i5780O6814L5051M292K5717Q205k2257m7104l3305q985K5105M9671L335
22558A0759n343r036j6101j1209J6486R042n3386m5304K048K1663J891p799J9437
22545f6852L007j1133j133K2986L7656M0148J3932k3254l5562r433M3970R746
22533B4078l0041j1266J8486J3676R882k0294M998Q269k269P293O508k4310l8102
22520c3092o223O6324N1914O352p055j1337j7405k0056J756r12J679q552K990
22507B6383K3000J3643J783j4583k64K5598J9033n598m067n808k4805j7534J5064
$$ y = [-33281, -16140, 5463, -1551, 432, 29946, 12346, -33625, -41538, -24873, 1663, -3865, -19298, 14756, 49613, 61289, 48322, 17851, -15660, -37557, -34189, -43368, -110427, -134599, -95780, -28966, 6085, 10377, 36094, 44299, 22042, -25062, -58367, -67352, -42247, 7424, 10759, 5416, -3620, -19721, -30930, -14444, -5402, -58788, -104092, -102044, -80381, -78490, -86289, -66852, -63845, -74978, -76111, -53125, -15469, 24679, 38611, 15357, -20205, -29638, 14332, 24078, -5963, -17229, 1257, 14933, 24815, 4521, 9519, 17788, 15519, 22812, 29320, 5010, -33092, -39315, 27009, 78923, 85275, 78220, 66883, 49478, 29422, 31178, 30266, 31945, 23393, 26383, 49383, 63026, 64809, 50226, 49962, 75560, 94593, 88995, 84928, 79120, 54315, 36781, 51845]
22494E1845M696M731K5407j1412l1226l1801j9353j2688L27L7245R250K821N583
22481C5425O209J3374j0763n2565l6995n21J6907K9436M3526J527j3453j7788
22469A4319j9743p203m049R50j833n037M015L1847M321l4440J2847k35M914L1467
22455C2140R9L4074L8904J708P196J1741j739R287Q358j5581n7357m4883K2323
22442D6270K2424o128m236J1252j8318k7552l0645P018J2853K1674n069K7722
22430E7265J6286j4073j2500N545k1056J1430J4406l4592l0350K375j5099J094
22418a9269J6414K9822K4958l0501k3006r622q579K278K3202L8414O966J6480
22406F7557L926r865l765k778k9706k3644O79m445m3191j9718K9022J6543M2230
$$ y = [51845, 56541, 61272, 86679, 75267, 44041, 12240, -7113, -19801, -19474, 17771, 27021, 29842, 35425, 41634, 55008, 44245, -8320, -45315, -45836, -28929, 507, 44033, 45560, 32107, 14319, -5424, -12627, -16676, -15726, -17559, -22596, -18581, 13266, 17587, -16853, -4006, -4241, 673, 32140, 32239, 66313, 105217, 106925, 114121, 125862, 124123, 133410, 141768, 126187, 68830, 23947, 46270, 68694, 62566, 58330, 69582, 51264, 23712, -6933, 85, 12938, 34612, 29543, 57265, 73551, 59478, 46978, 52523, 31467, 42897, 57303, 22711, -7639, -5264, -20363, -19269, -2855, 26967, 51925, 21424, -1582, -11204, -19783, -17505, 5697, 44111, 51077, 67557, 71483, 61618, 57853, 55075, 25369, 1725, 2404, -2041, -45232, -64950, -35928, -19385, 22845]
22393B2845K5248Q726K1947k694q324m3960m8780j7793J47L1084M3582J3266Q052
22380E3346r934m7868j9694p910k8667P09L415P763k019Q140K9745L1074M4499
22367F2599j7n4464j9749J5793K8860j576K1516N342l2033p995K7863K0293l2502
22354C3930l0922k6770j6140K2485J1354m1615k498M6893M6195q587k9230l8331
22342c3236k4281J7604P809j6080Q261J0800j0921J1897K7763J8864J3994q513
22330B3961j3582P50l3785m2369k1665K7882L3414l188m244k7971o458J1938J0933
22317d4384o728k9918J7708M8852p992k000L0041L5227J933j0342J9776n995l4334
22304A1844n509p977l5741j7389Q885L2267K7150o405k3337J3779L0211J3236
$$ y = [22845, 48093, 56819, 78766, 76072, 67748, 23788, -24992, -42785, -42638, -11554, 32028, 45294, 53346, 43412, -4456, -24150, -32060, -60727, -60018, -56603, -48840, -50859, -42719, -12974, 18100, 62599, 62582, 8118, -11631, 4162, 33022, 31446, 52962, 58304, 26271, 18276, 46139, 66432, 33930, 3008, -23762, -39902, -17417, -6063, -47678, -50176, -3283, 42912, 34325, 5095, -33236, -57517, -39913, -32104, -48184, -39923, -29123, -40044, -28147, -384, 18480, 32474, 23961, 10379, 11129, -22656, -65025, -86690, -58808, -25394, -28582, -32826, -60797, -67255, -55317, -44384, -51112, -81030, -63322, -14470, -22462, -24462, 5579, 40806, 42739, 32397, 52173, 46178, 11844, 6335, -1642, -37383, -54772, -45887, -13620, 13530, 7125, -16212, -2433, 27778, 41014]
22292D1014k3514m8882o364k05J549n592j1935m00l070Q722J7924M641j8183j3262
22278e7557j1664l0745l5665J4986L7675N1624J7848l1758o668j1252k6252p459
22266i6887O698J505J8857L1265K1375J2224L0818K4113J2399K0009L510m1127
22254D4759k9616n644M3877L6314J5126K997j0089m3008k3458J5116J4427k040
22242E8761j0558j208P378K1624j1345k4266j8741J8134O29l7474r915J1330j7337
22229a2988n737J1894J2090L0022J054p520q189j9771R319K1313k1896N803K481
22216A7875j2835Q059M3237K6883k1063k5379j2781n876o354j4256R719J4340
22204B1569j6830k3929J7447J3233j0340L1461N383n0352j3813j487k6016p879
$$ y = [41014, 17500, -31382, -37746, -37951, -36402, -41994, -53929, -54329, -57399, -48677, -30753, -26112, -44295, -57557, -69221, -99966, -135631, -120645, -82970, -31346, -13498, -45256, -51924, -63176, -89428, -96887, -90189, -88684, -69827, -38562, -17187, -4963, 25855, 49968, 62367, 82376, 85886, 44759, 15143, 9499, 53376, 89690, 104816, 107813, 97724, 54716, 31258, 46374, 60801, 58761, 48203, 46995, 54373, 75997, 64652, 40386, 21645, 39779, 40408, 2934, -6981, 4349, -12988, -18725, -6831, 5259, 35281, 36335, 28815, 20626, 855, 10174, 31487, 9591, 15394, 17875, 5040, 13099, 56336, 83219, 62156, 36777, 23996, 18120, 11766, -2490, 7229, 21569, 4739, -19190, -1743, 11490, 1150, 32611, 37994, -12358, -26171, -27658, -53674, -61553]
22192f1553J6843Q599O3440O0501O878J688m1782m5772J1699J6786j592k3746
22180A1989k357K2920r296j8341L286r016j7574q963k4688p412J5245n13j6563
22167f1283j9851J1721N355J3784J4061J1701N53j7215j9752k0046k9528J282
22155a09218K5827J5469Q098j6802L169K7140n985o125J2503N946O651J5364k4427
22142d2390l0333j1589L0660m969K821M7667K7505l5858m7659k3292J9960J5333
22130e2144M1807M7858K0122L339k4317m3359j1992K7753J9270O256k4582l151
22118F860K8472r158k2223j601j4539n5022j9028L8083N1996L0389J9434N094
22106E8757l2260o3j1882l3107J5401M8212K8356o759j0832N206M081L657M126
$$ y = [-61553, -44710, -36111, 27329, 87830, 94708, 96396, 54614, 8842, 20541, 37327, 35735, 11989, 9632, 32552, 23256, 4915, 8201, -815, -18389, -27352, -52040, -59452, -44207, -44720, -61283, -81134, -69413, -64058, -50274, -36213, -24512, -23959, -41174, -60926, -80972, -110500, -109218, -83391, -67922, -59824, -76626, -73457, -46317, -52302, -58427, -45924, -39978, -33327, -17963, -42390, -72723, -84312, -53652, -58621, -55800, -8133, 19372, -16486, -64145, -87437, -67477, -52144, -10337, 37521, 57643, 60982, 36665, -6694, -18686, 9067, 28337, 34593, 10011, 6860, 35332, 26174, 3951, 2350, -12189, -67211, -86239, -48156, 3840, 34229, 53663, 58757, 26497, 26434, 14552, -18555, -3154, 45058, 73414, 66655, 55823, 61029, 65110, 68767, 72893]
22093G2893k1239k4869k9189l3765k4824K5952K9019L959k9146q955j1781l7299
22081h9244l6715K8027L9395k6521M233L9694K87j8042O931K6386R011O85J7057
22068A184J6773k957M078L0046K0071l5936l5726J2395J5190j8066k109J9102
22056B4045O676N703k5134k4639K0378J3206q310o589l0309k2177P568j1514j0643
22043f1739R175K9509P722k7278k0513j5114j4621J938L6935K5678M1651L9670
22031E3013L383j3707k7029l9985k4185l497j624n503K6423K2653k3043n1289
22019h4390m5712k7134J2007M6316J7991K7481M7981m9062l3957L3119N1837L8628
22007C5105J5806o537n5054m2566O849N907K290N339k6826l6481K33J4160M732
$$ y = [72893, 51654, 26785, -2404, -36169, -60993, -35041, -6022, -2063, -31209, -40164, -51945, -89244, -125959, -97932, -58537, -85058, -80825, -41131, -40844, -58886, -51955, -25569, -16558, -15873, 1184, 17957, 15000, 19078, 49124, 69195, 33259, -2467, 9928, 25118, 7052, 4943, 24045, 30721, 36424, 11290, -13349, 7029, 20235, 11925, 5336, -24973, -47150, -39582, -51096, -61739, -52564, -23055, -15333, -42611, -63124, -78238, -92859, -90921, -53986, -28308, 13343, 53013, 56396, 42689, 15660, -24325, -48510, -52007, -53631, -59134, -32711, -10058, -33101, -84390, -130102, -157236, -145229, -98913, -80922, -53441, -5460, -54522, -88479, -55360, -3523, 35105, 50911, 44374, -10680, -53246, -46397, -40490, -38200, -32861, -59687, -96168, -95935, -81775, -77043]
21994g7043J5270P389r155l8107j0800l148l384K7460L6772K9613L1141J9254
21982B5262K487O337K2872J9642j4577n9533j7930L291P073K5076M1371J6431
21970G7802K057K0180k2054l8409n7852j551J7766J5855o889j0654M488K5260
21958B5999k941k0268m3548n5818k5750K122J1249k814Q367M2854q29J556L1765
21945b8056M4176M9612L9413m584k5984j1762j7286j050L2295P22J6531j245l6792
21932E5990K168M4714O362j4934j3584j7815m2949l9600J1626J7086J4568L84
21920B4016j7661k9799j0333L3309R505k6208J1665J1456r238K4769M1311K8310
21908I1102j2426k8912J2343K8273L037J0023J609q656o606o345m0677k6097L6501
$$ y = [-77043, -61773, -54384, -63539, -101646, -112446, -115594, -118978, -91518, -54746, -25133, 6008, 25262, 27749, 34086, 56958, 76600, 62023, 2490, -15440, -12149, -5076, 20000, 61371, 77802, 79859, 100039, 77985, 39576, -18276, -19827, -2061, 13794, 6905, -3749, 739, 25999, 23058, 2790, -40758, -96576, -122326, -120204, -108955, -111769, -103402, -60548, -61377, -59821, -28056, 16120, 65732, 105145, 100561, 74577, 62815, 45529, 44479, 76774, 77496, 94027, 92782, 55990, 58158, 102872, 109234, 94300, 80716, 62901, 19952, -19648, -8022, 9064, 23632, 24016, 6355, -23444, -33777, -468, 9037, -17171, -5506, 5950, -3288, 21481, 62792, 91102, 78676, 49764, 62107, 90380, 93417, 103440, 105049, 96393, 89787, 83442, 42765, 16668, 53169]
21895E3169L1825m2062m3021l8753q798j2405R820K3083j0077j0577K3909M1720
21883A7833L2290k3858k2860J1548Q898j0265p643K0781K9710m241l4569n5321
21871c7697l3918J1694K9854O766K1345K4546K7354J1746J1603O307J00K1302
21859A01002J3178k9261j2834J7435L4505N9017K9193p4797q1504j9806j4256
21848B1872j5988q598j569O340m1275m8117l025R474q708J7648O3138L7070J3228
21835D1490l525j8286k3863j0774l5920j3765L1050J7833l3095l1225J7106M8561
21823a4413K9844k4241k9245L0173O5053L4834k2125j1296p342k3769p606k0057
21811a90k0979J7924K5224J6019j7210l4644l336J3014L850j1055J3133o174k2612
$$ y = [53169, 84994, 42932, -89, -38842, -47640, -60045, -50225, -27142, -37219, -47796, -23887, 17833, 50123, 26265, 3405, 14953, 23851, 13586, 5943, 26724, 56434, 52193, 17624, -37697, -71615, -59921, -30067, -23301, -1956, 22590, 49944, 61690, 73293, 79600, 79700, 101002, 114180, 84919, 72085, 89520, 124025, 183042, 212235, 137438, 55934, 36128, 21872, 5884, -2714, -4283, 2057, -39218, -87335, -90360, -80886, -89594, -71946, -8808, 28262, 41490, 37965, 19679, -4184, -14958, -50878, -64643, -33593, -15760, -48855, -80080, -62974, -14413, 15431, -8810, -38055, -7882, 57171, 92005, 69880, 58584, 51242, 27473, 19867, -190, -21169, -3245, 21979, 37998, 20788, -13856, -17192, -4178, -328, -11383, 1750, -4424, -27036]
21798b7036j9840o789j2633j9810J3780M1608K9085J0112J8398J4213l6905m2751
21786c8568j164R822j8301J804L9331L3178K1969R528M887q472q057k3084k6723
21773c850J2785K0511J9467J3434j2724o101j6328m6000l7684m205K5577J5745
21761a9373K937N843j1455K0387L1125J7268J356l8706n6704m3415k5073J9857
21749i5953L8955N0333L3202j2660n8480l8798j7656M727K5022L1590N0583J1533
21737B2398j6866k1312k2734j4421L2756J3487N880L7560P422j2385k7333q451
21725c999j497J786K9720M141o622j7422l2135k7248P810L2827J9397P4l9429
21712c2597k3467N3591L3943J506k2120l0065q625K6622Q140l2357j9042k6736
$$ y = [-27036, -46876, -53665, -66298, -86108, -72328, -30720, -1635, 8477, 26875, 41088, 4183, -38568, -39732, -29910, -48211, -46407, -7076, 26102, 48071, 57599, 62486, 54014, 45957, 22873, -3850, 8935, 29446, 48913, 62347, 49623, 43522, 27194, -18806, -56490, -60695, -35118, -19373, -16436, -10593, -22048, -1661, 29464, 46732, 48088, 9382, -47322, -90737, -115810, -95953, -56998, -6665, 26537, 13877, -44603, -83401, -101057, -96330, -71308, -39718, 10865, 22398, 5532, -15780, -38514, -52935, -20179, -6692, -812, 36748, 44170, 31785, 4452, -3999, -5496, -3710, 26010, 30151, 23529, 6107, -26028, -53276, -45466, -12639, 6758, 6832, -32597, -56064, -2473, 31470, 32976, 10856, -19209, -27834, -1212, 6928, -25429, -44471, -71207]
21700g1207J6243M6372L4278L2503K4637o373j9395m5972l3878J3422l1156o5559
21688a06085K5007M2266J1434J484N413P145j0667J3018L3801K6751K6735q49
21676G5453n014M68J9141q963l6951j6513n201k4969k5396n1414k7871j4026o969
21663a28225k5009j5531K2455M9763N3387J2399J0684N969n615P299J6246n023
21651a201m412j402j3520j8408j4733M191j5338Q33m505k659O224J2836J8745
21638c3349M9567J7661j8654K8450L3296K2565R932l0872k6047j4189p102P519
21626C8777K7910m474J3158J3076k6020j7010q148J2810L9896L3292k0574n6836
21614D5857j6508j3769p593J8367J4003j6034j6838j6469J5889J8870j1605o474
$$ y = [-71207, -54964, -8592, 25686, 58189, 82826, 76453, 57058, 11086, -22792, -9370, -40526, -106085, -81078, -38812, -27378, -25894, -20481, -13336, -24003, -10985, 22816, 49567, 76302, 75453, 70439, 70907, 90048, 81085, 44134, 27621, 22420, -2549, -27945, -79359, -107230, -121256, -128225, -153234, -168765, -146310, -96547, -43160, -30761, -20077, -14108, -19723, -12424, 3822, -1201, -5613, -7015, -20535, -38943, -53676, -49485, -64823, -63990, -68495, -71154, -64930, -52094, -33349, 16218, 33879, 15225, 43675, 76971, 99536, 109468, 78596, 52549, 38360, 31258, 38777, 66687, 62213, 75371, 88447, 62427, 45417, 37269, 50079, 89975, 123267, 102693, 45857, 29349, 15580, 7987, 26354, 40357, 24323, 7485, -8984, 6905, 25775, 14170, 7696]
21602G696K4024j534j2260q987j0090r768j9070n0580K473K2360O408O546k7761
21589g0543l505M1240J1049j0139k4144j00J4741J1985J357m0825k9491O749J3014
21576g8612J8210J2831J3378L0344m036j8390q545m359J9828K7086k913L5323
21564D0145J1819p3915m8301J6718M5505K6398K6010o349o5208o6344k1953L8344
21552g7131M4748K0202J7751k4949m3741j4875J2520M047m0136m8016j6206J9241
21540a46545N7559K0811q531J6404N3540N1328J8304j1035n269o0507m2797J5982
21528d0756L3820N9302O0738J4760j6836k7948j0359j6487l7753n722o610k6297
21516b0148N650k0703j2266J0157J0257O438R809K8146n655j9394k4053l6552
$$ y = [7696, 31720, 30186, 17926, 8939, -1151, -10919, -29989, -80569, -78096, -55736, -49328, -42782, -70543, -74048, -32808, -21759, -31898, -56042, -56142, -41401, -29416, -28059, -68884, -98375, -91626, -78612, -60402, -47571, -34193, -3849, -7885, -26275, -34820, -39179, -19351, 7735, 4822, 40145, 51964, -21951, -70252, -53534, -8029, 18369, 44379, 38030, -27178, -93522, -115475, -77131, -32383, -12181, 5570, -19379, -63120, -77995, -65475, -61428, -101564, -149580, -165786, -146545, -88986, -68175, -76706, -60302, -6762, 44566, 62870, 51835, 46566, -13941, -56738, -40756, -6936, 52366, 113104, 127864, 111028, 83080, 72721, 56234, 18481, 12759, 6149, -20148, -14498, -35201, -47467, -37310, -27053, -20615, -10806, 17340, 11685, -7709, -31762, -68314]
21504f8314k16K3738J6910K2905n022l965J4312P228j1325n234j0661k7764q261
21491e5669m693J440j0268J2785K9636J3867R972p641k8264j5094L2347K9009
21479G427r940j0072J3196J1674K159M46L521k7560n7255j500K7064K9483J9657
21466H300J2810K3067K90j0652k5188j7588l577q05l1905j1279k636j89J9087
21453d0265K2620J0791J9316R228j5648n015K5280J5636j3956l0080l8438j8094
21441e8625K8507K1648L005n766J1162N813o736L87J424m268r008q606J3473J1317
21427C727L1239J580m4160j2493o062m3144j5121j0290Q281L6635K2002j939L0209
21414D64L5081k4004m7131k1491j6214j3177J5334N3686N7951M26l968O375k5319
$$ y = [-68314, -68530, -44792, -27882, -4977, -9999, -13964, 348, 7576, -3749, -8983, -19644, -47408, -55669, -60362, -58922, -69190, -56405, -26769, -12902, -2930, -10571, -38835, -53929, -21582, 7427, -2513, -12585, 611, 12285, 14444, 14890, 18411, -9149, -66404, -67904, -40840, -11357, 8300, 21110, 44177, 44467, 33815, 8627, -8961, -12538, -13343, -45248, -56527, -59163, -59352, -40265, -17645, -6854, 12462, 21690, 6042, 1027, 26307, 41943, 27987, -2093, -40531, -58625, -30118, -8470, -5465, -11231, -69, 5744, -992, -605, 819, -3449, -12457, -21063, -7590, 3727, 34966, 36546, -7614, -20107, -26169, -69313, -84434, -94724, -86443, -49808, -27806, -29745, 464, 35545, 11541, -35590, -57081, -73295, -86472, -71138, -17452, 40499, 40925, 36957, 43332, 18013]
21401A8013k2098j7464l76L3606M0155k492R125l7545n4199j702p016n882J3516
21388c4359L0121l61m6985k4611k052M4156L2522K1919J6360N462J5642m494l4207
21375A9113K843J5496K4638K1174m040l9316m1331m489K1666l960j8292k3029
21363b9527q316L0565M5336j4075l8741K387P733k7746j6751J0911Q580J112O378
21350b2154l1478j0400L6323J9496k475k70J6135M0527O044l239K7375k1008n8691
21337c815l3456j8657K8367J2401j5885j4883K7935K1292J2762k9823j4660K1449
21325f973n790P840K9612M2896J6922k0729l1602j1643K1573r308l8862k4764
21313c0828L2808O193j357K5244Q995l5856j0836l6459m8840K2043N0028J8960
$$ y = [18013, -4085, -21549, -21925, 11681, 51836, 49344, 58469, 20924, -33275, -34977, -41993, -47875, -34359, -4238, -4599, -51584, -76195, -78247, -34091, -1569, 20350, 36710, 42172, 57814, 53320, 19113, 21956, 37452, 62090, 83264, 79224, 39908, -1423, -5912, 15754, 11794, -6498, -29527, -37843, -7278, 38058, 23983, -14758, -12371, -4638, -32384, -49135, -38224, -29644, -28532, -22154, -53632, -64032, -27709, -8213, -10688, -10958, 5177, 45704, 51748, 48509, 75884, 54876, -3815, -37271, -55928, -27561, -15160, -31045, -45928, -17993, 3299, 16061, -13762, -28422, -6973, -12763, -4923, 24689, 67585, 84507, 63778, 32176, 20533, 42106, 32798, -6064, -30828, 1980, 8173, 6816, 32060, 41055, 5199, -5637, -42096, -90936, -68893, -18865, 95]
21301I5k6016j626N6791M4857M156M711m434j6323K314J048r362l272O821j2118
21287D7642k1283J0289M267p676j7365n495o936j3933j8940K1381L0338j0845
21275A1444K030P62M215Q564Q839J7343Q195L398J5368q829k0538q332L4907M3336
21261A20702l258k416l9602p1994l4030L5784N4334O626k6845l0417K0736K3352
21249E2972L98n3252n7601j9868J4064j7478j5428L823k4229m0613K5450O3542
21237f8220K0763q990L233R757n052j0001p234K9570M0452J1113j5482j7813l8615
21224e6519n8982M780M8278M8014J9897K7779j369j3693k2274k9359j1220j4751
21212e9419Q073Q981q202l8806j1003P4084P9655m116k6801k0338K3425j2484
$$ y = [95, -25921, -27547, 29244, 74101, 78257, 82968, 78534, 62211, 64525, 65573, 56211, 52939, 59760, 47642, 26359, 36648, 40915, 33239, 15874, 10379, 3443, -10490, -29430, -8049, 22289, 11444, 13474, 14236, 18451, 27015, 35854, 53197, 61392, 64790, 80158, 71329, 50791, 42459, 77366, 120702, 117444, 115028, 75426, 3432, -30598, 5186, 59520, 66146, 39301, 8884, 29620, 52972, 53370, 118, -57483, -77351, -63287, -80765, -96193, -92370, -116599, -157212, -131762, -68220, -47457, -56447, -53214, -43457, -48509, -58510, -65744, -36174, 4278, 15391, -91, -17904, -56519, -115501, -110721, -62443, -14429, 5468, 33247, 31878, 18185, -4089, -33448, -44668, -59419, -51346, -42365, -50567, -89373, -100376, -26292, 53363, 49247, 22446, 2108, 25533, 13049]
21200A3049J5900M2788j1934r64K5752L0423M067m4693k0493J6833j2219o1403
21188b894k7967L2611K0331L6299J8766j5974P543m83J9762k0062p0029k7490
21176b9587N8683J9162k1764q929j5650k5850k228P775J8128M257o264j5019K202
21163a5084j0385j605M146q118l298k4882J5902M9756o508n681L418l6701Q859
21150c0181M6183l480j9390k7603J5320J6750q675R873N1451M8718K2488l256
21138A18198j0394k2460k7850j4960j3395k5685j1295O265K8098j888k4796j8054
21126a8216k6240N154M7896K5931k9950l0409m6506k9436M6920N4387K7606Q346
21114C5483M953j2017p395l8101O056K8830J0918k3763k4587k2219l4051M243
$$ y = [13049, 28949, 71737, 59803, 58839, 84591, 115014, 119081, 74388, 53895, 70728, 58509, -2894, -30861, 1750, 22081, 58380, 77146, 61172, 68715, 68232, 87994, 67932, -2097, -29587, 29096, 48258, 26494, 17565, 1915, -23935, -26163, -18388, -260, 3997, -2267, -17286, -15084, -25469, -27074, -22928, -31046, -34344, -59226, -43324, 6432, -76, -5757, -2339, -39040, -30181, 16002, 12522, -6868, -34471, -19151, -2401, -11076, -1203, 50248, 98966, 121454, 118198, 107804, 85344, 57494, 42534, 29139, 3454, -7841, -1576, 26522, 24634, -162, -18216, -44456, -39302, 8594, 34525, 4575, -25834, -72340, -101776, -54856, -469, 27137, 35483, 40436, 28419, 21024, -17077, -11021, 17809, 28727, 4964, -19623, -41842, -75893, -71650]
21102g1650K9645J955k0090J9259M7659J404k4007J298K1968j3786j6685N218
21090a7812K6300m0691m0419N156M9938K6140J0036L7856J6471Q50R360n578p995
21077F9612q793j0817j9296j5036q5l8213n5275j7297M583K2265J7228p118k1249
21064g9491J5602M1032M2113m457j6731J1683M4117k6977p047K8452O447k4456
21052C0287J2313J9790j6295l146J1329p667m421J7015L7027P392k9728n8371
21040A5525m0052j7903J6758J8260o280J6459K3088j3898j0155J0319j1057j8737
21028a7673k4538m0263k0273J5671N2401K6922q893n50J6100j2155k8596r30k023
21015d4800k3246J4386J5983L852J9995P044l3258l198j8337n418J9875k71k89
$$ y = [-71650, -42005, -40050, -60140, -40881, 6778, 8182, -15825, -14527, 7441, -6345, -23030, -17812, 8488, -32203, -72622, -67466, -17528, 8612, 18648, 56504, 72975, 73825, 83185, 77607, 69612, 60819, 50002, 30706, 15670, 15585, -22628, -77903, -95200, -90617, -68352, -51124, -58242, -79491, -63889, -22857, 19256, 14799, -1932, 9751, 53868, 26891, 19844, 48296, 54743, 30287, 42600, 62390, 46095, 42949, 54278, 46611, 42190, 59205, 96232, 103624, 73896, 15525, -24527, -42430, -25672, -7412, -13692, 2767, 25855, 11957, 1802, 12121, 1064, -17673, -42211, -82474, -102747, -87076, -34675, -7753, -16646, -17196, -1096, -13251, -41847, -42777, -44800, -68046, -53660, -37677, -33825, -13830, -6786, -40044, -43242, -61579, -66997, -47122, -47393, -47682]
21002d7682j6076j3570J537M1443M0139L8997K3182N889L7140p014o8790m6616
20990a1421j4626m4393J396N1020M724N856o301j2441K12J9472p979k8187O937
20977c5731L967J42K7063N3905J8936k8756k1297j4025J5364J8195k2972k792
20965A1999L3099N9820O322l2021l1432k6313j9618J282K8351K9392R769l5381
20953C5269j9877k3830k7697j6374J8904L9222J7196n71J4750K6206J2638k0149
20941E5687k5374k168k600J4309L7336J1921k252l2100l5243o5905l1130k073
20929g9592L980J9346L4480J3182n093j2228j2998J142J7437j0638j5661L754
20917d2889L6358K6922K7772Q808j4471q085j1704r257J3858J3979J9114K1548
$$ y = [-47682, -63758, -77328, -75791, -34348, 5791, 44788, 67970, 73859, 110999, 103985, 35195, -11421, -26047, -70440, -69044, -18024, -13300, -7444, -13745, -26186, -25974, -6502, -14481, -42668, -35731, -31764, -31622, -4559, 49346, 68282, 39526, 18229, 4204, 19568, 37763, 14791, 11999, 45098, 104918, 111240, 79219, 47787, 21474, 1856, 3138, 31489, 60881, 70650, 35269, 15392, -8438, -36135, -52509, -33605, 5617, 22813, 22242, 36992, 63198, 75836, 55687, 30313, 28145, 25545, 39854, 77190, 89111, 86859, 54759, 19516, -46389, -77519, -79592, -75612, -56266, -21786, -8604, -13697, -25925, -38923, -37781, -20344, -30982, -46643, -42889, -6531, 20391, 48163, 56971, 42500, 34415, 22711, 13454, 27312, 41291, 60405, 81953]
20905H1953l3896n3984r664J0638q541o494K5889P024n8027n1672K8745N2997
20893a5032N0135J4788K865J2322O518j4190j0015k4498k0855P594K0813K67o107
20880B4605p524O012p391N731J1447l73k310J4302J5355n046j2411k5428n2549
20867c5580k5439K4042J3545l5312j4459q86K2853J1854k92j0238M477J8112M643
20854b2680k4125j6405j6522l73L443N8214O5959L3484J0576k3200l7526j8118
20842A2727m823O470J0148J3907j2479j1914j8013n191K4830K9508M364k8585
20830B0949k8175K6339L5650l5565p0416p626J3892l540q557J779p732l2497k618
20817i8117K3316J1519j8536j0505L5187Q248m905j6812J5275P4064N0142J0456
$$ y = [81953, 48057, -5927, -15591, -4953, -13494, -19988, 5901, 12925, -45102, -96774, -68029, -15032, 35103, 49891, 52756, 65078, 71596, 57406, 47391, 22893, 2038, 9632, 30445, 30712, 24605, 17081, 23093, 15702, 21433, 32880, 32507, 30197, 44499, 59854, 54808, 42397, 16969, -35580, -61019, -36977, -23432, -58744, -73203, -74089, -51236, -39382, -39674, -49912, -45435, -27323, -22680, -46805, -63210, -79732, -80105, -76662, -18448, 47511, 80995, 91571, 68371, 30845, 12727, 7904, 14374, 24522, 38429, 25950, 14036, -3977, -9168, 15662, 45170, 49534, 20949, -7226, 19113, 54763, 19198, -51218, -58844, -44952, -48492, -57049, -55270, -63002, -95499, -98117, -74801, -63282, -81818, -92323, -57136, -48888, -53793, -70605, -55330, 18734, 68876, 79332]
20805G9332j0409m0796m5461M678K2972m4223m800n527m628p247m675L0173k589
20792c3200n7854l4752K0957J7249K6733K8061M824J0721m2956k7679Q728Q739
20780g0429L4331M0230j2534M362L6582l031k4811O996P346j0786j9898k4822
20768c6464m4918k1706L500L9076L4935k896j3075m0014l562K4685J6867J4141
20756b9431J6278J6339r941J1390J7638j0473K20k100j7313O915Q050N327K3936
20743C6835J251l1360r670J3161J5872M854l969l8127l6776L100N710k339N280
20730c6178N116j6069j804R131N946K4426M66j6543j963m27j0408j1684R083L6318
20716d590L8492M1505R287p964j5686j3693k9991K657K0865J6682L0655J7974
$$ y = [79332, 68923, 28127, -17334, -12656, 10316, -33907, -38707, -44234, -48862, -56109, -60784, -30611, -33200, -91054, -125806, -104849, -87600, -60867, -32806, -27982, -17261, -60217, -87896, -79168, -70429, -36098, 4132, -8402, -4040, 32542, 29511, 4700, 11696, 19042, 8256, -11642, -36464, -81382, -103088, -99588, -60512, -25577, -28473, -41548, -81562, -85124, -60439, -43572, -29431, -13153, 3186, -6755, 4635, 22273, 11800, 12020, 9920, -7393, -478, 7572, 12899, 36835, 38086, 6726, -2944, 10217, 26089, 30943, 26974, -11153, -47929, -44829, -39119, -41458, -36178, -31062, -47131, -48935, -39804, -33858, -9432, -8966, -25509, -27472, -27899, -38307, -49991, -40908, -4590, 33902, 75407, 84694, 76730, 61044, 47351, 17360, 20017, 40882, 57564, 88219, 106193]
20704A06193q910k3469n0138l8582k5762j3109J6812k0768n3347m842M8483M1203
20692b6236R591k7968k8699p508J409j1672J2223j2470M914L6983J1276m742K0107
20679b2792M6095K4016L0767L8280k4577m6438m2387l8365l601j2813m901p590
20667f4306k4108p762j0250L4191N3466J8772j8404j9845Q981N914k1112O531
20655c7932K7136P0118L3903k6847m1634k2194L7530N3577N072p326J0996j5726
20643H6673j3156l152k2138J8364j5314j1809r650r008M060j4007R853K293k1614
20630A395k312K1750L085l8003k765L5166J9703n606M484p718K104n156q314K002
20616A9815K0252j188j895j0353j4115j0773O0863N9472m2633m9414R566K6494
$$ y = [106193, 97283, 73814, 23676, -14906, -40668, -53777, -36965, -57733, -111080, -115922, -67439, -26236, -16645, -44613, -73312, -80820, -79411, -91083, -78860, -91330, -86416, -49433, -38157, -42899, -22792, 23303, 47319, 78086, 116366, 91789, 45351, 2964, -35401, -39002, -51815, -56716, -64306, -88414, -96176, -106426, -72235, -18769, 3, -18401, -38246, -29265, -23351, -44463, -37932, -10796, 59322, 93225, 66378, 24744, 2550, 40080, 93657, 98729, 91403, 102399, 86673, 73517, 70365, 48227, 66591, 51277, 39468, 29818, 20810, 24870, 10863, 20716, 23009, 1395, -917, 20833, 23918, -14085, -16850, 18316, 38019, 32413, 36897, 29179, 31283, 26127, 17813, 19815, 40067, 38879, 36984, 26631, 12516, 1743, 62606, 122078, 79445, 30031, 39597, 66091]
20604F6091J5171j0223N065p505j1216k8330k2747j4478K0908n080l047K2784
20592B7393k5723n5765m3588R469M3754M7627J7496J5325K9331o279j2104R486
20580E6422R833k9688l7577k9052r053J4033J7472J0947L0647J0579m6028n8713
20568f0178j4885J1093k12J9476O1840K0332l71J2442o582k850K0720m693k5573
20555C0559j2244L5385o032k5089k7659q046M874l4964l8844j3392J4921k126
20543h2657m701N1280M3323M0285K3843j6650l7022l7176l2577l6675k0960R026
20531a00661m549K6643J4415l6462k1437N2681M6195J1980j0238K0226K2656J4683
20519C6132j4666r427l2102l8989m3989J4966L5177K3454N134R498J0783p54p062
$$ y = [66091, 81262, 71039, 76104, 68599, 57383, 29053, 6306, -8172, 12736, 7656, 4609, 27393, 1670, -54095, -97683, -88214, -44460, 3167, 20663, 35988, 65319, 59040, 46936, 56422, 66255, 36567, -1010, -30062, -39115, -25082, -7610, 3337, 33984, 44563, -1465, -60178, -75063, -63970, -64182, -44706, 17134, 37466, 37095, 49537, 42955, 40105, 60825, 56132, 30559, 18315, 53700, 47668, 22579, -5080, -13126, -8252, -43216, -82060, -95452, -80531, -82657, -87358, -36078, 7245, 47530, 71373, 54723, 17701, -19475, -52052, -88727, -109687, -100661, -105210, -78567, -64152, -100614, -122051, -69370, -23175, -11195, -21433, -1207, 21449, 36132, 21466, 12039, -20063, -59052, -103041, -88075, -52898, -29444, -24310, -14812, -4029, -4783, -11845]
20506a1845J7023J1096J9637J2346K650K239k5210n5986J13K6514L7719J1974
20494D8270k0965l3053j5839Q736M1092M9083L9147q498j1201j5472J898l733
20482G9465m276m572m3532j8750K2172L6350J918j4496o247l327J9862K859l3964
20469C3462k2078J132r821K450o663J6089K6579n905l8778l72k2916j1688L1183
20456g326L6538J9717r383k3386Q900o633k7916k8562j067J9359J6222J0360J8089
20443B4912L4773r52p1104p8139J3569L6781M3873M1700N6215M9515k80l4827
20431A16036m4462j8837l2571r524N812j9133j4887o328J724q793K0851K9048
20419A8936K3858j6666k5335j0022j7954m1196m5735k785K8798K1028J6698M701
$$ y = [-11845, 5178, 16274, 35911, 48257, 50907, 53146, 27936, -28050, -27937, -1423, 36296, 48270, 27305, -5748, -21587, -12851, 28241, 77324, 116471, 107973, 96772, 81300, 83198, 79465, 75189, 70617, 27085, 8335, 30507, 66857, 68775, 54279, 48032, 44705, 64567, 67426, 33462, 11384, 12516, 2695, 5145, -1518, 14571, 41150, 35245, -3533, -3905, -26821, -38509, -7326, 29212, 48929, 39546, 16160, 25060, 18427, -9489, -38051, -39118, -19759, -3537, 6823, 24912, 59685, 58733, -12371, -90510, -76941, -40160, 3713, 45413, 101628, 151143, 150863, 116036, 71574, 52737, 20166, 10642, 16454, -2679, -17566, -23894, -22170, -30963, -10112, 18936, 42794, 26128, 793, -9229, -27183, -68379, -114114, -116899, -88101, -67073, -50375, -45674]
20407d5674K4421J4237L5100J0273k3823l324L326j5395j3576k003Q810k6872
20395c4500k3837p175k569k1914k9138R504N4841N0302K9468K2112J0538J5467
20383G3099J9238k859j3713k6762j6422p905J1153j2297k9931j2156L3910K8128
20371D3483O247n561l9095k0778K940k2077P257M4150M6659k145j3439k2772j6629
20358H240l22K8189L1607K6816j1369m3022n6772l0336j722L5015L5557R126L
20345C1010L347k7644n4300P738L9797p92J7600m976j5132j6729m478J9132N279
20332a48j6404O365J6407J9680m479j4897k0793n390K9801M6709L6365k5279n3662
20319A4275r19J3734j1288l6507L325L9978K5609P725J9935j1568l0777m8082
$$ y = [-45674, -21253, -7016, 28084, 38357, 14534, 11210, 14536, -859, -14435, -16438, -7628, -34500, -58337, -65512, -68081, -89995, -119133, -109629, -54788, -4486, 24982, 47094, 57632, 73099, 92337, 89478, 75765, 49003, 32581, 24676, 35829, 23532, -6399, -18555, 15355, 43483, 49730, 44169, 5074, -15704, -12764, -34841, -27584, 16566, 63225, 61080, 47641, 24869, 8240, 7918, 36107, 67714, 94530, 83161, 40139, -16633, -46969, -48691, -13676, 21881, 31007, 31010, 34357, 6713, -47587, -39849, -52, -844, 16756, 11780, -3352, -20081, -24559, -5427, -148, -16552, -10187, 6220, 25900, 21421, 6524, -14269, -19659, 10142, 56851, 93216, 67937, 14275, 13356, 27090, 15802, -20705, -17380, 22598, 48207, 55932, 75867, 64299, 33522, -14560]
20307a4560j9238k088K0071l93J0172K544L5121K2105j498j5883j5087L448K1867
20294D6581k341R203J9170j2268j7526K1949n459R199r702J4397k892j9970l0032
20281B0309J652J1221j0533l203J5588j9363L5223K0532n4004o9254j4951l7262
20269a04045k6378K6107N5234M1720Q867J0259p16n028K7529O704K865j7628r138
20256A6352m894j0282r654L1417j1741j4500J8705K5620q42j5487q793o343k3455
20243a3897O477q139k9341J3797N7501L9463j4421j8779n680j9565L714R881q328
20230A2683N907K4658k5977o881J5100L3955J2583j7912k1700J1689n292j3675
20218B5138J182K0571Q158J27j2818J0507O293o490m2852m7069k2075j653K4130
$$ y = [-14560, -33798, -35886, -15815, -16208, -6036, -3492, 31629, 53734, 52236, 36353, 21266, 24714, 46581, 44240, 53443, 72613, 60345, 42819, 64768, 59309, 68508, 58806, 73203, 70311, 50341, 20309, 21961, 33182, 22649, 19446, 35034, 15671, 50894, 71426, 17422, -51832, -66783, -104045, -130423, -104316, -49082, -7362, 1505, 11764, 11048, 6020, 33549, 40253, 43118, 25490, 16352, 11458, 1176, -8478, 22939, 11198, -3302, 15403, 41023, 40181, 24694, 15901, 9558, -13897, -7420, -15559, -44900, -31103, 26398, 65861, 51440, 32661, 26981, 7416, 11130, 21011, 12683, 18590, 43248, 17271, 10390, 25490, 59445, 72028, 54116, 32416, 44105, 38813, 25138, 26320, 46891, 55049, 55176, 42358, 52865, 59158, 52668, 9816, -37253, -59328, -60981, -36851]
20205c6851K5093J4460m717l834P737J253R720J1793K0264J8878k9305l1449R033
20192A2075J0067J1674K716l618J1951n885p234P88K4093J8176k9430r448L291
20179C9216M016J823O069l77r464o214K3194J7810n4535k8151M119Q783J2947
20166A9236l561m1196j5528J1625M490N575K1141L7195j8409n8732j3759j358
20154e3281o799P69L8962L2956K7043N4140L4528k1203l5452n5475k8606P591
20142d827J4707l7992j7588M5003M9087K2626l4648k4039L502J5961K7255J4505
20130G3552M202j8800m7584k8678j8784N931J435n749K2489J7073J9050j9475
20118D662r242n999o958m20k248k624K0267n936j4217r779j3478P209J5434J1527
$$ y = [-36851, -11758, 2702, -2015, -5849, 1888, 3141, 12861, 24654, 44918, 63796, 34491, 3042, 12075, 22142, 33816, 36532, 32914, 44865, 38980, 31746, 32534, 56627, 74803, 45373, 35925, 39216, 43232, 45055, 51124, 50747, 41283, 35069, 58263, 76073, 21538, -6613, -2494, 6289, 19236, 15675, -25521, -41049, -29424, -24934, -19359, 1782, 38977, 20568, -38164, -51923, -53281, -60080, -59311, -20349, 12607, 39650, 93790, 128318, 107115, 71663, 16188, -12418, -4827, 9880, -28112, -45700, -697, 48390, 71016, 36368, 12329, 15831, 31792, 59047, 73552, 77754, 58954, 11370, -17308, -36092, -30161, -28726, -34475, -11986, 5087, 24137, 4662, -4580, -10579, -17537, -17957, -20205, -22829, -2562, -8498, -22715, -32494, -45972, -38763, -23329, -11802]
20104a1802K6870K8396R588J3376N042P043R499k0176j9514J0567K9965N2016
20092A40870M390k1882J1879j2777j6369q330R429j8283k4896j6262j460j4742
20080C1567K704j346J5106o599k1239k2596P736R251K6184M866n07j4635m7957
20067a7465o0280Q536M0044N9855L5868j1685l2565P2k6298j0324k989R687l0
20054g574n495n061K016J496K5528K4984K1503k850n674k3422m015J127J088m5559
20040b1908k9564j4344O058M357J3572Q642K5862L0046K2833l3846J034l17M413
20027A6838j3484P382J7125L1027j6054Q124J9693K1676l915Q690N86j5902l5645
20014D6141K1763M058K9548O631j1066R425N408k2589l554N548l182k7021J7815
$$ y = [-11802, 15068, 43464, 53052, 66428, 71470, 78513, 88012, 67836, 48322, 58889, 88854, 140870, 145260, 123378, 135257, 122480, 106111, 97781, 107210, 88927, 64031, 47769, 46309, 31567, 34271, 32925, 48031, 41432, 20193, -2403, 5333, 14584, 40768, 45634, 45127, 30492, -17465, -77745, -69209, -29165, 30690, 66558, 54873, 22308, 22380, -3918, -14242, -17231, -7544, -7574, -13069, -18130, -16114, -14618, 10910, 35894, 57397, 54547, 48873, 25451, 21436, 22563, 23651, -21908, -51472, -65816, -59758, -55401, -41829, -33187, -7325, 22721, 45554, 11708, 12742, 12425, 16838, 3354, 10736, 27861, 58888, 42834, 50958, 70651, 92327, 88412, 97102, 97688, 81786, 46141, 67904, 71962, 101510, 108141, 97075, 106500, 111908, 89319, 85765, 91313, 88131, 61110, 78925]
20001G8925J5718N716j2876k5563j8721N484l329N79K650J6729j6259l401K3105
19988F8757L7783J2158j6606m1898J380n448q684j3201N9066N8039K0499l5703
19976A36142m0294j7636k351k9515K6062O909l3287n1168j8476N587n681L530
19964b0178J7565j1871l558j0391L3627M8753L2340j0736j3717j3600M0120R991
19952I8345k2812l1558j3754k4186J6960M370l512k0811L1767O1761L2325r124
19940A19771k7833l7153J5413K3884j2602j6293p039M131M5805L9561K4752N569
19928A77966j7997l304L7142n66m0917j9377N871K029K7902O937k4539k4687M474
19915A30934k2302j0665M2253L7364K5953J5488K4057J0687j697J0655j7023k7741
$$ y = [78925, 94643, 100359, 87483, 61920, 43199, 48683, 45354, 45933, 48583, 65312, 49053, 45652, 68757, 106540, 118698, 102092, 60194, 61574, 56126, 47442, 34241, 93307, 151346, 171845, 136142, 95848, 78212, 75861, 46346, 72408, 79317, 46030, -5138, -23614, -18027, -23708, -20178, -2613, -14484, -18042, -28433, 5194, 53947, 86287, 75551, 61834, 48234, 88354, 98345, 75533, 43975, 30221, 6035, 22995, 27365, 23853, 3042, 34809, 96570, 128895, 119771, 91938, 54785, 70198, 94082, 81480, 65187, 58148, 62279, 108084, 147645, 172397, 177966, 159969, 156665, 193807, 193241, 152324, 132947, 138818, 140847, 168749, 175686, 151147, 126460, 130934, 108632, 97967, 140220, 177584, 203537, 219025, 243082, 253769, 252072, 262727, 245704, 217963]
19903B17963j7421K2372n043l6805k9877O025j6145j9425J9126K1804J1136j4157
19891A59553K2135L6567K6855M44L3170M0364l6898o2239o2804n7325J8501N4658
19879A72981K2551K1592l666j4621j4132j4506j2855k3776J8356N1919L3611n943
19867B31511j8980k1386o514j0990K0468N0665M8998J8491l919k8505m0040n0562
19855A89237j7665J806R30j4636m514l4670l1546k7652k4052k675O0820N2549
19843A47932L5491j8100j1899k0860n679K4700O5700R286j5568j8441K9068J6945
19831B38575J999R000L7725k4024k5242r920l581j2307M8702N154k3882j6940
19819B25259K7747L207j1642k1739L2042P066j9109k0918L2405M8843O5171n816
$$ y = [217963, 200542, 222914, 217871, 181066, 151189, 157214, 141069, 121644, 140770, 162574, 173710, 159553, 181688, 218255, 245110, 245554, 278724, 319088, 282190, 219951, 157147, 99822, 118323, 172981, 195532, 217124, 213458, 198837, 184705, 170199, 157344, 133568, 151924, 203843, 237454, 231511, 212531, 191145, 184631, 173641, 194109, 244774, 293772, 312263, 308344, 279839, 239799, 189237, 171572, 173378, 174308, 159672, 155158, 120488, 88942, 61290, 37238, 34563, 95383, 147932, 183423, 165323, 153424, 132564, 126885, 151585, 217285, 226571, 211003, 192562, 221630, 238575, 240574, 249574, 287299, 263275, 238033, 228113, 224532, 212225, 260927, 266081, 242199, 225259, 253006, 256213, 244571, 222832, 254874, 261940, 242831, 221913, 254318, 303161, 368332, 362516]
19807C62516j8428j9589N349k6625l289q924n989l6592L196l1245k2154n3591
19795A44635j3238J0396L7996j6922J243j8606J6986r511M281n2660j8483k0205
19783F5912J0224K0940L6196m0607m5489l2680J6535J7145L4156q026N640j0648
19771F9298J9320J3695M2967L384j2253k5642Q3308j4394n0809l8953J0403k5897
19759G4427J2872l0581q058j4405K1574K2965M5513n3720k8043q148N6787K8598
19747A19781O569n4611J4129L718j930l2047M2055Q773J821n0077L9962L2546
19735A30689J8819n261K0413J484M2009J5771K736m4691L0069K7123J4705l1377
19723B22489j7213m9919J8262J67M0817K4074K366l9553n882r408N6192J8469
$$ y = [362516, 344088, 324499, 329848, 303223, 299934, 291010, 285021, 248429, 251625, 220380, 198226, 144635, 131397, 141793, 179789, 162867, 164110, 145504, 162490, 152979, 157260, 104600, 86117, 65912, 76136, 97076, 133272, 92665, 47176, 14496, 31031, 48176, 82332, 74306, 79946, 69298, 88618, 102313, 145280, 148664, 136411, 110769, 194077, 179683, 128874, 89921, 100324, 74427, 87299, 56718, 48660, 34255, 55829, 78794, 124307, 70587, 42544, 34396, 91183, 119781, 126350, 71739, 85868, 89586, 87656, 55609, 97664, 106437, 108258, 58181, 98143, 130689, 149508, 144247, 164660, 166144, 208153, 223924, 226660, 181969, 212038, 239161, 253866, 222489, 205276, 155357, 173619, 173786, 214603, 238677, 241043, 201490, 195608, 186200, 242392, 260861]
19711B60861j4498o0472R813k5327K5971J4743M1724k8100j1793m9745L1263J2990
19699B07430J3023q732O5103M9447K8590m7731j0029p024M2056m742M062k5927
19687C05526J8672n814M8780J568P460j8573J4842m971O0797J7781k1442k8122
19675C96504L0571j8664L3338p531L2557j2239l4894o4503q840m4979K263L2904
19663C36487N9685J3329O2264L3019O7121R378j1285k9179K5236J5967M5138j6193
19651F10967m727j3775n877k3135L9429J1509J6055o01K4819K1689O093j2032
19639F70414J6045M01J8872m2M1108N0888N7223L3256N5485L7613K9023K0891
19627A031177N4859M6770N0223R8867J38350J19624Q9701P8357J32002J68371
$$ y = [260861, 246363, 185891, 195704, 170377, 196348, 211091, 252815, 224715, 212922, 163177, 194440, 207430, 220453, 211721, 276824, 326271, 354861, 307130, 297101, 290077, 332133, 327391, 331453, 305526, 324198, 318384, 367164, 368732, 376192, 357619, 372461, 367490, 428287, 446068, 424626, 396504, 427075, 408411, 441749, 434218, 466775, 454536, 419642, 355139, 346299, 301320, 303583, 336487, 396172, 409501, 471765, 504784, 571905, 581283, 569998, 540819, 566055, 582022, 627160, 610967, 606240, 592465, 586588, 563453, 602882, 614391, 630446, 629845, 654664, 676353, 682446, 670414, 686459, 686860, 705732, 705690, 746798, 797686, 854909, 888165, 943650, 981263, 1010286, 1031177, 1086036, 1132806, 1183029, 1281896, 1420246, 1539870, 1629571, 1707928, 1839930, 2008301]
19617B008301J60505J95792K38444K70458K78945L05095M13684N86904O76893
19608E135021P96537R78394J309276J657237K206257K757550L355411M048117
19600B2243800N259526O991226R652161J3665319J9671089L0029154M9094036
19593A56606311P7882583O0928558m4813440q3083053n3714989l3903236k0910893
19586E8991841j4281641r381644p121050m967819m131081k989759k661859j929391
19578A1527597j741050j201610j201147q32236q76044n65242o06823l85001m87828
19569C630616k92642l77419k02850l15185j76624k53360j24692j68602k8498j68980
19559A521764p2205j78276p3767j57322j7425j07649j1191q9628N823o4233L3465
$$ y = [2008301, 2168806, 2364598, 2603042, 2873500, 3152445, 3457540, 3871224, 4458128, 5135021, 5931558, 6909952, 8219228, 9876465, 12082722, 14840272, 18195683, 22243800, 27503326, 34494552, 44146713, 57812032, 77483121, 107512275, 156606311, 234488894, 295417452, 250604012, 167520959, 113805970, 79902734, 58991841, 44710200, 35328556, 28207506, 23239687, 19108606, 16118847, 13456988, 11527597, 9786547, 8584937, 7383790, 6551554, 5675510, 5110268, 4503445, 4118444, 3630616, 3337974, 2960555, 2757705, 2442520, 2265896, 2012536, 1887844, 1719242, 1690744, 1521764, 1449559, 1271283, 1197516, 1040194, 1022769, 915120, 903929, 814301, 820124, 755891, 789356]
19548G89356m3886M2940n3582N317r0226l3110q8267N1774m9387K7815k6959L8750
19536E70535n1117m331r0590j1974p9024p7k532N2002o1802K2113l522M0863m4227
19523C36317L3229j1813L5710o3606k5509r1881j1922j5930M6984k5803L5128
19512B40904j406M8660m5684q181k6522M9480l9235J4758j5454M1864j2857K6691
19500B73018m2859K7576m302L2270l8583r898n4934J1998k4805J1322n6289l6410
19488H8104q2288L8187L0124O7664K8370N7317k8173j5791l1920L7251j4074J3882
19476A88653m8474J3620L0449M0175l1689K7674L503J3831l0733K2822J1887J7598
19464B59316o8767m0895m0552P349N871O8277K4206L850m3120J5996k0372R369
$$ y = [789356, 745470, 788410, 734828, 740145, 649919, 616809, 528542, 580316, 530929, 558744, 531785, 570535, 519418, 515087, 424497, 412523, 333499, 333422, 330890, 382892, 321090, 343203, 339681, 380544, 336317, 369546, 357733, 393443, 329837, 304328, 212447, 200525, 184595, 231579, 205776, 240904, 239498, 288158, 242474, 234293, 207771, 257251, 218016, 232774, 217320, 259184, 246327, 273018, 230159, 257735, 253433, 285703, 247120, 237222, 182288, 194286, 169481, 180803, 124514, 88104, 5816, 44003, 74127, 141791, 170161, 227478, 199305, 183514, 151594, 188845, 174771, 188653, 140179, 153799, 184248, 224423, 192734, 220408, 223911, 237742, 207009, 229831, 241718, 259316, 190549, 149654, 109102, 116451, 122322, 190599, 214805, 218655, 175535, 191531, 171159, 180528]
19452A80528j4425M278J284L8806l9623p998l5809P335L2033M7259N481M0103
19440B59252k421R29J6089K1573o2698n7686k3747J0236r901J6610P418K4166
19428A99820j5156N1437K3324O097J71l0748n0184K1364J2212N3872K9177O274
19416C07660p1158p1798k3877M6424M4223Q637j9958R14j3656J6398J5665J1541
19404B51015j0498J6816l1025q507k2226P322J4034J5608k1135k1799q945R669
19392A90329j8007p653j6148m790J212k126j8689k0125j8633j5566j241R877K2385
19379A00825k427P281N1850J0164m8964m4696k3958l1211r298l2646k3773P015
19367c9838K3926L8210K82k6481j4504q040j3940k0989j9453K623K9596L6603
$$ y = [180528, 166103, 170381, 171665, 210471, 170848, 162850, 127041, 134376, 166409, 213668, 219149, 259252, 256831, 257760, 273849, 295422, 232724, 175038, 151291, 161527, 151626, 168236, 175654, 199820, 184664, 236101, 259425, 265522, 265693, 234945, 184761, 206125, 218337, 272209, 301386, 307660, 236502, 164704, 140827, 187251, 231474, 240111, 220153, 221067, 207411, 223809, 239474, 251015, 240517, 257333, 226308, 217801, 195575, 202897, 216931, 232539, 211404, 189605, 180660, 190329, 172322, 164669, 148521, 143731, 144943, 142817, 124128, 104003, 85370, 69804, 68563, 78440, 100825, 98398, 105679, 157529, 167693, 118729, 74033, 50075, 18864, 9566, -23080, -46853, -39838, -15912, 22298, 22580, -3901, -18405, -26445, -40385, -61374, -80827, -78204, -48608, -12005]
19355a2005K4921p113J6927n279k5738K0268J2142j1488j676M7963K8685l6215
19343E1392k9912N854M944P191p325K4258N620o9592k7362M948j0360L5750N4200
19330D9606M9380j3643m8720j1212M9662L0079R716N377K4870J8853o931o8039
19318H8998n7469k1664L60N349K995k9837k1770R888M1766M820R776P460r302
19305C1370l1452q280n635r793j7260K3067j345k8499o157M1737L4717L9059n082
19292E6447j3635Q668M1630L607J398j1598l8885n5069O1235L3531n0702n0340
19280a3713K9071J0571l4958m7927N83L8777O4452K2611O561l2678k4350K0258
19268C9258L3708n153r297l8251J7750r433k5816j306O1492L9353R398p049k044
$$ y = [-12005, 12916, 5803, 22730, 17451, -8287, 11981, 24123, 12635, 10959, 58922, 87607, 51392, 21480, 27334, 32278, 39469, 32144, 56402, 62022, -7570, -34932, -29984, -40344, -4594, 49606, 98986, 85343, 36623, 25411, 75073, 105152, 114868, 120245, 145115, 163968, 157037, 88998, 31529, 9865, 10225, 15574, 18569, -11268, -33038, -23150, 18616, 23436, 33212, 40672, 31370, -82, -8362, -13997, -23790, -41050, -17983, -19328, -47827, -53984, -12247, 22470, 61529, 56447, 42812, 51480, 93110, 96717, 98115, 86517, 47632, -7437, 53798, 87329, 36627, -13713, 15358, 25929, -9029, -56956, -56373, -17596, 46856, 69467, 76028, 43350, 19000, 39258, 72966, 67813, 58516, 20265, 38015, 28582, 2766, 1460, 62952, 102305, 111703, 104654, 102610]
19255A02610j5183N098m3811p4924j8589M4897K268N765m9305J7443N6318K244
19243C4831k7089k1227N051K5475j2556j6654k2299M2269J7521o835j4105j52
19231D230l1095P335K0471J7052k6239j0791j0646P328Q853M402l1128N23J0811
19218b8894M0662n462P144j3419o08Q88l245k7539m094o342L48l8954N958K1458
19204e2099N3181L0219K47r211l308n202j0643m5459j300J5975J0255r564L9854
19191A2945L6548M863n4204l8990j2802j1831l6391o010k382L2198J7111K5370
19179c3575J7035k8599k8175K9472J0241P5l056k9456N296O6568L2647j2966k909
19166B2598J4908K7022R389n2323k7857o473p017k3285j0990k0639j6058J1282
$$ y = [102610, 87427, 92525, 48714, -26210, -44799, 98, 2366, 8131, -41174, -23731, 32587, 34831, 7742, -13485, -8434, 17041, 4485, -12169, -34468, 7801, 25322, 18487, 4382, 4230, -26865, -19530, 941, 17993, -8246, -19037, -29683, -22355, -13502, -9100, -40228, -39705, -28894, 11768, 6306, 13450, 31, -577, 311, -2934, -30473, -34567, -40909, -40561, -79515, -73557, -52099, 1082, 31301, 31548, 22337, 19029, 13827, 3184, -42275, -43575, -27600, -17345, -26909, 12945, 49493, 54356, 152, -38838, -51640, -63471, -99862, -105872, -108254, -76056, -58945, -33575, -16540, -45139, -73314, -43842, -33601, -33526, -36582, -66038, -60742, 5826, 38473, 25507, 22598, 37506, 64528, 73917, 21594, -6263, -12736, -19753, -43038, -54028, -74667, -90725, -79443]
19154g9443M5653K6966l28J141M153k2627j2151J0871K3018J2280n513J7797k2341
19141e24j2013K6879j2774l2294n6317k2298K6813K6027R987p079l7847k0136
19129a11576J2279L9491L0629j8501L154L9802K6267K3945p245k2893n313m322
19117E717j538R143l331j1898j0354r581j0813N8248J8347m8405o4307m7794j3654
19104a30220J9783N034K8921P629m807J3568J221k5742k0651j2719K5678M8361
19092d3944O4690M1410O599l2873l0079M925J2345M441k2971k0042p89j7832k946
19079c7066K2471J5272j1088j9548q276J2K0409L4884K7268M0250J8836k8895
19067G4529o6252l8768p156L2839K8563r311J6884j702j837l29M193m546J2061
$$ y = [-79443, -33790, -6824, -7152, -6011, -1858, -24485, -36636, -25765, -2747, 9533, 4020, 21817, -524, -12537, 14342, 1568, -30726, -87043, -109341, -82528, -56501, -46514, -53593, -91440, -111576, -99297, -59806, -29177, -47678, -44524, -4722, 21545, 45490, 38245, 15352, 10039, 5717, 4179, 13322, 9991, -1907, -12261, -21842, -32655, 25593, 43940, -4465, -68772, -116566, -130220, -110437, -105403, -76482, -68853, -73660, -60092, -58871, -84613, -105264, -117983, -92305, -43944, 20746, 62156, 68755, 35882, 5803, 10728, 23073, 27514, 4543, -15499, -16288, -34120, -37066, -14595, 677, -10411, -29959, -38235, -38223, -17814, 17070, 44338, 84588, 103424, 74529, 8277, -30491, -37647, -4808, 23755, 14444, 31328, 29626, 27789, 27460, 31653, 27107, 39168]
19054C9168k675l2863o3570k3497J6122M1952L7408l081l4306l1036j1441j9174
19042h6993j2479L0849J4584K9033K319k7516j3589k7839l2673q828J0976M6202
19030g5954L6608R19q472K0251M5908M9553J38n1217m8419N591R507K0636K8449
19017C3498J2589j7813k8860j6653J8632Q303K6274K8169J3624n1090k2931M259
19005H001J2425q79M447n27J3864L1499p855n7336l7279m8536K2288L6893L5007
18992A2012K5368K4271K9673K5362J2598k806m1748k5355l1561l7119l8499N214
18980d2590j1799J717L8163L5908P500l3892l4319L4558M0249l372l2505j6073
18968a6455k6240k3702j7793L5646L3728O544k8021J4530k89k1928O42L2587n341
$$ y = [39168, 36493, 3630, -59940, -83437, -67315, -25363, 12045, 8964, -25342, -56378, -67819, -86993, -99472, -68623, -54039, -25006, -22687, -50203, -63792, -91631, -124304, -133132, -122156, -75954, -39346, -38427, -46899, -26648, 19260, 68813, 68951, 17734, -30685, -25094, -15587, 5049, 33498, 46087, 28274, -586, -17239, 1393, 9696, 35970, 64139, 77763, 26673, 3742, 8001, 20426, 19547, 23994, 23467, 37331, 68830, 60975, 3639, -33640, -82176, -59888, -22995, 12012, 37380, 61651, 91324, 116686, 129284, 126478, 84730, 59375, 27814, -9305, -47804, -42590, -54389, -52672, -14509, 21399, 28899, -4993, -39312, -4754, 35495, 32123, -382, -16455, -42695, -66397, -84190, -48544, -14816, -8272, -36293, -21763, -22052, -43980, -43338, -10751, -16092]
18955a6092j5411K6218M2635p806j8013l8237k9056j3108n1907m5336L0647L4510
18943a00956J2250N650K9503J744r863M948L5968R151J765M5613J9109j4246k4344
18930A6292m2706j2466o090K330o639K6174O556P529r938n881J3939p766m6790
18917f5456k1256j3595k554L828J4862R250K3036L6329l6975n0684J3174K2928
18905f7113N950k3193l0773j527K8756l653L336K7847K5072O533r201L075L865
18892c1026K0302M3323K1455k477J135M5756J3324l5475m3960j3050j1848m4335
18880c6876n2037K991j1792l1138n5057k9130N9750R9391L6594o204n040k739
18868c1287k801N633K499Q974k4224k2304M2825M1399J2821J9504j0312M584J3039
$$ y = [-16092, -31503, -5285, 37350, 29544, 11531, -26706, -55762, -68870, -120777, -166113, -135466, -100956, -88706, -83056, -53553, -51809, -61672, -56724, -20756, -11605, -9840, 35773, 54882, 40636, 16292, -26414, -38880, -44970, -42640, -49279, -23105, -16549, -9020, -18958, -24839, -10900, -18666, -65456, -86712, -100307, -102861, -99033, -84171, -74921, -51885, -15556, -52531, -103215, -90041, -67113, -61163, -84356, -115129, -116656, -87900, -91553, -88217, -60370, -35298, -28765, -37966, -34891, -31026, -10724, 32599, 54054, 51577, 52712, 98468, 111792, 76317, 32357, 19307, 7459, -36876, -88913, -85922, -97714, -128852, -183909, -213039, -153289, -53898, -17304, -23508, -28548, -31287, -34088, -28455, -25956, -16982, -41206, -63510, -20685, 20714, 33535, 53039, 42727, 47311, 60350]
18855F0350O375p491q738k900L0443K1302n937j6377k4986k0716L0654K9027J180
18842I2186q379j3740j2226J0427K0673K202j2891K5909K8358l060k9699l7119
18830F2641j4784p087l709k285j9508l6824j9603J9969L8858L0463k3689l7034
18818a2592N789K6246L1742M418k5938l1639j2920q080r462K9507O4618K2878
18806H4567m139l535k6474m538J2140L1823J7055k9288m3747n2695r555l331J107
18793c0610l2719l5349K3259K9610m586J7850K0655j4612k8k1716l6364l415K3232
18780f4793K3374j0504n28K2427J2891J5747k5626J4757K0340j7419q700N849
18768a2185J4927K1850j1037l0389j3213j0658j757j7877j10m46N18j2492J6614
$$ y = [60350, 66725, 59234, 50496, 47596, 78039, 99341, 93404, 77027, 52041, 31325, 61979, 91006, 92186, 83807, 70067, 57841, 68268, 88941, 91143, 78252, 104161, 132519, 129459, 99760, 62641, 47857, 40770, 37061, 34776, 15268, -21556, -41159, -21190, 17668, 48131, 24442, -12592, -6803, 19443, 51185, 55603, 29665, -1974, -14894, -22974, -32436, -2929, 61689, 84567, 80428, 76893, 50419, 45881, 58021, 89844, 106899, 77611, 33864, -18831, -28386, -31717, -30610, -63329, -98678, -75419, -45809, -50395, -32545, -11890, -26502, -26530, -48246, -84610, -88025, -64793, -41419, -51923, -52451, -30024, -17133, -1386, -27012, -12255, 8085, -9334, -18034, -12185, 2742, 24592, 13555, -16834, -30047, -40705, -42462, -60339, -60449, -60895, -60377, -72869, -56255]
18755e6255N866k9465m032q416j2545L7325K9331J2651p704J8562K1756n153N178
18742G099o081l3289l1440j3042K1953L4841K3555J3139L1192J7947o636j6070
18730D3168j3390n727q035j2007j4654o817K2478k4098k7814k9765K581L8198
18718c5882M1526K1536K1681j8515m4962j3216M016N466J6456L246J3332L2252
18706D6936K1012j969n223l1059N511q800J181l7107m538M7216P1529K0545l4600
18693I0634r580j0658l7463k1368j692K4311n103m0980j7415K2107j845J778P822
18680E48J2651J2015J5010j4810j8524o009K3706J0229K1303Q510k1355l4029
18668I245J1248K005k4669M494L7255K9694J1863l2886m9119n5312k4702j137
$$ y = [-56255, -50389, -79854, -83886, -92302, -104847, -67522, -38191, -25540, -33244, -14682, 7074, 1921, 7099, 1018, -32271, -63711, -76753, -54800, -19959, 3596, 16735, 47927, 65874, 59238, 43168, 29778, 24051, 16016, 4009, -10645, -17462, 5016, -19082, -46896, -76661, -74080, -35882, 5644, 27180, 48861, 30346, -14616, -27832, -23816, -18350, -1894, 1352, 14684, 46936, 67948, 65979, 60756, 29697, 35208, 26408, 27589, -9518, -14056, 33160, 104689, 125234, 90634, 81054, 70396, 32933, 11565, 9873, 34184, 29081, -11899, -29314, -7207, -9052, -7274, 548, 13199, 25214, 40224, 25414, 6890, 881, 24587, 34816, 56119, 64629, 43274, 9245, 20493, 22498, -2171, 2323, 39578, 69272, 81135, 48249, -870, -56182, -80884, -82021]
18656h2021N1087M9659K1378p773l0728k5026J3643K7813K5597j0241J531J2782
18644D7701J5103j30m3208m3838o459k3324j6314j1829k049j276j0089q68j6252
18631a12832j7470L970J713L3802L0963P401J6658J1362P436p254o318L0065N6990
18618E6486N7250l19m1753k015N449l1897m2441j3183L3133j1870j7950j2295
18606b1405j5706M520O0873L7259L173k4040k1073k4916P28J7056M081n729J3623
18593B8444k0119l6067j1465J4515R668J3152j3309M2216N4342O66n5035l5667
18581h659P531l249J5860K2959K1921J0466p596K3785n15p0621j04185j3963L0043
18568g6223l85K4857J7168J1964l0447O723O1895J199l4032j9552M3748J310j9447
$$ y = [-82021, -30934, 18725, 40103, 32330, 1602, -23424, -9781, 18032, 43629, 33388, 34919, 47701, 62804, 62674, 19466, -24372, -30831, -54155, -70469, -82298, -84347, -85623, -95712, -96580, -112832, -130302, -126332, -124619, -90817, -59854, -52453, -35795, -24433, -16997, -24251, -30569, -504, 56486, 113736, 113417, 71664, 69649, 75098, 43201, 760, -12423, 20710, 8840, -9110, -21405, -37111, -32591, 28282, 65541, 68714, 44674, 23601, -1315, -587, 16469, 20550, 14821, 28444, 8325, -27742, -39207, -24692, -15024, -1872, -15181, 27035, 81377, 82043, 27008, -8659, -1128, -4377, 11483, 34442, 56363, 66829, 59233, 83018, 82503, 11882, -92303, -106266, -76223, -76608, -51751, -34583, -22619, -53066, -46343, 15552, 16751, -17281, -36833, 6915, 8225, -11222]
18555a1222K0729K1041J0598j3508k3993j1529k0845k7968J6009M6924K8411j0335
18543B4312K148Q867l801J2277J7212j1228k4231k6036r495L798J7446L3493K6621
18530G1383l669j7459k820j788k5811m0724q219N882j0717J3357J7934p836r015
18517a9502O721l4381l8321J1930K2777j3392p590J0592L7352J2573o801n929
18505b3971J5567L2819m731k1655j0828j5374l0962j5611N4237N5643J7870k7094
18493B5910R19k4268j930K8266K2469K3409R228l0647m262J0943J6746l31j3180
18480F3272p5399p9959n4194Q553J7744j0310j1253K4533M7037M540L864K2962
18468c8610M9870M3293p901J942P257j0013p135j5863o983M570k0381m4985m7630
$$ y = [-11222, 9507, 30548, 41146, 27638, 3645, -7884, -28729, -56697, -40688, 6236, 34647, 24312, 26460, 35327, 31526, 43803, 61015, 49787, 25556, -480, -9975, -6177, 11269, 44762, 71383, 67714, 50255, 47435, 45647, 19836, -20888, -29107, -23225, -33942, -20585, -2651, -10487, -19502, -12781, -47162, -85483, -73553, -50776, -64168, -71758, -61166, -23814, -11241, -18042, -23971, -8404, 24415, 19684, -1971, -12799, -28173, -59135, -74746, -20509, 35134, 53004, 25910, 26829, 2561, 631, 28897, 51366, 74775, 84003, 53356, 49094, 60037, 76783, 76452, 63272, -12127, -92086, -146280, -137727, -119983, -130293, -141546, -117013, -69976, -65436, -61572, -38610, 11260, 54553, 46652, 48594, 55851, 45838, 38703, 22840, 15857, 20427, 46, -44939, -92569]
18455i2569k7776r59M2585q313l6501J1455N1058M9084J5599k794M27q050P748
18442I94J3790K9220l6916n8248k8602J335J4991J1755J8083J444j4050J226j5261
18429f0239k0219M19J3111L3560K1555n3267n9880J881M1562K9232j7759k2019
18417i2063R656J9545J6705n7586o2501P970N7789n810k3502m351J6160L3892
18405h4096J5348J3954L3576M1338j3112j0540K796q415K403M661J4495J0046
18393B2454M885J947J612j6485k5262O935M1649J4665l0224n9905o0930m6843
18381a45502Q519J1658K8076K393L560K0765K1418N239K5081K4222l5563m8903
18369g9037J0142L9584L2210p045j6439K6001M8366J0987j0555k1923j8328j7297
$$ y = [-92569, -120345, -121304, -78719, -87032, -123533, -112078, -61020, -11936, 3663, 869, 1296, -6754, 994, 14784, 44004, 7088, -51160, -79762, -78427, -63436, -51681, -33598, -32154, -46204, -44978, -60239, -80458, -80039, -66928, -33368, -11813, -65080, -124960, -123079, -81517, -52285, -70044, -92063, -82407, -62862, -46157, -103743, -166244, -158274, -100485, -106295, -129797, -134148, -117988, -84096, -68748, -54794, -21218, 20120, 7008, -3532, -736, -9151, -6748, -2087, 12408, 22454, 27339, 29286, 30898, 14413, -10849, -3914, 37735, 52400, 22176, -37729, -98659, -145502, -136983, -125325, -97249, -94856, -91296, -70531, -49113, -43874, -18793, 5429, -30134, -79037, -68895, -29311, 2899, -4146, -20585, 5416, 53782, 64769, 54214, 32291, 13963, -3334]
18357c334k0389j5415j5146K3878M0437q312n466j2986o111K9165N2037l487k8544
18344B6327L484K5829J1023L3589J9505L024L326J0206M598j4241l6853j430K0023
18331A08410J2552j7884l6681m4100n5164k7244K2808K5259P0j3746j7983j4071
18319e7774l942K6945M7708M4901K2796q82k5733n1701m6696k4498J1629N7766
18307E19J3142n7789j8431K2631j836p893K3809K5369N019m620k3779j5186L285
18294c5760n629J2679P534J2873L2855J022j5990j1135j6283M545J2276P19k5208
18281b5502k2128j1554N512K2701K7101K7356L5134p972m9166k7588M219K1264
18269f23J5691n923k0808j1152k775L75j5958k8709k952M471N5775N2867Q858
$$ y = [-3334, -23723, -39138, -54284, -30406, 10031, 1719, -3747, -16733, -22844, 6321, 58358, 54871, 26327, 29811, 55640, 66663, 100252, 119757, 122781, 126107, 136313, 140911, 126670, 89817, 88387, 108410, 120962, 103078, 66397, 22297, -32867, -60111, -37303, -12044, -11974, -25720, -43703, -57774, -61716, -34771, 12937, 57838, 80634, 79752, 54019, 2318, -44378, -68876, -57247, 519, 13661, -44128, -62559, -39928, -41764, -49657, -25848, -479, 4540, -80, -23859, -39045, -35760, -41389, -28710, -21176, -8303, 24552, 25574, 9584, -1551, -17834, -13289, -1013, -294, -25502, -47630, -59184, -53672, -30971, -3870, 23486, 58620, 50648, 1482, -26106, -21887, -623, 15068, 9145, -11663, -22815, -25590, -25215, -41173, -69882, -72834, -68363, -12588, 40279, 49137]
18256D9137O745J1216J2053l764j3197M1J7931J2129L791j7055n6516n7473k1554
18243e6516K0733M4768L1572L8992K7781j8864k7887m942k0128k9183j807L2065
18231C6584L4769j7192l4065k480J9496J7848q281m6054l1680K4559J3552m366
18219B690k9612l392J0766J7847J0611L4166K3033p687m2662n9971l4787J2027
18207f6971K1831K7451M7715Q575K9K2422j0978j0709m1328j6644m405M587K3590
18194E165J9840J8425K6761J7848J1642j4088n292r200l9120m0470j9464J920
18182b6033K7782r362j3024M970N952j9457j5222j6304k542m4002l7607L2137
18170a12712P5412N9156J2847j5035j4517l1170k3395J3233Q737P659K0525J6130
$$ y = [49137, 55882, 67098, 79151, 75387, 62190, 62231, 80162, 92291, 96082, 79027, 22511, -34962, -56516, -35783, 8985, 40557, 79549, 107330, 88466, 60579, 55637, 35509, 6326, 4519, 36584, 71353, 54161, 20096, 17616, 37112, 54960, 46679, 625, -31055, -6496, 7056, 2690, -26922, -30314, -19548, -1701, 8910, 43076, 66109, 58422, 15760, -44211, -78998, -66971, -45140, -17689, 30026, 38601, 38630, 61052, 50074, 39365, -1963, -18607, -23012, -18425, 5165, 25005, 43430, 70191, 88039, 99681, 85593, 80301, 71101, 31981, -8489, -27953, -26033, 1749, -7613, -20637, -15667, -9715, -29172, -44394, -60698, -63240, -107242, -144849, -112712, -37300, 21856, 34703, 19668, 5151, -26019, -49414, -36181, -27444, -19785, 740, 16870]
18158A6870L238n1865l6015O975k72k3091j3111J6862K7406J8324K667l1260J2582
18145e0690L3047J1250N942L0400M2871J534j0832j9783k9562l8476q777K5561
18133g515J0540j3856k2642j0507Q002K7784O263k195l3746k4550K4583K3355
18121a4484n289M341L3784L1988k6028k1181l926k60l7868k7784J8247K8863n527
18108b5124k6315L0450O1929L8309k5080k8085M453n618Q689q651m1241l7289
18096e3573j4372R291K6678L5044J1634k0942j302L5931K7072Q264k1360l6382
18084E983k0741n0954k7487Q878J7080Q119j283j0374K3427J2373Q130K2399K9789
18071B5339K420k1076l4758k802Q36J3687j8059l2376n2103l4808J9862K7832
$$ y = [16870, 20108, -31757, -67772, -60797, -61069, -84160, -97271, -80409, -53003, -34679, -32012, -63272, -50690, -17643, -6393, -451, 29949, 72820, 74354, 63522, 43739, 14177, -24299, -33076, -7515, 3025, -10831, -33473, -43980, -35978, -8194, -1931, -4126, -37872, -62422, -37839, -14484, -19773, -15432, 18352, 50340, 24312, 3131, -795, -1055, -38923, -66707, -48460, -19597, -25124, -51439, -20989, 40940, 79249, 54169, 26084, 30537, 24919, 33608, 24957, -16284, -53573, -67945, -58654, -31976, 3068, 14702, -6240, -7542, 28389, 55461, 63725, 42365, 5983, -14758, -65712, -93199, -84321, -67241, -59122, -60405, -70779, -47352, -34979, -26849, -4450, 25339, 27759, 6683, -28075, -30877, -30041, -16354, -34413, -66789, -118892, -153700, -133838, -106006]
18059a06006J3090j4790J8156O4684K2462M099J3736K874R362K0640R041j8676
18047C8672m2829k1379k4315J0892K1919p031m2943l1855J860L0787L0269m211
18035d0164k4034n976J2339M6701K2146k3655M061K0394k996j4027q960L5005
18023B0834L9037J1207M410p525k8507l1961J0828K3142j9118l5281P680J1272
18011F018j3521n976O80q600J7169J9960l637k497O271j7474L78K6178J9431m355
17997D0025J6705K1415p329o145n23k7621l1172o3325k3666K5731K8542J1344
17985a6019j4546k2843l9631j6574K1932L26k6542L1890Q8197K9385k2841j2873
17973a39K760L7234J1867R109K3550J3106j2042l2328k4838k5089L274j2609j9162
$$ y = [-106006, -92916, -107706, -89550, -24866, -2404, 1695, 15431, 18305, 27667, 48307, 57348, 38672, -4157, -25536, -49851, -38959, -17040, -24071, -67014, -98869, -97009, -66222, -35953, -40164, -64198, -70174, -57835, -11134, 11012, -12643, -8582, 11812, 8816, -5211, -14171, 20834, 59871, 71078, 75488, 67963, 39456, 7495, 18323, 41465, 22347, -12934, -5254, 6018, -7503, -13479, -12799, -21399, -4230, 15730, 12093, 9596, 15867, -1607, -1229, 24949, 44380, 40025, 56730, 78145, 70816, 64671, 64148, 36527, 5355, -57970, -81636, -55905, -27363, -16019, -30565, -53408, -93039, -109613, -87681, -87355, -113897, -82007, 6190, 35575, 12734, -139, 2621, 39855, 51722, 60831, 84381, 97487, 85445, 53117, 28279, 3190, 6464, -6145, -25307]
17960b5307M617k1691l2678r064j7044n675K8929L0547K0653l383K449M7160L6810
17947E6323k5070m2765k7533K8894M5491l734k4432N414J0882k3916J9347K8179
17935D7080l9329m4613l453P772L883k114j4979k0025J789o95R737M1585O2050
17922D8688K7349j101m2514m8774m576M8886J7239m5690l3468M3571M7539K9004
17910H6153l4582o6171j257L0833j7147l1035j7565K5171J8823J8065P408j042
17898A7654K929J8824J5782J2248J7836k5859m7854O190J500J9036J0464p754
17886D0996J234K3942J5197J6297J6996k5815m6846J513L9145J3144l0570k3373
17874D1860J7218K3859m2533n9792J2130M6553j2378n5658k8460L1812K7769O270
$$ y = [-25307, -20690, -42381, -75059, -84123, -101167, -106842, -77913, -47366, -26713, -30096, -27647, 19513, 56323, 31253, -11512, -39045, -10151, 35340, 31606, 7174, 12588, 23470, -446, 18901, 47080, 7751, -36862, -40315, -32543, -28660, -30774, -45753, -65778, -63989, -64684, -54947, -13362, 48688, 76037, 74936, 32422, -16352, -20928, 27958, 45197, -493, -33961, 9610, 57149, 86153, 51571, -14600, -15857, 14976, -2171, -33206, -50771, -25600, -6777, 11288, 18696, 17654, 20583, 39407, 55189, 67437, 85273, 59414, 11560, 17750, 19250, 38286, 48750, 40996, 42230, 66172, 81369, 97666, 114662, 88847, 42001, 43514, 82659, 95803, 65233, 41860, 59078, 82937, 40404, -19388, -7258, 39295, 26917, -28741, -57201, -25389, 2380, 8650]
17862H650r738K1287O924j1781J243n553l1782m1062j6973K2255J686J1332N1967
17849H455N5503O274k7895p6913m8060O524L9345P628L7804M9441k1996n5665
17837a9555j5478K1379L472j5441j1361N97L9491N3466L2586O405k1825o4324
17825I412n4667l4743J8935J7580k1397j9500L2529O7141L6834N83j644J521K0476
17812G3060K3137M0505Q693l3014n3007o1604k7747J92J1127j3046j8995J642
17800d9057K2570L0338J8427L3530J8133p806j5693m6838m0348M748M6274P928
17788B2206k4777l0838l5635j9127J2409L3035O520k277K4340l02j0544J0778
17776a4212K3729P694p092Q006K9742O588m871J0140L788m4085n1132l7128P129
$$ y = [8650, -1088, 20199, 27123, 15342, 16585, 11032, -20750, -61812, -78785, -56530, -54844, -43512, 8455, 63958, 70232, 42337, -34576, -82636, -76112, -36767, -29139, 8665, 58106, 36110, -19555, -35033, -13654, -10182, -25623, -36984, -36387, 3104, 56570, 89156, 95561, 73736, 9412, -45255, -79998, -61063, -43483, -64880, -84380, -51851, 15290, 52124, 52707, 51063, 52584, 73060, 96197, 136702, 145395, 112381, 59374, -2230, -29977, -29785, -18658, -31704, -50699, -49057, -26487, 3851, 22278, 55808, 73941, 66135, 50442, 3604, -36744, -31996, 14278, 22206, -2571, -33409, -69044, -88171, -75762, -42727, -36207, -38484, -14144, -14446, -24990, -14212, 9517, 17211, 10119, 18125, 47867, 54455, 49584, 59724, 63512, 19427, -31705, -68833, -61704]
17763f1704J573J388K3841L4762L6252J7214j3554l432J6322k2105k0304P088
17751A7341p930j2636j129j1679K2922l9139n1744j0360J8719M1171M4215K1182
17739C0933O351J2383o237p970j9857r893R968J313k365L6825R760l6798n0228
17726b5815l6829J5929J9994m021l5541N841K0510o75j6128k230O609p112o960
17713f6428J2881L8322Q091l662r724K8012N8547J6764l354J2672m7158o5289
17701b0326l8827R18J2589J8240L7512J0321k447j3313l7295j1483k805J3057
17689c3859K4600J3841k279j7629l7207l1329j805k427J2822K9045M2659L5538
17677C1970l399l934k5489l2307r527J108k3554k1086k2243M596L5861K6431J1683
$$ y = [-61704, -60131, -58743, -34902, -140, 36112, 53326, 39772, 36340, 52662, 30557, 10253, 17341, 9411, -3225, -4354, -16033, 6889, -32250, -83994, -94354, -75635, -34464, 9751, 30933, 37284, 49667, 43430, 35460, 15603, 5710, 15678, 16991, 14626, 51451, 61211, 24413, -25815, -62644, -46715, -26721, -30742, -66283, -60442, -39932, -40607, -56735, -58965, -52356, -59468, -66428, -53547, -15225, -7134, -10796, -20520, 7492, 66039, 82803, 79449, 92121, 44963, -20326, -59153, -58235, -45646, -27406, 10106, 20427, 17980, 4667, -32628, -44111, -46916, -33859, -9259, 4582, 2303, -15326, -52533, -83862, -85667, -88094, -75272, -46227, -3568, 31970, 28571, 24637, -852, -33159, -42686, -41578, -65132, -86218, -108461, -103865, -68004, -41573, -29890]
17664b9890J9962N374l650L2232M8488M588j0329k5623m5603m5396k48M0K8225
17651b1830N9331L7830k5323q1518p4413M634K4766K8491K2217K0840j845m6999
17639e3819m4237J5548Q0994N3759j1460l0482l6601k6050j223P418J7934M1223
17627A3004L7446K8392P677k0007k3047m349Q062n281j9468J1837J0049L677j477
17614D6515N305J9878j2318m9878P738N1564N4646R430j9532l2796m6403k6568
17602G581j6702m2293o8320k9319J4072K4425J3059N8059N4353l788J7616J9402
17590D8145O256M394K273J3334J068k7677m3905j2395k8845o4444k0613L5935
17578h6474M8813L5955J9916j3167m4241j5407J8865J2554K9478K543l4054n2415
$$ y = [-29890, -9928, -4554, -8204, 24028, 72516, 77104, 66775, 41152, -4451, -49847, -50095, -50055, -21830, 37501, 75331, 50008, -31510, -105923, -101289, -76523, -48032, -25815, -4975, -6820, -53819, -98056, -82508, -1514, 52245, 40785, 10303, -26298, -52348, -53571, -46153, -28219, 13004, 50450, 78842, 86519, 66512, 43465, 39116, 47178, 41897, 22429, 34266, 44315, 47992, 46515, 51820, 71698, 59380, 9502, 17240, 68804, 123450, 132880, 113348, 80552, 34149, 7581, -9121, -51414, -119734, -149053, -134981, -110556, -97497, -39438, 14915, 11127, 28743, 48145, 54401, 58795, 61068, 74402, 75470, 47793, 3888, -8507, -37352, -101796, -122409, -86474, -37661, -1706, 18210, 5043, -39198, -54605, -35740, -23186, 6292, 8835, -25219, -77634]
17566g7634k0782J3653K2981K1197K9835J1666M372k2050J79R969L4919K7612
17554E5917m0768n2169k970J9320L895L8640K6203j7241j6993k1293q962k0840
17542c7261p660J8342k187l264M2997N8646L5416j4195m1986k5251O225K3290
17530E3112Q005o298J1599P272k0735m177J3173j7339j1460j4843k6804q457q712
17517b5664j2520J0860ro134L624j6771J0594J786K171J2403k6896k8785J6233
17504e9108L9887L1840j917m5610k3833L506N817K106J5235Q842K6170j6602l0748
17491d4415P889L184K4302M1688O588k7846l9337l066K4984j4970J2567N8085
17479D9653J9791j5512l667J0853j747j4825k8439k9417O924l079L086P937j4585
$$ y = [-77634, -98416, -84763, -61782, -40585, -10750, 916, 5288, -16762, -16583, -6614, 28305, 55917, 15149, -37020, -39990, -20670, -16775, 21865, 48068, 30827, 13834, -7459, -16421, -37261, -44921, -26579, -28766, -32030, 10967, 69613, 105029, 90834, 48848, 23597, 29822, 53112, 61117, 54819, 66418, 73690, 52955, 48778, 61951, 44612, 33152, 18309, -8495, -16952, -25664, -38184, -27324, -27333, -33467, -29843, -46614, -36020, -34234, -32063, -19660, -46556, -75341, -59108, -19221, 12619, 10702, -34908, -58741, -55235, -49418, -47312, -32077, -23235, 2935, -13667, -44415, -36526, -33342, -9040, 32648, 39236, 11390, -27947, -31013, -6029, -20999, -8432, 49653, 69444, 53932, 50265, 61118, 59371, 44546, 16107, -13310, -6386, -9465, -6379, 1558, -13027]
17466a3027l1168p140J240j5353K4274K5675N309m27j209j5920J2038L8292J0782
17453C3366n0984j169L4362l7416k8166J3707K3914L0707K3492l4635l0544l037
17441b6403J439n608n423J0083j3344l2534l5021k1529R765K2443K082j376O3642
17428c1784N7857J6237K6539n853J0306K3702n42j0015j2597k954n392k5278k6735
17415A3491q001j8955k5727j6163k8336P78L0345L8541M7178J8636j8854j8016
17403A4917Q26p244j4460j8050J815q827K3866K097l5120j9033L548K0601L7921
17390B857J0479k0535q700K394P810P446N888j6990p95J4789J1691j6768k8951
17377b9385M012N997J8869J0065K1201j3251k4208j5193L9297N0843J9289K778
$$ y = [-13027, -44195, -51335, -50095, -65448, -41174, -15499, -10190, -10617, -11826, -27746, -15708, 22584, 33366, -17618, -18787, 15575, -21841, -50007, -36300, -12386, 18321, 41813, 7178, -23366, -26403, -24964, -30572, -35995, -25912, -39256, -71790, -106811, -128340, -118575, -96132, -94050, -95426, -31784, 26073, 42310, 68849, 62996, 73302, 97004, 96462, 86447, 73850, 70896, 65504, 40226, 13491, 5490, -13465, -39192, -55355, -83691, -82913, -52568, -14027, 33151, 51787, 32933, 14917, 15743, 8499, -5961, -24011, -22196, -31023, -7157, -5060, -40180, -59213, -55665, -35064, 2857, 13336, -7199, -15899, -13505, -5695, 1751, 7639, -9351, -10146, 4643, 16334, -434, -29385, -25373, -19376, -507, 9558, 30759, 17508, -6700, -21893, 17404, 68247, 87536, 90314]
17365I0314j4351j3286j7187j7000k3357j1721J3837k0442j7438l2670k1431J9897
17353f4835j295M758K9580K6412R132k0865J280k3110j2594q575J6811K4507L1693
17340A2899L5698J4708j8037k3501l2247n365K1789N1523O2771K5872l0566j1014
17328A04530L3663J1704k3200l7235j3339J6867L202K718k8765k9976l0935K5143
17316C4377O6245J0847m2496R849L0666j3772m86j6885k6755j4739k046l4619
17304A86J7157O7465J2228k2714l4277j8609M50l562K265k6001k9534r852o72
17291d5470L8942K3612P5O49J2285j2090m4866l0802J3381R317J5514J6603K0186
17278A7336J3655j4988m1593n6895J283L2626K6232K9352q639k2336j626K7644
$$ y = [90314, 75963, 62677, 45490, 28490, 5133, -6588, 7249, -13193, -30631, -63301, -84732, -64835, -66130, -61372, -31792, -5380, 3752, -17113, -15833, -38943, -51537, -60112, -43301, -18794, 12899, 48597, 63305, 45268, 21767, -10480, -15845, 5944, 57467, 120238, 146110, 115544, 104530, 138193, 149897, 126697, 89462, 76123, 92990, 96192, 98910, 70145, 40169, 9234, 34377, 100622, 111469, 68973, 78822, 109488, 95716, 95230, 78345, 51590, 36851, 34805, 186, 17343, 84808, 97036, 74322, 40045, 21436, 21886, 18324, 20589, -5412, -34946, -44798, -45470, -6528, 17084, 17159, 17808, 30093, 18003, -26863, -57665, -44284, -34967, -19453, -2850, 17336, 30991, 16003, -25590, -82485, -81202, -48576, -22344, 7008, -1631, -23967, -25593, 2051]
17266B051J9056J5827K7888j7073l4141k8606j2715K1134L7238Q29j9678n170
17254F640K042k608k254j83J3482k1864l8660n385K7820M5958N1688O059l5320
17241D7415k5724m9322n2054j9542N168M3938K9222j5831j913R587j3084k4905
17229f7045o196l335J9702L6711K9407J7085K6014J0935k2235k6823l3356k2220
17217d1356K636O560L3212M3814j198m5016l8933l676J6870J2146m91k0781j0548
17204d6761Q800K0919L8029q848m4582p204J3650J237O716J8128n264R381J3420
17191A7621K1899J3509k9034l0392L976j4600j5870j6220O378L2224K0356K2362
17179C2209K1856J2827J6048K543j5847k6767m3831k907R632k778k8954m5697
$$ y = [2051, 21107, 36934, 64822, 47749, 13608, -14998, -27713, -6579, 30659, 31488, 11810, 6640, 8682, 6074, 3820, 3637, 17119, -4745, -43405, -48790, -20970, 24988, 76676, 82735, 47415, 21691, -27631, -79685, -99227, -94059, -50121, -20899, -36730, -38643, -29056, -42140, -67045, -73241, -76576, -56874, -20163, 9244, 26329, 52343, 63278, 41043, 14220, -19136, -41356, -38720, -32160, 1052, 44866, 43668, -1348, -40281, -43957, -27087, -14941, -15432, -36213, -46761, -37961, -17042, 20987, 12139, -32443, -39647, -25997, -24760, -18044, 84, -5180, 4201, 17621, 39520, 53029, 23995, -6397, -2421, -17021, -32891, -49111, -42733, -10509, 9847, 32209, 54065, 66892, 82940, 85483, 69636, 42869, -962, -3869, 5763, 2985, -25969, -71666]
17167g1666j7614o669K3211L4183M4889J0926n504k3696n2418m227J3580M0212
17155a4793J5529m077J8017k0177l9278J0260K1157K8631O062k0571j2495Q23
17143a0912L5056K1708K0070L3162O732n272l8234m3172k52K4726k916j5393q562
17130A6741p308k6373j7874K1134M9261N482k5482k9320k3864j8589r66R110j1298
17117e9346l0480J5281L4040M1864M83k5521r216n717p272n744J5098J2618K435
17104b1477j1448R155K1880L5960K0213q837m970K5300j2445n7193j4575m693
17092b3130Q808K1406K4297Q113K12J1319q427Q752J2052k6797j9320p215M260
17079A4330m636m237J2959J7668k4179K4651M0164K3876k0613m017J2711j991
$$ y = [-71666, -89280, -95949, -72738, -38555, 6334, 17260, 11756, -11940, -64358, -68585, -55005, -14793, 736, -3341, 14676, -5501, -44779, -34519, -13362, 15269, 21331, 760, -11735, -10912, 24144, 45852, 65922, 99084, 105816, 100544, 62310, 19138, 18886, 43612, 40696, 25303, 16741, 9433, -16940, -34814, -13680, 35581, 41063, 15581, -13739, -37603, -56192, -57158, -48048, -59346, -89826, -74545, -40505, 1359, 1842, -23679, -32895, -38612, -45884, -51628, -36530, -23912, -21477, -32925, -23770, -1890, 34070, 54283, 45446, 40476, 65776, 53331, -3862, -18437, -23130, -14322, 7084, 31381, 39494, 39706, 51025, 42598, 51350, 63402, 36605, 17285, 10070, 14330, 9694, 5457, 18416, 36084, 11905, 36556, 76720, 100596, 79983, 75966, 88677, 86686]
17067H6686J7496j2827m3139j9265L359K0458r318K416J307p432Q854J4419J5798
17054G8812J9225k1500j7164K0482N2749K306n4122m8038j6859K5370j3074l3138
17042d951k9039l029K3144K1187J7220k1514k1655Q96J928K2362M246P379J9432
17029C7606o692K3667K8442L261m2676j8650J3584k1298m2793o298j7730j4677
17017f4254O657M659j04J174R346P945k6773j7344K4807M1478L9392j831l2027
17004f875k2258j8532J77J249J1179j9669J2533j1560l5856L8045N0498K624k9258
16991b7703k3502j981M4108L4429j883j5699J1423q178j2730J4110k45k270J883
16978A1762P621K6740l0344n4541k0546J2821L535J037q587K5827M8318j201j0839
$$ y = [86686, 104182, 91355, 48216, 28951, 32310, 52768, 43450, 45866, 47173, 39741, 48595, 63014, 78812, 98037, 76537, 59373, 79855, 132604, 134910, 80788, 32750, 15891, 41261, 28187, -4951, -33990, -37019, -13875, 7312, 24532, 3018, -18637, -17741, -15813, 6549, 10795, 18174, 37606, 30914, 54581, 83023, 86284, 43608, 24958, 38542, 17244, -25549, -31847, -49577, -64254, -57597, -52938, -53042, -51868, -42522, -34577, -61350, -78694, -53887, -12409, 26983, 25152, -6875, -29133, -47665, -47488, -46239, -35060, -54729, -42196, -53756, -89612, -51567, -1069, 1555, -27703, -51205, -53186, -9078, 25351, 23468, 7769, 19192, 11014, -1716, 12394, 12149, 9879, 11762, 19383, 46123, 15779, -38762, -59308, -46487, -42952, -41915, -50502, -24675, 23643, 22442, 11603]
16965A1603r280j9344j0110R280J7698j8592m5974j2199n456j5551O326L0122
16953f1477J8921J6553K5521K5805j908R279L5568J0945j4066J1833N467m0698
16941D1743n0144k4675K1956K0211l4155l1072N857M449J941O760m939K188K3522
16928a6358O866j111O3789J1237m6446o440P444L6811J2628J7535M5419l481l3758
16915I4135l0216l353K4951Q543m710k6710r703m0430o4521j8129J540j7110p276
16902i2989J8061J1267K6598M6100J8470q467L0595L3961m939n8135p8148j4922
16890g2548L4259l100q683K6559L8319L1806L2336K1345l2096n3293k0617K3616
16878A7903j0591l7727Q85L2976M5573L0092m0113m1127K3462N5452J8800j4967
$$ y = [11603, 2323, -17021, -27131, -17851, -153, -18745, -64719, -76918, -82374, -97925, -91599, -61477, -42556, -26003, -482, 25323, 23415, 32694, 68262, 79207, 65141, 76974, 82441, 41743, -8401, -33076, -11120, 9091, -25064, -56136, -50279, -45830, -43889, -37129, -42068, -39880, -16358, -9492, -10603, 53186, 64423, 17977, 11537, 18981, 55792, 68420, 85955, 131374, 127893, 94135, 63919, 60566, 85517, 94060, 89350, 62640, 52937, 12507, -52014, -70143, -68603, -85713, -92989, -74928, -63661, -37063, 9037, 27507, 19040, 49635, 83596, 78657, 20522, -57626, -72548, -38289, -41389, -50072, -23513, 14806, 46612, 78948, 100293, 68197, 14904, -5713, 17903, 7312, -30415, -29530, 3446, 49019, 79111, 38998, -2129, 21333, 76785, 95585, 80618]
16866H0618m3548m4529m0440o144Q382L6652M6434j1599l0217k4981r238J2622
16854b5988N917J2295m147q816P037l892l0175P651J5732k3939j1788J0658K698
16841d6757L623Q33M164k875j704k5638k2297p117p441L3896L1360l5186k5717
16828a00856k316J8005M7070L3901J2560k0938O292J9535N177p922o919Q617o672
16815E534k0589l0044k7431k091L6746J0386J883J4548m4296l8570L8771L8252
16803a6901K9003K6837M2985L5702l0686l9151K4998R206l4079l6636j3715K608
16791A71J5686R788k8119k4173K144L7604K3476j4465j1940J5733L4239l444J8935
16778G5635J0638k8387j0093j2538j0000k303J5924J5033J3028J4774M56k3253
$$ y = [80618, 37070, -7459, -47899, -54043, -45661, -9009, 37425, 25826, -4391, -29372, -38610, -25988, -20071, -7776, -11923, -20739, -13702, -17594, -47769, -40118, -24386, -48325, -60113, -49455, -46757, -43134, -42301, -38137, -41012, -42716, -68354, -90651, -97768, -105209, -71313, -39953, -75139, -100856, -103172, -85167, -38097, -4196, 8364, -12574, -6282, 13253, 18430, 10508, 3589, 12206, 5534, -15055, -45099, -72530, -74621, -37875, -27489, -25606, -11058, -55354, -93924, -55153, -16901, 12102, 38939, 81924, 117626, 86940, 47789, 72787, 81993, 47914, 11278, -2437, 171, 15857, 25645, -2474, -26647, -24503, 13101, 36577, 22112, 10172, 25905, 60144, 56700, 75635, 86273, 57886, 47793, 35255, 25255, 22952, 38876, 53909, 66937, 81711, 82167, 58914]
16766E8914k1728K570k0006l2430o028P769k6204o392j5416l2344J0535K4237
16754e6523M122J9729L0244L3584J0430m4265m3059k2839j5871L0625M7199K9913
16742B3289j3371j9246K881M4015J6589O661M724l51m806j6417M017K356J1431
16729F1772L1305K1552Q612M703J0543j2743m1241o1846l1930r586K4779M4870
16717E0790L4725P83k9458k9354p768J6717K2941M114k0754k7281l6688q525L321
16704b6437Q049K9782J467m2509l8965o841K5229O273J5342j314k5034K890K0204
16691c1864N1332K8036l4j1912R24p145j6015k056r504j1666J3707J4933k0818
16678b082q321p069O405k44l7179k6820M5361M1681k15L26J5474K3204J5751l429
$$ y = [58914, 37186, 39756, 19750, -12680, -18708, -10939, -37143, -43535, -58951, -91295, -80760, -56523, -52401, -32672, -2428, 31156, 41586, -2679, -45738, -68577, -84448, -53823, -6624, 23289, 9918, -9328, -6447, 37568, 54157, 60818, 65542, 65191, 60385, 43968, 47985, 50341, 61772, 93077, 114629, 123241, 127944, 138487, 125744, 84503, 22657, -9273, -18859, 5920, 50790, 85515, 86298, 56840, 27486, 19718, 36435, 59376, 63490, 42736, 15455, -21233, -29758, -26437, -18388, 11394, 12861, -29648, -68613, -75454, -50225, -43952, -28610, -29924, -54958, -52068, -31864, 19468, 47504, 47470, 35558, 36482, 29337, 13322, 11266, 1762, -9904, 3803, 18736, -2082, -10403, -17472, -11067, -11311, -48490, -75310, -29949, 11732, 11517, 11843, 27317, 50521, 66272, 62843]
16664F2843j065K1949j6905l8778k4725o71k7183k9247N63K9154O1973L0061Q87
16651F8856k4109k0235K8614m453n7190j1251K861P188K5174L0055k4372m2277
16639b1139J665L1303L1104j6536o6875n8505l0604J4944K8415J7658Q928K4396
16627c5246M0292K4939J9744j0862n5290k4859K4475J8017j464j2834M655N8166
16615D9733K6082k7918m2013j4516l845J186J0901J5071K3275J7886l5247o5791
16603d5196k3826O898m766m521J7078N9554M1648j4606j5577j2434P847J4127
16591B6226K2664M459l597J1272j5317m475p049q515j0115P59k2094m2963O221
16578d2524M0025o285j8227J50M2023P5964K50p9013o9452j2993K6848J9019J4381
$$ y = [62843, 61778, 83727, 66822, 28044, 3319, 2648, -24535, -53782, -53219, -24065, 37908, 67969, 68856, 44747, 24512, 53126, 48673, -8517, -19768, -16907, -9719, 15455, 45510, 21138, -21139, -19474, 11829, 42933, 26397, -40478, -98983, -129587, -114643, -86228, -68570, -59642, -35246, 5046, 29985, 49729, 38867, -16423, -41282, -16807, 1210, -254, -13088, -8433, 49733, 75815, 47897, 5884, -8632, -12477, -11291, -390, 14681, 37956, 55842, 20595, -45196, -69022, -62124, -66890, -71411, -54333, 5221, 46869, 32263, 16686, 4252, 12099, 26226, 48890, 53349, 49752, 61024, 45707, 41232, 34183, 25668, 15553, 16312, -5782, -48745, -42524, -2499, -8784, -27011, -26861, 15162, 91126, 91376, 12363, -57089, -70082, -43234, -24215, -9834]
16565i834K053J7215J7004M186j7005j0383q899k9148k8584J273Q734O605K8621
16552a8162L1081J2790R06q455m1926m119j4259m4314r57K8661J1988J4888K3753
16539h125J399j5305R792r929o655O397L5079J6257k6721Q904J7379m2574l5469
16526d9571K913O802j2782j6294J4710M4013J4935l0256J8862L7935K5801J4133
16514G1201k1150l0364l9830j4071J9395K397k573q024l3625l5621l17K0479j2543
16501h4646j507J8584n341L670K4691M995j9932j5892q092l630K9235L2514P246
16488a8105j0984L180K3525L7221M2370n342k3990j7409K121k1066j9065p647
16476a5191J4555L447p546K0263k141l9689L76K6602L1157L9163M457j6930l7049
$$ y = [-9834, -7781, 9434, 26438, 30624, 13619, 3236, -5663, -34811, -63395, -62122, -53388, -46783, -18162, 12919, 25709, 26615, 18160, -23766, -27885, -42144, -86458, -87415, -58754, -46766, -31878, -8125, -6726, -22031, -12239, -22168, -28823, -22426, 12653, 28910, 2189, 11093, 28472, -14102, -49571, -46658, -39856, -52638, -68932, -54222, -10209, 4726, -25530, -6668, 31267, 57068, 71201, 50051, 19687, -20143, -34214, -14819, -12422, -14995, -23019, -56644, -92265, -92582, -72103, -84646, -86153, -67569, -72910, -69240, -44549, -39554, -59486, -75378, -83470, -87100, -57865, -25351, -18105, -29089, -25909, -2384, 34837, 77207, 71865, 47875, 30466, 32587, 11521, -7544, -15191, -636, 2811, -4735, 15528, 13387, -26302, -25926, 676, 31833, 70996, 75453, 58523, 21474]
16463B1474M265J8235K904J2633k0385m0476k7762L4024O078j7011R271J7530
16451B0780q304p796m479l5273l4986k518J9776J8659j5739j6122J6354L3387
16439a6261M2466J5606k9965l1464m5273J0319L2101J6935L9158L8639J1308K7360
16427A10929R958J5204j3703j3989k4486l6929j0779M727l0053m1295k3017J2732
16415d0701j938J3337L5199K0324K343O737J9863R7l7680j0818Q215M568K7717
16402D7263J8104N21l0666n3799m2294J8209M2261j5689l4431q783k2109j8071
16390i9484K759R897R155k4398o1574k2374N0594M2899r747j4536J6462N5375
16378d4972M9033j411m0998k2723j267O703L3436K3446N443R35k0979M066K1380
$$ y = [21474, 25739, 43974, 46878, 59511, 39126, -1350, -29112, 4912, 10990, -6021, 3250, 20780, 12476, 4680, 201, -35072, -70058, -72576, -52800, -34141, -49880, -66002, -49648, -16261, 26205, 41811, 11846, -19618, -64891, -54572, -22471, -5536, 33622, 72261, 83569, 110929, 120887, 136091, 122388, 108399, 83913, 46984, 36205, 40932, 10879, -30416, -53433, -40701, -42639, -29302, 5897, 26221, 28564, 35301, 55164, 55261, 17581, 6763, 14978, 19546, 47263, 65367, 65888, 35222, -18577, -60871, -42662, -401, -16090, -50521, -59304, -81413, -99484, -96725, -86828, -77673, -102071, -163645, -186019, -135425, -92526, -102273, -116809, -100347, -44972, 4061, 2650, -38348, -61071, -62338, -55635, -22199, 1247, 6690, 7625, -13354, -9288, 12092]
16365A2092j9303r118K6560L4684o667l7252l2344k2538k32K1633k590j731L4502
16352b304p893O219K5505J9258Q797K7123j685j4803n85j6778N889N890j9558
16339C5075j6442o613l4248k3662L403K2449N1734L3656q931o629p584l8991k5449
16326b2232J332L6019N5909K6090p248o754j1205k9018j4573q079q945M0322N5582
16313A07200j31k7078k4203n4805l0245K0314K3811j526k0817P420M1064j2238
16301B8766m1339k3156m086l6379k0174K1483M6127M6738K5494j2974j0458J9509
16289C9551M5965K4367j7945l7891n2567m3674k9957p671o80J0774L6854L1570
16277a304j009l0170J4200K6000J9507k877j8604j1809j2406L499P419k7370k4535
$$ y = [12092, -7211, -16329, 10231, 44915, 38248, 996, -31348, -53886, -54118, -32485, -35075, -36806, -2304, -10197, -3978, 21527, 40785, 49582, 76705, 75020, 60217, 59632, 42854, 48743, 54633, 35075, 18633, 12020, -22228, -45890, -42487, -20038, 31696, 65352, 56421, 49792, 42208, 3217, -22232, -20900, 15119, 71028, 97118, 89870, 83116, 71911, 42893, 28320, 20241, 11296, 51618, 107200, 107069, 79991, 55788, 983, -29262, -8948, 14863, 13337, -7480, -60, 41004, 28766, -12573, -35729, -39815, -76194, -96368, -74885, -28758, 17980, 43474, 30500, 20042, 39551, 85516, 109883, 91938, 54047, 1480, -42194, -72151, -79822, -80502, -69728, -32874, -1304, -2313, -32483, -18283, 7717, 27224, 24347, 5743, -6066, -18472, -14973, -7554, -34924, -59459]
16264e9459n535K0395Q19j170K3786K1135O158J6976k1057m5875j2822l237k8821
16251h8707r639K795K7913L2199K9634l138l201n968j0487j8839p561j5681m1091
16238a11771K729N4660J5108j0953L2186L4202k7207k1674J3277J3687l5998o1344
16226a03098l4953M6431L3988L5101L3321k6278l7733R384M556j7264J4043K267
16214d0235J5872K271m2288l6310L3250K4480N048J469k1458k6521K9125L5732
16202a9565K8560L8218j261L637M683j0766K940K0882J7046J0042r810j5070j0981
16189E8555l6625j8118l4135k8452J5178L9046K0269j0250k1445k6251k1263k3774
16177h7265n699J1188J0789K2340r016l0727o469L6562p787l1060K8182M1934
$$ y = [-59459, -64994, -44599, -43780, -44950, -21164, -29, 6129, 23105, 2048, -43827, -56649, -59886, -88707, -98346, -95551, -67638, -35439, -5805, -8943, -12144, -18112, -28599, -47438, -54999, -70680, -111771, -109042, -54382, -39274, -50227, -18041, 16161, -11046, -32720, -19443, -5756, -41754, -103098, -138051, -91620, -57632, -22531, 10790, -15488, -53221, -43837, -39281, -56545, -42502, -40235, -24363, -22092, -64380, -100690, -67440, -42960, -37912, -36443, -57901, -84422, -55297, -19565, 8995, 47213, 45952, 49589, 54272, 43506, 46446, 67328, 84374, 94416, 84606, 69536, 58555, 21930, 3812, -30323, -58775, -43597, -4551, 15718, 5468, -15977, -42228, -63491, -87265, -92964, -81776, -70987, -48647, -57663, -88390, -94859, -58297, -66084, -97144, -68962, -27028]
16165b7028n150k0180r627o162N252k2523j9031R142n913j5591j3922m039M4236
16152i0536O0293K2919k7001j0137L5813K8004O007L601j4707O382K1723J1859
16140E4220J3338m111k2385p097p549j6387l4747l0181j0647p891j5164M249K1549
16127f2803J6289K8754R311J620k946r810j5262K7386L5180n563k4491k6796l3077
16114f2208k6092K8464P1664P6805L5687k6915m3844k3128p489J480J5302m379
16102C5347j6156O709k0305o472K108l0931m9854k7015J1005r825j2252L1711
16090h5930N1587N1314K8283J466L173P705o829k1936l1820N578J3188k8320j8294
16077c0835n831o329O335J9747K6376N0127K1757N2012L9926k9847l5101j3468
$$ y = [-27028, -32178, -52358, -61985, -68147, -62895, -85418, -104449, -95307, -101220, -116811, -130733, -134772, -90536, -30243, -7324, -34325, -44462, -8649, 19355, 25362, 28963, 14256, 20638, 42361, 54220, 67558, 63447, 41062, 33965, 26416, 10029, -24718, -54899, -65546, -73437, -88601, -84352, -62803, -46514, -17760, -8449, -6829, -9775, -19585, -34847, -7461, 27719, 22156, -2335, -29131, -62208, -88300, -59836, 11828, 88633, 124320, 97405, 53561, 30433, 22944, 24424, 39726, 35347, 19191, 25900, 5595, -877, 1231, -29700, -79554, -106569, -95564, -105389, -117641, -85930, -34343, 16971, 45254, 46720, 49893, 57598, 50769, 28833, -2987, 2591, 15779, -12541, -30835, -36666, -42995, -36660, -16913, 9463, 59590, 81347, 133359, 173285, 143438, 108337, 94869]
16065I4869q602j1246p818k6360m8363p027N594l7374l1902L745j701K3690K2546
16052b9949k8644O294K8908J7838M8630L1911l9474n4641n8546l2824K5614L0565
16040e4318M5459L3529k4374m3538n5K3400N1849K5640j056J4852j9725m0208
16028A1455M209p970p2243l72N4660N781r629o270J8048j3728j4517l396j7908
16015e1880J0286K0047j6940N994L7527L3591J6446O028o126j8054P99j5829k5519
16002c630L8767L5399L723k4911P082J3903m493k7510q9650p6079j6894P790K9929
15989a06574K9465L1566M8916K3094L0918J9597j812J7283J7301k2670j0001R30
15977G8013L0945J3595n7911l6846m421J2609J1475k668J0748L8167L842k1978
$$ y = [94869, 86267, 75021, 67203, 40843, -7520, -14547, -8953, -46327, -78229, -74484, -76185, -52495, -29949, -58593, -52299, -23391, -5553, 43077, 74988, 35514, -19127, -77673, -110497, -84883, -54318, -8859, 24670, 296, -43242, -43297, -19897, 31952, 57592, 56536, 71388, 51663, 11455, 15664, 7694, -64549, -64921, -10261, -4480, -14109, -20379, -2331, -16059, -30576, -33972, -51880, -41594, -21547, -38487, -32493, 5034, 38625, 55071, 61099, 54973, 36919, 37718, 21889, -3630, 35137, 70536, 74259, 49348, 56430, 70333, 65840, 38330, -51320, -127399, -144293, -136503, -106574, -77109, -45543, 3373, 26467, 57385, 76982, 75170, 92453, 109754, 87084, 77083, 78013, 108958, 122553, 64642, 27796, 23375, 35984, 47459, 44791, 55539, 93706, 97548, 75570]
$$ [...]
##END NTUPLES=NMR SPECTRUM
##END=
