##TITLE=C13_LR-746-R-H-BtOAc
 CDCl3, 400 sc

 18.2.2022
##JCAMPDX= 6.0         $$ Bruker NMR JCAMP-DX V2.0
##DATA TYPE= NMR SPECTRUM
##DATA CLASS= NTUPLES
##ORIGIN= UXNMR, Bruker Analytische Messtechnik GmbH
##OWNER= root
$$ XWIN-NMR		Version 3.5
$$ Fri Mar 18 11:51:46 2022 Russian Standard Time (UT+4h)  she@DPX200
##.OBSERVE FREQUENCY= 50.327896
##.OBSERVE NUCLEUS= ^13C
##.ACQUISITION MODE= SIMULTANEOUS
##.ACQUISITION SCHEME= undefined
##.AVERAGES= 401
##.DIGITISER RES= 17
##SPECTROMETER/DATA SYSTEM= spect
##.PULSE SEQUENCE= zgpg30
##.SOLVENT NAME= Acetone
##.SHIFT REFERENCE= (INTERNAL, Acetone, 0, 222.961)
##AUDIT TRAIL= $$ (NUMBER, WHEN, WHO, WHERE, WHAT)
$$ ##TITLE= Audit trail, XWIN-NMR		Version 3.5
$$ ##JCAMPDX= 5.01
$$ ##ORIGIN= Bruker BioSpin GmbH
$$ ##OWNER= she
$$ F:/spectra/data/she/nmr/c13/1/pdata/1/auditp.txt
$$ ##AUDIT TRAIL=  $$ (NUMBER, WHEN, WHO, WHERE, WHAT)
(   1,<2022-03-18 11:50:53.90 +0400>,<she>,<DPX200>,
      <created by zg, POWCHK disabled, PULCHK disabled
       terminated by command 'halt'
       configuration hash MD5:
       00 E9 B6 7A A2 85 ED C7 34 08 36 98 17 FE 4E 26
       data hash MD5: 32K
       6D 1B 58 39 C5 F7 57 0E E1 DD 96 D1 30 34 60 0A>)
(   2,<2022-03-18 11:51:00.81 +0400>,<she>,<DPX200>,
      <Start of raw data processing
       efp BC_mod = 2 LB = 1 FT_mod = 6 PKNL = 1 PHC0 = -319.1677 PHC1 = 27.16232 SI = 32K 
       data hash MD5: 32K
       C3 41 2D E2 33 7D C2 9F 7B AC FC 04 A5 30 E9 C8>)
(   3,<2022-03-18 11:51:03.35 +0400>,<she>,<DPX200>,
      <abs ABSG = 5 
       data hash MD5: 32K
       0A 21 6C 57 28 49 D4 11 B6 45 A5 35 87 1A 59 C6>)
$$ ##END=
$$ 
$$ hash MD5
$$ C9 E7 ED 28 2C 60 8D D3 36 AF 02 78 61 E2 80 DA
##$RELAX= 
##$RELAX= 
##$RELAX= 
##$RELAX= 
##$RELAX= 
##$RELAX= 
##$RELAX= 
##$RELAX= 
$$ Bruker specific parameters
$$ --------------------------
##$DU= <F:/spectra>
##$EXPNO= 1
##$NAME= <c13>
##$PROCNO= 1
##$TYPE= <nmr>
##$USER= <she>
##$AMP= (0..31)
100 100 100 100 100 100 100 100 100 100 100 100 100 100 100 100 100 100 
100 100 100 100 100 100 100 100 100 100 100 100 100 100 
##$AQSEQ= 0
##$AQ_mod= 1
##$AUNM= <au_zg>
##$AUTOPOS= <>
##$BF1= 50.322709
##$BF2= 200.13
##$BF3= 50.322709
##$BF4= 500.13
##$BF5= 500.13
##$BF6= 500.13
##$BF7= 500.13
##$BF8= 500.13
##$BYTORDA= 1
##$CFDGTYP= 0
##$CFRGTYP= 5
##$CHEMSTR= <none>
##$CNST= (0..31)
1 1 145 1 1 1 1 1 1 1 1 1 1 1 1 1 1 1 1 1 1 1 1 1 1 1 1 1 1 1 1 1 
##$CPDPRG= <waltz16>
##$CPDPRG1= <>
##$CPDPRG2= <waltz16>
##$CPDPRG3= <>
##$CPDPRG4= <mlev>
##$CPDPRG5= <mlev>
##$CPDPRG6= <mlev>
##$CPDPRG7= <mlev>
##$CPDPRG8= <mlev>
##$CPDPRGB= <>
##$CPDPRGT= <>
##$D= (0..31)
0 2 0.00345 0 0 0 0 0 0 0 0 0.03 2e-05 3e-06 0 0 0 0 0 0 0 0 0 0 0 0 0 
0 0 0 0 0 
##$DATE= 1647588554
##$DBL= (0..7)
120 120 120 120 120 120 120 120 
##$DBP= (0..7)
150 150 150 150 150 150 150 150 
##$DBP07= 0
##$DBPNAM0= <>
##$DBPNAM1= <>
##$DBPNAM2= <>
##$DBPNAM3= <>
##$DBPNAM4= <>
##$DBPNAM5= <>
##$DBPNAM6= <>
##$DBPNAM7= <>
##$DBPOAL= (0..7)
$$ [...]
##$SUBNAM4= <"">
##$SUBNAM5= <"">
##$SUBNAM6= <"">
##$SUBNAM7= <"">
##$SUBNAM8= <"">
##$SUBNAM9= <"">
##$SW= 239.972175391363
##$SWIBOX= (0..15)
0 1 3 0 0 0 0 0 0 0 0 0 0 0 0 0 
##$SW_h= 12077.2946859903
##$TD= 32768
##$TD0= 1
##$TE= 0
##$TE2= 300
##$TE3= 300
##$TEG= 300
##$TL= (0..7)
120 120 120 120 120 120 120 120 
##$TP= (0..7)
150 150 150 150 150 150 150 150 
##$TP07= 0
##$TPNAME0= <>
##$TPNAME1= <>
##$TPNAME2= <>
##$TPNAME3= <>
##$TPNAME4= <>
##$TPNAME5= <>
##$TPNAME6= <>
##$TPNAME7= <>
##$TPOAL= (0..7)
0.5 0.5 0.5 0.5 0.5 0.5 0.5 0.5 
##$TPOFFS= (0..7)
0 0 0 0 0 0 0 0 
##$TUNHIN= 0
##$TUNHOUT= 0
##$TUNXOUT= 0
##$USERA1= <user>
##$USERA2= <user>
##$USERA3= <user>
##$USERA4= <user>
##$USERA5= <user>
##$V9= 5
##$VALIST= <valist>
##$VCLIST= <CCCCCCCCCCCCCCC>
##$VD= 0
##$VDLIST= <DDDDDDDDDDDDDDD>
##$VPLIST= <PPPPPPPPPPPPPPP>
##$VTLIST= <TTTTTTTTTTTTTTT>
##$WBST= 1024
##$WBSW= 4
##$XGAIN= (0..3)
0 0 0 0 
##$XL= 0
##$YL= 0
##$YMAX_a= 2736576
##$YMIN_a= -707197
##$ZGOPTNS= <>
##$ZL1= 120
##$ZL2= 120
##$ZL3= 120
##$ZL4= 120
##$ABSF1= 222.961
##$ABSF2= -17.03589
##$ABSG= 5
##$ABSL= 3
##$ALPHA= 0
##$AQORDER= 0
##$ASSFAC= 0
##$ASSFACI= 0
##$ASSFACX= 0
##$ASSWID= 0
##$AUNMP= <proc_1d>
##$AZFE= 0.1
##$AZFW= 0.5
##$BCFW= 0
##$BC_mod= 2
##$BYTORDP= 0
##$COROFFS= 0
##$CY= -3
##$DATMOD= 1
##$DC= 0
##$DFILT= <>
##$DTYPP= 0
##$F1P= 0
##$F2P= 0
##$FCOR= 0.5
##$FTSIZE= 32768
##$FT_mod= 6
##$GAMMA= 0
##$GB= 0
##$INTBC= 1
##$INTSCL= 4.134877e-10
##$ISEN= 128
##$LB= 1
##$LEV0= 0
##$LPBIN= 0
##$MAXI= 10000
##$MC2= 0
##$MEAN= 0
##$ME_mod= 0
##$MI= 0.1934396
##$NCOEF= 0
##$NC_proc= -4
##$NLEV= 6
##$NOISF1= 120.0001
##$NOISF2= 80.00006
##$NSP= 0
##$NTH_PI= 0
##$NZP= 0
##$OFFSET= 222.961
##$PC= 1.4
##$PHC0= -319.1677
##$PHC1= 27.16232
##$PH_mod= 1
##$PKNL= yes
##$PPARMOD= 0
##$PSCAL= 0
##$PSIGN= 0
##$REVERSE= no
##$SF= 50.3227146458226
##$SI= 32768
##$SIGF1= 140
##$SIGF2= 120
##$SINO= 11.81781
##$SIOLD= 32768
##$SREGLST= <13C.CDCl3>
##$SSB= 0
##$STSI= 32768
##$STSR= 0
##$SW_p= 12077.2946859903
##$SYMM= 0
##$S_DEV= 0
##$TDeff= 32768
##$TDoff= 0
##$TI= <>
##$TILT= no
##$TM1= 0
##$TM2= 0
##$TOPLEV= 0
##$USERP1= <user>
##$USERP2= <user>
##$USERP3= <user>
##$USERP4= <user>
##$USERP5= <user>
##$WDW= 1
##$XDIM= 32768
##$YMAX_p= 390331380
##$YMIN_p= -21524783
$$ End of Bruker specific parameters
$$ ---------------------------------
##NTUPLES= NMR SPECTRUM
##VAR_NAME=  FREQUENCY,     SPECTRUM/REAL,   SPECTRUM/IMAG
##SYMBOL=    X,             R,               I
##VAR_TYPE=  INDEPENDENT,   DEPENDENT,       DEPENDENT
##VAR_FORM=  AFFN,          ASDF,            ASDF
##VAR_DIM=   32768,         32768,           32768
##UNITS=     HZ,            ARBITRARY UNITS, ARBITRARY UNITS
##FACTOR=    0.368581032318806, 1,           1
##FIRST=     11220.0027064323, 0,            0
##LAST=      -857.291979557962, 0,           0
##MIN=       -857.291979557962, -21524783,   0
##MAX=       11220.0027064323, 390331380,    0
$$ Real data points
##PAGE= N=1
##DATA TABLE= (X++(R..R)), XYDATA
$$ [...]
9333 5708839 4907817 2368645 -322387 1275937 871945 -2413015 -1182121 2069857 2336807
9324 2336807 823866 -1454388 -3801118 -2638604 -2544204 -3217709 -3965128 -2374238 -380324
9315 -380324 -1209641 -2033308 -2850733 -5283421 -4734658 -3772894 -5503719 -8116820 -14332433
9306 -14332433 -17248906 -16236254 -13235052 -12385285 -10031539 -5949030 -2372817 171003
9298 171003 -1369038 -4772647 -7911684 -8815706 -8664347 -5503224 -2601829 -2498552 -5599200
9289 -5599200 -8896236 -8356247 -4473901 -508629 487487 933849 2548320 2186261 -632664
9280 -632664 718370 5152099 6145330 6713043 8367592 9409717 9400359 6167289 524911
9271 524911 -2301814 1599502 3969792 3177774 1508041 2634714 1071376 -2034140 -2336765
9262 -2336765 -4611144 -6142056 -2949194 242256 1397495 -587740 -2937730 -602721
9254 -602721 2910974 4321050 2836699 116882 -320441 -1660556 -3655257 -344445 2865002
9245 2865002 3550734 2825463 -354407 -7249511 -10084405 -5481225 -1981018 -256821 3307909
9236 3307909 3592493 1457668 1318374 1948420 5460076 7476421 5020954 3426418 4159728
9227 4159728 5086242 1021662 -341058 1807623 -752732 -2663128 -1436674 966712
9219 966712 759278 805368 3094906 5771254 6427680 5812987 3478151 1791594 2618913
9210 2618913 3956863 4045066 4702531 4998396 4753413 2839983 1789751 3240366 3764511
9201 3764511 5236787 3895717 -827208 -3447638 -6765279 -6229261 -2190306 910732
9193 910732 333312 -4495535 -7805449 -8242581 -5923712 -5388613 -5454384 -3279230 -1620152
9184 -1620152 295817 4333725 8698851 8471382 4513751 4150614 4550843 1648277 -5353710
9175 -5353710 -8081128 -9504960 -12207289 -10502599 -6273373 -1623517 -395965 -3195258
9167 -3195258 -2908020 -3379559 -5744793 -6468649 -4519505 -939432 2366583 693949 77347
9158 77347 -4143091 -8907667 -11013583 -13571075 -13010528 -6662598 3854047 8487153 6009319
9149 6009319 4256358 2243888 -1675213 -5744836 -10174617 -13133822 -12264123 -11374606 -8345662
9140 -8345662 -2508720 2185158 4828007 4430630 3668374 1728759 -331547 -3110756 -6429332
9131 -6429332 -10135719 -12482173 -5688330 173756 846494 222102 -2184423 -1211544 -446993
9122 -446993 1821478 2104943 -1884725 -961202 2626059 1554436 -2174884 -2383525 -1150815
9113 -1150815 -732001 996803 2405684 -1386091 -5069565 -6600142 -6841986 -4946723 -2590673
9104 -2590673 -1536845 -2029618 -240245 3428894 6310511 3952902 304189 1207088 2396232
9095 2396232 77913 -1623662 -2318973 -3822631 -1405028 3487837 4821782 5228001 4124197
9086 4124197 2505108 1223133 -232267 -552710 -5357831 -7720511 -3981404 -1764156
9078 -1764156 -1642436 -3521273 -1553234 780925 -891610 -3307634 -4229745 -2352906 209347
9069 209347 233266 1249399 4136605 3709594 2177319 4215188 7727110 7811618 7925873
9060 7925873 10080369 11389422 13105317 11632245 10128930 12156469 14658135 16342115
9052 16342115 12717281 5722417 305758 -1129642 -5130401 -8039833 -8110606 -7351544 -3431088
9043 -3431088 924064 942259 -1564348 -1382451 -846958 -1178442 -239846 -3209137 -9132330
9034 -9132330 -12965322 -10147161 -4464052 166123 2578814 702226 -2077129 -2043237 -2541026
9025 -2541026 -7724396 -7609447 -1788778 -612929 2691018 6218882 6660520 7141226 8654590
9016 8654590 11157807 9051348 4741165 115858 -1667096 -334243 -1411978 -7040164
9008 -7040164 -5368358 -1288393 -2341454 -2714549 -2488911 -5443018 -7400731 -6146842 -5884493
8999 -5884493 -4514871 -405339 2438885 3918472 4085424 1916176 -62157 -3018895
8991 -3018895 -6387747 -8324458 -9192966 -10419824 -11291023 -9441882 -6070007 -2231438 -2072122
8982 -2072122 -5830866 -8480183 -7534696 -8547056 -8632070 -8134238 -5367225 -2360414 -3309557
8973 -3309557 -3377911 -1981074 -6568 766035 -231250 -1278076 -3137843 -538217 4301831
8964 4301831 6578903 8598145 10149484 9255619 7308038 6058505 7319295 8330989
8956 8330989 3427336 -2335675 -2329070 -392753 1836862 1631217 -130068 -1914564 -652438
8947 -652438 2621606 3048446 4630938 5565714 2434274 102751 1597171 5217327 5232099
8938 5232099 848536 -3854426 -6798642 -6005601 -2473462 -615751 -1003188 -2771422 -4780798
8929 -4780798 -9689473 -14431468 -15212149 -11895466 -8569795 -8529704 -7713154 -5624977 -2566407
8920 -2566407 -1139210 -1207776 960383 1945490 2574272 2100515 -514317 2105294 1767509
8911 1767509 -2345030 -2225607 -2105832 -1522580 -224071 428645 2419460 3753133 1502
8902 1502 -1683124 50842 4415427 9064527 10730478 12795926 10751298 10121521 9274262
8893 9274262 8485295 6901616 2433460 1937353 1657999 121639 324292 -1919337 -2874573
8884 -2874573 -1651965 -36866 1124123 1272480 2443319 4245421 6771911 8084251
8876 8084251 6619899 2852326 379941 243099 711212 -1937040 -2413322 269766 3396330
8867 3396330 6566006 6079886 5685124 4242115 3054417 976809 -1587167 -2312450 -4473123
8858 -4473123 -5741380 -3111122 -2590049 -1281034 3635458 4631294 -66476 -4687827 -9308021
8849 -9308021 -13016325 -13568134 -12128149 -11326101 -10817525 -8413797 -3734071 777528 3323591
8840 3323591 1683091 -446601 -1007345 -1016501 -1649970 -2475993 -2106110 -2658417 -599157
8831 -599157 5584106 5952261 629289 -5250275 -7638441 -4501847 -4162740 -5234673 -3342236
8822 -3342236 -275564 -600197 -4864058 -8114796 -7899841 -6959701 -8541695 -8388990 -3719401
8813 -3719401 608266 1317151 444489 -3852133 -4040675 75684 2194338 624039 138673
8804 138673 220560 -921561 -1950756 698093 4780920 5767061 5616171 6238008 6948465
8795 6948465 4519879 -1310144 -8465206 -10520737 -9138782 -10336402 -8843335 -6738442
8787 -6738442 -1956253 3054174 8063245 10928071 12835109 12411880 8013209 6393420
8779 6393420 8868501 9359877 4672413 1983729 -1202081 -2538800 -456024 399677 -880325
8770 -880325 -546669 242960 -833193 -708221 -1029988 -1970836 -2417889 -1899420 -2395835 -5176531
8760 -5176531 -5439379 -5057892 -3736906 -2399818 -797411 3319059 6194633 1299560 -7606180
8751 -7606180 -10484893 -10185766 -11125583 -7668069 -4024567 -2386666 -6612398 -8960144 -6432389
8742 -6432389 -1988028 -386265 -1558606 1756458 5943604 2483328 -1906441 -1886267 940778
8733 940778 1981777 3133894 3092376 1310689 -1884592 -4611047 -2664644 -1558608 1446583
8724 1446583 970605 -5700239 -9541105 -8653425 -6565710 -5730657 -5147680 -5179405 -3293044
8715 -3293044 1032240 2909374 2356625 329317 287915 540826 1109894 135608 -3029111
8706 -3029111 -5236899 -6178684 -5181682 -912025 3487584 2894148 2934114 2939630 1014862
8697 1014862 1057544 -2623809 -3320642 2689294 5150000 5369270 6704326 8437985 5717553
8688 5717553 2281043 -1666384 -3421979 -2096825 20642 -1026342 -2803770 -1562955
8680 -1562955 -4583513 -9163965 -9656276 -12063564 -12920156 -9690597 -6412366 -2964757 435353
8671 435353 2209443 3767467 4507901 1482422 1426092 461496 -1333812 2092597 4715848
8662 4715848 -240127 -5177154 -7068573 -8426265 -9513881 -11515622 -9313043 -4110867
8654 -4110867 52884 295848 -2928423 -4454973 -1188702 -1059341 -1681517 -1874598 -2569963
8645 -2569963 -3650101 -4688220 -4721249 -5087570 -5505252 -2697373 5775903 9064678 9139515
8636 9139515 8170875 5625256 6525950 4959236 3930681 4302466 4056082 3155906 3224240
8627 3224240 4897879 8247979 10430966 8517234 4595533 6455469 8295030 7331631
8619 7331631 8439350 6042677 -2958346 -8243013 -6969925 -5442396 -5874784 -7771221
8611 -7771221 -1978895 5343560 8919934 8919648 7680023 8533451 6530509 1937508 2675788
8602 2675788 2944648 -81930 -3842235 -5301331 -4628757 -1993309 303145 2099915 3889405
8593 3889405 3281565 1712631 1118437 3541339 5275371 2284590 2761973 4356166 1010654
8584 1010654 -2322255 -3178570 -1428711 -428932 -1903520 -2108262 -2632409 -1406215 1248834
8575 1248834 3456848 -610389 -5756648 -5003856 -2045748 -1723806 -398280 -641578 -958230
8566 -958230 -2703962 -6729005 -10317166 -8758904 -5975580 -2773632 -1550050 -1361545 1214726
8557 1214726 3619251 4527453 2571397 -778396 1057238 5320810 8956383 10102881
8549 10102881 9705417 9290001 6091814 3492997 4558171 6504191 2625668 -354748
8541 -354748 -12160 3451113 9418672 12740610 14921734 15997871 15457826 17192804 13128576
8532 13128576 5306465 1413791 1818704 3207361 1473788 -3969597 -9758649 -12056106
8524 -12056106 -10676849 -10126183 -7162986 -4277656 -3085221 -1589026 499596 646445
8516 646445 1195856 -534369 -2751615 -2994269 -2820473 -3350252 -1790175 -34193 -447813
8507 -447813 295067 -861631 -4236417 -6766792 -7779283 -3962039 -477658 -2904831 -4507999
8498 -4507999 -6017369 -9033129 -11806343 -10393251 -8869779 -9398138 -11033204 -7104687
8490 -7104687 -125907 1476734 852018 -1079654 -3395974 -5928404 -7236061 -9175572
8482 -9175572 -11242267 -7972105 1083721 5995818 5098863 2858272 -656871 311483 -894906
8473 -894906 -5830087 -8968914 -9020195 -7282542 -3225123 3731412 4975041 2884976 832957
8464 832957 1889255 2811078 1325965 1116747 200149 -1188486 484913 1353928 3794817
8455 3794817 5085565 4692915 2482025 -353499 -2477934 -4921360 -1722724 2661984
8447 2661984 1166247 -4372493 -8663532 -7816564 -1972199 1474304 3500205 3095562 759077
8438 759077 1126126 4967216 8915933 16333650 25350343 34146506 42397822 49160248 62360377
8429 62360377 88587579 129290745 177246458 194495282 160109873 116418657 81812515
8422 81812515 58442657 44604294 37738379 34695449 31140725 28834153 24384387 20202797
8414 20202797 16965998 16885201 16173592 14855466 13477496 10000729 6006759 3179786 1458793
8405 1458793 2593388 2992733 2668909 3294470 3858707 6681688 8092099 7250718 2928735
8396 2928735 411517 988419 2363807 6658442 8983801 8676088 8775139 9721558 8044851
8387 8044851 7119050 7952596 8136822 9935157 10167319 7758055 6979058 6854546 2972245
8378 2972245 970609 2961781 1083000 -370130 220182 872933 392751 2412313 4343851
8369 4343851 1075431 -4488972 -5171967 -3012146 -4530632 -5645619 -685049 305562 -3408113
8360 -3408113 -1697507 2457456 2089786 -10895 1871637 5048487 9419154 13787686
8352 13787686 17812584 17675816 13710267 12638027 9244831 3571745 -866921 -2360573
8344 -2360573 -1109409 2713460 3237233 2457083 3070752 2270517 2709825 5158383 3645065
8335 3645065 -1007294 -3841769 -4098749 1249710 6573477 9350791 10080653 7925893 2278745
8326 2278745 -2570946 -3323784 -2534668 645554 2952616 2947569 4144321 3496323 2235443
8317 2235443 32148 -1172075 -3530931 -5704087 -1106944 2203839 1733232 -1419150
8309 -1419150 -1926255 -1386145 -4853888 -6482224 -2546740 1107031 2334821 5490455 7026272
8300 7026272 4652522 3848022 5239431 6027974 3976488 -2081168 -4898180 -3509511 -2354721
8291 -2354721 -3722286 -4872341 -4330180 -4101621 -5990637 -6838793 -9789743 -10934622 -8027124
8282 -8027124 -5427412 491930 6219534 6656810 326394 -4847237 -1669653 571433
8274 571433 -220502 -4448148 -7884514 -9144653 -6345113 -8341540 -12006962 -8543614 -3616295
8265 -3616295 -1039972 -159982 -619851 -2342597 -3804351 -4642743 -4085662 -2380013 -2195248
8256 -2195248 -2597457 -890281 255329 891727 3289111 4929366 5476794 5774282 4670889
8247 4670889 3620341 2720292 2708773 1414721 -1127573 -786699 1705473 3449146 3379559
8238 3379559 1322339 3204876 5489948 3536304 926367 -2805030 -4344584 -2080051
8230 -2080051 519716 784322 -1954963 -4209177 -3450507 -4533051 -4485129 -3923680 -5422668
8221 -5422668 -4887731 -1526786 1052805 2845441 1727491 1001197 3413402 6135215 7583254
8212 7583254 5769036 3948329 4813594 6933209 5764161 1706322 -1933001 -1617526 -482360
8203 -482360 1909692 6656487 10960620 11437696 8933538 3997342 -691987 -5369303 -6036917
8194 -6036917 -1523828 1033882 -555548 -2509159 -3492523 -922069 2501842 4078346
8186 4078346 5927423 6100947 2970344 -2251896 -3633474 -3269179 -2213828 446021 2985319
8177 2985319 1285985 -3213234 -2885143 -2540691 -2265045 -1300551 -2302438 -2112621 1231455
8168 1231455 2910634 3262541 2483919 976109 -672925 55763 -2543956 -4879584 -3106644
8159 -3106644 -1022518 696212 2047657 4143694 3607479 3926733 4601067 4191825 1245116
8150 1245116 -2906310 -6928300 -11514151 -12539259 -9625683 -5887813 -5554483 -5131051 -2181280
8141 -2181280 -1987627 976901 2523307 5041354 7727972 7841816 7585667 7179665 5345550
8132 5345550 4694366 6555854 8594147 8618860 10754663 10378469 6985141 2267910 -654847
8123 -654847 -590332 -3484490 -5621456 -5068896 -1253343 3516644 3802980 4208503 4194416
8114 4194416 4913532 6600270 3888971 495412 953992 1784201 420537 505229 -1121541
8105 -1121541 -4089216 -5060047 -4475831 -5743182 -7053707 -9413908 -9543575 -9662782 -10619503
8096 -10619503 -10873736 -10278313 -10357799 -10767961 -3940413 3510922 7166863 12061309 18261848
8087 18261848 22095071 23007882 31310572 44293573 56828798 75372652 111295059 161857178
8079 161857178 194845705 174563335 129433699 95262893 73193729 58189641 49211976
8072 49211976 44512770 40399189 32632472 25538274 19580727 15024224 13675642 16686329
8064 16686329 18230518 16278036 14600268 14089874 11910613 6472517 3673362 5064776
8056 5064776 8965709 13205002 14899810 12219064 7108152 1013069 -2890440 -4180298
8048 -4180298 -3479061 -4231462 -4155169 -2187638 2532238 6408688 5997064 4673930 2980192
8039 2980192 1854969 5290860 6532203 5151475 6516828 7948841 4410536 3272038
8031 3272038 5421571 7877462 8717948 7623460 8757795 8593727 4914496 4116109 7347381
8022 7347381 7605047 7347841 6754985 6270151 5617887 4230191 2926124 -359934 -278771
8013 -278771 1317729 2438739 1485478 -1496649 -1062806 -409568 -591093 233752 2946430
8004 2946430 6853021 5600235 3171466 4048170 5112726 6924076 7232773 8229914 8780695
7995 8780695 6351726 5150156 6038955 2401285 -808040 653118 3674979 2327034
7987 2327034 -3345500 -5054250 -5780119 -7690155 -6288472 -2102880 664148 5699904
7979 5699904 7044243 6600628 7790193 4366339 833380 -125765 -3303166 -4465620 -3239916
7970 -3239916 -1039362 2713948 6115906 8492661 10952924 12742601 12626745 9997566
7962 9997566 8208122 8996748 7453268 4391686 1555177 3008953 4851877 5847008 4081161
7953 4081161 -70357 -2494561 -3447601 -1748852 -615712 477804 1484369 4296062
7945 4296062 8046662 7252951 5961496 4637194 3127997 4053587 6144127 8731091 7776197
7936 7776197 5728578 4829140 2960878 753867 -575716 -2037734 -453268 1824147
7928 1824147 1578982 580160 191499 -969039 -1900255 -2478438 -5934776 -5195095 -2251339
7919 -2251339 1062963 5453846 8694859 11359595 9619222 4475147 -1153052 -5835353
7911 -5835353 -7175936 -6037752 -821015 3207637 715272 -4708032 -4748873 -4042909 -3871316
7902 -3871316 -3699522 -4049519 -4725680 -6456812 -2252946 1016240 1155604 55999 1500889
7893 1500889 2830429 1383264 -218255 -2511323 -3695537 -1580931 1622283 3372048
7885 3372048 3541409 -405476 -1357572 38234 -86271 -3088801 -4725990 -5068485 -5585207
7876 -5585207 -6092906 -1956060 506001 -607707 2623284 5983309 3028817 -1711285
7868 -1711285 -3928310 -3867961 -580212 1567458 4116239 5416985 2810492 -926386 -1759507
7859 -1759507 1229086 3600530 5731813 8617151 8406324 6889177 4942798 2249185
7851 2249185 3438555 6017767 10041767 11711182 10259531 9532156 7745163 6959289 5893948
7842 5893948 4085402 -260036 -6666005 -10574568 -12061523 -12794910 -13412985 -10181481 -6364605
7833 -6364605 -8142898 -9674001 -8544680 -5963163 -2854580 -461453 893408 1555995
7825 1555995 4153568 6964744 5742396 2093450 2535293 2813452 2067533 2126693 433761
7816 433761 883460 1399703 1728994 1524147 26314 -3982293 -6399785 -4475450 -2168589
7807 -2168589 574000 3831300 3844204 1096205 -2239684 -3516435 -2278762 -3466552 -8305694
7798 -8305694 -9520402 -6373356 -1818844 -511840 -2856894 -6614452 -6727686 -5647244
7790 -5647244 -7937867 -10805393 -10361025 -8656482 -7467786 -10261548 -12529867 -6850367
7782 -6850367 -1221859 -308221 2032441 7131318 4991907 -2039017 -6161009 -6388559 -3955521
7773 -3955521 -2716190 -5084348 -8638645 -6949192 -2985214 -2699845 -3855931 -1801479
7765 -1801479 2768247 3532085 1346310 187423 -791302 -4168999 -7383628 -5576983 -5926896
7756 -5926896 -6752566 -4554117 -3349258 -3519668 -2062036 188251 3324827 5490430 5236593
7747 5236593 5687479 6938627 9400963 8739968 8259269 8400731 9659402 11617159 9930781
7738 9930781 4831235 472550 2511922 3885351 3977946 3964766 4661488 5211503 1479352
7729 1479352 849173 2623230 1648960 1638195 -550034 -522994 688915 -3756968 -6694278
7720 -6694278 -4895859 -524299 4015689 2120926 -1036628 -1149828 -1709692 -371756 1458773
7711 1458773 -1172117 -3586144 -3365486 -3347978 574853 1660426 1528901 2528359 3595544
7702 3595544 4189547 1285310 -2015362 -4141029 -7478067 -8623771 -4733847 -706213
7694 -706213 813131 435157 447812 3553626 6651698 7454966 5631140 2177592 -1193616
7685 -1193616 -1577122 -507614 958708 -2208474 -6349436 -2051625 -747143 -1027290 -1999031
7676 -1999031 -1526861 -1105662 -1231650 -1073135 -1476196 -3330784 -5162318 -4299302 -1189588
7667 -1189588 1408582 -592907 -4410083 -4972948 -1228102 3471226 614248 -2196494
7659 -2196494 -3025652 -3307188 -1354255 -616139 762018 2476647 1778499 -2985959 -7395090
7650 -7395090 -10111404 -7580210 -3038058 -2226212 -1905336 -2541321 -3764325 -5563241 -3925877
7641 -3925877 -1562035 -3754645 -4961904 -2657744 2361189 3519828 1518165 2212320
7633 2212320 4548638 5112625 7642976 7206317 2480779 1623780 4395930 4342684 3147533
7624 3147533 794325 -3576563 -3914092 -403168 2033509 3015543 3655495 5001568 2839256
7615 2839256 948394 3581308 4590151 4905402 5270011 3921116 723062 -3368113 -1383292
7606 -1383292 -667545 -1654931 1808009 5613750 5937729 4596907 3695181 5652009 7354881
7597 7354881 6849827 7391801 6754490 3725848 381770 -1349315 1398444 3844429 3540369
7588 3540369 -845116 -6332325 -5094296 -2565333 -2371852 -2165002 -3197280 -1736089 -1684258
7579 -1684258 -3790069 -6717263 -8450814 -10832053 -14462670 -15467824 -13238509 -7368993
7571 -7368993 -3093429 -5758192 -6529137 -6431891 -6489967 -7151468 -5520586 -5001283 -5599472
7562 -5599472 -5798446 -7011828 -6540340 -3220622 3253761 6450915 2695799 -740133 -2283702
7553 -2283702 -6247195 -7372117 -3946366 2154775 7175409 9216727 9339014 12912149
7545 12912149 13283593 10243591 8018508 6459252 1727471 -1355970 572365 3186697
7537 3186697 3597242 4063988 3644779 2958541 1325862 -1873568 -1758188 -47710 1553165
7528 1553165 1848996 2840721 3605236 4113125 4822263 5148181 4397531 3685937 1684678
7519 1684678 2441036 5029053 187323 -3417901 -1725659 -148638 2782137 5206791
7511 5206791 4395904 1556514 2166264 7257974 11242351 10829398 3135655 -3419347 -4527065
7502 -4527065 -2739741 -1509188 -1441803 258681 2204987 3728085 3670414 1789776 1514029
7493 1514029 681469 -1144040 -2582060 -6585479 -9223467 -7071696 -7130003 -11065780 -9720908
7484 -9720908 -6465865 -4090101 -2375637 -1305738 -1267606 264075 2306909 4417071 5174033
7475 5174033 8241265 11367833 8655418 3842052 3843248 8119753 8913704 5583946 1313425
7466 1313425 -1582852 -2236396 647431 4668893 7490323 5923215 4758568 3975030 4206002
7457 4206002 6492801 9722482 10075825 9288361 8391243 7143367 3119267 2152644 2369212
7448 2369212 2046719 279448 -3581480 -3989345 -1747234 210993 716564 3762090 4729688
7439 4729688 1392419 -2136495 -1719501 -1207761 -3542909 -6990388 -9676289 -8856993 -7388927
7430 -7388927 -7070446 -7455021 -6882350 -5315053 -2379070 107343 -2312415 -2839538 -853581
7421 -853581 -79018 1061003 1216333 -618264 -928002 1264571 4567581 4910250 3848364
7412 3848364 2654840 5366017 8313348 7330548 7930408 7735234 4510073 4629078 5699777
7403 5699777 1304602 -3414411 -4308821 -3402267 -2801319 -2970836 -2667211 -1152256 3360374
7394 3360374 7549843 6000121 4021845 1612597 1267112 1160779 -2076806 -6332747 -8798107
7385 -8798107 -6270734 -4463713 -6161603 -4414381 -1972981 -602558 -817621 -1434231 -1477645
7376 -1477645 -3872508 -5178705 -5679867 -7037460 -7143471 -1881463 2393007 1666901 -1995812
7367 -1995812 -1758475 277343 -4124507 -4781930 379300 3971941 3898634 4882742 5774876
7358 5774876 7028842 3697792 -1753373 -4329390 -5548321 -6694152 -6604219 -7036915 -5077918
7349 -5077918 -1238902 -48700 -1820504 -5045501 -6523719 -9513276 -8324558 -4904811
7341 -4904811 -4505823 -5385145 -5716161 -6852895 -6886169 -3325435 977836 1777326 -31451
7332 -31451 671873 2504940 -706334 -6168922 -6687187 -6363935 -5829996 -1937138 1855143
7323 1855143 3576256 4026874 2474237 -1273224 -3164967 -3890812 -1818124 1465283 4747404
7314 4747404 4811877 3381777 5696028 3982793 627893 -105531 445510 1796493 4240007
7305 4240007 7469879 11385214 13942084 13308343 9957550 7545117 5806278 3127564
7297 3127564 1040454 -251128 2466614 2759325 1708995 2378046 3081126 1518712 927280
7288 927280 3194580 3120241 3490827 3482708 2505707 2331394 2622966 1620880 -854666 -1364073
7278 -1364073 -538751 585408 2854429 1423574 1168356 4689276 6851035 2180422 -1385462
7269 -1385462 -1735860 -3113294 -2668485 2952689 5892480 2154858 -2516377 -4315204 -3180068
7260 -3180068 4562909 9903050 9234560 5944896 1706328 -628547 -900064 145902 -3066122
7251 -3066122 -6013193 -4772462 370126 6936447 11286034 10047473 8468855 6811420
7243 6811420 4251225 3752361 3692882 -104611 -3940418 -3155917 737266 2225575 -1182334
7234 -1182334 -492388 1686516 4826286 7425524 7782525 4585517 -89485 -1114018 -892634
7225 -892634 389931 1650326 4297596 8943997 8598022 4936041 3919750 8297851 9949124
7216 9949124 6574243 3899630 1865414 -669684 -1665897 -1507015 -3771728 -4622382 -1336214
7207 -1336214 2814438 4567695 5082074 5003109 4532056 4211317 3581028 3560520 2354283
7198 2354283 2198418 5130902 6221083 3246639 490082 2239632 4686201 5414240 4872175
7189 4872175 4705411 1140899 -2018084 -2639578 -1030852 2718228 5357230 5312142 2246040
7180 2246040 1303580 2151753 -280826 -2258159 -1963836 -1508547 -2520094 -1396802 -2448888
7171 -2448888 -6482404 -10127971 -9019663 -5749664 -3655672 -2087719 -1851192 -4935263
7163 -4935263 -4270686 -2365844 -3562238 -7249979 -9294300 -8417230 -7996540 -7580539 -6534814
7154 -6534814 -4973505 -3817513 -1694329 -1722533 -3893629 -4109772 -3110396 -1513803 2233261
7145 2233261 4737017 4366452 770132 -3084625 -6192163 -4481232 -1784968 -4640499
7137 -4640499 -9204628 -12952731 -11928597 -4208649 4541892 5867920 3520224 1755752
7129 1755752 -1291229 236606 2578924 3148856 3492832 2755281 2312740 3855526 7856224
7120 7856224 9768825 8853585 6234543 5541721 7063291 6035821 7096197 6530500 2189792
7111 2189792 -1488762 -4239444 -4191653 -1112453 2774967 3182995 3311027 1530165 -1215705
7102 -1215705 -518900 2445342 1140079 -2872245 -3455434 -2524752 -2718144 -2779140 -194660
7093 -194660 2632488 4656410 4720710 3978965 6587981 7901188 7222840 6313003 5504272
7084 5504272 1290938 -3820048 -7614345 -7446829 -3775334 -1099016 -495939 -579870 -1750812
7075 -1750812 -3932334 -9746434 -12729238 -9663713 -8962719 -6005848 -4619433 -5197831 -4227990
7066 -4227990 -4865384 -4677853 -5220539 -3390444 -707780 3448286 5346670 3195415 4097401
7057 4097401 5993329 6007110 3090998 1196230 1410380 2677032 1918796 1404893 737821
7048 737821 -114274 -613823 1734140 8438172 11802246 12812108 14455516 11975779 8691729
7039 8691729 8821223 7654635 4444783 3443746 4494991 4515435 2980366 -1261768 -6292355
7030 -6292355 -8105568 -7268086 -6315549 -1444262 3368805 6258801 6429318 5589676 4450520
7021 4450520 3582443 2926967 1518263 2087087 4093141 2069326 -2102525 -2297088 1523301
7012 1523301 4968577 5170355 7593403 13149092 17291556 12227893 4679585 1563347
7004 1563347 -216320 613169 353255 1141879 92368 724244 2613175 2710686 3161047
6995 3161047 5421663 6269662 5573221 7648277 8040593 7066459 4778903 3916628 6383491
6986 6383491 6073559 6011507 8413010 7885908 9522184 8945734 6067786 4340409 4510848
6977 4510848 4234039 5957796 9817245 11704744 7664246 4967253 3718982 2781981 2122707
6968 2122707 2957126 3165893 3938679 3144174 2638552 3448393 3340446 1501619 -1021318
6959 -1021318 -2264725 -1022254 1016844 1915842 1965225 3024356 2572564 1800135 1220960
6950 1220960 3079352 8652004 10679421 7328926 2959874 795074 1874781 5361356
6942 5361356 6063850 9240304 10806629 9153310 7812962 7269066 3492322 -1556570 -4821862
6933 -4821862 -4219126 1660198 7278296 8722631 6280400 6029901 4593138 1599550 -1442768
6924 -1442768 -3239742 25968 4494929 6120362 5710269 5186304 4561140 4270896 3524301
6915 3524301 2252542 394178 -1126663 -4068400 -5019249 -2426410 393535 6474685
6907 6474685 8454852 4791128 2619718 4365439 5993708 4705478 1630463 1149834
6899 1149834 1924034 1867210 -208708 -1218197 -3693973 -3192302 -810463 -3803187 -5732008
6890 -5732008 -4553075 -1126888 1804322 1090108 -193798 -1714471 -1138120 2650394 2962734
6881 2962734 2822404 5949273 6399927 5053156 3385591 -678265 -1402197 35415 -379805
6872 -379805 -3463728 -4588226 -486827 3013555 5562350 9198738 9945240 6837523 4674192
6863 4674192 4344364 780502 -4302561 -6792137 -3973998 -613526 2457442 5305518
6855 5305518 4636952 4242202 4388255 2590247 2523337 -205434 -2259450 -2952641 -3394013
6846 -3394013 -4267068 -3206788 -2092687 -2652763 -2878309 -1489963 1519042 599969 357973
6837 357973 1215167 -829796 -2344697 -4139594 -5408132 -4469271 -1085556 1402456 324056
6828 324056 -1365062 -1415978 -1642097 -3273880 -5479522 -6816630 -4924561 -1588585 1460918
6819 1460918 6076899 8172099 5496129 5434462 7135063 6828850 6426331 5309598 3863552
6810 3863552 4391424 4472907 574579 1171673 2904850 1085712 -543697 509837 1620619
6801 1620619 3863107 4010744 2504406 -308937 -813812 -1704988 -4747276 -2154405 -1246352
6792 -1246352 -2329250 -909027 -1112137 -3235903 -1687739 -60050 590613 1797902 3348982
6783 3348982 3907919 6598720 8553487 6436833 3740742 4582121 4955126 3078574 2088595
6774 2088595 755721 458814 5034509 10054622 9498173 7302410 6981045 8204308 10969805
6765 10969805 8456069 5405526 4884127 3889515 5080809 8959674 10018512 7392222
6757 7392222 6470402 7491301 6146067 5077317 4773565 3397294 -703329 -1594282 612485
6748 612485 2073520 1803984 -1302495 -4040821 -2855379 -2474391 -3759641 -3346468 -762149
6739 -762149 -551645 -3023065 -4471731 -4873209 -3585665 -1434369 -492719 -1281619 -2137736
6730 -2137736 846057 4384807 4059627 4291187 6264796 9139394 10873088 10397035 5486944
6721 5486944 1576702 1349417 1533404 5002938 8979016 8791880 7731389 7897887 9347305
6712 9347305 5467589 2586624 1347557 1800207 4736880 5294266 3368381 999048 -195255
6703 -195255 3063877 6732377 5997712 2571183 1638927 999576 -2734248 -2176253 -868622
6694 -868622 847935 4539282 5496414 4158281 863714 -1086659 255138 2307675 3159669
6685 3159669 974887 -1919318 -3175691 -4446609 -7194794 -10047946 -11496554 -9684421
6677 -9684421 -6927445 -3998758 -1650123 2917899 7450063 6237622 3102103 3166608 930850
6668 930850 -3914047 -3559443 -5602147 -8067868 -4364949 -2959123 -1439601 1683218 3370481
6659 3370481 782356 -4668317 -6679917 -3841243 849361 1415535 -5587877 -13522600
6651 -13522600 -15793404 -14309821 -8089970 -2017372 72439 3830817 5835229 4640270
6643 4640270 5827673 4029637 951550 2717164 4404825 3536939 4688908 6848924
6635 6848924 6309121 3882559 4140502 6957727 5250404 1389443 1372600 3070169 5720249
6626 5720249 7770065 5394058 1176040 -2878199 -2037982 956108 2217519 3156154 1059958
6617 1059958 -1382171 -861470 3934149 9006161 11572901 11062398 7915728 3697811 1174707
6608 1174707 1022421 1876926 2076343 3552079 4535265 4252092 4815290 3756752 -664867
6599 -664867 -3348129 -1913295 31516 1629273 3004468 2256350 -2900594 -6077231 -4814973
6590 -4814973 -2724976 1552656 3157837 2251329 1706996 568808 61053 -618001 -3043100
6581 -3043100 -3028499 -1850105 -2099508 -4467878 -1104616 7037223 8533733 3260056 -1924034
6572 -1924034 -3224778 -3672602 -2203180 580025 2364133 60323 -3717096 -5751745
6564 -5751745 -6009145 -4010019 -1418021 -936555 260870 2505543 4877960 4511522 2069019
6555 2069019 -693247 -1586114 -4411866 -9366064 -9859021 -7135860 -3194696 -437764 2062670
6546 2062670 5457018 5594212 292135 -1505558 -1210135 -6078482 -8611034 -5380080 80355
6537 80355 2755289 2616673 2755826 2257455 -2556075 -6786153 -6170416 -3279573 -3806604
6528 -3806604 -7275073 -8405148 -9246105 -8854817 -5301895 -2210451 1659777 5636219 8337202
6519 8337202 8645666 8821916 5667348 3560664 6343673 8265518 7809383 2284406 -2582027
6510 -2582027 -2562782 -1907227 -3789029 -5498812 -6591749 -6244531 -5775408 -7007205 -7127079
6501 -7127079 -4114437 -1580739 -64540 1536049 3912860 2569509 -1442686 -3000482
6493 -3000482 -1883400 -2135739 -4014975 -8375026 -13435016 -12109249 -9566380 -7498464
6485 -7498464 -7078916 -4950274 -3570302 -1068660 3068967 963744 -326822 -1727139
6477 -1727139 266840 6406443 8452578 5198706 -88719 -5508808 -8248389 -6533696
6469 -6533696 -3497131 977375 7542977 8662904 7337303 8308963 11239766 11740385 8416991
6460 8416991 6741240 3951013 1355305 3069675 2912957 -2872029 -5633879 -1414101
6452 -1414101 4883202 5899802 6491099 7072008 5236569 3914681 4295261 3382968 1705577
6443 1705577 -1071602 -1848827 1726843 3472085 2080290 1351195 2859444 4442295 3972403
6434 3972403 1284987 -416780 -1564951 -2427849 -4292805 -1804149 4001700 4061470 1666410
6425 1666410 775759 2507221 6235073 11042055 15009501 14443792 12482281 15690874 15849181
6416 15849181 15532750 16457185 16620666 17083090 15420134 15020073 16876086 18831228 17690376
6407 17690376 14452566 10852500 7661520 5083899 2039048 -1428565 -1078901 1161279
6399 1161279 1309942 -1634355 -808938 2496365 3775435 6185635 7396804 4908218 2346158
6390 2346158 -288238 -4623629 -5280507 -4368518 -4809809 -5693355 -5732423 -6852748 -6663053
6381 -6663053 -2461276 540573 3917453 6951156 6683552 3101555 2678514 3854027 3246459
6372 3246459 6673941 11385781 14275316 14586322 11747340 5168495 -3513295 -6636453
6364 -6636453 -7190043 -5310755 -1754329 -673409 -1161100 215606 -118736 1623085 4389201
6355 4389201 3574594 185999 1745251 7081575 10868367 10895528 7095612 3907245 2145549
6346 2145549 1625950 6961995 9136367 5806173 4475596 5017555 5281238 5919971 6371436
6337 6371436 7121384 3882620 -1719428 -5636408 -5854267 -2815714 757198 4365312 5391656
6328 5391656 4271539 4524753 5947262 3506217 355814 -3484265 -5190524 -1975716
6320 -1975716 2413743 970750 -1538393 -3794617 -4875517 -4895183 -5273759 -5240345 -4056888
6311 -4056888 -3083097 -5059646 -7391638 -7008941 -5214120 -5538289 -2721179 291116 111579
6302 111579 -2558245 -4865738 -4289587 -2225960 401136 -1434178 -426582 3983013 8767607
6293 8767607 8090043 4288865 4837340 6276948 5727597 2908407 367441 531019 -1540500
6284 -1540500 -3550207 -4629781 -6654592 -6959461 -7091324 -3836977 -105982 2034929 1073779
6275 1073779 -262079 -571800 -1368177 -1819403 -165753 5208966 9704150 10064598 6947104
6266 6947104 4119985 3668407 3898769 4153559 3553377 5447226 5849635 3387407 4778262
6257 4778262 6625270 6689251 5810806 3864748 700346 1929307 5318603 3578468 -1080761
6248 -1080761 -2933969 -3625623 -4356582 -5425476 -4134588 -2746085 -4040163 -5690865 -6326724
6239 -6326724 -7245048 -4410287 -1055581 873566 1630936 -1000535 -4012635 -2306145 1191576
6230 1191576 2599440 4183748 2295453 -509848 2982826 6187196 9512093 11084429
6222 11084429 12357206 13303385 8405137 5079455 2970241 3473743 5737069 3855689
6214 3855689 528639 -1299131 678325 1890056 2739029 5255465 4187046 730835
6206 730835 -2263930 -4303283 -2023930 1927361 5268308 6213085 6226245 5370126 4614146
6197 4614146 3566197 114127 -2783832 -2592922 -1108777 -1431615 -2615711 -2654085 -4187401
6188 -4187401 -5399554 -4940223 -6648238 -7632640 -5661522 -3542898 2507883 7781122 8166984
6179 8166984 6328888 6884836 10084901 11778820 8929465 4281893 3058006 619136
6171 619136 -5166444 -6902197 -5807494 -5416593 -2765708 -1548527 -3913335 -4844364 -3068584
6162 -3068584 -2020482 2858490 6237741 3924006 -1296359 -4352414 -6248700 -3767273
6154 -3767273 354930 3278756 2724250 736500 2388292 4235216 2781135 2399175 2283581
6145 2283581 4737349 6900443 6808406 7685600 8979454 10816356 9958969 9454702 6835122
6136 6835122 5359904 2601171 -37733 -2200159 -2699784 76751 1527582 1810307 4230613
6127 4230613 3477528 3224057 5473281 6185940 1508484 -3981055 -5011209 -6445531 -9444227
6118 -9444227 -7403321 -4654944 -4316745 -2070300 -2070987 -3821831 -7329868 -9991370 -9082426
6109 -9082426 -7097359 -4295653 -2200012 -1951925 69779 1265169 1376150 1297043 1759272
6100 1759272 4959979 7691637 4393776 -2077313 -6746980 -3788448 668941 1369497
6092 1369497 2405680 1617918 -4245722 -7064906 -8361414 -9532788 -9762642 -9004797 -3861053
6083 -3861053 -1417740 -2499260 -2082283 1473466 1946326 1024527 474391 1186164 1960559
6074 1960559 361038 1757614 -1091666 -2763339 -956673 3403488 7885138 8792373
6066 8792373 6955821 5122575 3485065 558940 -346674 -1702220 -857313 -1804541 -4935897
6057 -4935897 -6081317 -6040232 -4573101 -3866241 -3826662 -1337578 -625366 -2389522 -4470192
6048 -4470192 -1871054 4384268 8109013 7311040 4635548 2999390 2307337 3264456 1350730
6039 1350730 1372984 4504611 3507058 2036899 2513613 2364370 2637730 3177560 2639449
6030 2639449 609706 -411749 -1619731 -2631119 -2457249 -3358069 -3804659 -268952 981213
6021 981213 -655184 -2068942 -2810187 -3509218 -3648691 -2059535 639468 1482035 61509
6012 61509 -2375409 -3268895 -4622082 -7381399 -7343330 -1950260 2058323 3882883 4221394
6003 4221394 1166896 -1667118 803650 1624633 1919342 4782353 5476740 3735127 2081897
5994 2081897 3168710 7373303 13157142 13918325 11429479 9858436 3178883 -2225119
5986 -2225119 -1386080 1166804 2578663 3514104 4547265 4140417 -261300 -2237236 -3209607
5977 -3209607 -1223642 3383493 6072358 5873745 5429290 4335938 1141001 711423 1852766
5968 1852766 2877950 4563936 4504307 1375866 -437198 -783526 -1199641 -1708939 -4278377
5959 -4278377 -4048510 -2044605 -2291295 -1861274 -623973 -2565402 -3566519 49220 836105
5950 836105 -1005380 -2040306 745881 859273 -1235745 786706 7302388 11006055 8864304
5941 8864304 3869067 1533028 -609475 -2124125 -689646 2086607 2807374 5359786
5933 5359786 5985996 6003378 4948399 909192 -357743 -2351656 -5851091 -7702040 -6557321
5924 -6557321 -1889855 2117938 4377639 4625993 2574247 4027074 4743191 4856723 6670125
5915 6670125 7457345 5702283 2886493 -238303 -1625587 -2487255 -1685654 920501 1343107
5906 1343107 -857861 526507 2384893 2020679 3143839 5175363 4494351 1422032 -568041
5897 -568041 -11874 1285548 -456868 -111801 1557695 2195638 3827544 3695156 1603243
5888 1603243 -411205 -1248553 -807069 -1151543 -4270867 -2264263 2641779 2707323 368957
5879 368957 -380573 -1833599 -2745728 -1239292 1770048 4381597 4739731 4579988 2008951
5870 2008951 -680526 -315149 -830067 -1966330 -1073449 1698954 4828794 4625033 1526787
5861 1526787 -489595 -1240081 -719840 -1104889 -2433558 -5970252 -5655132 -3640444 -3475977
5852 -3475977 -1590477 92465 4589039 9089834 8520916 3530624 907770 330744 -185520
5843 -185520 -2340478 -3644005 -2397264 285677 -192219 573001 -1325567 -6003067 -5853494
5834 -5853494 -4750474 -5640581 -5810389 -4065810 -1626924 -2554886 -4899014 -6820815 -5838657
5825 -5838657 -4928362 -813238 4514997 4969698 988557 -947493 46397 2622232 3663485
5816 3663485 2746787 -1771165 -8507721 -12286246 -12242774 -10213315 -4274886 2300017 4998294
5807 4998294 4451457 2365318 1898614 1957884 -3028388 -7828785 -7742735 -5013506 -966269
5798 -966269 1212665 -203096 -4964845 -11450748 -11647908 -8218093 -6127449 -7679796 -6639365
5789 -6639365 -3650815 -2983978 -2626071 -3637204 -3733079 -2934442 -5527356 -9934609 -12819710
5780 -12819710 -12631276 -8770482 -3948438 -1641804 -2543950 -2302004 -2077459 -2844954 -1651225
5771 -1651225 209841 -167821 -1175983 776937 4308651 4279138 302129 1088655 4969582
5762 4969582 6297128 5543110 3483420 694658 1793501 3827391 3855068 3785067 3079853
5753 3079853 4594190 2795896 -2223380 -3542590 -427211 -1774278 -7407010 -8989953
5745 -8989953 -6149390 -3377027 -2349012 -1742172 -1589567 2669497 6566731 4776192 -576856
5736 -576856 -5942320 -9123401 -9351709 -5971231 -3633641 -1244875 -1830027 -373484 4515980
5727 4515980 5018797 2473222 1861849 2584369 1182602 -1171845 1617116 5112135 5735408
5718 5735408 6699563 6412461 5081745 4201798 2116209 -2249272 -5405529 -3838043 -1635491
5709 -1635491 -2178237 -5435061 -7736010 -6250661 -4151324 -2236145 -2805712 -4153009 -5094540
5700 -5094540 -3585602 179723 4894211 7824241 7425771 7395377 8712620 6736128 365849
5691 365849 -2885132 -3076679 -3550074 -6087117 -7860317 -6090633 -3279858 -1041809 1418956
5682 1418956 4565565 3975894 -197632 -1514433 1927447 4404532 2077119 263986
5674 263986 -669752 -2535178 -3773201 -4663714 -7821414 -6835334 -4418199 -4372490 -2794440
5665 -2794440 -892719 -788951 -529671 1835157 6113636 9066537 8649161 3988099 -1331348
5656 -1331348 -5496822 -4745511 -4934388 -8985701 -13280817 -11364579 -6516054 -1332371 3016908
5647 3016908 2396673 -1100721 -1402446 324424 2261081 2680222 1619539 873919 2071437
5638 2071437 3724896 6700602 8471514 9385448 9997171 11577846 12171663 9024811 5540740
5629 5540740 2078444 878208 3436101 2697858 650389 -335323 1343056 2912363 1259370
5620 1259370 1693851 3462405 4475954 3508820 1983011 39027 -1388360 -3168860 -5922960
5611 -5922960 -6473816 -4253482 -1732395 -2653773 -3965734 292874 3460931 5544019 5055951
5602 5055951 5204811 6708434 6437588 7128797 7107688 2292962 -890032 -1112084 -4036412
5593 -4036412 83977 6620678 10172071 10154570 8095487 7792677 7288770 8383620 8818568
5584 8818568 8414464 7292954 8037707 9619846 9453827 9832961 9286034 5521925 1501910
5575 1501910 1973448 2073324 1050390 4327244 6051555 3990405 -61040 -5030108 -8113210
5566 -8113210 -4425482 3255025 7179337 7198489 6005959 7524443 7951095 6973149 8271878
5557 8271878 7946077 8323815 6482381 1161550 -4792398 -10453709 -10169394 -7750363 -7478648
5548 -7478648 -5021582 367769 6095536 8751185 6946239 -560184 -7835677 -10278305
5540 -10278305 -8471929 -5697532 -5479237 -3972393 -3752988 -5221693 -3076076 2597643
5532 2597643 7394128 9337553 7344646 3468001 2199880 2803005 2186375 2191343 2037480
5523 2037480 615158 681842 3927261 8540787 9469091 5641200 680381 -1006375 -2521080
5514 -2521080 -4004450 -4316018 -2499964 1132280 3659715 4640649 5540269 4947129 2732975
5505 2732975 480258 -159841 -1463245 -3523296 -3070671 -2553977 564004 2605113 1177208
5496 1177208 -2059717 -4896208 -7626863 -6760853 -3200833 -375349 1996632 6357329
5488 6357329 6171641 3120377 2571777 873515 -324480 -2986604 -5274012 -4266883 -3567858
5479 -3567858 -5159159 -7233701 -9411503 -8663589 -5829373 -2968234 -2308142 -3992025 -5545597
5470 -5545597 -4943613 237044 4113821 4819268 5091913 6050002 8694178 6841499 3905070
5461 3905070 8347527 11687935 7815016 8501667 11891664 8997345 2134316 -2641792
5453 -2641792 -1266263 1931660 2244617 1550380 -3292093 -6946223 -6898996 -2249865 2706207
5444 2706207 3033906 7306760 12271247 11279730 7540382 4313633 2675958 4341321 5156101
5435 5156101 4124733 1529462 -4740901 -5924403 -3012107 861186 4484067 3910137
5427 3910137 2738903 3027202 2083864 -1180206 -2840200 -1985928 579662 -41632 -2722066
5418 -2722066 -4944110 -4259217 -3069440 -3740418 -4658085 -4847467 -7056573 -9572208 -11660961
5409 -11660961 -12896696 -9917631 -7345387 -7303887 -9405870 -11193628 -10525669 -7667780 -8404078
5400 -8404078 -7194941 -3632024 730165 -519856 -5705487 -5834206 -6239034 -6854449 -3138385
5391 -3138385 -205302 -678753 40884 608730 1599932 5077739 4675444 -241826 -5636927
5382 -5636927 -8425886 -7544934 -2582614 -836653 403939 2996059 1697343 -2911918
5374 -2911918 -3924941 -1842489 1560648 1129079 -1367374 -3027175 -5583754 -5485597 -1369226
5365 -1369226 2914859 4626987 2842307 1319940 691098 1361947 3515003 3322335 4400317
5356 4400317 6789158 5640239 2625332 -778877 -3265492 -2499552 -2907911 -1266830 90529
5347 90529 -1316046 -23843 1602169 -623981 -4073202 -2365804 347152 1001523 -2663322
5338 -2663322 -5787354 -4175787 -2234855 -1771862 2732622 7292016 9312474 6766210
5330 6766210 4796523 5069559 3041175 191477 -3698122 -3539317 -3590657 -2651359 -718877
5321 -718877 562312 -252297 1288355 3065096 3347313 2460957 2242888 -375200 -5136886
5312 -5136886 -5486449 -1907619 429096 1385658 321624 2161088 5505179 6272331 4108697
5303 4108697 1715505 3079739 2249153 -3701109 -6886755 -6629317 -4334004 -1949592 1075456
5294 1075456 2994913 1122979 249061 -326528 -3697332 -6750075 -7826921 -7094646 -2947105
5285 -2947105 -3148562 -2855681 735120 1151066 2891520 4945349 2896104 -1060129 -2539420
5276 -2539420 -1646409 -2674665 -3055343 -1375907 899030 999433 -960537 -2312890 -2722227
5267 -2722227 -1601420 -449425 179174 1787934 1937185 -1549158 -3333378 -37174 5231600
5258 5231600 7201546 6212938 5569207 5766064 5588575 2169360 -2927065 -5267125 -3628854
5249 -3628854 -2893285 -571603 4710348 7299021 6193737 4168926 2752018 2598668 3042701
5240 3042701 2100276 1209535 -1484826 -1805208 -261183 -857584 -2284217 -1705617 -2003256
5231 -2003256 -3400291 -2213214 -195064 717390 1749683 2481870 4076332 2381249 -1470649
5222 -1470649 -4060117 -4887858 -5154862 -6306871 -7539019 -5775918 -3718802 -2115855 -700922
5213 -700922 -1889074 1559575 5293145 6740605 7492163 8976004 11300815 10358178 7008965
5204 7008965 3310598 1451368 -441053 -2204779 -3527022 -3807988 -3381086 -6307523 -10003003
5195 -10003003 -7664136 -3499475 -229084 415529 1339295 3135425 3437060 2138426 1174262
5186 1174262 -672130 -4291021 -2093178 1123024 5633939 9522037 8050782 2861083
5178 2861083 36692 1752040 3664110 4979735 7111868 3948713 190465 -269077
5170 -269077 -2097803 -479584 2986445 481635 -1898323 -3622539 -4847150 -5621827 -5931805
5161 -5931805 -3820594 -3554691 -2505533 -275820 -760294 -4524892 -5616875 -1506884 3334460
5152 3334460 4965101 3620513 1520327 -565170 -3221643 -2029907 385919 1376499
5144 1376499 -2004027 -6564648 -7764608 -5130114 -1652329 2085113 5211346 5349494
5136 5349494 4290791 2240510 -1038481 -2638961 -2951325 -5299014 -3706054 -1549789
5128 -1549789 -1798476 -1509381 -390582 1448962 1284523 764469 71303 -1633236 -3011329
5119 -3011329 -4433520 -5806561 -6418900 -5444282 -6883683 -8371179 -7734500 -7486421 -7464949
5110 -7464949 -8204003 -9810139 -7423376 -4810971 -5088673 -5579579 -5903446 -6449519 -5494027
5101 -5494027 -5240598 -5305751 -3359054 -3034826 -3484811 -3531094 -2474896 -5506864 -7885640
5092 -7885640 -12917245 -14233097 -8415981 -6520242 -4467873 -628279 3822995 3374996
5084 3374996 -827983 -1797328 -2259909 -4593438 -3826327 1486725 7235544 7728988 5275889
5075 5275889 6056342 6713754 4687289 3676025 5054479 6587938 8968850 10352137 7611274
5066 7611274 2806463 -2075618 -1307697 470787 -1311290 -2367069 -4420127 -5181926 -3117609
5057 -3117609 -2317477 -2153663 -2849008 -1091023 2732968 5892758 8016363 8730152 8063328
5048 8063328 3633077 1799546 3689115 4596050 3069695 3325304 8862016 12320700 12362439
5039 12362439 8905844 5340059 6105754 5882477 3345920 -760201 -2448167 -2160213 -1145333
5030 -1145333 -1179666 -1952735 -1448646 3078002 4744477 -454866 -6367513 -10060719 -10282655
5021 -10282655 -6600747 -1521169 1374482 949424 -887305 -613955 1037772 1146284 -1537426
5012 -1537426 -1554361 -3916998 -8084648 -8215248 -5839810 -5494778 -6102601 -6253595 -5595424
5003 -5595424 -1366570 1335100 387410 835157 245051 -2023842 -5942611 -9720192 -9839489
4994 -9839489 -9653425 -6208475 -502509 2942129 4479290 5798351 4412615 563929
4986 563929 -1797334 -1219918 -4365479 -3822830 1155867 4558974 6454936 6627138 5241269
4977 5241269 2730097 1797885 2386895 4855643 3877058 972102 -83031 -155029 1027007
4968 1027007 4407528 5661953 6054086 4247011 3010123 1237599 -2242913 -3217349 -2301733
4959 -2301733 1981118 7944645 8065076 7869428 5943178 2657203 1338923 3042906 22241
4950 22241 -1918166 901162 2181054 5560596 7662686 5420270 1500979 -1134305 1538593
4941 1538593 2145871 928623 184965 -1571775 -1696614 -2972601 -4893333 -7728065 -8762438
4932 -8762438 -7632234 -7307512 -5570816 -2211826 1214692 4096224 7111809 8181212
4924 8181212 3890676 703138 1517642 2318753 -3599434 -8666617 -9882639 -8939797 -7803899
4915 -7803899 -5316122 -2934558 -2986153 -3296784 -3062538 -1348793 190002 1303878 583344
4906 583344 -1093496 1103674 1206268 1770451 2886888 1145722 -148396 -811759 -1436624
4897 -1436624 -3594328 -3236453 -3703027 -6659425 -6772537 -5688498 -5468754 -6412228 -8024664
4888 -8024664 -5935873 -3823544 -3958758 -3429251 -1840905 -47360 2171253 4887272 2978876
4879 2978876 -1286742 -1712483 2655870 10816748 15680446 12573962 6737007 4810483
4871 4810483 6062829 6128707 2800598 -1541834 -2809087 -335348 2391447 920334 -1803650
4862 -1803650 -3044803 -4269778 -4979099 -3645302 -2122232 1336786 4110831 688622
4854 688622 -2345864 -3327695 -1240709 4537630 5609237 5184716 5443913 2145714 823041
4845 823041 2448666 2598669 3373013 2862086 78176 139328 -148985 -943092 -447287 -932725
4835 -932725 -2165223 -486179 -889434 -2707873 -4580584 -6719090 -7930042 -6754515 -6002663
4826 -6002663 -8336994 -10820664 -12362495 -11602504 -7622157 -2893463 -363505 2148909
4818 2148909 5599011 7548643 6370307 5019373 4365382 3885291 2768561 5005122 5561592
4809 5561592 1979928 -458532 276813 3489172 971689 1670482 6708039 5549606 5819907
4800 5819907 6938188 7762561 6062176 2825067 1708989 1090894 960591 15887 -1627189
4791 -1627189 -1517864 -1641718 -601697 791065 4710582 7593332 4902509 423860 -1056400
4782 -1056400 164515 1957407 1951993 -1482459 -5307133 -3896114 -3361851 -4069488 -2337666
4773 -2337666 1638 1723043 1916978 985425 913328 -2520524 -7488445 -6997614 -2663146
4764 -2663146 -1642627 -3572654 -2395748 -1168225 -4106009 -6904940 -6956393 -7871617 -7626007
4755 -7626007 -3609197 -201819 1624585 696575 -2280049 -2751817 -1818942 2020645 3145449
4746 3145449 1172528 35452 402628 2030219 4257006 5357060 2166239 449183
4738 449183 -953097 -5295873 -7778402 -7117777 -6404469 -5437815 -2675964 -2900171 -2087927
4729 -2087927 -387507 545477 -893923 -3018793 -4431791 -5560073 -5004835 -1383332 3142688
4720 3142688 5056260 5079611 1383418 -5785120 -9202436 -7497790 -10128639 -12605658 -7386936
4711 -7386936 -3351744 -1549336 243658 -707538 -3469695 -3577691 -3357812 -352226 -687541
4702 -687541 -3510490 -3841283 -2523758 -4752143 -10222490 -10798152 -7054756 -4789806 -3837876
4693 -3837876 -3459443 -1252505 -2572606 -9180413 -10991925 -11110825 -7902507 -3678558 -1171304
4684 -1171304 -1815431 -2781633 -343009 1173357 -2055068 -6043240 -9581242 -10166912 -10960510
4675 -10960510 -13205955 -11547469 -9361637 -10666953 -9559615 -8492813 -6078197 1984
4667 1984 1519281 -1006261 -2410890 -408540 428790 -1607803 -2710928 -5212196 -4989639
4658 -4989639 -557591 1162810 1554900 -478954 -6260558 -6666843 -806435 2937060 2960785
4649 2960785 3719843 3637022 1598221 -103150 -892023 -2201876 -4839573 -6044629 -5557260
4640 -5557260 -2621799 -1439113 647802 4673987 6404176 5708759 6087908 3116140 2731780
4631 2731780 6631439 5989891 4654568 4021445 3932776 508964 -2885785 -1635332 -2319407
4622 -2319407 -3120576 -2467709 -3612530 -384336 4029270 1468383 -68675 4098697 8504008
4613 8504008 16807291 26314806 30091538 32365434 46604239 64924827 81611282 104663101
4605 104663101 138576620 188174382 256192520 331408574 368954382 329838970 249094419
4598 249094419 183430293 147911360 125033043 109241520 101610830 98558743 99141093 105519191
4590 105519191 119119635 147290105 186691708 242469790 320431241 390331380 390159184
4583 390159184 314349497 231674180 176115908 140250656 112138669 90575965 74628356
4576 74628356 64667693 55382417 47744409 43564546 39795823 39302484 41115538 43150164
4568 43150164 47674858 46749219 42277328 33430565 25947822 20422557 15570214 13323421
4560 13323421 10559794 8053557 10486384 13078528 14190906 16248412 17888875 21285409
4552 21285409 26150752 28581299 32283682 36130232 33919506 25629565 16949617 10338675
4544 10338675 6937918 5110196 1987365 473658 1293899 636270 -285557 35154 -894562
4535 -894562 -623569 -904594 -1859019 -1124705 -714609 2016781 3545788 -1775563 -3703831
4526 -3703831 -631495 -195018 -415619 -2180126 -2017664 1019537 971086 -2689887 -6152546
4517 -6152546 -9272118 -6734304 -207710 4230622 4470336 -127245 -1659402 -2711245
4509 -2711245 -3727297 -1079743 2066957 -178099 -2730922 -3493385 -2977332 -2416211 -2389024
4500 -2389024 -1255461 1393222 3064410 1430558 -771625 -1757080 1648593 3242478
4492 3242478 1085580 -1559773 464271 -288194 -4754685 -5300020 -6121858 -10911147 -13649392
4483 -13649392 -10814819 -6470633 -4199088 -270468 6368969 8545947 6176980 5112458
4475 5112458 6277569 7095295 7773241 7177587 5136601 6213125 7158784 4730870 1455396
4466 1455396 -2170554 -1543340 1047352 2761687 2693790 -2845182 -5019571 -3944687 -3217695
4457 -3217695 -1288155 1029363 5870760 9584669 10170379 9478605 6592536 3921675 -589261
4448 -589261 -3761206 -4189679 -2674888 1600169 3221838 2106786 1672320 625772 -2329204
4439 -2329204 -4386064 -3209323 -391452 -1001096 -210034 2594226 2724639 966092 -1301606
4430 -1301606 1269714 7362406 9105367 10138471 11667563 10182312 6010311 1362843
4422 1362843 -1078395 323426 -1880537 -3867837 -3912646 -2567992 1170564 4376763 1465359
4413 1465359 -2365096 -3490903 -448459 714706 -4190842 -5824263 -6611075 -9236819
4405 -9236819 -10027446 -7306392 -3189891 -245307 445578 407430 1802824 4225425 4907340
4396 4907340 3796930 1672229 216335 1320181 4304774 6933532 6628549 6332730 6282456
4387 6282456 7042469 8176620 7893845 6810795 4708232 7782825 13766712 14908232 9507866
4378 9507866 3183242 2179312 1313833 -670111 -1338770 -4351053 -6894419 -5754923 -2093042
4369 -2093042 622483 2268733 3466622 2367302 878993 758391 4355479 6958139
4361 6958139 6981658 2236712 -1255259 -487659 -11889 -777808 -167721 3238251 5971900
4352 5971900 3365301 713808 2233324 2730622 3988865 4952561 2404477 -4042458 -8683521
4343 -8683521 -8866786 -8226671 -7012034 -1919118 6198205 8205053 8274890 5975714 1998535
4334 1998535 -1213365 -1894601 -1044319 -2428828 -4422355 -4487524 -5296931 -4583763 -2153927
4325 -2153927 -1237746 -2491957 -1265344 2712753 2749210 -692079 -4247495 -4877506 -1633111
4316 -1633111 1675905 4470699 4736717 2910757 5784414 6986560 5045576 2534554
4308 2534554 2833818 3076891 2385925 2078478 456439 -1868522 -1817785 -529890 -629706
4299 -629706 206804 2846390 5177090 5195502 1584594 -1971572 -2197572 2043250 7167136
4290 7167136 6620463 7133799 10365867 11933843 12356597 11373220 8326706 4127212 1331732
4281 1331732 -2409679 -4814621 -4990392 -5526421 -3609254 -1114166 -1771774 361476 6496884
4272 6496884 10048215 5787799 438908 -2263556 -3008116 -4069666 -4960157 -7985782 -10174474
4263 -10174474 -8071053 -6507280 -6292264 -4560326 -3286834 -1443051 -1663705 -1756504 1060814
4254 1060814 658562 -2339393 -1627229 -1980079 -3062805 -4915969 -7325482 -8317393 -7976546
4245 -7976546 -6041982 -3491725 2059446 6433553 7080549 4531423 3391406 2776908 2767253
4236 2767253 3019114 3118163 2648642 1789895 1527087 138967 2545808 7348752 7650947
4227 7650947 5687153 4069732 2328061 -870831 -3914285 -5552424 -6920094 -6758987
4219 -6758987 -5886914 -5220990 -1978729 -152363 -733364 -341454 1857913 1428200 -1251806
4210 -1251806 -2663469 1972016 4289664 984757 -1381124 38283 1440338 60511
4202 60511 -141271 2147919 5444717 7980445 12433752 13458323 9961749 5061183 1595693
4193 1595693 -717885 -1724219 -529907 1628479 5203939 3618105 -622925 1479477
4185 1479477 5070391 6612934 5830131 2060082 2104294 4556202 6248145 7572814 8625812
4176 8625812 9539182 11098645 10756834 9262798 7354326 6243396 4523735 3451141 2380764
4167 2380764 -445428 987743 2892969 5278995 8626693 8908395 5150316 -758771
4159 -758771 -3600591 -1724818 1867669 3960129 5609618 4636178 535358 -2513951 -3103883
4150 -3103883 -305957 4474134 5130436 1442279 -1654191 -2235753 6348 2476961 4932600
4141 4932600 9144409 11969132 14632296 15284086 10146929 4307809 3110554 2882826 4701902
4132 4701902 9040501 11379346 9772641 7431032 3845334 -6430 -2145383 -2888576
4124 -2888576 -694330 1053269 346588 2399796 7879136 11971513 8592391 3811813
4116 3811813 3982850 3553431 828383 -1529010 -1309177 1313662 4040717 4113867 1456056
4107 1456056 -526641 -1040715 -4395032 -7009764 -5679285 -853122 564118 1418858 3599477
4098 3599477 4055411 3319416 5021170 5125071 492039 -1890948 -8134 4322830 4337045
4089 4337045 -796679 -1909576 407194 1877307 2367040 4346505 4455335 4106423 1059715
4080 1059715 -3677952 -5386412 -4907280 -3136458 527782 5514500 8846042 5667517
4072 5667517 1411526 632992 2974880 5624063 6342938 8000306 5211211 -2463947 -3388490
4063 -3388490 -1092874 -1068634 -1594156 1559413 3807029 1753123 -39473 1912852 4573248
4054 4573248 8198420 8219945 4720217 2469613 1513929 -176953 -1893879 517249 4723467
4045 4723467 6702656 6662559 6837187 4803198 3488808 5018967 114503 -2364715 3689235
4036 3689235 8700686 9677519 8598879 7140824 7882930 6437841 908255 213635 3435779
4027 3435779 6160594 6113876 4388477 1498868 698902 262861 -2508129 -3420742 1213117
4018 1213117 3499343 2951603 4345787 5778759 4903570 2330124 -1067402 -1710635 -3713774
4009 -3713774 -6469679 -8682165 -9581254 -9992736 -11889469 -8685227 -5064162 976174 4026974
4000 4026974 2417177 -69418 139401 2796779 2413382 2545450 3999851 5643334 7373061
3991 7373061 9560550 9665210 7156545 3793524 1060827 1831274 -1000180 -6313812 -9891268
3982 -9891268 -10801542 -6950207 -700282 2138549 4599196 9678441 10150335 7123292 4974058
3973 4974058 4618333 2940958 -831018 -3049053 -4136669 -4378461 -5323685 -8766001 -11219138
3964 -11219138 -12282120 -11408330 -10638351 -7421643 -5735640 -6305269 -6511547 -5124133 -732954
3955 -732954 3924826 6194973 5391670 4785818 8060726 9047962 4721419 -1328829 -5020927
3946 -5020927 -2826330 304492 926498 2271281 4714021 5313642 4046522 2414522 -1634408
3937 -1634408 -3797525 -931159 2499224 3326420 826045 -5106711 -9747038 -9034118 -5467045
3928 -5467045 -2702864 -1008899 -216828 -878339 -3371214 -5590971 -6646293 -7826823 -8343119
3919 -8343119 -5523677 -610349 -767532 -3934480 -5408190 -6091026 -4654708 -5178821 -4534025
3910 -4534025 -2938462 -1625937 1132699 2732978 2872197 4011105 6523652 8425359
3902 8425359 5936111 5468926 7797456 7978870 7097562 5734775 1881034 -2859633 -6969975
3893 -6969975 -9773794 -10749632 -8778955 -5763126 -5312364 -6556296 -6804976 -8687569 -9304539
3884 -9304539 -6860500 -3848852 -2478916 -4143902 -8473424 -8059160 -3535749 11674
3876 11674 572229 732111 -542827 -2025308 -5896534 -10605899 -11852127 -12052798 -11571499
3867 -11571499 -9191311 -7343363 -5785803 -3160393 -3925390 -4705445 -6452131 -7261771 -1364080
3858 -1364080 3983377 4317017 8471180 6813735 -1040831 -5772420 -6617869 -5936755 -5428307
3849 -5428307 -4143082 -1980791 1429819 5611587 4504739 2925419 4946029 6103854
3841 6103854 2512437 -2426988 -5398738 -5834318 -4862181 -6020979 -5459581 -2615347 -1591849
3832 -1591849 -4537487 -8793032 -10284260 -8077929 -4453416 -1096851 97091 4666797
3824 4666797 10977864 10386710 7863750 7431294 8754208 6461296 3237048 929495 -2338815
3815 -2338815 -1468351 4321472 8567441 7848202 3320818 -1344894 -2115596 1568297 2805951
3806 2805951 -1753311 -5925394 -5400734 -6417163 -10181249 -14695325 -13118944 -5671872
3798 -5671872 -1514241 -150535 961036 1215911 2631186 1626529 -2250721 -3244671 -1731873
3789 -1731873 -668863 -2272674 -4363998 -3771291 -2303445 -1230695 538174 -554579
3781 -554579 -1910947 -1711004 -3287456 -3889722 -1721230 -865728 -1412598 -2305956 -1687100
3772 -1687100 -2294872 -1053652 1517290 2337669 5433352 11471070 12866986 8199928 5755692
3763 5755692 4525241 2172090 3346464 3814611 3319759 6421100 6927591 1585222 -1782919
3754 -1782919 -5044336 -9065033 -9240131 -5367033 -5604490 -3175717 -1116680 -655811 -1331299
3745 -1331299 -4653027 -1957110 814594 1675441 -102039 -1505881 -3352130 -4667300
3737 -4667300 -5428374 -4940359 -1446700 -1139298 -81942 2971067 5977337 6453895 5415008
3728 5415008 4582308 4196435 6697832 6692476 6059526 4114931 -264596 -4722795 -8675538
3719 -8675538 -10006933 -8722814 -5028036 -2761228 -4518149 -5048956 -2664710 -865642
3711 -865642 194792 22527 1590562 6415464 6311248 3664885 571835 45930 1770385
3702 1770385 3472411 3766695 3097282 3937688 5478942 6078946 3887005 1539448 1675698
3693 1675698 2991026 1481903 331748 3316775 4158364 1536800 -782494 -642156 -2261725
3684 -2261725 -3007659 1001282 6846823 7390520 4505272 -1488205 -3536264 2136450 5517690
3675 5517690 3584786 2154464 4426673 610905 -3027165 -4190558 -2590926 963559
3667 963559 1157711 1612745 -466393 -5190218 -4978235 -4358415 -9402904 -11730916 -8110787
3658 -8110787 -4091648 -77022 4159560 5865246 2956560 -1449940 -2635406 -885478
3650 -885478 -1087428 -7139627 -9123331 -5187112 -1212824 2648839 4968818 4732073 1470473
3641 1470473 -2182968 -5867314 -8753500 -7914058 -3825950 432896 124608 503032 1762524
3632 1762524 3313884 521024 -1506834 -878363 -1270112 -2767735 -8783152 -9938085 -6695069
3623 -6695069 -4337720 -3549589 -5519593 -7597310 -9284400 -7117676 -6137806 -9045972 -10515442
3614 -10515442 -10565657 -10228542 -9869099 -12282376 -15303062 -14606260 -10091917 -6325053 -6167613
3605 -6167613 -8379526 -6918837 -3906173 -4003551 -5961436 -3212571 352394 -1119853 -4139277
3596 -4139277 -3172122 179515 885260 1589695 3029078 2514367 6106988 6975532 2782056
3587 2782056 795728 -1304672 -1306022 1871028 1223824 45945 -1844069 -2392602 -3343255
3578 -3343255 -3867600 -3979913 -4710950 -6083129 -9924145 -11832217 -14482717 -15016378 -12614680
3569 -12614680 -8871927 -8849845 -10583338 -11038789 -11726155 -12940702 -13293979 -9641410 -5858097
3560 -5858097 -6204324 -8079013 -9342118 -7316049 -4513755 -4970043 -5006877 -2673133 -1617020
3551 -1617020 -1560432 -1779754 -1232380 -2201793 -5221845 -7011418 -8059578 -9542629 -7686171
3542 -7686171 -4934444 -2980711 -587970 2225191 379131 -398944 -522066 708866 2431923
3533 2431923 -405300 452105 5942708 4477288 -2112405 -1744483 825236 1138431 2637380
3524 2637380 1815014 -814563 -1616511 -1588643 764670 415293 2641395 6776390 8330454
3515 8330454 9566054 8008309 5019081 1408666 -1022734 -3922953 -3885586 -2837863 -1252199
3506 -1252199 1583791 5826369 6670517 3527483 -2057773 -6798965 -11309621 -9000287
3498 -9000287 -4457274 -5132960 -9645225 -12385028 -10221509 -8184610 -9850613 -7757533
3490 -7757533 -2706727 4120175 8803144 7701170 1652887 -3712096 -5085869 -5355474
3482 -5355474 -3443381 -3477575 -1848519 4374204 9525910 8256142 8372270 12994287 14034827
3473 14034827 10464410 6383378 5115937 4119502 2513395 1222644 -1410900 -2547544
3465 -2547544 948983 5790624 4522320 -2277464 -6559213 -9198670 -11183286 -10132443
3457 -10132443 -6751103 -1017940 1951976 874947 -559185 135572 1549027 1565702 642770
3448 642770 -2075606 -5972302 -5257028 -238065 1778610 2535605 4084645 2711737 69634
3439 69634 506977 4335453 5501300 4741188 6410187 7886322 8664929 9050421 8330986
3430 8330986 6492881 -954725 -8340189 -7836239 -3508615 -1207741 -2322339 -4795489
3422 -4795489 -4970374 -3167171 -564260 698041 1400767 590897 894039 1263941 -476874
3413 -476874 -1387681 1923628 5553299 3134979 460944 565941 2409967 3520434 1073429
3404 1073429 -2780101 -6154242 -6751701 -5827553 -6467928 -4621669 -3029780 -2913199 1189408
3395 1189408 4177013 5526669 6361460 6002560 4658302 5146196 6765565 4026243 -527987
3386 -527987 -1865270 -4722761 -8038960 -9441941 -9033305 -9224580 -8993191 -3622637 147441
3377 147441 2887705 5844598 6133550 2960098 1674746 2521126 3529863 5053402 6179159
3368 6179159 6993522 8127955 8204754 9412421 7302244 2044034 -1861628 -7378770 -11319959
3359 -11319959 -13137480 -11075507 -7450045 -6401913 -6455867 -6633121 -10649597 -12342717 -9918548
3350 -9918548 -7709765 -8386466 -10178457 -11562054 -7390543 338630 2429824 -2670544
3342 -2670544 -6074777 -6081303 -6972812 -9665673 -7640154 -4048745 -5421424 -7672453 -8053688
3333 -8053688 -3642327 -2902012 -3819270 -1315734 3296488 3738193 1372401 1018785 27902
3324 27902 -171133 80011 1392245 4266341 1613749 -2448439 -6503790 -6890588 -4188389
3315 -4188389 -2322205 -4422645 -6896944 -6573068 -6618801 -10029807 -13026414 -12689678 -14537879
3306 -14537879 -13536399 -9940187 -10978475 -9291631 -5695402 -1861579 3728281 6396150
3298 6396150 6090212 3717737 4708038 7806026 7041092 4087466 -2148899 -4507246 -602883
3289 -602883 -530363 -3580483 -5055207 -1614397 751084 1255060 1860446 1100777 -1767480
3280 -1767480 906975 6650374 4641946 -3070182 -3498587 1706658 3552358 2110409
3272 2110409 -513378 -281916 -670462 -633370 399042 695014 2972580 2928484 2494984
3263 2494984 3434009 3043191 685034 -3049130 -6301930 -6197808 -6127778 -3707583 -604843
3254 -604843 -816132 808790 3625484 5366333 5475855 7001675 9752119 9175125 4555643
3245 4555643 -1577346 -6731903 -8104618 -10816757 -14880079 -14377743 -10143558 -2386128
3237 -2386128 1934663 1133160 -2411505 -2202356 1489251 2752262 2747093 169490 -5681275
3228 -5681275 -5896843 -3105960 -4599778 -4514048 -3374225 -5503215 -8810992 -7467325 -3721495
3219 -3721495 -1943506 -3880083 -5251500 -1786649 -1320652 174324 7344362 13549108
3211 13549108 15520599 12451934 10316335 9283432 9763864 8988268 7671160 7436909 8034876
3202 8034876 8118314 5896953 -373121 -3838678 -1856754 1846266 3140013 226947 -3381529
3193 -3381529 -2996296 539888 1414769 848817 -332968 -303920 1139456 4936118 8129728
3184 8129728 11659410 10148361 6993073 5593997 2740845 -29033 -1180336 -989486
3176 -989486 758208 2298142 995022 2219884 3797877 3256269 -382613 -3049812 -4870164
3167 -4870164 -6609520 -6946551 -5622218 -3045158 -660927 -155687 -5110085 -7741386 -4214768
3158 -4214768 186068 2209898 -1094598 -2864820 -3082710 -3734486 -3130713 -3193337 -3029410
3149 -3029410 -775393 3254486 4128689 3931696 2804255 1619370 1368941 -2458744 -4291122
3140 -4291122 -5459726 -5522603 -2379141 -1106655 -423444 -275248 -2957500 -7148768 -7140830
3131 -7140830 -5113030 -4462952 -2402869 1123278 1409113 -848453 -1309795 -2173775 -3270938
3122 -3270938 -2465470 957325 2208245 2012257 1090473 -12339 1556104 1731551 2315726
3113 2315726 6199179 8684043 9479883 12488154 13320364 9000428 4927337 5323629 5711366
3104 5711366 6036812 4962865 2758240 4464596 7831155 5837577 3224086 -315128
3096 -315128 -2680158 -4767136 -8151710 -8551159 -6624151 -6979223 -8870795 -9953987 -8324714
3087 -8324714 -7533371 -7149648 -6482960 -6112290 -8285767 -9015069 -6482286 -947206 7640647
3078 7640647 12887824 14636122 15152310 12951777 9444579 6329669 4276100 4439861 1524086
3069 1524086 -3724681 -5494202 -4290233 -4188368 -1254608 1939186 4932797 6647504
3061 6647504 7293668 8852425 8665296 5927127 4990132 5598848 7010643 6652439 5758671
3052 5758671 2269324 -2683998 -5851787 -8015875 -7408007 -5857810 -4267007 -1538825
3044 -1538825 4357544 3849268 -1490486 -3467304 -2977393 -1340131 12827 -890750 -2007117
3035 -2007117 -2736584 -3848425 -4789202 -8685862 -11636296 -11381654 -10771974 -8240439 -2005402
3026 -2005402 1892792 3372180 3587818 2409467 2912904 -564055 -4447805 -6540148 -7485635
3017 -7485635 -4477364 -4160460 -4213572 -2194335 -2175470 -3283761 -1678049 295329 765995
3008 765995 -1074953 -1944346 -1734910 -2435867 -3370497 -3278306 -4642586 -4370647 335658
2999 335658 3853470 2363392 -275252 -2500666 -7016229 -9291209 -4419088 -876367
2991 -876367 -2552997 -1142688 -92237 -265806 1282564 2972064 2011352 788905 1102123
2982 1102123 -160032 -2521034 -5591259 -4957088 -4098034 -5469829 -6745204 -6029136 -4038098
2973 -4038098 -3421018 -5036397 -6927482 -6398113 -3087564 -1001903 -2051395 -3974691 -4117848
2964 -4117848 1806398 9010490 7460174 956934 -1977095 -3079774 -2586993 116761
2956 116761 3255581 3054838 4399197 5489982 3238697 3706428 2948206 559250 1280372
2947 1280372 2409058 2334267 3648967 4119999 2912714 5776054 11334634 11646999 5353397
2938 5353397 339854 -302591 1446148 2203948 45614 -3425827 -3782305 -1793328 -637459
2929 -637459 656837 -1505603 -3830793 -4632760 -2850919 -1802661 -3345618 -3370906 -2465189
2920 -2465189 -3445285 -2858221 -882146 548386 -261741 -442215 2186117 7101590 8092413
2911 8092413 3031865 2717540 7602311 8612893 6940956 5103855 3713869 1074908
2903 1074908 -2389265 -4665690 -2939077 -3435781 -1801537 3291890 4520705 4523396 2559128
2894 2559128 678899 -2494186 -3632927 -3281834 -495656 4110314 7279427 7394582 3858656
2885 3858656 1451446 463949 2284918 5564237 5330036 1334805 -2122222 -2990809 -1177602
2876 -1177602 2533922 1243736 687105 3667895 4660667 2360567 1455039 3364586 8306597
2867 8306597 11430568 10839761 8342135 5410035 7820102 10116222 6764069 6887102 8160275
2858 8160275 6784776 1418144 -2563331 -2035451 -2685894 -7081458 -8321500 -5825178 -8745607
2849 -8745607 -16639048 -19346680 -17484834 -11336820 -6100914 -5629554 -4416869 -2616191
2841 -2616191 -2216932 -2393696 -2764402 -2931006 -4722445 -5484441 -2424742 1973256 2926582
2832 2926582 1606619 -1766436 -5655816 -9819422 -8820647 -7950999 -8827755 -5357490 -4504464
2823 -4504464 -1349832 963372 1343449 1352176 -1421416 -3447087 -659465 4241504 4522653
2814 4522653 3173152 4504390 4659972 4395517 1902328 -1146385 -3011535 -1661794 1661693
2805 1661693 6428372 9525175 8704830 6754702 3116256 790563 146009 -643886 267644
2796 267644 3848829 6461796 6056898 5851778 7436143 9476748 7836877 5214990 2991152
2787 2991152 4135392 4870722 6944117 7864273 5537263 4495267 5417153 6579850 6218093
2778 6218093 273880 -3514520 -3264115 -4417924 -4282464 -2258261 -653754 -1279467 -3237433
2769 -3237433 -4299304 -2578387 -2699651 -1425330 -2590683 -5113294 -6194897 -7377269
2761 -7377269 -11450187 -13742568 -8313431 -2212703 2292027 5268063 8519264 10332000
2753 10332000 9883880 6629931 560991 -2124346 -524873 1489326 -110180 1146380
2745 1146380 3064988 3315239 1880340 -2149036 -2639879 -1148593 -143997 -46105 418769
2736 418769 1979365 3673238 3066629 2778549 4216284 5285840 3698469 -341992 -2512326
2727 -2512326 -1276697 -757041 -2019803 -965140 -2802276 -8315350 -10639716 -9473123
2719 -9473123 -5696889 130496 492875 -3827208 -4593068 -2507872 -130110 2243450 5117506
2710 5117506 7485810 10690024 9995110 4932426 -3320737 -10354359 -9872717 -3674248 267392
2701 267392 -889553 -2396335 -1346342 -330737 -280611 876460 -2420791 -7866438 -10100531
2692 -10100531 -9962920 -11125524 -13565047 -13648323 -12084668 -11719590 -9889966 -6652420 -2826637
2683 -2826637 -291942 -203219 -2403112 -7591308 -9400837 -7004172 -4796550 -4573371 -5015397
2674 -5015397 -2944048 615040 4240568 5872431 3562131 759710 2671647 2463162
2666 2463162 1634430 2675348 6851319 8747744 8616577 10361985 12431213 13901136 11395186
2657 11395186 7741383 6192892 5175691 3946435 1379517 -1291353 -3017917 -3663780
2649 -3663780 -3593322 -711249 269686 2294975 2346051 -879790 -2561302 -3427480 -628955
2640 -628955 3117262 6938886 7813738 7940239 6447410 4698651 4805226 3624297 -377938
2631 -377938 -2434716 -2351567 -3988833 -6447753 -9724014 -8785476 -3418506 1646451 3279114
2622 3279114 1277384 1066178 2925382 4236042 1461013 -106200 -547731 784981 4301120
2613 4301120 6186233 4894210 5834259 6720196 6033146 7181703 6236839 3083676 681104
2604 681104 -381367 -2367866 -6742880 -2884060 7728647 9795989 7812616 5375192
2596 5375192 2590309 2102753 -199415 -563169 1022501 -69451 -1126938 1245006 5491126
2587 5491126 7364665 7733898 7122407 2646272 -580797 395982 -1383158 -3157329 -875568
2578 -875568 1686228 818101 -1237287 -4895385 -6378516 -4572665 -322325 3168589 5615591
2569 5615591 5137786 746782 306453 2103913 5513996 8704747 5745259 735198 -340316
2560 -340316 1612445 4611874 4340319 1390328 634552 2877883 5824308 6097872 4938493
2551 4938493 5365330 4634062 3933013 3518833 5833827 7137828 4393362 2017317 2097157
2542 2097157 1116866 -83555 1029248 548012 -3264216 -6481083 -4599290 -1992571 497699
2533 497699 1972750 -251192 -2465373 1581944 7018504 8515756 8240264 6985529 5534702
2524 5534702 3620285 1741135 -2352128 -6883855 -8324529 -5064651 -818376 3065587
2516 3065587 5248520 3476160 2594749 719487 -2536680 3598766 8250934 6671631
2508 6671631 7380802 7418265 8001492 8567887 7872523 6422100 3984445 -796061 -7065110
2499 -7065110 -8632660 -6575292 -9280035 -11518959 -11916578 -9675911 -7039339 -5268525
2491 -5268525 -2884195 -1727507 -2807851 -794900 3202536 2775552 141772 -3824760
2483 -3824760 -8978454 -12008981 -9367196 -8903372 -11578605 -10899747 -10311518 -11352757 -11386475
2474 -11386475 -11039958 -9146079 -7038986 -4396314 -2807153 -1083387 1304034 655699
2466 655699 -180550 1985363 5903201 6635764 7317072 6473056 3619938 3078520 3950744
2457 3950744 1486765 -1806007 -3912223 -1590400 988155 1578619 764078 222352 -83614
2448 -83614 1104704 3995167 3979369 -1543275 -4693975 -1988411 2341917 2212367 1836863
2439 1836863 3061363 -990972 -5241536 -7089044 -7559388 -7481333 -4101855 -2124474 -6397547
2430 -6397547 -8103568 -7671293 -8179755 -7581437 -5609416 -4291417 -4156205 -2401089 -1019858
2421 -1019858 112282 -1571878 -2486728 -1759004 -2195889 -1073150 -2036470 -8274590 -13832384
2412 -13832384 -15142182 -8647035 -3591123 -1391976 1473327 4812744 5844629 -49914
2404 -49914 -4829941 -4617387 1322179 4918403 3420108 2626375 888271 -841833 -2369675
2395 -2369675 -3499483 -3600187 -5118701 -5602173 -2047694 3121646 6131911 4617935 982583
2386 982583 2068436 4134310 4164119 4736964 8023903 9908755 5917461 1823162 -4425331
2377 -4425331 -10751307 -9603688 -2862373 -959936 -3818351 -4731384 -3960975 -2366927 -581079
2368 -581079 936282 3338523 666948 84720 3359074 4906369 3650507 3246333 8305128
2359 8305128 11466295 7313072 2707489 -382584 -131498 1674759 5239407 9404731
2351 9404731 9698270 7947886 5594579 40923 -3665407 -2321230 446392 2538404
2343 2538404 4230543 3982389 1315890 -2062429 -2424329 -2687178 -4433869 -7024466 -6432297
2334 -6432297 -4347716 -1015967 3233529 3166293 546894 1791714 5693354 7925553 9346145
2325 9346145 10094618 11700109 9547704 8059559 9979793 9844687 8908639 7402612 7386453
2316 7386453 8622643 2360377 -6788197 -10583505 -13509645 -14173404 -11474096 -11087546 -11440978
2307 -11440978 -8509518 -6392342 -5249003 -3193914 -4046640 -3209430 -1112233 2618212
2299 2618212 563646 -3858565 -3647878 -2353194 -5586626 -8079270 -8420159 -8526686 -4445702
2290 -4445702 2655036 6652654 9089978 9236785 5307055 1387379 -1179761 -4495665
2282 -4495665 -9101398 -10284951 -8794801 -8425286 -7114456 -5933459 -2056345 3107268
2274 3107268 4038229 1365987 -1804663 -1705319 -1146636 -132587 2691938 4428977 5619317
2265 5619317 7199972 7182816 8313768 9378365 8499107 7000417 8018070 6983848 2585161
2256 2585161 -1547996 -3097056 -1332725 2340115 4731023 5476417 2792628 557858
2248 557858 1138327 708610 -1477576 -3440028 -1188907 2024951 4008779 4462974 8140333
2239 8140333 10461902 6378758 1805682 -1677613 -4242648 -2399328 -2048008 -522779
2231 -522779 2241800 42683 -6264894 -9575210 -9448843 -7100421 -2338977 -203877 -1637308
2222 -1637308 -3627756 -4754589 -3911805 -2988116 -1916149 1840698 4793426 6312701 6239044
2213 6239044 5659380 3414044 -571818 -1376939 -495473 -3107877 -5777805 -8864406 -8088276
2204 -8088276 -4592994 -2408548 -2427645 -5517813 -6522521 -5726814 -2445053 667948 -217729
2195 -217729 -5513065 -7955493 -8951317 -10450542 -8635972 -3498423 -1122523 -2756799 -4482763
2186 -4482763 -3454306 -2447156 -3962027 -4343523 -3453065 -6328396 -10100351 -9518912 -6972630
2177 -6972630 -1285461 4302230 3812542 1384257 -489323 -1762943 216590 -383779 -1442594
2168 -1442594 610196 1397730 1492949 1072820 3381956 5666948 5348769 5298317 2587027
2159 2587027 -710014 -2698629 -5810080 -7737072 -8383153 -7444802 -6639720 -4604588 -3248852
2150 -3248852 -4841221 -2328019 -4196934 -7350596 -6832713 -5648738 -6061866 -4506486 -4011901
2141 -4011901 -2865638 818118 1842152 1159353 -2057713 -6916275 -9510517 -8061979
2133 -8061979 -9163982 -12059156 -10248201 -6560885 -4607874 -5665642 -9339819 -10188031
2125 -10188031 -7565449 -4904041 -4991933 -4660175 -2263191 1079 969439 -1061251 -5103520
2116 -5103520 -4230621 2829883 10866667 12810949 9421849 1500780 -5155146 -7684474
2108 -7684474 -4779814 626629 3838775 8748510 10444747 6875644 2880522 2327817
2100 2327817 854067 -799506 -3520683 -8032877 -8629027 -6448683 -3974023 -1033466
2092 -1033466 -244326 -2524447 -4523872 -785401 3106640 3679305 2384036 97704 -3128801
2083 -3128801 -3881348 -3003243 160581 1933806 -1366267 -3322800 -4235840 -4151911 -3644802
2074 -3644802 -2805089 126939 1882648 311546 -1934602 -1733519 -1279383 -3797682 -7458136
2065 -7458136 -5329386 -2267099 -750383 -918256 -2862518 -7475188 -9127812 -9678027 -13646438
2056 -13646438 -14138681 -10196913 -7905490 -8036193 -6504433 -4198239 -451404 -96845 29647
2047 29647 1153644 4178830 7387112 6745594 6275058 6735553 7375194 3792042 -1890132
2038 -1890132 -2427787 -1478413 695131 -582481 -2822130 -2118963 -546884 -1012022 -4264076
2029 -4264076 -6887387 -8780644 -11032302 -10418209 -7598395 -6459109 -8141474 -8678875 -5872601
2020 -5872601 14935 5046528 4757988 4601059 4589589 1547323 2294805 4970218 4514341
2011 4514341 4043734 3973571 7062121 7698532 3524453 2792923 4318404 3872369 4533372
2002 4533372 3760783 2103271 2350824 2343968 3974779 7290889 4948714 4688259 9291655
1993 9291655 10630606 8160721 3607010 225285 -2420030 -4348547 -2623564 342480
1985 342480 -332462 52235 2865939 1452107 -764877 -1570723 -2601784 -3498252 -3340554
1976 -3340554 -873021 -2357474 -5964476 -5441453 -83440 3166553 4492334 560944
1968 560944 -327222 1179073 -2017161 -2574539 583206 4965050 8142060 7902579 7120234
1959 7120234 6032076 2385812 2654330 5748420 2505919 2128662 4791535 4072864 2868735
1950 2868735 -2693617 -6341803 -3863006 -1483953 -1038766 -1615381 -3377708 -5124805 -5069693
1941 -5069693 -5870884 -7126630 -5312932 -6208117 -6058935 -4580120 -2242927 -397474 370867
1932 370867 -100067 -625117 -51110 1942124 2424357 -847920 -7663111 -12103746 -11098852
1923 -11098852 -8403093 -5456594 -4879103 -7692804 -9323666 -5454697 -581128 1200315
1915 1200315 2024817 2694212 2492842 1493524 -1245573 -821393 -614091 -3659351 -4877645
1906 -4877645 -6835392 -6292643 -3957350 -5639618 -4523037 -2725388 -3233222 -4406333 -1688141
1897 -1688141 3555294 3547821 -134524 -62566 84449 1576758 2932862 1891915 313780
1888 313780 1481926 4848967 2673061 -238237 -1779053 -2726213 -3544504 -2389936 -763048
1879 -763048 -2621125 -5246119 -4965141 -3895596 -1932251 -986422 -97626 -1863570 -6845558
1870 -6845558 -9360459 -8906126 -7124350 -7120792 -5839756 -4738630 -5395523 -5683170 -5634611
1861 -5634611 -4408707 -4976944 -366573 1115155 2061080 3916555 6361265 7430000 5960369
1852 5960369 5868229 7440388 7767888 5743073 2872502 -3565068 -7681223 -6584411 -5950472
1843 -5950472 -4700133 -2011592 -1177791 3088187 7948693 9979198 10155662 7916373 6470809
1834 6470809 4409295 1149972 1290405 715211 -776933 -5093247 -7524719 -4028410 634615
1825 634615 1516564 -1804374 -6877598 -8690178 -9085947 -6212954 -4469495 -4932765 -2464071
1816 -2464071 -81013 -4397816 -7480882 -6310096 -4730624 -3822102 -1020566 273778
1808 273778 1979322 4044174 5679793 4618127 -955594 -5557858 -2127987 3309634
1800 3309634 6964000 9741605 10182223 7496231 5267643 7773239 7764106 830228 -5418169
1791 -5418169 -4092055 -1282576 478483 3698777 5826850 7041343 8829104 8133799
1783 8133799 4843288 1966057 632357 -553667 -292709 2152447 4298270 2299077
1775 2299077 148441 739691 1598346 1103039 693734 714308 3544356 5439544 7526263
1766 7526263 8882160 8525421 8037097 7934428 4973605 1605442 -1451446 -3133010 -4634597
1757 -4634597 -4193059 -3387097 -2142551 -154330 589021 -1571631 -3868594 -4808504 -6723448
1748 -6723448 -6741346 -5175040 1080237 6069063 7041014 4980926 5273631 1508952 -3508042
1739 -3508042 -5774430 -6029542 -2237320 -1553776 -3314780 -2484460 -2673576 -7170138 -12665197
1730 -12665197 -12886401 -8041258 125087 5824706 6387934 3093127 1550889 1786584 410524
1721 410524 3431883 4989856 4030401 2264762 218723 -1057044 -3982364 -7353325 -6657132
1712 -6657132 -4579915 -2255870 617122 1214896 -702708 -1932074 -1566155 -435991 -4733364
1703 -4733364 -10408190 -10564191 -9484546 -8000164 -5793501 -3739408 -1357304 1296896
1695 1296896 1683750 1793553 243566 -31645 2003203 3500790 6158814 7071510 5240993
1686 5240993 1304633 -540576 -651614 -1798573 -2586757 227420 1094577 2520748 3012995
1677 3012995 1379207 3330759 5298758 3595430 -2004770 -2757093 -1093730 -4338073
1669 -4338073 -5069707 -5160032 -8025496 -11542222 -12934131 -11134579 -9236417 -9664931 -8292063
1660 -8292063 -6839586 -5856569 -5991882 -4405082 436768 4098760 5746179 6128440 5409026
1651 5409026 1745870 -541621 -811586 1355339 4821188 5933928 4579141 2348533
1643 2348533 980894 201996 243620 469961 -1719315 -3065927 -1032254 -291135 163652
1634 163652 -867948 -2935013 -3084964 -1090252 -275436 1520462 5125841 7965592 9793625
1625 9793625 8577541 4797584 1241122 -1530083 -2588826 718015 4865780 6775947
1617 6775947 6457163 2593108 -654090 -2198082 -5543562 -7230297 -6295917 -4358645 -4522426
1608 -4522426 -5207987 -4555266 -4812768 -4623985 -5213396 -3249011 -525870 1960423 1749932
1599 1749932 51391 -869960 -866588 -1845992 -4508210 -5129553 -5104388 -6352548 -8166938
1590 -8166938 -5485539 -481777 1893725 4205354 8313988 10349594 11389012 10286662
1582 10286662 4455913 514120 3091964 4620206 5278129 3643885 732588 508156
1574 508156 2634196 2460325 1309640 -798876 -4747410 -7501479 -8215333 -7950133 -7728917
1565 -7728917 -7627174 -7695750 -4213796 -154161 -198979 -3320138 -1936023 363817 -2033656
1556 -2033656 -2845903 -3663248 -5019884 -5410020 -3089824 -447923 -2743325 -4377534 -2366406
1547 -2366406 -1548912 -2128298 -2295538 549273 2002722 2070647 1323783 165908 813967
1538 813967 1434176 228961 -202294 -1768241 -775273 4300987 6125219 1386709 -2818070
1529 -2818070 -5121330 -9335207 -10252913 -6507140 -3222836 -2134760 103309 -46207 -397342
1520 -397342 1534573 5508912 8554751 4022522 -1397578 1132436 5842967 6419644 5502732
1511 5502732 9605989 12368656 11178371 12789060 12091963 10895867 10107056 10216347 8276725
1502 8276725 4137293 1150237 1628569 5386915 6504475 5573842 2805981 2340938 3326220
1493 3326220 5007526 6641180 4521832 2855791 2649006 2244132 4643155 6537310 5617770
1484 5617770 4319384 1383988 -583301 -2220249 -1887425 -1500764 -2370804 -1427384 556643
1475 556643 710349 1631160 1303582 -325894 -531544 1671761 3119291 1473721 -596057
1466 -596057 -3305492 -5616768 -4104121 -1897110 -3673112 -3256766 -116553 615237 -1608450
1457 -1608450 -1655001 1378094 2867430 4470515 3892552 4047960 6246799 7462271 9974490
1448 9974490 9822386 6110803 3259012 3124375 5499393 4132162 2601893 5799446 7039278
1439 7039278 4990947 2025896 -1899076 -2682900 -722088 2111730 27519 -2171098
1431 -2171098 -1154842 -1683537 -1238192 -1711898 -2741702 -2101685 2353032 4886398 -202739
1422 -202739 -2551303 -994548 -2259036 -3458865 -2953539 -3177992 -4465822 -3006485 4825223
1413 4825223 13859991 17257852 16384957 14663239 10106244 2115802 -2991744 -3249893 -2024259
1404 -2024259 -843776 -522276 -2070482 -2759594 -1823167 -3241825 -5087586 -6229689 -5285699
1395 -5285699 -965787 3856181 7495894 6838145 6032849 6408267 6850174 6003821 5414152
1386 5414152 4176285 2195554 1747737 1748840 878217 1465020 1596877 2007584 2997754 4239790
1376 4239790 2974775 1224594 527333 3476565 6733399 9427259 10261811 8527005 3774014
1367 3774014 -1030312 115075 6235613 8788292 6860735 3706590 4372651 3721798 717175
1358 717175 -1397985 -301569 433151 -1280381 -861181 120288 -3901975 -6755475 -3307676
1349 -3307676 -257875 -1305354 -364361 -76177 -1024868 3838391 7957182 8446913 7562199
1340 7562199 7322796 3383767 -636678 -804449 349939 -984989 152936 4515977 8165344
1331 8165344 8842555 5789421 -170331 -5703075 -9216751 -10310999 -6220483 -1502580
1323 -1502580 3922457 7688849 2713511 -1946589 -2668500 -2633805 -2771820 -5878544 -7311680
1314 -7311680 -3914366 -1646536 125463 3199139 6619588 7561733 6474801 4882431
1306 4882431 1930918 1443387 3495013 4152228 3397874 2328768 390571 -481876 3012451
1297 3012451 6306394 3831061 475183 -955109 -3220732 -6373356 -6235100 -3429748
1289 -3429748 -1129802 -1072123 -2884420 -3907673 -5641217 -5549940 -3760319 -2434533 256109
1280 256109 5188228 5379937 3464755 1827341 1736214 2654039 1900577 1708607 -250281
1271 -250281 -273198 -890142 -2273233 -619458 80771 -188620 529445 5017234 7893260
1262 7893260 7558579 7646970 8526520 11681301 10229522 6667917 4610525 3568970 3958720
1253 3958720 -599016 -3762252 -658286 2768086 3259159 4004485 6449495 6425482 3404757
1244 3404757 2370682 3725069 4018960 1958891 1030231 1097419 -1005471 -3093656 -1839305
1235 -1839305 -4262728 -9115868 -6608861 -2098666 -815454 -1759222 -3547353 -2737357 -4469252
1226 -4469252 -6170899 -5068405 -6576528 -6345705 -2589947 -2940373 -3880492 -1557176 1747703
1217 1747703 2335977 1775543 2785615 2811975 4740020 2408721 -18662 2003 -3138601
1208 -3138601 -6119135 -4373704 -3354680 -860407 2106047 -276689 -4503425 -7361057
1200 -7361057 -8873637 -6357537 -2560442 716863 2991826 7988296 9948069 7488935
1192 7488935 3135627 -2498150 -2757546 33652 1155998 3684661 3944020 2600787 3413017
1183 3413017 4734158 3403972 2320487 1057632 818964 -496752 -4301504 -4331518 -1884588
1174 -1884588 -1824903 -4120801 -3748356 -136157 4426795 3147616 -1928734 -3556491 -1128362
1165 -1128362 1980353 3074502 1982562 1698718 4486523 6293683 6755400 5942868 4223069
1156 4223069 6744977 8070060 6405710 6170943 7636150 7244630 9406662 11280330 10654067
1147 10654067 8341723 7255774 6740074 2998207 -82951 1101983 5742129 11613205
1139 11613205 10228248 7092372 6449448 6165428 4357610 1806087 1618365 1193882 -1287801
1130 -1287801 -3011860 -1514152 1932018 2646990 -366853 -2988903 -2620157 -1536364 -3213832
1121 -3213832 -4632389 -5351863 -5417409 -5120237 -5265744 -6198269 -5736923 -3871708 -5505912
1112 -5505912 -8433592 -7116759 -4559163 -1628760 962219 1185285 2074528 3032696 3698750
1103 3698750 6994746 8376503 6267676 7183329 7948234 3155586 109833 1797178 -378332
1094 -378332 -3544119 -5483853 -3643518 -834737 173662 2224927 2427469 2712997 5187314
1085 5187314 8686923 10186378 10986964 11467558 10869235 10733411 11069097 6513699 856567
1076 856567 -1209086 -1023320 -54364 1546591 4724561 6449886 5427527 1511743 -408605
1067 -408605 -1874038 -2317052 -1243504 -505536 -2042452 -4532644 -3301964 220505 3165889
1058 3165889 2901654 2583098 -108532 -5082578 -3072624 -331775 645137 2646389 4011943
1049 4011943 1931022 -302804 -1297769 -3094498 -2503323 -2114581 -1989176 -1848006 -954788
1040 -954788 -3106005 -7235525 -6071163 -1951371 -1176496 -2143703 -1330061 1036689 1983802
1031 1983802 3638453 6653214 7500082 7371903 8174355 6612369 2206533 -1751995 -4551786
1022 -4551786 -4158046 -586507 3357450 4244412 4019079 2810117 6742844 11967399 12173521
1013 12173521 9335611 5966762 1423476 -1965979 -4368833 -6096423 -4626406 -352666
1005 -352666 3913139 4648705 3353028 2843063 2587834 1173612 2912956 5843024 4504197
996 4504197 1183277 2388149 6132855 7591272 7099009 5034774 3020746 2636795 3146067
987 3146067 2102308 36380 -1545500 -973815 -1133078 -2601436 -2842359 -3623319 -2709396
978 -2709396 -3069253 -5208108 -3825497 -2734925 971493 1471685 -2567850 -4498169 -3130820
969 -3130820 104299 332142 -1498162 -768647 1459753 1500152 3468925 5490757 1120326
960 1120326 -2380693 -3221722 -2728056 -1666542 -1100309 -245023 -2276662 -6166480 -9179672
951 -9179672 -7010118 -4097027 -4036444 -5892168 -5254009 -6391210 -6597671 -5144237 -2996962
942 -2996962 389644 1258214 3715279 6622308 6345011 4632327 4461678 4432778 2194507
933 2194507 226026 -3883157 -6826612 -7311929 -5997023 -3609571 1689961 4368842 3794905
924 3794905 4610977 4532417 1129791 -1972247 -5604635 -6396110 -6268501 -5179659 1055122
915 1055122 1709049 -651656 -1595139 -1771011 -3539791 -5388033 -7190099 -4893255 -2349201
906 -2349201 -4667633 -13942939 -21524783 -18980761 -12568064 -8796144 -8394879 -7462173 -5994004
897 -5994004 -7873432 -8033977 -3180450 2703564 6563901 4754416 1885576 -1665199 -1572447
888 -1572447 -674276 2024133 4114095 6165911 6371259 1666998 -371003 -2019298 -4740984
879 -4740984 -5852704 -7355285 -6737029 -3536104 1155267 3449844 5081271 3194130 2240035
870 2240035 3620706 1236124 -1250655 -883581 1765535 4232005 6614352 4862198 2642409
861 2642409 2242346 1204534 -255004 -157846 2564584 3853435 4131799 2491078 3194162
852 3194162 8268140 8028758 5451216 3063651 2470933 3324503 4895478 5202600 1782006
843 1782006 -752509 -1308984 -2482779 -4930997 -6423658 -3873509 -632385 -709439 -2399364
834 -2399364 -488646 168134 -654803 -1631131 -2660098 -3500546 -2869153 -5454257 -4714181
825 -4714181 -3031931 -2856345 292757 2456130 3324317 1680257 -1025681 -1323291 288679
816 288679 442926 -134427 -1301052 -3905892 -6289096 -4116930 -1285297 -2402154 -10008996
807 -10008996 -14164082 -12986035 -7659140 -2723257 -4354850 -9216137 -7953488 -4307954
799 -4307954 -347839 3934845 6557234 6314784 6012341 7652974 6860342 3954061 2706624
790 2706624 -199268 -3055523 -621315 5928982 9889891 10220192 8808722 2713566 -3764806
781 -3764806 -5732747 -4005997 -503931 115990 -503769 1720648 4203578 5196993 4470082
772 4470082 3602002 2977767 2340568 3008489 3229667 3006771 4142379 5546988 7402746
763 7402746 8206627 6951038 4057110 2610999 1896018 -214381 2614087 6896963 5641722
754 5641722 390694 1259705 7434795 9362008 4842266 -1209677 -3570634 -5365242 -4417535
745 -4417535 -3089325 -2491187 477084 2597555 447035 2371148 5415603 4909243 3439516
736 3439516 2086399 1337525 -2438924 -3987892 2277763 7956206 7949456 3227721 -5558423
727 -5558423 -8280369 -3093034 -593041 -456453 2246021 2654319 3022693 4635477 4661910
718 4661910 6668204 7969690 7807993 5691822 3273963 -289752 -2303565 -3152470 -1168766
709 -1168766 -1594798 439618 6366507 8841978 7707665 5402183 3076266 1407815 283795
700 283795 -1062936 -2022011 -4018884 -6044788 -5821045 -3419229 -1863087 -1820692 -3136010
691 -3136010 -3243184 -2806822 -4511223 -6428128 -5694264 -1747850 -1908472 -3603940 -557863
682 -557863 114940 -2649123 -7240590 -8596625 -6306320 -4054858 -1651055 -3005681 -4410978
673 -4410978 -3850464 -5214470 -6437033 -1521495 6316147 11653076 12396027 11002732 7881056
664 7881056 5108582 819936 -2092537 66132 750716 -1709062 -4089091 -1627564 2208357
655 2208357 2753393 -153388 -2833232 -2367055 -1850044 553378 3653312 3905198 2970830
646 2970830 3887800 3920625 2868111 874487 -941899 -3814459 -5616689 -4768514 -3571359
637 -3571359 -4067694 -6103026 -8009641 -6659679 -1862554 2360794 5523802 5944387 6432470
628 6432470 7141039 4628154 4362339 5903881 3370249 -1515772 -4191828 -5276623 -3889040
619 -3889040 -2292727 -5108265 -5717767 -4771429 -4361152 -2275576 1001157 2772320 2543622
610 2543622 -551542 -3458102 -1583088 2786368 8484873 10144709 4960690 3096825
602 3096825 4132088 4595156 4341490 3004727 1729810 202745 -2299789 -2529615 -2660361
593 -2660361 -5848417 -4416533 -1210800 -733177 -1060081 -309752 581408 2243078 5006997
584 5006997 4201719 -1195967 -7253763 -7507031 -3793207 371748 2312815 1442081 -203605
575 -203605 -1102720 -1272049 2676673 4371920 2697317 -1141485 -3942655 -5335477 -5968604
566 -5968604 -1848211 1549965 4563535 7860363 8337251 7332598 6809548 3615792 -709961
557 -709961 -1878287 -2947 2877142 3521122 4147143 6603128 7154564 6439576 7112331
548 7112331 5413699 2104871 316369 488518 3301633 8516283 9414629 6606988 3065002
539 3065002 -723886 -1853397 -4296488 -8660773 -8720457 -6197395 -4560573 -1396332 2263160
530 2263160 3109334 2111154 1307091 1501921 2599884 3747232 1258637 64304 4147908
521 4147908 6258379 3286405 -731393 -1044230 1887301 2365099 292873 -943203 -2345720
512 -2345720 -2989428 820840 4627123 4537089 3083369 903287 -911678 -705541 814467
503 814467 1403470 118216 -1236566 515399 -631252 -3262910 -2985960 -1125187 -305344
494 -305344 -2903801 -3733170 -4705912 -7236353 -11376557 -14457572 -12724262 -10927334 -10893408
485 -10893408 -10037401 -5193743 -2297551 -2919470 -3866063 -4082684 -4740988 -2106162 401669
476 401669 -2531497 -4256994 -2839434 -1165641 -1646630 -2164627 -2461194 -1987374 1506372
467 1506372 5634825 9508974 10897383 7929973 4310564 2041775 2951878 1788894 -1429535
458 -1429535 -1321125 3693704 3765295 2609040 6506812 10159977 10735084 8379162 6012657
449 6012657 3583077 602569 34557 2421702 3831442 3421692 3081214 6132439 5641755
440 5641755 32976 -4133951 -2335562 -228478 -426134 -2461430 -4264522 -6548004 -6214480
431 -6214480 -2742664 700114 947403 -1201002 -3873300 -3575212 -142544 3547212 2994729
422 2994729 -1760095 -1769841 627220 1668624 1324664 3072373 3821168 2952345 797449
413 797449 -1089404 -44929 3949483 8437374 8285564 6000533 3750535 585907 699282
404 699282 2084115 1956192 1751484 -325036 -722962 -1067715 -2690331 542199 5267639
395 5267639 5913108 4543904 4429260 2627995 -1648020 -6036714 -2858705 -758210 -1560738
386 -1560738 -4472357 -5984929 -5230277 -2228216 2727093 3124037 -1526512 -4492627 -2366230
377 -2366230 -2087776 -3065955 358861 2336943 -794979 -1368561 576847 2499386 2225591
368 2225591 -2035173 -4116507 -4241307 -3262595 1571725 2662492 2829202 1217177 1785506
359 1785506 4614784 4717508 4829629 4124852 6029961 8189411 6694941 5426284 5251622
350 5251622 3693432 1367570 2637425 3986791 2855521 1130318 1182264 1824212 924985
341 924985 1817922 6059794 6957235 5904966 5880635 1750117 -3347232 -3479566 -2347479
332 -2347479 -1470769 -505152 1808893 1738429 -1026872 -2949963 -3297933 -2972754 -3372499
323 -3372499 -5788944 -6031682 -5348328 -5633812 -3920462 -4331354 -4811282 -4198240 -1073942
314 -1073942 -773749 -3135138 -6226590 -7758606 -8028626 -6993824 -4402315 -4124912 -2001757
305 -2001757 -281847 -1297238 -3570181 -4104978 -3899928 -3786839 -1904427 -501507 -1671952
296 -1671952 -1224814 -1055309 -364275 4022175 6636051 7653518 9821026 12729550 12554398
287 12554398 10264709 7619115 5883602 4551661 5299784 7025005 5704539 1824735
279 1824735 -2573880 -1988715 -1435679 -2777510 -3151942 -1438064 548678 187906 -127281
270 -127281 1986583 2649854 1345235 1477591 514325 1237119 3149880 2250338 196984
261 196984 -366572 639515 1044718 2419643 3035509 3474411 4287740 490463 -4385133
252 -4385133 -6276282 -6521019 -6298636 -4879250 -5011660 -5730673 -3637350 538953 2630106
243 2630106 1017100 -506639 1524412 2382247 381568 -602606 -1098955 -2301364 -3145425
234 -3145425 -4172668 -5431938 -4891230 -1745149 625579 344806 -942485 -2433254 -4866587
225 -4866587 -5671443 -3718163 223616 2828621 2433990 3660309 3624024 2412224 3569410
216 3569410 5749966 7091099 8381170 8424981 6235132 7054646 6496889 5009582 2384995
207 2384995 -879054 -1683954 -1175788 1216391 3671940 4847110 3130507 -966 379998
198 379998 5550786 6628142 4025593 2581468 1249445 -591929 -2528514 -2540057 -23199
189 -23199 1703317 1912953 722916 1265643 1804800 300317 -489541 -846375 1992101
180 1992101 4659662 3262306 655069 1149490 594893 -12077 523645 -432288 -1668049
171 -1668049 -1729948 367441 1828720 2774615 2528012 2691642 1429873 -691171 -1787268
162 -1787268 -514188 -2616332 -5980113 -6457035 -4579235 -1090130 557700 2980716 4164219
153 4164219 2165324 792198 -210727 -1189718 -2709162 -5489361 -5570929 -3952996 -4392372
144 -4392372 -5935783 -5971430 -5331094 -4256576 -3853490 -1622648 1187139 1772548 -853818
135 -853818 -2658924 -3857614 -4861737 -2793548 -705158 1232655 2630229 2447867 4861019
126 4861019 7609133 4472013 255979 813278 2364106 2874739 3849493 3880856 1734519
117 1734519 -1670002 -2905388 -2672027 -2339024 -2804598 -4122819 -3543749 -1825120 -1663763
108 -1663763 -850121 -787256 -3340476 -2911874 -72752 914838 2807112 3813053 3438626
99 3438626 2981962 3563057 2985279 2588260 1718902 -1783528 -5083162 -6080862 -4327315
90 -4327315 -2359264 -923242 2026702 4883413 5094146 4214957 4829696 4398482 3153413
81 3153413 3425066 4193555 3019275 3401899 3852949 804200 -581334 1778591 3909530
72 3909530 2985370 692041 505902 898449 345056 573747 777103 108456 -421376 -1304159
62 -1304159 -1955083 -1496937 3719 -1596774 -2934262 -2728067 -3564509 -2820944 -1460687
53 -1460687 1380931 4343702 4038559 524977 -2419393 -3967482 -3138463 -1681288 165292
44 165292 2161154 750880 -973385 -2689470 -2196251 -497417 -152498 581413 293059
35 293059 493802 -499174 -2353701 -4047776 -3182038 -2283575 -3348050 -2903134 -3678270 -4430789
25 -4430789 -4749579 -3876274 -2496733 -909650 -442220 -427898 1434996 4523303 5448681
16 5448681 3214778 -458375 -994505 878601 2267634 2424047 -47143 -3117951 -1991559
7 -1991559 1029046 2325651 3242751 4939819 6557121 6236024 4756588
0 4756588
$$ Imaginary data points
##PAGE= N=2
##DATA TABLE= (X++(I..I)), XYDATA
32767 913316 1282288 2793965 4543106 5706296 5966145 6889670 7706805 6262760 4418294
32758 4418294 1868989 1438769 5107819 8011909 9046415 8786635 7136628 7498547 9613801
32749 9613801 8635741 10604584 13116326 13858451 14394292 14748289 14499353 14435165 14289937
32740 14289937 12019029 10114289 10072495 12326437 16012929 16677021 13032850 9597381
32732 9597381 11414441 14300903 14424598 12731559 12371141 11895888 9783512 9234473 10336430
32723 10336430 10778680 11878680 12175739 11513901 11746636 12523649 12054222 10550621 8649996
32714 8649996 6043832 3385400 3171035 5984730 6960066 7044459 6239060 6867883 9255339
32705 9255339 10568425 9842206 7677268 5687162 4689921 5413282 6874329 8354676 11630038
32696 11630038 13133814 14168819 12811013 10132183 9428868 7942682 7206861 7762306
32688 7762306 10542173 13885044 15790525 16376818 16481007 13414915 10215031 9642674 8750756
32679 8750756 7433369 9559232 13730380 15235014 14116493 14085250 14554653 13724164 16325095
32670 16325095 15989075 13610035 12320928 12508499 13173016 13945284 15625164 14152274 12958718
32661 12958718 12308519 10943112 11639775 11305819 10147461 9966464 11180236 12982024 12871486
32652 12871486 9842925 8675398 9088354 8310857 9789019 12357205 14486884 16904074
32644 16904074 19057490 19839987 17827323 14410634 14979590 15691168 14544807 12317525
32636 12317525 11816549 13515888 15445815 15844283 15132269 15447410 17920983 20972121 23031024
32627 23031024 23725747 20929043 15155408 12848270 14565581 14908186 13281782 11262347
32619 11262347 10388835 12668260 14417812 17535672 19688625 19543003 20017784 17982603
$$ [...]
##END NTUPLES=NMR SPECTRUM
##END=
