##TITLE=C13_LR-743-M5
 D2O, 21300 sc

 9.2.2022
##JCAMPDX= 6.0         $$ Bruker NMR JCAMP-DX V2.0
##DATA TYPE= NMR SPECTRUM
##DATA CLASS= NTUPLES
##ORIGIN= UXNMR, Bruker Analytische Messtechnik GmbH
##OWNER= root
$$ XWIN-NMR		Version 3.5
$$ Thu Feb 10 10:15:05 2022 Russian Standard Time (UT+4h)  she@DPX200
##.OBSERVE FREQUENCY= 50.327896
##.OBSERVE NUCLEUS= ^13C
##.ACQUISITION MODE= SIMULTANEOUS
##.ACQUISITION SCHEME= undefined
##.AVERAGES= 21300
##.DIGITISER RES= 17
##SPECTROMETER/DATA SYSTEM= spect
##.PULSE SEQUENCE= zgpg30
##.SOLVENT NAME= CDCl3
##.SHIFT REFERENCE= (INTERNAL, CDCl3, 0, 222.961)
##AUDIT TRAIL= $$ (NUMBER, WHEN, WHO, WHERE, WHAT)
$$ ##TITLE= Audit trail, XWIN-NMR		Version 3.5
$$ ##JCAMPDX= 5.01
$$ ##ORIGIN= Bruker BioSpin GmbH
$$ ##OWNER= she
$$ F:/spectra/data/she/nmr/c13/1/pdata/1/auditp.txt
$$ ##AUDIT TRAIL=  $$ (NUMBER, WHEN, WHO, WHERE, WHAT)
(   1,<2022-02-10 10:12:38.71 +0400>,<she>,<DPX200>,
      <created by zg, POWCHK disabled, PULCHK disabled
       terminated by command 'halt'
       configuration hash MD5:
       00 E9 B6 7A A2 85 ED C7 34 08 36 98 17 FE 4E 26
       data hash MD5: 32K
       56 67 12 D7 B3 89 1F 1F 58 48 68 1B A7 D0 07 C2>)
(   2,<2022-02-10 10:12:46.34 +0400>,<she>,<DPX200>,
      <Start of raw data processing
       efp BC_mod = 2 LB = 1 FT_mod = 6 PKNL = 1 PHC0 = -328.5747 PHC1 = 35.76232 SI = 32K 
       data hash MD5: 32K
       56 41 FC 7B 46 A7 7E 6A FD 5B FA 39 9D 36 B3 F2>)
(   3,<2022-02-10 10:13:40.57 +0400>,<she>,<DPX200>,
      <pk PHC0 = -2.320783 PHC1 = -8.600001 
       data hash MD5: 32K
       25 BF 9D 62 E8 55 42 CE F8 3E AC 52 0F A2 35 B7>)
(   4,<2022-02-10 10:13:49.93 +0400>,<she>,<DPX200>,
      <abs ABSG = 5 
       data hash MD5: 32K
       C7 C8 EA 9A 1D 8F 0A A4 D7 6E 51 88 FF 9A E6 D0>)
$$ ##END=
$$ 
$$ hash MD5
$$ 49 C8 7B FF CA 25 81 00 B5 94 97 08 17 8D 26 5F
##$RELAX= 
##$RELAX= 
##$RELAX= 
##$RELAX= 
##$RELAX= 
##$RELAX= 
##$RELAX= 
##$RELAX= 
$$ Bruker specific parameters
$$ --------------------------
##$DU= <F:/spectra>
##$EXPNO= 1
##$NAME= <c13>
##$PROCNO= 1
##$TYPE= <nmr>
##$USER= <she>
##$AMP= (0..31)
100 100 100 100 100 100 100 100 100 100 100 100 100 100 100 100 100 100 
100 100 100 100 100 100 100 100 100 100 100 100 100 100 
##$AQSEQ= 0
##$AQ_mod= 1
##$AUNM= <au_zg>
##$AUTOPOS= <>
##$BF1= 50.322709
##$BF2= 200.13
##$BF3= 50.322709
##$BF4= 500.13
##$BF5= 500.13
##$BF6= 500.13
##$BF7= 500.13
##$BF8= 500.13
##$BYTORDA= 1
##$CFDGTYP= 0
##$CFRGTYP= 5
##$CHEMSTR= <none>
##$CNST= (0..31)
1 1 145 1 1 1 1 1 1 1 1 1 1 1 1 1 1 1 1 1 1 1 1 1 1 1 1 1 1 1 1 1 
##$CPDPRG= <waltz16>
##$CPDPRG1= <>
##$CPDPRG2= <waltz16>
##$CPDPRG3= <>
##$CPDPRG4= <mlev>
##$CPDPRG5= <mlev>
##$CPDPRG6= <mlev>
##$CPDPRG7= <mlev>
##$CPDPRG8= <mlev>
##$CPDPRGB= <>
##$CPDPRGT= <>
##$D= (0..31)
0 2 0.00345 0 0 0 0 0 0 0 0 0.03 2e-05 3e-06 0 0 0 0 0 0 0 0 0 0 0 0 0 
0 0 0 0 0 
##$DATE= 1644400794
##$DBL= (0..7)
120 120 120 120 120 120 120 120 
##$DBP= (0..7)
150 150 150 150 150 150 150 150 
$$ [...]
##$SUBNAM4= <"">
##$SUBNAM5= <"">
##$SUBNAM6= <"">
##$SUBNAM7= <"">
##$SUBNAM8= <"">
##$SUBNAM9= <"">
##$SW= 239.972175391363
##$SWIBOX= (0..15)
0 1 3 0 0 0 0 0 0 0 0 0 0 0 0 0 
##$SW_h= 12077.2946859903
##$TD= 32768
##$TD0= 1
##$TE= 0
##$TE2= 300
##$TE3= 300
##$TEG= 300
##$TL= (0..7)
120 120 120 120 120 120 120 120 
##$TP= (0..7)
150 150 150 150 150 150 150 150 
##$TP07= 0
##$TPNAME0= <>
##$TPNAME1= <>
##$TPNAME2= <>
##$TPNAME3= <>
##$TPNAME4= <>
##$TPNAME5= <>
##$TPNAME6= <>
##$TPNAME7= <>
##$TPOAL= (0..7)
0.5 0.5 0.5 0.5 0.5 0.5 0.5 0.5 
##$TPOFFS= (0..7)
0 0 0 0 0 0 0 0 
##$TUNHIN= 0
##$TUNHOUT= 0
##$TUNXOUT= 0
##$USERA1= <user>
##$USERA2= <user>
##$USERA3= <user>
##$USERA4= <user>
##$USERA5= <user>
##$V9= 5
##$VALIST= <valist>
##$VCLIST= <CCCCCCCCCCCCCCC>
##$VD= 0
##$VDLIST= <DDDDDDDDDDDDDDD>
##$VPLIST= <PPPPPPPPPPPPPPP>
##$VTLIST= <TTTTTTTTTTTTTTT>
##$WBST= 1024
##$WBSW= 4
##$XGAIN= (0..3)
0 0 0 0 
##$XL= 0
##$YL= 0
##$YMAX_a= 138433135
##$YMIN_a= -60726376
##$ZGOPTNS= <>
##$ZL1= 120
##$ZL2= 120
##$ZL3= 120
##$ZL4= 120
##$ABSF1= 222.961
##$ABSF2= -17.03589
##$ABSG= 5
##$ABSL= 3
##$ALPHA= 0
##$AQORDER= 0
##$ASSFAC= 0
##$ASSFACI= 0
##$ASSFACX= 0
##$ASSWID= 0
##$AUNMP= <proc_1d>
##$AZFE= 0.1
##$AZFW= 0.5
##$BCFW= 0
##$BC_mod= 2
##$BYTORDP= 0
##$COROFFS= 0
##$CY= -3
##$DATMOD= 1
##$DC= 0
##$DFILT= <>
##$DTYPP= 0
##$F1P= 0
##$F2P= 0
##$FCOR= 0.5
##$FTSIZE= 32768
##$FT_mod= 6
##$GAMMA= 0
##$GB= 0
##$INTBC= 1
##$INTSCL= 4.134877e-10
##$ISEN= 128
##$LB= 1
##$LEV0= 0
##$LPBIN= 0
##$MAXI= 10000
##$MC2= 0
##$MEAN= 0
##$ME_mod= 0
##$MI= 0.1934396
##$NCOEF= 0
##$NC_proc= 5
##$NLEV= 6
##$NOISF1= 120.0001
##$NOISF2= 80.00006
##$NSP= 0
##$NTH_PI= 0
##$NZP= 0
##$OFFSET= 222.961
##$PC= 1.4
##$PHC0= -330.8955
##$PHC1= 27.16232
##$PH_mod= 1
##$PKNL= yes
##$PPARMOD= 0
##$PSCAL= 0
##$PSIGN= 0
##$REVERSE= no
##$SF= 50.3227146458226
##$SI= 32768
##$SIGF1= 140
##$SIGF2= 120
##$SINO= 11.81781
##$SIOLD= 32768
##$SREGLST= <13C.CDCl3>
##$SSB= 0
##$STSI= 32768
##$STSR= 0
##$SW_p= 12077.2946859903
##$SYMM= 0
##$S_DEV= 0
##$TDeff= 32768
##$TDoff= 0
##$TI= <>
##$TILT= no
##$TM1= 0
##$TM2= 0
##$TOPLEV= 0
##$USERP1= <user>
##$USERP2= <user>
##$USERP3= <user>
##$USERP4= <user>
##$USERP5= <user>
##$WDW= 1
##$XDIM= 32768
##$YMAX_p= 446838715
##$YMIN_p= -360688
$$ End of Bruker specific parameters
$$ ---------------------------------
##NTUPLES= NMR SPECTRUM
##VAR_NAME=  FREQUENCY,     SPECTRUM/REAL,   SPECTRUM/IMAG
##SYMBOL=    X,             R,               I
##VAR_TYPE=  INDEPENDENT,   DEPENDENT,       DEPENDENT
##VAR_FORM=  AFFN,          ASDF,            ASDF
##VAR_DIM=   32768,         32768,           32768
##UNITS=     HZ,            ARBITRARY UNITS, ARBITRARY UNITS
##FACTOR=    0.368581032318806, 1,           1
##FIRST=     11220.0027064323, 0,            0
##LAST=      -857.291979557962, 0,           0
##MIN=       -857.291979557962, -360688,     0
##MAX=       11220.0027064323, 446838715,    0
$$ Real data points
##PAGE= N=1
##DATA TABLE= (X++(R..R)), XYDATA
$$ [...]
$$ plain form
13753 -62663 9772 103932 144381 109799 37586 -20637 -97461 -96147 -44787 -14900 -36545 -46511
13741 -46511 -31543 -26458 -6485 15230 28621 29249 14493 18831 32595 78506 87025 57931 49133
13728 49133 78457 86865 95270 124102 164187 168843 77690 -2742 -12468 4364 8952 37360 51856
13715 51856 66591 86586 93653 102262 55082 20062 67648 96124 77434 73568 91888 79248
13703 79248 23053 -30791 -81815 -110040 -87084 -34221 -605 17122 5054 -11754 5460 -8233
13691 -8233 -6824 8932 26113 60347 56474 22252 -11137 -27781 -34150 -77573 -115043 -140793
13679 -140793 -132965 -148547 -116622 -44986 -7694 20162 53959 56567 67565 89857 67354 75728
13667 75728 99237 18610 -74905 -80940 -106680 -149131 -168107 -110989 -61731 -32221 -26820 20263
$$ packed form
13753f2663P2435R4160M0449l4582p2213n8223p6824J314N1360K9887k1645r966
13741d6511J4968N085J9973K1715J3391O28j4756M338J3764M5911Q519k9094q798
13728D9133K9324Q408Q405K8832M0085M656r1153q0432r726J6832M588K8408J4496
13715E1856J4735J9995P067Q609m7180l5020M7586K8476j8690l866J8320j2640
13703G9248n6195n3844n1024k8225K2956N2863L3616J7727j2068j6808J7214j3693
13691h233J409J5756J7181L4234l873l4222l3389j6644o369m3423l7470k5750
13679a40793P828j5582L1925P1636L7292K7856L3797K608J0998K2292k2503Q374
13667G5728K3509q0627r3515o035k5740m2451j8976N7118M9258K9510N401M7083
$$ plain form
13655 20263 63551 68770 31820 -23281 6243 66405 78348 79046 77208 56177 62561 79984 32480
13642 32480 -36973 -50411 -18634 1393 26400 80205 99965 85377 62330 30699 27657 -20206
13630 -20206 -73420 -81837 -78640 -71439 -74713 -65978 -37464 -66311 -70867 -49856 -50014 -28883 14918
13617 14918 57471 65736 24153 -16584 9990 -4117 -11169 -20338 -33192 -19375 13754 -20946
13605 -20946 -52143 -99121 -130138 -92860 -26193 -226 28750 41736 -10710 -100560 -118959 -103168
13593 -103168 -76015 -59222 -130193 -181389 -138957 -62546 -15281 11817 50111 80902 82362 23723
13581 23723 -36792 -45282 -10753 -20076 -44196 -61901 -47663 6959 54308 61204 35822 23271
13569 23271 58991 68523 20687 -19426 -54676 -65492 -54880 -72713 -48443 -12588 25424 50083
$$ packed form
13655B0263M3288N219l6950n5101K9524O0162J1943O98j838k1031O384J7423m7504
13642C2480o9453j3438L1777K0027K5007N3805J9760j4588k3047l1631l042m7863
13630b0206n3214q417L197P201l274Q735K8514k8847m556K1011j58K1131M3801
13617A4918M2553Q265m1583m0737K6574j4107p052r169j2854J3817L3129l4700
13605b0946l1197m6978l1017L7278O6667K5967K8976J2986n2446q9850j8399J5791
13593a03168K7153J6793p0971n1196M2432P6411M7265K7098L8294L0791J460n8639
13581B3723o0515q490L4529r323k4120j7705J4238N4622M7349O896k5382j2551
13569B3271L5720R532m7836m0113l5250j0816J0612j7833K4270L5855L8012K4659
$$ plain form
13557 50083 86812 112005 76812 36477 31685 28044 40693 88395 116467 67318 21497 11685
13545 11685 45598 34155 -2707 23207 64585 36536 -1847 -15402 -14204 -16957 -21604 -49311
13533 -49311 -47933 -3500 15770 21624 -39004 -59513 503 49987 69868 73794 77053 79818 47805
13520 47805 1789 7257 32867 52611 73916 86348 46642 32830 45055 48599 22167 -52375
13508 -52375 -115825 -132451 -103568 -57656 -41649 -70968 -92018 -45838 10079 27381 -3707 -27327
13496 -27327 27674 64495 52097 43185 48866 39382 31471 6633 8887 27697 53306 55478 62375
13483 62375 56671 40360 66782 114137 123880 130149 101840 88383 91451 98495 77247 -4374 -83144
13470 -83144 -66764 -15546 48196 105744 83385 48969 64709 42347 -8716 -27026 -27598 -31839
$$ packed form
13557E0083L6729K5193l5193m0335m792l641J2649M7702K8072m9149m5821r812
13545A1685L3913j1443l6862K5914M1378k8049l8383j3555J198k753m647k7707
13533d9311J378M4433J9270N854o0628k0509O0016M9484J9881L926L259K765l2013
13520D7805m6016N468K5610J9744K1305J2432l9706j3812J2225L544k6432p4542
13508e2375o3450j6626K8883M5912J6007k9319k1050M6180N5917J7302l1088k3620
13496b7327N5001L6821j2398q912N681r484p911k4838K254J8810K5609K172O897
13483F2375n704j6311K6422M7355R743O269k8309j3457L068P044k1248q1621p8770
13470h3144J6380N1218O3742N7548k2359l4416J5740k2362n1063j8310n72m241
$$ plain form
13458 -31839 -39321 -15262 6258 -273 -34264 -84237 -104945 -55550 -34961 -67019 -81575 -99403
13446 -99403 -104266 -125939 -149783 -178495 -229478 -221017 -153010 -157473 -147908 -120146 -110875 -79592 -73682
13433 -73682 -91563 -72564 -31503 -42094 -64268 -68463 -57779 -76018 -96624 -74884 -61147 -54340
13421 -54340 -36875 -11219 14280 20106 11002 3387 9219 22434 38520 44316 47413 -8789 -87966
13408 -87966 -125434 -96722 -51943 158 39114 8120 -43676 -54048 -23815 13122 -19562 -108538
13396 -108538 -172932 -182655 -184130 -197121 -186280 -163918 -151041 -116204 -113874 -163618 -177887 -184699
13384 -184699 -147718 -98943 -76960 -45854 -51677 -68766 -50196 -69769 -45809 -16457 -55710 -66418
13372 -66418 -25058 -14042 -18198 -14445 15124 69800 82484 1018 -93421 -176204 -167388 -94653
$$ packed form
13458c1839p482K4059K1520o531l3991m9973k0708M9395K0589l2058j4556j7828
13446i9403m863k1673k3844k8712n0983Q461O8007m463R565K7762R271L1283N910
13433g3682j7881J8999M1061j0591k2174m195J0684j8239k0606K1740J3737O807
13421e4340J7465K5656K5499N826r104p615N832J3215J6086N796L097n6202p9177
13408h7966l7468K8712M4779N2101L8956l0994n1796j0372L0233L6937l2684q8976
13396a08538o4394r723j475j2991J0841K2362J2877L4837K330m9744j4269o812
13384a84699L6981M8775K1983L1106n823j7089J8570j9573K3960K9352l9253j0708
13372f6418M1360J1016m156L753K9569N4676J2684q1466r4439q2783Q816P2735
$$ plain form
13360 -94653 -30711 9464 679 15336 -38179 -83869 -118326 -160978 -185915 -168232 -76448 68034
13348 68034 142302 106655 41585 2712 27860 59824 55709 64487 52010 -15061 -50310 -58275
13336 -58275 -39769 -22902 3672 11178 16106 11826 -40085 -80450 -86472 -80074 -7281 52646 70186
13323 70186 61288 6112 -12594 -27215 -33908 -17767 -13558 -22097 -12828 -5235 -62929 -153668 -197384
13310 -197384 -179046 -137007 -102667 -61955 -80688 -108468 -85952 -66045 -30595 13782 15601 7663
13298 7663 -290 -39315 -55202 -37510 -48924 -64520 -59480 -42514 -18750 13941 47556 75901
13286 75901 87556 27855 -55604 -103661 -141354 -112988 -76575 -58210 -12721 44373 67446 76623
13274 76623 84478 62872 50038 6230 -75049 -104662 -116121 -126155 -65300 26234 68335 58019
$$ packed form
13360i4653O3942M0175q785J4657n3515m5690l4457m2652k4937J7683R1784J44482
13348F8034P4268l5647o5070l8873K5148L1964m115Q778j2477o7071l5249p965
13336e8275J8506J6867K6574P506M928m280n1911m0365o022O398P2793N9927J7540
13323G0186q898n5176j8706j4621o693J6141M209q539R269P593n7694r0739m3716
13310a97384J8338M2039L4340M0712j8733k7780K2516J9907L5450M4377J819p938
13298G663p953l9025j5887J7692j1414j5596N040J6966K3764L2691L3615K8345
13286G5901J1655n9701q3459m8057l7693K8366L6413J8365M5489N7094K3073R177
13274G6623P855k1606j2834m3808q1279k9613j1459j0034O0855R1534M2101j0316
$$ plain form
13262 58019 44849 -2942 5793 33250 72335 9403 -44807 -18753 -48460 -109096 -118428 -159068
13250 -159068 -181006 -136832 -72905 -16097 40780 54341 4888 -86224 -150243 -175238 -136413
13239 -136413 -99475 -117700 -136451 -163616 -123109 -77519 -58242 -37881 -17393 3919 22122
13228 22122 16164 -13104 5477 50644 89938 100031 51979 10302 -2115 -38152 -61135 -31915
13216 -31915 -14639 15398 45821 33335 31399 58566 49935 4777 -32986 -41956 -15524 -5173
13204 -5173 63674 114853 118636 93179 28967 25370 47668 50994 68698 62608 48665 42996 34091
13191 34091 1200 -17442 4531 8294 -2410 7392 23930 59486 92653 102359 65509 34612
13179 34612 17905 11362 6863 -9877 -13140 -4897 -26234 -40372 -19904 -19147 -1001 -23059 -71571
$$ packed form
13262E8019j3170m7791Q735K7457L9085o2932n4210K6054k9707o0636r332m0640
13250a59068k1938M4174O3927N6808N6877J3561m9453r1112o4019k4995L8825
13239a36413L6938j8225j8751k7165M0507M5590J9277K0361K0488K1312J8203
13228B2122n958k9268J8581M5167L9294J0093m8052m1677j2417l6037k2983K9220
13216c1915J7276L0037L0423j2486j936K7167q631m5158l7763q970K6432J0351
13204e173O8847N1179L783k5457o4212l597K2298L326J7704o090j3943n669q905
13191C4091l2891j8642K1973L763j0704R802J6538L5556L3167R706l6850l0897
13179C4612j6707o543m499j6740l263Q243k1337j4138K0468P57J8146k2058m8512
$$ plain form
13166 -71571 -50378 -22005 20639 57560 57587 52183 48540 78288 108462 119957 104180 46049 5775
13153 5775 48180 56967 36023 79112 182020 194116 98561 13230 -8435 -14644 -26866 -11722
13141 -11722 8442 9124 38552 40477 46794 19959 -36311 -71289 -91089 -73447 -78220 -86008 -69207
13128 -69207 -46024 -38361 -35708 -5756 -24178 -59769 -34470 -3397 -1615 -1799 8620 42459 109974
13115 109974 137899 96623 77020 43008 -8032 -45206 -34381 12374 42253 46022 43105 -8019
13103 -8019 -19574 -9885 -37371 -106739 -187929 -234220 -235256 -227927 -206345 -146635 -79229 -33190
13091 -33190 -76575 -145165 -116714 -85138 -69394 -95409 -114217 -103275 -78353 -58567 -67140 -65229
13079 -65229 -45637 -68126 -94003 -89169 -63106 -836 39239 62735 39990 7175 4554 21023
$$ packed form
13166g1571K1193K8373M2644L6921K7n404l643K9748L0174J1495j5777n8131m0274
13153E775M2405Q787k0944M3089J02908J2096r5555q5331k1665o209j2222J5144
13141a1722K0164O82K9428J925O317k6835n6270l4978j9800J7642m773p788J6801
13128f9207K3183P663K653K9952j8422l5591K5299L1073J782j84J0419L3839O7515
13115A09974K7925m1276j9603l4012n1040l7174J0825M6755K9879L769k917n1124
13103h019j1555R689k7486o9368q1190m6291j036P329K1582N9710O7406M6039
13091c3190m3385o8590K8451L1576J5744k6015j8808J0942K4922J9786q573J911
13079f5229J9592k2489k5877M834K6063O2270M0075K3496k2745l2815k621J6469
$$ plain form
13067 21023 15703 1346 -28635 -54984 -34002 11742 46756 59575 8531 -102603 -129806 -82396
13055 -82396 -25071 -7006 -35615 -56891 -76220 -88069 -36185 26604 108667 172517 154357 95395
13043 95395 17922 -9778 -28071 -66119 -58110 -28105 -72074 -98803 -71779 -57628 -102406 -106428
13031 -106428 -53617 -45607 -67650 -51974 -32121 -31706 -39154 -42373 -12622 -38771 -6550 95239
13019 95239 165436 167224 167500 143710 60201 40051 62347 74030 82196 58649 11934 -71462
13007 -71462 -98030 -92716 -81874 -37737 -9701 -32226 -55352 -42988 -34788 -39224 -47296 -42366 -34601
12994 -34601 -19603 52 5594 -7800 34784 106640 115830 81029 21014 -51836 -56753 -1888
12982 -1888 18075 -2200 -34902 -69588 -107510 -134350 -139917 -107990 -41357 48074 89521 83027
$$ packed form
13067B1023n320j4357k9981k6349K0982M5744L5014J2819n1044j11134k7203M7410
13055h2396N7325J8065k8609k1276j9329j1849N1884O2789Q2063O3850j8160n8962
13043I5395p7473k7700j8293l8048Q009L0005m3969k6729K7024J4151m4778m022
13031a06428N2811Q010k2043J5676J9853M15p448l219K9751k6149L2221J01789
13019I5239P0197J788K76k3790q3509k0150K2296J1683Q166k3547m6715q3396
13007g1462k6568N314J0842M4137K8036k2525k3126J2364Q200m436q072M930P765
12994c4601J4998J9655N542j3394M2584P1856R190l4801o0015p2850m917N4865
12982a888J9963k0275l2702l4686l7922k6840n567L1927O6633Q9431M1447o494
$$ plain form
12970 83027 15661 -43963 -141343 -201113 -146350 -100936 -85930 -69607 -67387 -73414 -75610 -80489
12958 -80489 -53575 -49058 -64317 -68695 -53387 -53302 -60162 -25961 21765 38101 -9154 -88984 -138551
12945 -138551 -155094 -130066 -58375 22414 36711 10500 -37816 -77954 -34457 20485 54249
12934 54249 68879 68699 60518 67358 102158 163074 233763 252960 204140 146775 85078 29864
12922 29864 -29057 -78755 -54516 -17460 13800 50111 45835 21692 9134 -44521 -71218 -42083
12910 -42083 -17699 6630 18502 -3596 -23012 -44267 -35716 -5815 14928 -6133 -27099 -47919
12898 -47919 -83689 -49530 -18519 -11612 10323 -18208 -35108 -32058 -66209 -83957 -102099 -117554
12886 -117554 -110311 -134864 -121997 -28778 19797 45608 85008 36290 -20839 -26948 -15890 -16385
$$ packed form
12970H3027o7366n9624r7380n9770N4763M5414J5006J6323K220o027k196m879
12958h0489K6914M517j5259m378J5308Q5o860L4201M7726J6336m7255p9830m9567
12945a38551j6543K5028P1691Q0789J4297k6211m8316m0138M3497N4942L3764
12934E4249J4630j80q181O840L4800O0916P0689J9197m8820n7365o1697n5214
12922B9864n8921m9698K4239L7056L1260L6311m276k4143j2558n3655k6697K9135
12910d2083K4384K4329J1872k2098j9416k1255Q551K9901K0743k1061k0966k0820
12898d7919l5770L4159L1011O907K1935k8531j6900L050l4151j7748j8142j5455
12886a17554P243k4553J2867R3219M8575K5811L9400m8718n7129o109J1058m95
$$ plain form
12874 -16385 -25129 -6722 -1082 7873 -29130 -57744 -63243 -52313 -10213 -2894 -27284 -49948 -58125
12861 -58125 -75586 -58190 -55184 -47365 -50997 -60161 -37936 -60927 -57407 -33914 -35980 16386 31631
12848 31631 -11015 -85811 -138303 -123529 -81268 -28291 6729 4706 21626 32481 28384 -1430
12836 -1430 -3250 -12098 -39353 -51440 -61129 -79125 -98449 -90094 -79667 -58783 -48670 -9996 -9228
12823 -9228 -51340 -78739 -81830 -66347 -44108 -41876 -63193 -59810 -48875 -43487 -35290 -20365 -3546
12810 -3546 -12036 -50224 -134326 -175537 -126010 -87823 -73891 -69954 -93540 -150712 -108021 -62149
12798 -62149 -125360 -248806 -312479 -312883 -271488 -220773 -196608 -160320 -107589 -71203 -109071 -139822
12786 -139822 -132287 -62740 -25370 -12820 3178 36705 81426 56105 44902 99035 104356 37378
$$ packed form
12874a6385q744J8407N640Q955l7003k8614n499J0930M2100P319k4390k2664q177
12861e8125j7461J7396L006P819l632r164K2225k2991L520K3493k066N2366J5245
12848C1631m2646p4796n2492J4774M2261N2977L5020k023J6920J0855m097k9814
12836a430j820q848k7255j2087r689j7996j9324Q355J0427K0884J0113L8674P68
12823i228m2112k7399l091J5483K2239K232k1317L383J0935N388Q197J4925J6819
12810c546q490l8188q4102m1211M9527L8187J3932L937k3586n7172M2691M5872
12798f2149o3211j23446o3673m04M1395N0715K4165L6288N2731L6386l7868l0751
12786a39822P535O9547L7370J2550J5998L3527M4721k5321j1203N4133N321o6978
$$ plain form
12774 37378 19513 16862 -33185 -65986 -74102 -66008 -40110 -47901 -125184 -142090 -97086 -84595
12762 -84595 -74276 -86115 -133271 -202892 -227021 -204807 -204289 -175778 -86314 -55104 -86916 -129409
12750 -129409 -173762 -151529 -114642 -129407 -64339 5105 9702 -46816 -101456 -138842 -146334 -142307
12738 -142307 -180740 -195113 -197215 -215661 -223461 -186331 -126075 -81534 -26150 9337 30132 -21744
12726 -21744 -92470 -39329 35011 41018 29339 16129 3690 -22515 -5591 24747 -30925 -48614
12714 -48614 -1050 9721 2398 -75773 -86065 -31437 -555 6298 10055 -40898 -127259 -171296
12702 -171296 -131351 -39883 10721 12865 20202 72778 51449 -25000 -56588 -80615 -91659 -46645
12690 -46645 -19202 5414 32830 35539 52700 96954 130640 135249 83447 8557 -30988 -50418
$$ packed form
12774C7378j7865k651n0047l2801q116Q094K5898p791p7283j6906M5004J2491
12762h4595J0319j1839m7156o9621k4129K2214N18K8511Q9464L1210l1812m2493
12750a29409m4353K2233L6887j4765O5068O9444M597n6518n4640l7386p492M027
12738a42307l8433j4373k102j8446p800L7130O0256M4541N5384L5487K0795n1876
12726b1744p0726N3141P4340O007j1679j3210j2439k6205J6924L0338n5672j7689
12714d8614M7564J0771p323p8171j0292N4628L0882O853L757n0953q6361m4037
12702a71296L9945R1468N0604K144P337N2576k1329p6449l1588k4027j1044M5014
12690d6645K7443K4616K7416K709J7161M4254L3686M609n1802p4890l9545j9430
$$ plain form
12678 -50418 -46713 -62267 -72662 -80158 -99303 -101438 -51567 -32192 -80315 -120852 -163821 -138071
12666 -138071 -49882 -47916 -69902 -41169 -26809 -6800 14105 6288 16365 20211 -1616 16610
12654 16610 37636 36125 30375 -6972 -52290 -111046 -160135 -178743 -167408 -130895 -114101 -92404
12642 -92404 -51261 -14086 -19822 -58366 -49412 -33866 -64796 -54827 29285 54124 47104 -1642
12630 -1642 -35607 -47498 -91061 -116004 -114566 -93140 -78312 -80576 -90303 -125159 -162008 -143176
12618 -143176 -67877 -9708 -28459 -96186 -140417 -96234 -6363 66952 126863 101244 40355
12607 40355 21157 52314 94122 97911 104131 89442 57124 39927 73409 124215 160289 175939
12595 175939 121707 39714 10118 20809 70404 95384 120952 112714 77188 68102 42650 20430
$$ packed form
12678e0418L705j5554j0395p496j9145k135M9871J9375m8123m0537m2969K5750
12666a38071Q8189J966k1986K8733J4360K0009K0905p817J0077L846k1827J8226
12654A6610K1026j511n750l7347m5318n8756m9089j8608J1335L6513J6794K1697
12642i2404M1143L7175n736l8544Q954J5546l0930R969Q4112K4839p020m8746
12630a642l3965j1891m3563k4943J438K1426J4828k264r727l4856l6849J8832
12618a43176P5299N8169j8751o7727m4231M4183Q9871P3315N9911k5619o0889
12607D0355j9198L1157M1808L789O220j4689l2318j7197L3482N0806L6074J5650
12595A75939n4232q1993k9596J0691M9595K4980K5568q238l5526r086k5452k2220
$$ plain form
12583 20430 -28115 -50661 -49817 -53843 -52027 -75645 -83315 -68874 -82609 -99697 -114799 -154723 -148095
12570 -148095 -109084 -59132 -39483 -64911 -53065 -25571 -32839 -92781 -137049 -104141 -115147 -99523
12558 -99523 -69041 -45053 -36953 -37805 -79836 -101077 -53594 -29268 -33938 -55152 -115868 -74360
12546 -74360 42398 78181 37787 -29751 -67054 -34132 -21062 -40738 -59472 -56498 -59723 -73421
12534 -73421 -90842 -120534 -166575 -160373 -132109 -100060 -116865 -145577 -114473 -69614 -51736 -51727 12793
12521 12793 90420 100965 50041 -16459 -25228 -26944 -49567 -75558 -39109 -27415 -51219 -61510
12509 -61510 -57786 -51312 -70189 -102252 -116682 -104410 -120543 -166535 -169986 -169452 -193050 -215885 -225067
12496 -225067 -200624 -204560 -222579 -179054 -141192 -84422 8006 70352 67561 24327 43869 45988
$$ packed form
12583B0430m8545k2546Q44m026J816k3618p670J4441j3735j7088j5102l9924O628
12570a48095L9011M9952J9649k5428J1846K7494p268n9942m4268L2908j1006J5624
12558i9523L0482K3988Q100q52m2031k1241M7483K4326m670k1214o0716M1508
12546g4360J16758L5783m0394o7538l7303L2922J3070j9676j8734K974l225j3698
12534g3421j7421k9692m6041O202K8264L2049j6805k8712L1104M4859J7878RO4520
12521A2793P7627J0545n0924o6500q769j716k2623k5991L6449J1694k3804j0291
12509f1510L724O474j8877l2063j4430J2272j6133m5992l451N34k3598k2835r182
12496b25067K4443l936j8019M3525L7862N6770R2428O2346k791m3234J9542K119
$$ plain form
12484 45988 46386 49625 27766 -19958 -98379 -141553 -104984 -73927 -60175 -4424 366 -15097
12472 -15097 -13075 -10145 -21342 -28881 -29730 -41591 -57966 -34792 -18475 -2316 -11621 -48953 -91334
12459 -91334 -119037 -130650 -111429 -97982 -100402 -113729 -124099 -113726 -100497 -110633 -147117 -176191
12447 -176191 -181921 -182883 -148721 -99054 -73698 -15501 -7559 -48816 -92300 -107154 -89484 -51276
12435 -51276 -69796 -140646 -166314 -162067 -105761 -88888 -100104 -165240 -200452 -190701 -189456 -181721
12423 -181721 -201943 -210869 -178481 -109229 -33257 -26689 -53014 -64663 -102012 -91940 -32000 -7406
12411 -7406 30126 60813 80979 52422 36199 20411 -2227 -400 10875 34408 43663 30003
12399 30003 -32435 -71235 -103608 -94326 -51654 -68057 -80345 -48398 -2543 3251 -7793 -6584
$$ packed form
12484D5988L98L239k1859m7724p8421m3174L6569L1057J3752N5751M790j5463
12472a5097K022K930j1197p539q49j1861j6375K3174J6317J6159r305l7332m2381
12459i1334k7703j1613J9221J3447k420j3327j0370J0373J3229j0136l6484k9074
12447a76191n730r62L4162M9667K5356N8197P942m1257m3484j4854J7670L8208
12435e1276j8520p0850k5668M247N6306J6873j1216o5136l5212R751J245P735
12423a81721k0222q926L2388O9252P5972O568k6325j1649l7349J0072N9940K4594
12411g406L7532L0687K0166k8557j6223j5788k2638J827J1275K3533R255j3660
12399C0003o2438l8800l2373R282M2672j6403j2288L1947M5855N794j1044J209
$$ plain form
12387 -6584 -29983 -13129 18039 39595 57109 71725 78954 86208 92767 14824 -97124 -116527
12375 -116527 -101853 -86046 -61482 -45481 -86901 -69281 -29272 1547 31661 43641 19661
12364 19661 1173 -5283 -40956 -94310 -115136 -133481 -122172 -105502 -91118 -56823 -55659 -70092
12352 -70092 -75552 -99703 -111035 -91365 -34356 33752 4822 -11358 -986 -29037 -54164 -114388
12340 -114388 -112730 -71258 709 36790 25576 25287 25072 3412 -41544 -48699 37895 78138 79121
12327 79121 109957 106425 71329 37020 -31061 -62997 -24399 23018 36909 15606 28264 26136
12315 26136 -1299 19747 -20320 -54941 -59605 -49741 -7486 15274 33131 -10683 -63216 -26378
12303 -26378 -19716 -43995 -59816 -64245 -73328 -70719 -24665 -9991 -26602 -48450 -84152 -99435
$$ packed form
12387f584k3399J6854L1168K1556J7514J4616P229P254O559p7943j11948j9403
12375a16527J4674J5807K4564J6001m1420J7620M0009L0819L0114J1980k3980
12364A9661j8488o456l5673n3354k0826j8345J1309J6670J4384L4295J164j4433
12352g0092n460k4151j1332J9670N7009O8108k8930j6180J0372k8051k5127o0224
12340a14388J658M1472P1967L6081j1214k89k15k1660m4956p155Q6594M0243R83
12327G9121L0836l532l5096l4309o8081l1936L8598M7417J3891k1303J2658k128
12315B6136k7435K1046m0067l4621m664R864M2255K2760J7857m3814n2533L6838
12303b6378O662k4279j5821m429r083K609M6054J4674j6611k1848l5702j5283
$$ plain form
12291 -99435 -46569 -17844 28631 75568 68192 15661 -370 28208 7351 -39393 -40502 -46675
12279 -46675 -88372 -81309 -57732 -46515 -35316 -8747 -3425 -1857 26097 35711 -24620 -72741
12267 -72741 -90776 -50032 -12746 -34773 -39523 -22410 -26802 -61260 -71077 -102868 -124308 -143780
12255 -143780 -115394 -53654 -35784 -69211 -87925 -48055 -27896 -9186 -41037 -126227 -149470
12244 -149470 -139661 -124807 -131195 -145829 -133108 -98741 -110332 -121041 -74818 -46883 -57077 -39745
12232 -39745 11709 47480 57043 18262 -53307 -81660 -46911 -16077 18183 6582 -10170 -7697
12220 -7697 -3799 -16981 21889 43910 37415 36229 39796 16921 -21528 -37715 -61147 -74622 -68939
12207 -68939 -109240 -108219 -71893 -132168 -160761 -81704 -78866 -121981 -150904 -187931 -126935 -64750
$$ packed form
12291i9435N2866K8725M6475M6937p376n2531j6031K8578k0857m6744j109o173
12279d6675m1697P063K3577J1217J1199K6569N322J568K7954R614o0331m8121
12267g2741j8035M0744L7286k2027m750J7113m392l4458r817l1791k1440j9472
12255a43780K8386O1740J7870l3427j8714L9870K0159J8710l1851q5190k3243
12244a49470R809J4854o388j4634J2721L4367j1591j0709M6223K7935j0194J7332
12232c9745N1454L5771R563l8781p1569k8353L4749L0834L4260j1601j6752K473
12220g697L898j3182L8870K2021o495j186L567k2875l8449j6187k3432j3475N683
12207f8939m0301J021L6326o0275k8593P9057K838m3115k8923l7027O0996O2185
$$ plain form
12195 -64750 -62198 -35035 52935 92765 58546 39385 1469 -29986 16187 96027 134856 103205
12183 103205 -4833 -57326 15183 101254 88009 66299 71433 109194 145294 116576 73255
12172 73255 7114 -62489 -84068 -69279 -77975 -110247 -101290 -60483 -45404 -59145 -99220 -95147
12160 -95147 -55883 -97591 -124306 -112194 -121815 -107392 -71671 -65964 -51083 -59337 -72062 -43624
12148 -43624 -27858 -34302 -44105 -53171 -48303 -31919 -6791 5827 -6363 47624 78686 66776
12136 66776 -7527 -72677 -58271 -32867 -10589 -3086 4510 22529 -8619 -65883 -86254 -60374
12124 -60374 -57726 -71509 -23696 52032 53259 28415 21186 29108 2641 -36206 -128188 -237175
12112 -237175 -226138 -184997 -244628 -323809 -312672 -305258 -233927 -154099 -158496 -140013 -94965 -40881
$$ packed form
12195f4750K552K7163Q7970L9830l4219j9161l7916l1455M6173P9840L8829l1651
12183A03205j08038n2493P2509Q6071j3245k1710N134L7761L6100k8718m3321
12172G3255o6141o9603k1579J4789q696l2272Q957M0807J5079j3741m0075M073
12160i5147L9264m1708k6715J2112r621J4423L5721N707J4881q254j2725K8438
12148d3624J5766o444r803r066M868J6384K5128J2618j2190N3987L1062j1910
12136F6776p4303o5150J4406K5404K2278P503P596J8019l1148n7264k0371K5880
12124f0374K648j3783M7813P5728J227k4844p229P922k6467l8847r1982j08987
12112b37175J1037M1141n9631p9181J1137P414P1331P9828m397J8483M5048N4084
$$ plain form
12100 -40881 5510 785 46914 87064 96338 114277 122237 121197 91145 12662 -64025 -61656 -84846
12087 -84846 -158393 -192691 -183198 -155091 -84299 -92144 -85904 -15686 15941 -14558 -60349 -45279
12075 -45279 -35262 -44221 -69529 -135664 -192173 -213312 -208477 -198078 -149465 -91640 -72898 -79731
12063 -79731 -66139 -42695 -43090 -73531 -63423 -41331 -52565 -50500 -46501 -19266 -29686 -75105
12051 -75105 -113603 -94813 -46588 -29212 8445 39292 39433 98266 202017 228666 165041 127627
12039 127627 128356 90354 60274 50284 43698 60502 63403 60076 76033 77369 50291 -13411 -32454
12026 -32454 -13535 8850 -22517 -92390 -122394 -54364 48091 39571 -24226 -49917 -19278 -6566
12014 -6566 -9484 -28020 -32495 -10590 9624 25955 67088 87978 53500 73344 130059 114283
$$ packed form
12100d0881M6391m725M6129M0150R274J7939P960j040l0052p8483p6687K369k3190
12087h4846p3547l4298R493K8107P0792p845O240P0218L1627l0499m5791J5070
12075d5279J0017q959k5308o6135n6509k1139M835J0399M8613N7825J8742o833
12063g9731J3592K3444l95l0441J0108K2092j1234K065L999K7235j0420m5419
12051g5105l8498J8790M8225J7376L7657L0847J41N8833J03751K6649o3625l7414
12039A27627P29l8002l0080r990o586J6804K901l327J5957J336k7078o3702j9043
12026c2454J8919K2385l1367o9873l0004O8030J02455q520o3797k5691L0639J2712
12014f566k918j8536m475K1905K0214J6331M1133K0890l4478J9844N6715j5776
$$ plain form
12002 114283 17143 -73995 -98985 -76542 -28156 -17889 -36751 -49352 -70298 -55503 -45112
11991 -45112 -27601 15805 47929 40786 43431 31026 -19021 -42708 -75129 -92823 -73608 -83311
11979 -83311 -78472 -62596 -64706 -47709 -19205 9171 16075 41746 90754 84592 63500 62575 42760
11966 42760 -6891 -66263 -112875 -100863 -72426 -90834 -116395 -88311 -74830 -67145 -92716 -95639
11954 -95639 -73716 -80460 -107659 -141734 -138354 -105034 -150146 -177337 -133438 -46415 1065 1819
11942 1819 -5112 9776 -18828 -35736 -46852 -44937 -9278 33784 51450 36814 18299 -25704
11930 -25704 -80331 -84086 -74968 -80317 -75082 -98066 -145697 -200345 -181840 -95496 -41209 -43253 -77989
11917 -77989 -116719 -138401 -134541 -109111 -106540 -78344 -34576 -32396 -93352 -82735 -39083 15841
$$ packed form
12002A14283r7140r1138k4990K2443M8386J0267j8862j2601k0946J4795J0391
11991d5112J7511M3406L2124p143K645j2405n0047k3687l2421j7694J9215r703
11979h3311M839J5876k110J6997K8504K8376O904K5671M9008o162k1092r25j9815
11966D2760m9651n9372m6612J2012K8437j8408k5561K8084J3481P685k5571k923
11954i5639K1923o744k7199l4075L380L3320m5112k7191M3899Q7023M7480P54
11942A819o931J4888k8604j6908j1116J915L5659M3062J7666j4636j8515m4003
11930b5704n4627l755R118n349N235k2984m7631n4648J8505Q6344N4287k044l4736
11917g7989l8730k1682L860K5430K571K8196M3768K180o0956J0617M3652N4924
$$ plain form
11905 15841 20145 -18484 -46228 -106459 -128734 -107101 -117584 -174898 -203778 -146881 -97261 -118369
11893 -118369 -155249 -186294 -193785 -199138 -209707 -223133 -149015 -37451 -31241 -62464 -146934 -201884
11881 -201884 -205127 -238920 -255267 -244057 -150114 -44230 -19918 -43380 -69569 -63189 -33524 997
11869 997 49998 62624 66975 101352 132151 127451 127807 118584 62494 37997 39160 49108 9868
11856 9868 -33447 -35612 -77763 -92459 -68384 -87480 -139466 -147062 -155188 -107421 -66438 -79212
11844 -79212 -83528 -63406 -52763 -84011 -127181 -157442 -138586 -73795 -41073 -42187 -67509 -51585
11832 -51585 -36625 -57094 -55025 -52832 -63141 -35377 9386 27722 1912 -20697 -75563 -116462
11820 -116462 -79179 -55624 -91770 -99572 -95141 -131131 -111894 -79576 -41811 10682 7683 -2392
$$ packed form
11905A5841M304l8629k7744o0231k2275K1633j0483n7314k8880N6897M9620k1108
11893a18369l6880l1045p491n353j0569j3426P4118J11564O210l1223q4470n4950
11881b01884l243l3793j6347J1210R3943J05884K4312k3462k6189O380K9665L4521
11869I97M9001J2626M351L4377L0799m700L56r223n6090k4497J163R948l9240
11856I868m3315k165m2151j4696K4075j9096n1986p596q126M7767M0983j2774
11844g9212m316K0122J0643l1248m3170l0261J8856O4791L2722j114k5322J5924
11832e1585J4960k0469K069K193j0309K7764M4763J8336k5810k2609n4866m0899
11820a16462L7283K3555l6146p802M431l5990J9237L2318L7765N2493k999j0075
$$ plain form
11808 -2392 22678 51055 66868 49619 31480 -44781 -126997 -75606 -9875 -12920 -14602 -65194
11796 -65194 -51690 -17903 -19134 -10897 4777 1033 -44498 -60653 -34433 42771 117865 106174
11784 106174 28402 -25771 -25954 -56495 -134138 -158796 -130061 -106807 -66615 -78032 -129327 -127703
11772 -127703 -136699 -202650 -222884 -213275 -189243 -167840 -148326 -94131 -58051 -74752 -84437 -63401
11760 -63401 -19724 -1979 -45745 -139550 -205999 -241124 -248128 -252572 -211200 -195126 -192196 -174720
11748 -174720 -155815 -132777 -126874 -144447 -142289 -163278 -157533 -129797 -135889 -143235 -110962 -99392
11736 -99392 -121957 -120585 -97648 -37895 26367 105425 165089 93481 -9999 -8548 34663 23510
11724 23510 -18226 -29718 -12860 29866 25098 26236 85687 122004 105291 101629 71930 23489
$$ packed form
11808b392K5070K8377J5813j7249j8139p6261q2216N1391O5731l045j682n0592
11796f5194J3504L3787j231Q237J5674l744m5531j6155K6220P7204P5094j1691
11784A06174p7772n4173j83l0541p7643k4658K8735K3254M0192j1417n1295J624
11772a27703q996o5951k0234R609K4032K1403J9514N4195L6080j6701r685K1036
11760f3401M3677J7745m3766r3805o6449l5125p004m444M1372J6074K930J7476
11748a74720J8905K3038N903j7573K158k0989N745K7736o092p346L2273J1570
11736i9392k2565J372K2937N9753O4262P9058N9664p1608j03480J451M3211j1153
11724B3510m1736j1492J6858M2726m768J138N9451L6317j6713l662k9699m8441
$$ plain form
11712 23489 19601 -19325 -97606 -151937 -184738 -204697 -142541 -11695 70314 37968 -19605 -52960
11700 -52960 -15316 25922 30326 20977 -15949 -40003 10652 66243 30671 -111742 -232933 -235016
11688 -235016 -174413 -126434 -97392 -79074 -40696 37432 32100 -8728 -27950 -52272 -81991 -33164
11676 -33164 14893 -34686 -90223 -147096 -164696 -173153 -176639 -156467 -104927 -51533 -47313 -55528
11664 -55528 -26521 3021 -17626 -53849 -120722 -172840 -153972 -151802 -127793 -84846 -89937 -103170
11652 -103170 -117978 -138520 -105809 -58965 -29878 -22550 -28979 -37917 -66008 -83474 -121575 -153954
11640 -153954 -158078 -154511 -170634 -179168 -164861 -158241 -166896 -135699 -83820 -32465 29710 53111
11628 53111 52771 -2329 -68302 -64995 -10763 12108 52245 91182 79762 29436 -16088 -46358
$$ packed form
11712B3489l888l8926p8281n4331l2801j9959O2156J30846Q2009l2346n7573l3355
11700e2960L7644M1238M404r349l6926k4054N0655N5591l5572j42413j21191k083
11688b35016O0603M7979K9042J8318L8378P8128n332m0828j9222k4322k9719M8827
11676c3164M8057m9579n5537n6873j7600q457l486K0172N1540N3394M220q215
11664e5528K9007K9542k0647l6223o6873n2118J8868K170K4009M2947n091j3233
11652a03170j4808k0542L2711M6844K9087P328o429q938k8091j7466l8101l2379
11640a53954m124L567j6123q534J4307O620q655L1197N1879N1355O2175K3401
11628E3111l40n5100o5973L307N4232K2871M0137L8937j1420n0326m5524l0270
$$ plain form
11616 -46358 -39802 -53418 -80927 -58464 -38135 -52815 -60394 -56646 -67607 -70533 -53644 -46483 -30997
11603 -30997 -34828 -54646 -32174 -23743 -30522 -143 48420 112858 140394 113052 66779 36045
11591 36045 21693 6282 -88194 -207760 -221921 -198609 -174433 -114962 -74554 -56783 -53590 -83383
11579 -83383 -98063 -89306 -89146 -91683 -84709 -34842 -10929 23010 79909 109441 77733 36096 25484
11566 25484 -27200 -72551 -90239 -89236 -35887 39374 62339 -9671 -107424 -114745 -78629 -75366
11554 -75366 -81102 -70369 -66094 -73008 -102902 -91909 -27168 30109 55104 34348 -17635 -67134
11542 -67134 -60564 -44872 -97366 -116461 -130172 -168345 -154450 -159030 -184224 -208608 -173413 -100655
11530 -100655 -24768 -22384 -27731 -29081 -5012 -28701 -104419 -116793 -156110 -233075 -251602 -203071
$$ packed form
11616d6358O556j3616k7509K2463K0329j4680p579L748j0961k926J6889P161J5486
11603c0997l831j9818K2472Q431o779L0379M8563O4438K7536k7342m6273l0734
11591C6045j4352j5411r4476j19566j4161K3312K4176N9471M0408J7771L193k9793
11579h3383j4680Q757J60k537O974M9867K3913L3939N6899K9532l1708m1637j0612
11566B5484n2684m5351j7688J003N3349P5261K2965p2010r7753p321L6116L263
11554g5366n736J0733M275o914k9894J0993O4741N7277K4995k0756n1983m9499
11542f7134O570J5692n2494j9095j3711l8173J3895m580k5194k4384L5195P2758
11530a00655P5887K384n347j350K4069k3689p5718j2374l9317p6965j8527M8531
$$ plain form
11518 -203071 -135849 -80658 -39090 -40991 -39233 4330 42234 87717 62577 38997 14457 -5338
11506 -5338 -59680 -83075 -79461 -40057 12052 36736 26080 22602 22635 15462 -17198 -8352 27102
11493 27102 -15757 -62464 -42973 -9679 -16858 -52245 -82962 -57937 -35586 -33106 -50145 -61194
11481 -61194 -34433 -33220 -50315 -52208 -27870 -3212 40284 48981 19500 851 5521 -4416 12029
11468 12029 11815 3137 -33833 -26050 8005 -23154 -43037 -17604 38520 82929 50703 39881
11456 39881 43187 -1333 -79832 -134957 -142162 -168101 -206107 -219223 -150889 -53340 -24111 -11671
11444 -11671 -505 -37998 -70073 -55988 -1099 10529 -37423 -62016 -71992 -122315 -146387 -126801
11432 -126801 -98056 -47478 32625 64989 81849 85233 66437 29453 -53543 -78149 -39597 11180
$$ packed form
11518b03071O7222N5191M1568j901J758M3563L7904M5483k5140k3580k4540j9795
11506e338n4342k3395L614L9404N2109K4684j0656l478L3p173l2660Q846L5454
11493B7102m2859m6707J9491L3294p179l5387l0717K5025K2351K480j7039j1049
11481f1194K6761J213j7095j893K4338K4658M3496Q697k9481j8649M670r937J6445
11468A2029k14q678l6970P783L4055l1159j9883K5433N6124M4409l2226j0822
11456C9881L306m4520p8499n5125p205k5939l8006j3116O8334R7549K9229J2440
11444a1671J1166l7493l2075J4085N4889J1628m7952k4593r976n0323k4072J9586
11432a26801K8745N0578Q0103L2364J6860L384j8796l6984q2996k4606L8552N0777
$$ plain form
11420 11180 48262 15780 -50466 -108792 -86233 -33753 -48518 -91395 -123217 -129210 -134046 -132999
11408 -132999 -159386 -180342 -182678 -171035 -133878 -99482 -129371 -120374 -84532 -75063 -53802 -24831
11396 -24831 -19228 -41216 -118525 -136597 -116965 -85069 -55604 -22099 -47677 -88284 -119140 -174106
11384 -174106 -219991 -217773 -206556 -175156 -190372 -185387 -155726 -98592 -54541 -26346 -30787 -30200
11372 -30200 -90422 -173409 -216638 -211812 -170212 -84133 -21589 -21239 -65953 -84856 -36797 -42088
11360 -42088 -127843 -157415 -67978 -32330 -98054 -135574 -105889 -75092 -83829 -162682 -167513 -104926
11348 -104926 -58934 -41355 -63310 -93150 -102508 -49004 8862 8057 -24549 -27754 -44757 -19693
11336 -19693 20654 -12169 -26875 10803 56683 82865 126340 103948 59292 25526 -29277 -62356
$$ packed form
11420A1180L7082l2482o6246n8326K2559N2480j4765m2877l1822n993m836J047
11408a32999k6387k0956k336J1643L7157L4396k9889Q997L5842R469K1261K8971
11396b4831N603k1988p7309j8072J9632L1896K9465L3505k5578m0607l0856n4966
11384a74106m5885K218J1217L1400j5216M985K9661N7134M4051K8195m441N87
11372c0200o0222q2987m3229M826M1600Q6079O2544L50m4714j8903M8059n291
11360d2088q5755k9572Q9437L5648o5724l7520K9685L0797q737p8853m831O2587
11348a04926M5992J7579k1955k9840r358N3504N7866q05l2606l205j7003K5064
11336a9693M0347l2823j4706L7678M5880K6182M3475k2392m4656l3766n4803l3079
$$ plain form
11324 -62356 -102408 -116765 -65891 -38228 -76073 -108589 -106016 -67166 -37918 -56982 -62280 -58675
11312 -58675 -48335 -22486 28251 73632 121613 142292 72802 3026 -1007 12863 17689 -20698
11300 -20698 -90230 -128838 -134964 -115212 -73558 -34919 -47168 -74384 -112821 -139191 -138208 -130189
11288 -130189 -117021 -147861 -140885 -101098 -78486 -86977 -113224 -153399 -127684 -103320 -132672 -127975
11276 -127975 -67600 -26337 -5539 47590 62504 23356 -25458 -46436 -54224 -50932 -48167 -87698
11264 -87698 -114646 -109512 -115879 -144216 -150843 -75279 -44583 -92427 -116162 -103665 -71823 -109565
11252 -109565 -107803 -42350 -9542 -22081 -73386 -137334 -167024 -126719 -67893 -90164 -87941 -37614
11240 -37614 76349 207984 213891 135676 80220 85304 126026 97501 40996 20119 -3546 -37217
$$ packed form
11324f2356m0052j4357N0874K7663l7845l2516K573L8850K9248j9064n298L605
11312e8675J0340K5849N0737M5381M7981K0679o9490o9776m033J3870M826l8387
11300b0698o9532l8608o126J9752M1654L8639j2249k7216l8437k6370R83Q019
11288a30189J3168l0840O976L9787K2612q491k6247m0175K5715K4364k9352M697
11276a27975O0375M1263K0798N3129J4914l9148m8814k0978p788L292K765l9531
11264h7698k6948N134o367k8337o627P5564L0696m7844k3735J2497L1842l7742
11252a09565J762O5453L2808j2539n1305o3948k9690M0305N8826k2271K223N0327
11240c7614J13963J31635N907p8215n5456N084M0722k8525n6505k0877k3665l3671
$$ plain form
11228 -37217 -51771 -80683 -81423 -41016 31674 69355 35220 27465 76021 185794 278621 307846
11216 307846 314223 270293 220480 195690 170224 138571 149630 119971 115295 68992 -4634 -28574
11204 -28574 -12023 24503 80813 109189 67713 3941 -62891 -109640 -133566 -118947 -102349 -67760
11192 -67760 -1562 81082 111907 114734 119679 148643 181283 219305 235485 186762 147202 142968
11180 142968 132025 114905 74517 2261 -27005 -2704 63153 109052 102524 93937 110012 119622
11168 119622 64070 8820 6222 -5176 -32280 -71313 -56911 -64908 -88500 -137568 -109659 -51087
11156 -51087 -11967 -26401 -82500 -123027 -121430 -101036 -94530 -64374 -29828 -24150 37367 82915
11144 82915 88115 108728 105303 90648 78239 62100 107286 178716 208909 224273 210144 186872
$$ packed form
11228c7217j4554k8912p40M0407P2690L7681l4135p755M8556J09773R2827K9225
11216C07846O377m3930m9813k4790k5466l1653J1059k9659m676m6303p3626k3940
11204b8574J6551L6526N6310K8376m1476o3772o6832m6749k3926J4619J6598L4589
11192f7760O6198Q2644L0825K827M945K8964L2640L8022J6180m8723l9560m234
11180A42968j0943j7120m0388p2256k9266K4301O5857M5899o528q587J6075R610
11168A19622n5552n5250k598j1398k7104l9033J4402p997k3592m9068K7909N8572
11156e1087L9120j4434n6099m0527J597K0394O506L0156L4546N678O1517M5548
11144H2915N200K0613l425j4655j2409j6139M5186P1430L0193J5364j4129k3272
$$ plain form
11132 186872 180774 131624 86333 117195 143919 92773 98145 126710 117491 104298 102572 108060
11120 108060 159129 238703 254810 206408 185178 201220 232016 196391 144645 101804 104780 165744
11108 165744 201335 172202 71293 47272 89638 64996 22636 -20666 -89919 -89502 -38810 -60288
11096 -60288 -64773 -77758 -95914 -54035 -40343 -48414 -9030 35088 68984 88969 116440 162327
11084 162327 180190 158210 123307 26938 -6151 15708 22467 -14648 -59918 -56004 -48495 -77870
11072 -77870 -112677 -77462 -45332 -16251 29390 2073 -27086 -37240 -25612 -3269 32258 75898
11060 75898 90531 85759 35922 37521 65556 43669 28715 58538 112204 128073 75786 2177
11048 2177 -27253 -22276 -10716 -76020 -156876 -168861 -143347 -103073 -72353 2947 105981 147459
$$ packed form
11132A86872o098m9150m5291L0862K6724n1146N372K8565r219j3193j726N488
11120A08060N1069P9574J6107m8402k1230J6042L0796l5625n1746m2841K976O0964
11108A65744L5591k9133j00909k4021M2366k4642m2360m3302o9253M17N0692k1478
11096f0288m485j2985j8156M1879J3692q071L9384M4118L3896J9985K7471M5887
11084A62327J7863k1980l4903r6369l3089K1859O759l7115m5270L914P509k9375
11072g7870l4807L5215L2130K9081M5641k7317k9159j0154J1628K2343L5527M3640
11060G5898J4633m772m9837J599K8035k1887j4954K9823N3666J5869n2287p3609
11048B177k9430M977J1560o5304q0856j1985K5514M0274L0720P5300J03034M1478
$$ plain form
11036 147459 102798 65764 22459 -32556 -37825 -8285 7468 -8264 -15984 24708 97684 150284
11024 150284 143987 82936 22894 10953 27977 53113 105793 118809 92530 99945 192114 205560
11012 205560 127741 69367 30355 5538 2699 3324 42612 91264 117551 152372 181359 269942
11000 269942 345809 331329 252945 159905 124327 157031 174987 131697 105557 134951 116637
10989 116637 75544 65101 86709 120061 163257 188862 166680 138107 144172 119205 84947 97553
10977 97553 116386 61713 38589 42115 -3705 -20834 38667 86405 116021 131908 102148 57018
10965 57018 47712 54672 53629 -5197 -20649 -31367 -54390 -119412 -156728 -116382 -53502 -16756
10953 -16756 -21458 -2590 24463 12263 -20400 -78018 -103247 -62824 -17147 -95 -3050 4730
$$ packed form
11036A47459m4661l7034m3305n5015n269K9540J5753j5732p720M0692P2976N2600
11024A50284o297o1051o0042j1941J7024K5136N2680J3016k6279P415R2169J3446
11012B05560p7819n8374l9012k4817k839O25L9288M8652K6287L4821K8987Q8583
11000B69942P5867j4480p8384r3040l5578L2704J7956m3290k6140K9394j8314
10989A16637m1093j0443K1608L3352M3196K5605k2182k8573O065k4967l4258J2606
10977I7553J8833n4673k3124L526m5820j7129N9501M7738K9616J5887k9760m5130
10965E7018r306O960j043n8826j5452j0718k3023o5022l7316M0346O2880L6746
10953a6756m702J8868K7053j2200l2663n7618k5229M0423M5677J7052k955P780
$$ plain form
10941 4730 -9589 -47089 -45625 -54066 -71499 -75540 -92515 -82895 -36813 -22570 -58619 -72418 -118914
10928 -118914 -181595 -173693 -140854 -65653 -19864 26122 28564 -27446 -71597 -64532 -32153 6989
10916 6989 6718 11381 25460 -3589 -14321 43796 70757 91722 100728 102947 88579 78708 59580
10903 59580 53632 39410 45295 14068 29996 10193 -14264 28477 33922 -2897 24656 54736
10891 54736 89319 144028 192447 210183 192832 190228 170779 112050 51496 -7393 -25586 -13021
10879 -13021 -24209 -9570 32297 47503 41510 48985 66780 72140 42058 17509 38864 89797
10867 89797 106093 59465 28610 41091 84459 84257 42409 36879 100097 173813 233934 239684
10855 239684 194886 163162 200050 210827 215507 226297 262587 314129 328718 275389 187335 143093
$$ packed form
10941D730j4319l7500J464q441j7433m041j6975R620M6082J4243l6049j3799m6496
10928a18914o2681P902L2839P5201M5789M5986K442n6010m4151P065L2379L9142
10916F989k71M663J4079k9049j0732N8117K6961K0965R006K219j4368r871j9128
10903E9580n948j4222N885l1227J5928j9803k4457M2741N445l6819K7553L0080
10891E4736L4583N4709M8419J7736j7351k604j9449n8729o0554n8889j8193J2565
10879a3021j1188J4639M1867J5206n993P475J7795N360l0082k4549K1355N0933
10867H9797J6296m6628l0855J2481M3368k02m1848n530O3218P3716O0121N750
10855B39684m4798l1724L6888J0777M680J0790L6290N1542J4589n3329q8054m4242
$$ plain form
10843 143093 124817 87061 61290 50502 87921 126795 139124 139699 144762 145476 174696 196804
10831 196804 210862 181687 146386 133873 123184 146251 167107 204111 224632 209941 240291
10820 240291 257272 252309 274806 293527 242417 222068 210077 255379 324316 334565 289531 242091
10808 242091 212497 185130 171566 147225 167758 242922 324854 387257 380669 360886 330480 280903
10796 280903 232635 237957 220080 236063 309936 397922 440501 435300 429451 408645 368305 349308
10784 349308 334799 322099 335663 352291 349762 366441 360567 320574 296985 268643 231020 259195
10772 259195 299728 313172 347313 364650 348646 328033 301797 311498 362040 380882 343822 295787
10760 295787 296345 334522 342466 363582 323185 305775 287024 277547 281497 237128 213644 234903
$$ packed form
10843A43093j8276l7756k5771j0788L7419L8874J2329N75N063P14K9220K2108
10831A96804J4058k9175l5301j2513j0689K3067K0856L7004K0521j4691L0350
10820B40291J6981m963K2497J8721n1110k0349j1991M5302O8937J0249m5034m7440
10808B42091k9594k7367j3564k4341K0533P5164Q1932O2403o588j9783l0406m9577
10796B80903m8268N322j7877J5983P3873Q7986M2579n201n849k0806m0340j8997
10784C49308j4509j2700J3564J6628k529J6679n874l9993k3589k8342l7623K8175
10772B59195M0533J3444L4141J7337j6004k0613k6236R701N0542J8842l7060m8035
10760B95787N58L8177P944K1116m0397j7410j8751r477L950m4369k3484K1259
$$ plain form
10748 234903 289648 340770 338651 368970 398912 414672 414169 427464 480043 511367 507467 515886
10736 515886 532326 509099 520766 592709 671044 698184 711415 780129 877931 879534 831068 843855
10724 843855 963858 1139280 1306698 1527012 1817376 2015190 2044506 1872085 1632962 1457934
10714 1457934 1372434 1268897 1216310 1251896 1291436 1300605 1284973 1287222 1322341 1365804 1466384
10703 1466384 1602873 1762954 1902350 2046351 2166371 2272881 2361052 2477978 2635206 2819057
10693 2819057 2994239 3224944 3436976 3769385 4239497 4707671 5188431 5796572 6488371
10684 6488371 7305263 8337939 9658824 11254818 13219792 15635709 18748110 22619252
10676 22619252 27446425 33485527 41147149 51080603 64483658 82963990 108931689 145770807
$$ packed form
10748B34903N4745N1122k119L0319K9942J5760n03J3295N2579L1324l900Q419
10736E15886J6440k3227J1667P1943P8335K7140J3231O8714R7802J603m8466J2787
10724H43855J20003J75422J67418K20314K90364J97814K9316j72421k39123j75028
10714A457934q5500j03537n2587L5586L9540R169j5632K249L5119M3463J00580
10703A466384J36489J60081J39396J44001J20020J06510Q8171J16926J57228J83851
10693B819057J75182K30705K12032L32409M70112M68174M80760O08141O91799
10684F488371Q16892J032676J320885J595994J964974K415917L112401L871142
10676B2619252M827173O039102P661622R933454J3403055J8480332K5967699L6839118
$$ plain form
10668 145770807 196491872 255813870 294996105 278955420 223738283 168379722 126485181
10661 126485181 96881744 75824340 60658666 49409451 40852131 34094933 28850671
10654 28850671 24632902 21209017 18359562 16013725 14052794 12410494 11053002 9934075
10646 9934075 8889873 7989270 7253205 6639783 6101907 5675226 5243948 4803136 4398143
10637 4398143 4088913 3816872 3575314 3327250 3132943 2949822 2736301 2556025 2382529
10628 2382529 2284627 2234021 2201596 2204635 2119149 2033975 1969886 1931098 1930434 1911837 1909176 1979620
10616 1979620 2101269 2277066 2458423 2565960 2461958 2192439 1935597 1720344 1530996
10607 1530996 1403627 1362032 1362711 1359114 1303842 1215351 1166327 1094985 974005 881941 830415
$$ packed form
10668A45770807N0721065N9321998L9182235j6040685n5217137n5358561m1894541
10661A26485181k9603437k1057404j5165674j1249215q557320o757198n244262
10654B8850671m217769l423885k849455k345837j960931j642300j357492j118927
10646I934075j044202r00603p36065o13422n37876m26681m31278m40812m04993
10637D398143l09230k72041k41558k48064j94307j83121k13521j80276j73496
10628B382529r7902n0606l2425L039q5486q5174o4089l8788o64j8597k661P0444
10616A979620J21649J75797J81357J07537j04002k69519k56842k15253j89348
10607A530996j27369m1595O79l597n5272q8491m9024p1342j20980r2064n1526
$$ plain form
10596 830415 813495 804860 752831 773684 895427 948640 944598 907919 853561 838980 806780 787903
10584 787903 791859 785955 787281 795242 797369 774436 734714 681865 679531 691134 679832 687875 709517
10571 709517 682308 671072 677979 689049 674171 613996 585903 600747 602815 603850 632865 657140
10559 657140 636597 592624 583498 547368 486767 489484 577287 668444 630004 570792 556991 578246
10547 578246 545801 520796 520688 515878 517140 503893 510345 541043 545311 531334 477458 445795 452434
10534 452434 473621 536787 598913 639113 670442 705632 723489 718037 735093 774907 847130 970463
10522 970463 1119240 1317075 1590292 1892630 2193182 2354005 2288886 2131479 1972679 1856894
10512 1856894 1802554 1770032 1838426 1956080 2074194 2089389 1979623 1776035 1559463 1390942
$$ packed form
10596H30415j6920q635n2029K0853J21743N3213m042l6679n4358j4581l2200j8877
10584G87903L956n904J326P961K127k2933l9722n2849k334J1603j1302Q043K1642
10571G09517k7209j1236O907J1070j4878o0175k8093J4844K068J035K9015K4275
10559F57140k0543m3973r126l6130o0601K717Q7803R1157l8440n9212j3801K1255
10547E78246l2445k5005j08m810J262j3247O452L0698M268j3977n3876l1663O639
10534D52434K1187O3166O2126M0200L1329L5190J7857n452J7056L9814P2223J23333
10522I70463J48777J97835K73217L02338L00552J60823o5119j57407j58800j15785
10512A856894n4340l2522O8394J17654J18114J5195j09766k03588k16572j68521
$$ plain form
10502 1390942 1260622 1136595 1006290 864463 792406 772257 798673 813225 843236 881107
10492 881107 939335 1031572 1100984 1207239 1342103 1575224 1831649 2068415 2345152 2680553
10482 2680553 2919998 2993895 3023072 3080529 3064930 2857378 2482585 2166420 1918427 1724492
10472 1724492 1594461 1439125 1289257 1249616 1191046 1102520 1078995 1096858 1121971 1204850 1274021
10461 1274021 1247112 1168050 1083718 984862 874772 796366 721273 608860 553698 561762 561999
10450 561999 544030 543961 519819 484300 527066 619914 655558 685368 672780 588814 546021 557662
10438 557662 556053 561377 539124 559470 539843 529186 588074 640070 584013 549449 569702 608515
10426 608515 574569 552426 531115 525433 529733 572462 595284 635381 668587 667941 629001 569192
$$ packed form
10502A390942j30320j24027j30305j41827p2057k0149K6416J4552L0011L7871
10492H81107N8228R2237O9412J06255J34864K33121K56425K36766K76737L35401
10482B680553K39445P3897K9177N7457j5599k07552l74793l16165k47993j93935
10472A724492j30031j55336j49868l9641n8570q8526k3525J7863K5113Q2879O9171
10461A274021k6909p9062q4332r8856j10090p8406p5093j12413n5162Q064K37
10450E61999j7969o9k4142l5519M2766R2848L5644K9810j2588q3966m2793J1641
10438E57662j609N324k2253K0346j9627j0657N8888N1996n6057l4564K0253L8813
10426F08515l3946k2143k1311n682M300M2729K2822M0097L3206o46l8940n9809
$$ plain form
10414 569192 515709 511074 487173 549180 583823 622434 643348 710171 725285 743070 743975 797330
10402 797330 796977 796226 786950 816161 850518 909882 963471 1059128 1136518 1286678 1393640 1547052
10390 1547052 1707130 1952295 2349590 2907265 3164703 3005644 2593542 2287489 2064416
10381 2064416 1913070 1763284 1724975 1687328 1712695 1700097 1786701 1855333 1927697 2009737 2168286
10370 2168286 2247778 2366457 2466851 2652623 2808798 3062985 3205168 3406192 3595986 3889002
10360 3889002 4154882 4553129 4981185 5552070 6095026 6784540 7494604 8511720 9687256
10351 9687256 11246112 13049038 15351981 18062701 21693641 26220296 32126542 39243884
10343 39243884 48399320 59902271 75546146 96855885 127717921 172798806 241262871
$$ packed form
10414E69192n3483m635k3901O2007L4643L8611K0914O6823J5114J7785R05N3355
10402G97330l53p51r276K9211L4357N9364N3589R5657P7390J50160J06962J53412
10390A547052J60078K45165L97295N57675K57438j59059m12102l06053k23073
10381B064416j51346j49786l8309l7647K5367j2598Q6604O8632P2364Q2040J58549
10370B168286P9492J18679J00394J85772J56175K54187J42183K01024J89794K93016
10360C889002K65880L98247M28056N70885N42956O89514P10064J017116J175536
10351I687256J558856J802926K302943K710720L630940M526655N906246P117342
10343C9243884R155436J1502951J5643875K1309739L0862036M5080885O8464065
$$ plain form
10336 241262871 338398494 437127890 446838715 355725267 256749432 186319400 139405508
10329 139405508 107049264 84531765 68093314 55926180 46354869 38936584 32999103
10322 32999103 28327470 24417238 21323832 18603169 16404635 14491506 13049386 11719357
10314 11719357 10601466 9541255 8691145 7925265 7318425 6736587 6257402 5785140 5391510
10305 5391510 4986122 4657892 4306863 4057963 3802577 3614456 3396636 3230166 3034132
10296 3034132 2930430 2851540 2791521 2706674 2668636 2591136 2556329 2582493 2674284 2801062 3024358
10285 3024358 3289312 3672332 3941650 3737994 3214722 2714328 2291275 2058269 1879873
10276 1879873 1715730 1583867 1527307 1462150 1372484 1264238 1183942 1143371 1150767 1131944 1108475
$$ packed form
10336B41262871R7135623R8729396R710825r1113448r8975835p0430032m6913892
10329A39405508l2356244k2517499j6438451j2167134r571311p418285n937481
10322C2999103m671633l910232l093406k720663k198534j913129j442120j330029
10314A1719357j117891j060211q50110p65880o06840n81838m79185m72262l93630
10305E391510m05388l28230l51029k48900k55386j88121k17820j66470j96034
10296C034132j03702p8890o0019q4847l8038p7500l4807K6164R1791J26778K23296
10285C024358K64954L83020K69318k03656n23272n00394m23053k33006j78396
10276A879873j64143j31863n6560o5157q9666j08246q0296m0571P396j8823k3469
$$ plain form
10265 1108475 1003746 975650 969429 955696 979842 996258 932686 862765 834466 798268 737741
10254 737741 680289 669981 686797 711800 738304 686663 633154 645553 667788 666493 649546 644970
10242 644970 682336 707358 734308 715715 658902 635799 699663 753575 767037 828620 869361
10231 869361 816225 740032 684610 593562 540701 529438 488746 441113 444475 502705 536457 539229
10219 539229 562467 497005 408768 381593 388793 354820 330420 299345 245199 217066 188484 198679
10207 198679 248108 226317 178152 136949 122894 104200 118780 158374 213903 301824 379402
10196 379402 417409 394585 357252 378274 405048 383824 368674 352890 290149 281876 282749 267871
10184 267871 247556 171803 121942 153290 155542 140297 122197 161367 166296 126815 131654 153508
$$ packed form
10265A108475j04729k8096o221j3733K4146J6416o3572o9921k8299l6198o0527
10254G37741n7452j0308J6816K5003K6504n1641n3509J2399K2235j295j6947m576
10242F44970L7366K5022K6950j8593n6813k3103O3864N3912J3462O1583M0741
10231H69361n3136p6193n5422r1048n2861j1263m0692m7633L362N8230L3752K772
10219E39229K3238o5462q8237k7175P200l3973k4400l1075n4146k8133k8582J0195
10207A98679M9429k1791m8165m1203j4055j8694J4580L9594N5529Q7921P7578
10196C79402L8007k2824l7333K1022K6774k1224j5150j5784o2741q273Q73j4878
10184B67871k0315p5753m9861L1348K252j5245j8100L9170M929l9481M839K1854
$$ plain form
10172 153508 146819 166722 181541 197923 237176 280764 304958 282147 211660 162046 167424 188772
10160 188772 200354 209208 148933 110608 67119 60543 33934 22135 41852 68326 40937 37101
10148 37101 82935 101111 110572 100461 81002 110440 126947 194018 232822 214669 165006 157377
10136 157377 150509 171635 162369 161163 161051 136486 99199 46465 12718 66622 120528 154278
10124 154278 192915 222346 259566 230812 131934 94120 80668 60295 52745 62672 48849 76306
10112 76306 125805 159247 164374 177523 197672 209003 159553 77671 66680 83786 65480 48839
10100 48839 13454 9692 20239 44261 27237 9583 45941 139592 187508 220118 231901 200056
10088 200056 150623 149945 129872 113787 155877 192817 165792 149228 119000 111785 90086 54908
$$ packed form
10172A53508o689J9903J4819J6382L9253M3588K4194k2811p0487m9614N378K1348
10160A88772J1582Q854o0275l8325m3489o576k6609j1799J9717K6474k7389l836
10148C7101M5834J8176R461j0111j9459K9438J6507O7071L8804j8153m9663p629
10136A57377o868K1126r266j206j12k4565l7287n2734l3747N3904N3906L3750
10124A54278L8637K9431L7220k8754r8878l7814j3452k0373p550R927j3823K7457
10112G6306M9499L3442N127J3149K0149J1331m9450q1882j0991J7106j8306j6641
10100D8839l5385l762J0547K4022j7024j7654L6358R3651M7916L2610J1783l1845
10088B00056m9433o78k0073j6085M2090L6940k7025j6564l0228p215k1699l5178
$$ plain form
10076 54908 53943 121854 166600 186798 127551 45015 48546 77769 97506 163473 198841 167199
10064 167199 98314 19110 -15620 -41833 -59629 -34340 -20338 -19318 -42150 -54949 -46951 -22330
10052 -22330 -923 27925 30658 17965 6297 -24998 -80596 -100946 -47583 29512 51295 45817
10040 45817 7617 -16881 -8261 29577 93611 133232 125830 101177 16388 -34985 13196 80131
10028 80131 108230 123208 98300 77195 84676 112345 122233 125265 134938 147546 113987 81093
10016 81093 44013 20270 -8405 -3074 49313 73742 81171 115293 88720 -5365 -26394 11966
10004 11966 -745 -19891 -51039 -59668 -70903 -45673 -37876 10152 34721 65851 96543 65201
9992 65201 84174 147814 209175 250473 211282 136469 58553 -226 -4054 2055 -6867 2288 -18927
$$ packed form
10076E4908r65O7911M4746K0198n9247q2536L531K9223J9737O5967L5368l1642
10064A67199o8885p9204l4730k6213j7796K5289J4002J020k2832j2799P998K4621
10052b2330K1407K8848K733j2693j1668l1295n5598k0350N3363P7095K1783n478
10040D5817l8200k4498Q620L7838O4034L9621p402k4653q4789n1373M8181O6935
10028H0131K8099J4978k4908k1105P481K7669R888L032R673J2608l3559l2894
10016H1093l7080k3743k8675N331N2387K4429P429L4122k6573r4085k1029L8360
10004A1966j2711j9146l1148q629j1235K5230P797M8028K4569L1130L0692l1342
9992F5201J8973O3640O1361M1298l9191p4813p7916n8779l828O109q922R155k1215
$$ plain form
9979 -18927 -24850 6052 46754 80534 117221 111202 51972 35819 10379 -18456 -22198 -21018 27872
9966 27872 97258 113098 93823 62126 12053 -40003 -57931 11007 88194 92438 53001 26712
9954 26712 53594 63899 37346 6377 31640 63325 74146 79962 155719 224266 195038 118803
9942 118803 111600 122395 141334 115006 71333 73854 99378 154262 182485 138878 95430 53329
9930 53329 37773 90983 85805 43651 -10380 -57441 -103940 -141276 -116667 -67538 -27623 11353
9918 11353 56268 98569 117016 111480 76163 32917 68682 125137 115158 113231 114200 122676 116428
9905 116428 106826 86892 65505 85099 91606 93222 74174 87287 72568 57731 1736 -1898
9893 -1898 10997 12889 27207 47176 77149 94915 115459 140990 90763 28840 33708 84189
$$ packed form
9979a8927n923L0902M0702L3780L6687o019n9230j6153k5440k8835l742J180M8890
9966B7872O9386J5840j9275l1697n0073n2056j7928O8938P7187M244l9437k6289
9954B6712K6882J0305k6553l0969K5263L1685J0821N816P5757O8547k9228p6235
9942A18803p203J0795J8939k6328m3673K521K5524N4884K8223m3607m3448m2101
9930E3329j5556N3210n178m2154n4031m7061m6499l7336K4609M9129L9915L8976
9918A1353M4915M2301J8447n536l5317m3246L5765N6455r979j927R69Q476o248
9905A16428r602j9934k1387J9594O507J616j9048J3113j4719j4837n5995l634
9893a898J2895J892J4318J9969K9973J7766K0544K5531n0227o1923M868N0481
$$ plain form
9881 84189 96055 68043 83771 94398 90557 73135 61933 81901 79298 122854 167089 160076
9869 160076 139190 99728 112042 120123 77696 71144 34594 -25613 -57198 -32408 -31223 13391
9857 13391 102972 97651 54330 18024 -3807 15042 22916 36193 26832 -36979 -79420 -123974
9845 -123974 -143893 -95957 -47427 -42292 -30117 2400 44424 67840 677 -79461 -117288 -104814
9833 -104814 -79432 -4190 20899 20416 -2825 -56323 -40354 -26181 -37297 -3218 4683 -15723
9821 -15723 -21654 -41173 -37074 -40058 -28330 16215 9973 2413 -16640 -70394 -69454 15408 63574
9808 63574 24187 -28013 -56289 -24452 16254 42266 15821 -40059 -30562 -17127 17205 8568
9796 8568 -28879 -46529 -64421 -92321 -90751 -93343 -88606 -43928 -47907 -58504 -50049 -84740 -110577
$$ packed form
9881H4189J1866k8012J5728J0627l841j7422j1202J9968k603M3556M4235p013
9869A60076k0886l9462J2314Q081m2427o552l6550o0207l1585K4790J185M4614
9857A3391Q9581n321m3321l6306k1831J8849P874J3277r361o3811m2441m4554
9845a23974j9919M7936M8530N135J2175L2517M2024K3416o7163q0138l7827J2474
9833a04814K5382P5242K5089m83k3241n3498J5969J4173j1116L4079P901k0406
9821a5723n931j9519M099k984J1728M4545o242p560j9053n3754R40Q4862M8166
9808F3574l9387n2200k8276L1837M0706K6012k6445n5880R497J3435L4332q637
9796H568l7447j7650j7892k7900J570k592M737M4678l979j0597Q455l4691k5837
$$ plain form
9783 -110577 -136858 -79614 -8436 -36613 -133945 -146476 -72016 -10605 -6680 -52944 -65583 -22354
9771 -22354 73403 162103 169284 80312 -21883 -19573 -15673 -72180 -83006 -5334 60277 10572
9759 10572 -55441 -105575 -115431 -10908 65500 53556 8651 -43904 -93748 -151494 -187874 -210378
9747 -210378 -232666 -223723 -171184 -89428 -61786 -23222 31674 31753 -16652 -43810 -34050 -25265 -75504
9734 -75504 -103924 -146213 -160078 -158791 -175279 -200671 -217456 -196861 -187238 -163373 -149265 -108530
9722 -108530 -96883 -134388 -164278 -186603 -166090 -135818 -81815 -1557 87723 97090 50303 8583
9710 8583 -22916 -12879 13646 21186 26218 77086 127324 95015 65320 86036 61485 41602
9698 41602 1874 -26286 59853 87433 80455 47422 -10032 3181 44564 77616 63089 22150
$$ packed form
9783a10577k6281N7244P1178k8177r7332j2531P4460O1411L925m6264j2639M3229
9771b2354R5757Q8700P181q8972j02195K310L900n6507j0826P7672O5611m9705
9759A0572o6013n0134r856J04523P6408j1944m4905n2555m9844n7746l6380k2504
9747b10378k2288Q943N2539Q1756K7642L8564N4896P9m8405k7158R760Q785n0239
9734g5504k8420m2289j3865J287j6488k5392j6785K0595R623K3865J4108M0735
9722a08530J1647l7505k9890k2325K0513L0272N4003Q0258Q9280R367m6787m1720
9710H583l1499J0037K6525P540N032N0868N0238l2309k9695K0716k4551j9883
9698D1602l9728k8160Q6139K7580o978l3033n7454J3213M1383L3052j4527m0939
$$ plain form
9686 22150 -3136 -53426 -49908 -51941 -106330 -112238 -48163 -4773 -21427 -75073 -120128 -189905
9674 -189905 -185110 -100029 -19200 38945 88955 103169 84422 119639 144429 142683 75319 19226
9662 19226 1904 -40882 -82160 -92341 -98116 -18468 48177 51993 18553 -25244 -31216 -9233
9650 -9233 38061 109021 165654 194693 229077 263457 259752 221631 157896 123450 99460 52432
9638 52432 54810 -7986 -71063 -66998 -35783 -12428 -9057 -943 16411 36373 51904 62891 70542
9625 70542 109049 125626 130694 113850 68326 36886 -7571 -12988 1909 1692 -1661 -15571 -47338
9612 -47338 -89958 -98462 -74726 -77579 -105804 -101453 -108940 -120074 -124238 -92104 -71281 -72514 -119959
9599 -119959 -132218 -102729 -117970 -201865 -216254 -148191 -94417 -77616 -65110 -37575 7784 2025
$$ packed form
9686B2150k5286n0290L518k033n4389n908O4075M3390j6654n3646m5055o9777
9674a89905M795Q5081Q0829N8145N0010J4214j8747L5217K4790j746o7364n6093
9662A9226j7322m2786m1278j0181n775P9648O6645L816l3440m3797n972K1983
9650i233M7294P0960N6633K9039L4384L4380l705l8121o3735l4446k3990m7028
9638E2432K378o2796o3077M065L1215K3355L371Q114J7354J9962J5531J0987P651
9625G0542L8507J6577N068j6844m5524l1440m4457n417J4897k17l353j3910l1767
9612d7338m2620q504K3736k853k8225M351p487j1134m164L2134K0823j233m7445
9599a19959j2259K9489j5241q3895j4389O8063N3774J6801J2506K7535M5359n759
$$ plain form
9587 2025 -10919 -20 26414 54029 56765 25712 -26643 -68073 -56095 16256 61570 32907
9575 32907 -32140 -88459 -88995 -39342 -28098 -74956 -88296 -72566 -81903 -72609 -30690 -48550 -90838
9562 -90838 -88895 -51474 -16223 19841 35837 21818 35749 52903 80856 34509 -64799 -84244
9550 -84244 -53300 -69321 -69755 -33130 -9561 -10869 -35338 -47660 -64987 -87273 -82687 -79686 -37025
9537 -37025 -2649 -25741 -15453 28149 61690 88891 110474 105594 96966 96413 84728 60660 43073
9524 43073 67602 75071 26850 -18844 7917 -14200 -53065 -52519 -61674 -35617 19186 91684 113915
9511 113915 81227 12420 10972 74834 159783 195355 137280 60001 32264 80454 173123 193624
9499 193624 160648 146973 114792 60194 48691 56734 43543 23578 14836 -18968 -82748 -124812
$$ packed form
9587B025j2944J0899K6434K7615K736l1053n2355m1430J1978P2351M5314k8663
9575C2907o5047n6319n36M9653J1244m6858j3340J5730r337R294M1919j7860m2288
9562i0838J943L7421L5251L6064J5996j4019J3931J7154K7953m6347r9308j9445
9550h4244L0944j6021m34L6625K3569j308k4469j2322j7327k2286M586L001M2661
9537c7025L4376k3092J0288M3602L3541K7201K1583m880q628n53j1685k4068j7587
9524D3073K4529P469m8221m5694K6761k2117l8865N46r155K6057N4803P2498K2231
9511A13915l2688o8807j448O3862Q4949L5572n8075p7279k7737M8190R2669K0501
9499A93624l2976j3675l2181n4598j1503Q043j3191j9965q742l3804o3780m2064
$$ plain form
9487 -124812 -77518 -11645 26372 21518 41261 37905 29029 57652 65689 105790 136211 82203
9475 82203 -1793 -49702 -38969 45289 103514 102310 79926 43348 41008 49680 24758 -11124
9463 -11124 22704 58324 65389 25570 26984 48455 45733 28858 24522 31722 33613 51428 77179
9450 77179 113896 168902 144048 42463 30290 109987 162688 160574 120388 45010 31838 62203
9438 62203 67189 92617 123413 142442 111358 119566 155414 198515 307741 277321 139000 40992
9426 40992 10145 49516 143659 201267 185767 145803 103430 95119 124845 127251 92999 70101
9414 70101 48133 7760 29597 97054 125057 124703 109578 125496 168230 195173 163411 148686
9402 148686 191454 304933 456550 591592 695835 818747 921840 984639 987448 924940 784307
$$ packed form
9487a24812M7294O5873L8017m854J9743l356q876K8623Q037M0101L0421n4008
9475H2203q3996m7909J0733Q4258N8225j204k2384l6578k340Q672k4922l5882
9463a1124L3828L5620P065l9819J414K1471k722j6875m336P200J891J7815K5751
9450G7179L6717N5006k4854j01585j2173P9697N2701k114m0186p5378j3172L0365
9438F2203M986K5428L0796J9029l1084Q208L5848M3101J09226l0420j38321r8008
9426D0992l0847L9371R4143N7608j5500l9964m2373q311K9726K406l4252k2898
9414G0101k1968m0373K1837O7457K8003l54j5125J5918M2734K6943l1762j4725
9402A48686M2768J13479J51617J35042J04243J22912J03093O2799K809o2508j40633
$$ plain form
9391 784307 616336 489633 395368 312686 299096 349417 356742 314485 243392 215125 184622
9380 184622 146228 113480 66077 149 -4330 24204 37155 43905 7447 -10853 27346 51240
9368 51240 56289 21244 -8208 -21719 -56308 -71915 -26667 29461 8302 -41178 -34388 1903
9356 1903 22121 36861 -9470 -65714 -71073 -44263 -36127 -31431 32498 51553 -34003 -64415 -13157
9343 -13157 5826 -28043 -26196 -15200 24306 54372 84208 121968 90675 30137 -6158 -4375
9331 -4375 25947 26558 -60478 -211191 -232117 -146670 -73838 -43640 -43096 -31632 -23590 -50 -298
9318 -298 -17941 -15187 -25106 -46250 -48562 -46103 -52507 -75130 -37800 109298 235475 260657 244898
9305 244898 173553 114750 83816 80021 119246 154966 128598 95533 74098 31187 16634 47200
$$ packed form
9391G84307j67971j26703r4265q2682j3590N0321P325m2257p1093k8267l0503
9380A84622l8394l2748m7403o5928m479K8534J2951O750l6458j8300L8199K3894
9368E1240N049l5045k9452j3511l4589j5607M5248N6128k1159m9480O790L6291
9356A903K0218J4740m6331n6244n359K6810Q136M696O3929J9055q5556l0412N1258
9343a3157J8983l3869J847J0996L9506L0066K9836L7760l1293o0538l6295J783
9331d375L0322O11q7036j50713k0926Q5447P2832L0198N44J1464Q042K3540k48
9318b98j7643K754r919k1144k312K459o404k2623L7330J47098J26177K5182j5759
9305B44898p1345n8803l0934l795L9225L5720k6368l3065k1435m2911j4553L0566
$$ plain form
9293 47200 57886 28612 -19891 -11945 37409 73522 100322 87874 67854 53374 23204 23368
9281 23368 27988 45176 72913 108506 120716 144534 205042 231704 248315 253524 221257 167745
9269 167745 149675 159087 223134 274514 328321 394550 477602 595339 648924 737091 899281
9258 899281 1103495 1237459 1221260 1112708 955828 770592 583733 477001 417120 366569
9248 366569 371181 360975 311800 248525 176026 126858 134948 142200 152801 148031 159290 145184
9236 145184 90327 55772 58109 64577 87818 91230 51476 72566 113171 154062 175864 154198
9224 154198 110550 43199 -17044 -29215 7458 22280 26140 48614 109658 153209 201039 208713
9212 208713 157344 142271 161738 149416 127179 116507 80371 18796 -30310 -37911 51501 169155
$$ packed form
9293D7200J0686k9274m8503P946M9354L6113K6800j2448k0020j4480l0170J64
9281B3368M620J7188K7737L5593J2210K3818O0508K6662J6611N209l2267n3512
9269A67745j8070R412O4047N1380N3807O6229Q3052J17737N3585Q8167J62190
9258H99281K04214J33964j6199j08552j56880j85236j86859j06732n9881n0551
9248C66569M612j0206m9175o3275p2499m9168Q090P252J0601m770J1259j4106
9236A45184n4857l4555K337O468K3241L412l9754K1090M0605M0891K1802k1666
9224A54198m3648o7351o0243j2171L6673J4822L860K2474O1044M3551M7830P674
9212B08713n1369j5073J9467j2322k2237j0672l6136o1575m9106p601Q9412J17654
$$ plain form
9200 169155 224958 214809 167056 117767 98522 100438 100649 127785 173867 217189 241425 272616
9188 272616 387817 579761 786066 923678 998710 1076627 1114748 1077197 973663 800252
9178 800252 627086 490838 430837 398799 343090 305869 296115 249837 250750 253360 187182 88691
9166 88691 9403 2099 57300 95102 65461 65377 89283 69885 22734 -5529 5606 30989 -7485
9153 -7485 -52428 -44268 -1864 41790 57039 27256 -12656 -32352 -23832 37283 101255 118148
9141 118148 89923 137967 252848 353544 465434 624456 832154 1051681 1217525 1228909
9131 1228909 1083059 879084 684731 526073 399320 299028 172411 76891 66927 95062
9121 95062 85583 71151 93133 109430 154946 213277 196251 96959 -28116 -71235 -5882 89666
$$ packed form
9200A69155N5803j0149m7753m9289j9245J916K11K7136M6082M3322K4236L1191
9188B72616J15201J91944K06305J37612P5032P7917L8121l7551j03534j73411
9178H00252j73166j36248o0001l2038n5709l7221r754m6278R13K610o6178r8491
9166H8691p9288p304N5201L7802k9641q4K3906j9398m7151k8263J1135K5383l8474
9153g485m4943Q160M2404M3654J5249k9783l9912j9696Q520O1115O3972J6893
9141A18148k8225M8044J14881J00696J11890J59022K07698K19527J65844J1384
9131A228909j45850k03975j94353j58658j26753j00292j26617r5520r964K8135
9121I5062r479j4432K1982J6297M5516N8331j7026r9292j25075m3119O5353R5548
$$ plain form
9109 89666 75323 27884 -23099 -31079 7539 19644 27966 17429 9225 -19727 -43068 -55958
9097 -55958 -46183 -38357 -81694 -105374 -112622 -89441 7162 79175 116688 123237 64402 18783 50475
9084 50475 131781 194254 168931 119978 104915 91660 105715 179949 248384 250701 186186 91009
9072 91009 73892 117154 115622 67946 26274 69612 102675 44710 -22014 -17101 -25480 -74088
9060 -74088 -67481 -60709 -40725 27805 107514 114355 36506 1318 2965 59302 77705 55582 36006
9047 36006 24729 39375 8746 -3587 -28242 -48488 -56709 -31062 -11438 -41675 -94361 -130804
9035 -130804 -123824 -45951 14531 23405 4303 8205 -7576 -57363 -79947 -85493 -33998 25215
9023 25215 45830 28837 63126 56260 30208 44764 29944 48287 88057 118325 126051 144181
$$ packed form
9109H9666j4343m7439n0983p980L8618J2105Q322j0537q204k8952k3341j2890
9097e5958R775P826m3337k3680p248K3181R6603P2013L7513O549n8835m5619L1692
9084E0475Q1306O2473k5323m8953j5063j3255J4055P4234O8435K317o4515r5177
9072I1009j7117M3262j532m7676m1672M3338L3063n7965o6724M913q379m8608
9060g4088O607O772J9984O8530P9709O841p7849l5188J647N6337J8403k2123j9576
9047C6006j1277J4646l0629j2333k4655k0246q221K5647J9624l0237n2686l6443
9035a30804O980P7873O0482Q874j9102L902j5781m9787k2584n546N1495N9213
9023B5215K0615j6993L4289o866k6052J4556j4820J8343L9770L0268P726J8130
$$ plain form
9011 144181 99312 35413 20612 -5741 -11325 -3425 52450 53464 58258 72588 34050 21866
8999 21866 53319 87828 73097 52829 44557 69233 137011 173012 160363 110002 79132 77713
8987 77713 58321 84856 160478 146655 102653 105361 126572 130540 102648 130746 156115 155058
8975 155058 154545 108206 93225 192400 256280 260238 255795 210420 175470 107405 64977 51382
8963 51382 58931 83361 105881 101595 55074 9267 -28225 -34335 -10375 -47777 -105200 -117267
8951 -117267 -120851 -95054 -34165 47549 74624 34974 -7113 -80713 -159193 -155727 -143026 -158347
8939 -158347 -77463 -26258 -56894 -99057 -105380 -70776 -7993 47168 76277 51308 40738 84842
8927 84842 132568 127442 109471 163305 204122 160226 93483 93846 102423 74958 58545 25842 1297
$$ packed form
9011A44181m4869o3899j4801k6353n584P900N5875J014M794J4330l8538j2184
8999B1866L1453L4509j4731k0268q272K4676O7778L6001j2649n0361l0870j419
8987G7713j9392K6535P5622j3823m4002K708K1211L968k7892K8098K5369j057
8975A55058n13m6339j4981R9175O3880L958m443m5375l4950o8065m2428j3595
8963E1382P549K4430K2520m286m6521m5807l7492o110K3960l7402n7423j2067
8951a17267l584K5797O0889Q1714K7075l9650m2087p3600p8480L466J2701j5321
8939a58347Q0884N1205l0636m2163o323L4604O2783N5161K9109k4969j0570M4104
8927H4842M7726n126j7971N3834M0817m3896o6743L63Q577k7465j6413l2703k4545
$$ plain form
8914 1297 -7718 19441 55356 52990 40393 6670 4206 32200 21473 14719 28283 12803 513
8901 513 11299 18222 -9919 -26729 -64217 -81514 -98411 -137628 -124382 -73947 -34004 -1419
8889 -1419 -11589 -13879 11111 5517 -18192 -42822 -47887 -28718 12006 45467 82938 162868 323223
8876 323223 472576 400667 218212 122939 50618 -25075 -56728 -39886 -12730 13552 45810
8865 45810 24810 2336 2335 -89239 -173338 -166306 -78132 23598 90668 126368 119036 81299 33748
8852 33748 20560 45270 22114 -44555 -64658 -61363 -95138 -91438 -49065 -39161 -41212 -57486 -122116
8839 -122116 -166245 -134935 -87794 -137827 -181942 -193672 -167047 -139300 -115936 -142975 -156036 -167352
8827 -167352 -130437 -89431 -101237 -153407 -166140 -170681 -149497 -69734 -34074 -36820 -2711 30669
$$ packed form
8914A297r015K7159L5915k366j2597l3723k464K7994j0727o754J3564j5480j2290
8901E13J0786O923k8141j6810l7488j7297j6897l9217J3246N0435L9943L2585
8889a419j0170k290K4990n594k3709k4630n065J9169M0724L3461L7471P9930J60355
8876C23223J49353p1909j82455r5273p2321p5693l1653J6842K7156K6282L2258
8865D5810k1000k2474jr1574q4099P032Q8174J01730O7070L5700p332l7737m7551
8852C3748j3188K4710k3156o6669k0103L295l3775L700M2373R904k051j6274o4630
8839a22116m4129L1310M7141n0033m4115j1730K6625K7747K3364k7039j3061j1316
8827a67352L6915M1006j1806n2170j2733m541K1184P9763L5660k746L4109L3380
$$ plain form
8815 30669 39795 27745 18890 45078 52126 43427 49188 -6951 -68930 -26624 477 -32393 -20104
8802 -20104 -45973 -47069 -51922 -51123 -4501 4382 -52299 -95750 -76158 -41261 29331 74990 73343
8789 73343 41395 11099 4551 11640 25570 13338 -28435 -62702 -67618 -19272 12093 17740 5981
8776 5981 -3364 26408 33589 56642 124933 169738 163102 101193 70116 65718 59048 55249 34425
8763 34425 32104 41422 25464 -46628 -88889 -80616 -71019 -40745 -28947 -28616 -19199 -26999 -34043 -40730
8749 -40730 -79884 -125678 -126927 -72906 -16280 2599 -31270 -41298 553 76634 72449 -22937
8737 -22937 -71228 -51666 -4585 -33546 -111381 -129626 -92721 -55482 -24671 25504 35552 33593
8725 33593 32800 30541 17680 -20965 -1545 64665 78625 15477 -18422 -18483 -1371 50954 25299
$$ packed form
8815C0669R126j2050q855K6188P048q699N761n6139o1979M2306K7101l2870J2289
8802b0104k5869j096m853P99M6622Q883n6681m3451J9592L4897P0592M5659j647
8789G3343l1948l0296o548P089J3930j2232m1773l4267m916M8346L1365N647j1759
8776E981r345K9772P181K3053O8291M4805o636o1909l1077m398o670l799k0824
8763C4425k321R318j5958p2092m2261Q273R597L0274J1798L31R417p800p044o687
8749d0730l9154m5794j249N4021N6626J8879l3869j0028M1851P6081m185r5386
8737b2937m8291J9562M7081k8961p7835j8245L6905L7239L0811N0175J0048j959
8725C3593p93k259j2861l8645J9420O6210J3960o3148l3899o1J7112N2325k5655
$$ plain form
8712 25299 -12870 -584 37878 58814 71008 74508 58000 48123 9838 -54250 -92006 -93433
8700 -93433 -108477 -163097 -158387 -105865 -39430 48580 130913 162630 137412 98009 21654 -14506
8688 -14506 9106 38294 60633 52832 12794 18853 82879 99980 81329 71832 155143 209920
8676 209920 190912 178261 185058 176694 191981 233916 278332 281357 263469 226954 199883 193342
8664 193342 165525 159757 155851 113389 115955 157207 218785 242070 215195 218474 239033 234484 256744
8651 256744 288446 303821 305825 290127 247700 214299 200956 255878 319803 292375 233055 194728
8639 194728 216481 249171 269396 285483 263428 289884 295560 270601 231870 185131 152830 172591
8627 172591 198189 240951 241165 215359 219687 235601 232281 229491 225058 209067 159163 146301 168553
$$ packed form
8712B5299l8169J2286L8462K0936J2194L500j6508r877l8285o4088l7756j427
8700i3433j5044n4620M710N2522O6435Q8010Q2333L1717k5218l9403p6355l6160
8688a4506K3612K9188K2339p801m0038O059O4026J7101j8651r497Q3311N4777
8676B09920j9008j2651O797q364J5287M1935M4416L025j7888l6515k7071o541
8664A93342k7817n768l906m2462K566M1252O1578K3285k6875L279K0559m549K2260
8651B56744L1702J5375K004j5698m2427l3401j3343N4922O3925k7428n9320l8327
8639A94728K1753L2690K0225J6087k2055K6456N676k4959l8731m6739l2301J9761
8627A72591K5598M2762K14k5806M328J5914l320k790m433j5991m9904j2862K2252
$$ plain form
8614 168553 186936 211259 236852 204344 78959 46372 90070 112496 83274 54275 62315 52257
8602 52257 27307 15512 -25842 -12756 11064 50799 60974 72626 112805 58764 -6860 -25028
8590 -25028 13239 31429 51765 80248 102565 116764 86855 30571 15133 67270 96279 72938
8578 72938 45456 26218 -24790 -74805 -67562 -101973 -98720 -24795 -3747 -16451 -6825 5003
8566 5003 -8442 -2039 36719 28825 -39412 -90258 -93115 -75678 -60160 -28290 -6088 23332 24051
8553 24051 -9374 9628 45993 67872 98677 96778 76347 33405 -18038 -8520 16145 30132
8541 30132 42617 41600 57272 67426 47082 38122 75303 131560 176215 189766 222003 250438
8529 250438 169766 51547 -44960 -34632 42786 73044 71291 111467 104635 17090 -12991 14448
$$ packed form
8614A68553J8383K4323K5593l2508j25385l2587M3698K2426k9222k8999Q040j0058
8602E2257k4950j1795m1354J3086K3820L9735J0175J1652M0179n4041o5624j8168
8590b5028L8267J8190K0336K8483K2317J4199k9909n6284j5438N2137K9009k3341
8578G2938k7482j9238n1008n0015P243l4411L253P3925K1048j2704R626J1828
8566E003j3445O403L8758p894o8237n0846k857J7437J5518L1870K2202K9420P19
8553B4051l3425J9002L6365K1879L0805j899k0431m2942n1443R518K4665J3987
8541C0132J2485j017J5672J0154k0344q960L7181N6257M4655J3551L2237K8435
8529B50438q0672j18219r6507J0328P7418L0258j753M0176o832q7545l0081K7439
$$ plain form
8517 14448 -8231 -22585 -24233 -19640 65325 139354 165199 176672 156185 111489 76120 83242
8505 83242 71963 31849 20678 46728 70549 57692 57139 95339 115882 142961 123977 60173
8493 60173 37082 81932 160153 184080 151061 134389 141751 133368 116609 109874 136231 149348
8481 149348 151207 138683 106357 122204 134961 118165 67440 33383 39813 71919 49349 53100
8469 53100 121298 177547 161164 134697 125489 165820 169969 144101 114881 63139 13507 -5042
8457 -5042 -722 29780 49710 47120 20487 -43565 -52845 -56990 -28190 44008 106452 121093 128416
8444 128416 183762 241058 236094 215489 195789 141183 87090 52945 13413 40127 34884 74127
8432 74127 107597 107039 125730 172356 202946 212614 187718 151888 135259 128478 184299 260281 298392
$$ packed form
8517A4448k2679j4354j648M593Q4965P4029K5845J1473k0487m4696l5369P122
8505H3242j1279m0114j1171K6050K3821j2857n53L8200K0543K7079j8984o3804
8493F0173k3091M4850P8221K3927l3019j6672P362q383j6759o735K6357J3117
8481A49348J859j2524l2326J5847J2757j6796n0725l4057O430L2106k2570L751
8469E3100O8198N6249j6383k6467r208M0331M149k5868k9220n1742m9632j8549
8457e042M320L0502J9930k590k6633o4052r280m145K8800P2198O2444J4641P323
8444A28416N5346N7296m964k0605j9700n4606n4093l4145l9532K6714n243L9243
8432G4127L3470n58J8691M6626L0590R668k4896l5830j6629o781N5821P5982L8111
$$ plain form
8419 298392 304888 267265 193631 144247 113112 107133 117332 87278 100584 144905 154524 161323
8407 161323 190351 276061 367743 411074 390759 350293 286768 192772 159363 197205 225266 240860
8395 240860 235966 248605 244415 233453 228951 196235 201307 252832 254804 210449 197057 207248 203037
8382 203037 128569 42622 14007 21728 25459 41529 65934 77173 107718 200587 273793 262659
8370 262659 255694 243538 200648 222286 248906 209297 135110 102422 72686 72994 114957 164057
8358 164057 198606 189044 189074 208538 210313 229502 226436 219918 185037 163433 221019 259466 250037
8345 250037 233215 199501 170773 191649 236145 221572 173985 175801 198921 205011 165486 139274
8333 139274 190504 276073 333454 356657 381517 402712 403981 363549 357628 324631 313703 335275
$$ packed form
8419B98392O496l7623p3634m9384l1135n979J0199l0054J3306M4321R619O799
8407A61323K9028Q5710R1682M3331k0315m0466o3525r3996l3409L7842K8061J5594
8395B40860m894J2639m190j0962m502l2716N072N1525J972m4355j3392J0191m211
8382B03037p4468q5947k8615P721L731J6070K4405J1239L0545R2869P3206j1134
8370B62659o965j2156m2890K1638K6620l9609p4187l2688k9736L08M1963M9100
8358A64057L4549r562L0J9464J775J9189l066o518l4881k1604N7586L8447r429
8345B50037j6822l3714k8728K0876M4496j4573m7587J816K3120O090l9525k6212
8333A39274N1230Q5569N7381K3203K4860K1195J269m0432n921l2997j0928K1572
$$ plain form
8321 335275 325271 296002 238514 146731 148821 182232 172425 147774 162427 241241 290350 332054
8309 332054 358563 347127 328709 298689 315361 329605 302606 301564 324919 341084 342479 329039
8297 329039 334642 367824 443188 486126 495322 537893 589560 604282 623603 625475 671984 735258
8285 735258 778436 818163 853466 882745 910771 927110 930910 925266 945510 1013637 1062785 1096797
8273 1096797 1089029 1060658 1059166 1130141 1263244 1368953 1464114 1618718 1778873 1932477 2043475
8262 2043475 2028151 1972778 1910648 1918929 1932438 1983693 2108282 2250170 2329591 2404456 2484426
8251 2484426 2560411 2713356 2940124 3187932 3481403 3815732 4233612 4760277 5376511 6081125
8241 6081125 6908336 7958215 9235838 10713698 12515686 14798707 17653779 21197305
$$ packed form
8321C35275j0004k9269n7488r1783K090L3411r807k4651J4653P8814M9109M1704
8309C32054K6509j1436j8418l0020J6672J4244k6999j042K3355J6165J395j3440
8297C29039N603L3182P5364M2938R196M2571N1667J4722J9321J872M6509O3274
8285G35258M3178L9727L5303K9279K8026J6339L800n644K0244O8127M9148L4012
8273A096797p768k8371j492P0975J33103J05709R5161J54604J60155J53604J10998
8262B043475j5324n5373o2130Q281J3509N1255J24589J41888P9421P4865P9970
8251B484426P5985J52945K26768K47808K93471L34329M17880N26665O16234P04614
8241F081125Q27211J049879J277623J477860J801988K283021K855072L543526
$$ plain form
8233 21197305 25544970 30714268 36666202 43036953 49003805 53533722 55973844 56469955
8225 56469955 55807949 54918059 54595952 55235399 57078494 60451083 65779982 73496643 84153913
8216 84153913 98428845 116770517 138295552 158591063 168514935 160555004 138195595
8209 138195595 111971120 88823197 70526328 56573141 45975229 37837251 31507700
8202 31507700 26574200 22712556 19565254 16954238 14815587 13033419 11544332 10324223
8194 10324223 9208735 8255281 7451488 6709105 6065179 5563489 5172345 4796702 4426097
8185 4426097 4104677 3799731 3554129 3355371 3154925 2972525 2814043 2670025 2552824 2428071
8175 2428071 2297798 2204262 2159592 2084958 1992604 1918762 1858820 1767314 1668160 1624939 1639217
$$ packed form
8233B1197305M347665N169298N951934O370751N966852M529917K440122M96111
8225E6469955o62006q89890l22107O39447J843095L372589N328899P716661J0657270
8216H4153913J4274932J8341672K1525035K0295511R923872p959931k2359409
8209A38195595k6224475k3147923j8296869j3953187j0597912q137978o329551
8202C1507700m933500l861644l147302k611016k138651j782168j489087j220109
8194A0324223j115488r53454q03793p42383o43926n01690l91144l75643l70605
8185D426097l21420l04946k45602j98758k00446j82400j58482j44018j17201j24753
8175B428071j30273r3536m4670p4634r2354p3842n9942r1506r9154m3221J4278
$$ plain form
8164 1639217 1604253 1584601 1602047 1621361 1655268 1680120 1692800 1734208 1725173 1581025 1367543
8153 1367543 1189615 1131677 1067770 971300 912191 893198 877033 798210 744064 776061 793468
8142 793468 778691 734148 710798 720490 690352 636560 613281 631778 650488 655461 655758 606168
8130 606168 544251 520484 509562 445111 416843 445460 487681 499551 524345 556305 582123 575328
8118 575328 524109 458989 447294 428032 365033 368461 418434 449760 474685 449927 399282 364200
8106 364200 374606 415664 466037 496226 505748 481584 497013 499948 477842 479454 483155 448699
8094 448699 427541 382550 363784 400285 416630 415236 398932 402201 421254 452638 465873 463212
8082 463212 487410 515782 548847 536671 560003 578261 586657 624911 739296 754449 691084 668657
$$ packed form
8164A639217l4964j9652J7446J9314L3907K4852J2680M1408r035j44148k13482
8153A367543j77928n7938o3907r6470n9109j8993j6165p8823n4146L1997J7407
8142G93468j4777m4543k3350R692l0138n3792k3279J8497J8710M973K97m9590
8130F06168o1917k3767j0922o4451k8268K8617M2221J1870K4794L1960K5818o795
8118E75328n1219o5120j1695j9262o2999L428M9973L1326K4925k4758n0645l5082
8106C64200J0406M1058N0373L0189R522k4164J5429K935k2106J612L701l4456
8094D48699k1158m4991j8766L6501J6345j394j6304L269J9053L1384J3235k661
8082D63212K4198K8372L3065j2176K3332J8258Q396L8254J14385J5153o3365k2427
$$ plain form
8070 668657 660886 589859 532451 457466 434810 450738 504172 562483 595113 576414 553925 503942
8058 503942 435423 390484 401049 442923 525524 563337 583813 568499 549930 574869 620677 581157
8046 581157 561140 571254 600868 603141 588608 610702 672312 724673 804576 840013 880648 918881
8034 918881 961053 979825 1045678 1126805 1239660 1324390 1405765 1503029 1637707 1810141 2097084
8023 2097084 2471371 2981731 3278361 3102326 2725909 2410053 2086033 1902433 1815259 1852874
8013 1852874 1870674 1876397 1850205 1947345 2075990 2202890 2247548 2351328 2415562 2587245 2810579
8002 2810579 3053152 3202344 3354299 3508032 3821283 4219702 4748535 5220877 5764993 6308016
7992 6308016 7011315 7784367 8738631 9853130 11306855 13010017 15222719 17914175 21439989
$$ packed form
8070F68657p771p1027n7408p4985k2656J5928N3434N8311L2630j8699k2489m9983
8058E03942o8519m4939J0565M1874Q2601L7813K0476j5314j8569K4939M5808l9520
8046E81157k0017J0114K9614K273j4533K2094O1610N2361P9903L5437M0635L8233
8034I18881M2172J8772O5853Q1127J12855Q4730Q1375R7264J34678J72434K86943
8023B097084L74287N10360K96630j76035l76417l15856l24020j83600q7174L7615
8013A852874J7800N723k6192R7140J28645J26900M4658J03780O4234J71683K23334
8002B810579K42573J49192J51955J53733L13251L98419N28833M72342N44116N43023
7992F308016P03299P73052R54264J114499J453725J703162K212702K691456L525814
$$ plain form
7983 21439989 25836533 31459448 38316430 47115185 58290380 73369110 93978957 123322563
7975 123322563 165579377 228136468 313987404 397009605 404642685 327445924 239476327
7968 239476327 174892329 131450494 101646663 80792800 65565079 54337780 45697513
7961 45697513 38876451 33164227 28475508 24552335 21389410 18666724 16505705 14770971
7953 14770971 13378765 12114581 11116491 10332939 9762094 9161655 8546884 7825297 7129471
7944 7129471 6414026 5784007 5268301 4885872 4559937 4303503 3994975 3740978 3485764 3316625
7934 3316625 3129076 2914727 2735853 2629837 2547336 2527750 2516781 2502575 2466688 2488371 2471447
7923 2471447 2428911 2442240 2648785 2949185 3359637 3627245 3435573 2932980 2455974 2112923
$$ packed form
7983B1439989M396544N622915O856982Q798755J1175195J5078730K0609847K9343606
7975A23322563M2256814O2557091Q5850936Q3022201P633080p7196761q7969597
7968B39476327o4583998m3441835k9803831k0853863j5227721j1227299q640267
7961D5697513o821062n712224m688719l923173l162925k722686k161019j734734
7953A4770971j392206j264184r98090p83552n70845o00439o14771p21587o95826
7944G129471p15445o30019n15706l82429l25935k56434l08528k53997k55214j69139
7934C316625j87549k14349j78874j06016q2501j9586j0969j4206l5887K1683j6924
7923B471447m2536J3329K06545L00400M10452K67608j91672n02593m77006l43051
$$ plain form
7913 2112923 1911837 1717631 1515613 1374412 1369705 1341733 1285038 1196230 1126674 1041227 999375
7902 999375 1013933 1013036 976162 996610 1065307 1103362 1047349 1012554 997689 941508 901447 861751
7890 861751 790433 746069 736741 718246 751001 782222 807973 840185 862348 902988 890024 876351
7878 876351 852403 794156 735021 693034 731629 747393 714893 659498 589697 549319 504263 486464
7866 486464 481291 457211 414936 389111 345518 300642 312932 371285 445641 493092 510166 514412
7854 514412 519138 516894 519528 508728 450496 401139 374774 391486 400959 423443 476409 481415 457355
7841 457355 392610 339104 320182 341014 354760 350516 353276 378314 419312 435069 386887 342000
7829 342000 329562 377160 436390 419770 348580 315251 293467 276367 255180 240356 244707 305733
$$ packed form
7913B112923k01086j94206k02018j41201m707k7972n6695q8808o9556q5447m1852
7902I99375J4558q97l6874K0448O8697L8055n6013l4795j4865n6181m0061l9696
7890H61751p1318m4364r328j8495L2755L1221K5751L2212K2163M0640j2964j3673
7878H76351k3948n8247n9135m1987L8595J5764l2500n5395o9801m0378m5056j7799
7866D86464n173k4080m2275k5825m3593m4876J2290N8353P4356M7451J7074M246
7854E14412M726k244K634j0800n8232m9357k6365J6712R473K2484N2966N006k4060
7841D57355o4745n3506j8922K0832J3746m244K760K5038M0998J5757m8182m4887
7829C42000j2438M7598N9230j6620p1190l3329k1784j7100k1187j4824M351O1026
$$ plain form
7817 305733 311799 291638 313638 335201 339696 339745 321872 281928 290420 324898 311232 303121 297123
7804 297123 296548 274618 213677 195456 231092 271086 283512 268629 257807 230187 263221 367235
7792 367235 479793 522378 587190 695129 719488 644497 587905 490522 401595 359805 345938
7781 345938 339408 335409 303890 221508 170303 202740 210700 193784 154220 193706 265661 289567
7769 289567 237587 154522 150722 184617 214248 232179 254254 339552 352301 319153 332265 337800
7757 337800 317344 311768 294872 313842 333119 341882 272368 190621 150538 214107 236868 202738
7745 202738 110194 82521 118642 148879 150718 169493 194267 196001 165385 132750 118819 130099
7733 130099 152423 202707 238646 250417 234756 210215 156595 112387 116039 119696 99674 145929
$$ packed form
7817C05733O066k0161K2000K1563M495M9j7873l9944Q492L4478j3666q111n998
7804B97123n75k1930o0941j8221L5636L9994J2426j4883j0822k7620L3034J04014
7792C67235J12558M2585O4812J07939K4359p4991n6592r7383q8927m1790j3867
7781C45938o530l999l1519q2382n1205L2437P960j6916l9564L9486P1955K3906
7769B89567n1980q3065l800L3895K9631J7931K2075Q5298J2749l3148J3112N535
7757C37800k0456n576j6896J8970J9277Q763o9514q1747m0083O3569K2761l4130
7745B02738r2544k7673L6121L0237J839J8775K4774J734l0616l2635j3931J1280
7733A30099K2324N0284L5939J1771j5661k4541n3620m4208L652L657k0022M6255
$$ plain form
7721 145929 164124 170873 238281 281543 256516 199968 154690 183712 253769 290718 300747 275430
7709 275430 206533 201682 186050 120548 58118 61550 76766 82913 73818 57752 70010 82652
7697 82652 50663 28101 31882 75516 129670 139413 164027 229744 281205 364151 429591 405960
7685 405960 346402 301623 259645 244144 219707 185339 89336 18380 38503 97682 134032 181118
7673 181118 236927 247666 255101 261907 212772 180302 191695 200248 151700 82105 29138 29497 23778
7660 23778 -33916 -28689 41195 104169 118496 76452 59155 116495 131069 70888 36331 27319
7648 27319 87501 148740 160623 134296 119562 128335 99735 117401 198332 199221 176124 149521
7636 149521 101433 76603 46188 15832 14430 63247 128016 160536 129252 78560 108049 145355
$$ packed form
7721A45929J8195O749O7408M3262k5027n6548m5278K9022P0057L6949J0029k5317
7709B75430o8897m851j5632o5502o2430L432J5216O147r095j6066J2258J2642
7697H2652l1989k2562L781M3634N4154R743K4614O5717N1461Q2946O5440k3631
7685D05960n9558m4779m1978j5501k4437l4368r6003p0956K0123N9179L6350M7086
7673A81118N5809J0739P435O806m9135l2470J1393Q553m8548o9595n2967L59n719
7660B3778n7694N227O9884O2974J4327m2044j7297N7340J4574o0181l4557r012
7648B7319O0182O1239J1883k6327j4734Q773k8600J7666Q0931Q89k3097k6603
7636A49521m8088k4830l0415l0356j402M8817O4769L2520l1284n0692K9489L7306
$$ plain form
7624 145355 126631 128084 138375 133882 119718 100610 74881 85937 94389 17113 -29364 5053
7612 5053 50142 97579 136462 123005 91230 89473 116713 93120 91084 123011 118583 66096 24550
7599 24550 60229 94655 124194 116736 42828 12378 53341 100911 156350 210177 170433 87115
7587 87115 41192 23584 31699 65790 47510 -6519 15461 98276 106404 89815 86634 67957
7575 67957 49247 50921 68158 76738 40728 26352 57161 78517 95499 60346 -6437 -20384
7563 -20384 13246 54744 99884 139517 165530 173622 163541 156639 150339 158005 155901 121573 132750
7550 132750 146827 154710 125712 73677 38925 22626 56978 74485 53841 55234 62793 51030
7538 51030 3421 -14638 -10640 -8077 -13450 24776 81277 110034 127472 160307 169539 94782 55200
$$ packed form
7624A45355j8724J453J0291m493j4164j9108k5729J1056Q452p7276m6477L4417
7612E053M5089M7437L8883j3457l1775j757K7240k3593k036L1927m428n2487m1546
7599B4550L5679L4426K9539p458p3908l0450M0963M7570N5439N3827l9744q3318
7587H7115m5923j7608Q115L4091j8280n4029K1980Q2815Q128j6589l181j8677
7575F7957j8710J674J7237Q580l6010j4376L0809K1356J6982l5153o6783j3947
7563b0384L3630M1498M5140L9633K6013Q092j0081o902o300P666k104l4328J1177
7550A32750J4077P883k8998n2035l4752j6299L4352J7507k0644J393P559j1763
7538E1030m7609j8059L998K563n373L8226N6501K8757J7438L2835R232p4757l9582
$$ plain form
7525 55200 85824 114156 142625 144820 142593 197007 231116 203580 155611 140117 172927 169094
7513 169094 113522 67681 95611 97152 67669 72350 79493 70940 67003 111708 138101 115546 127601
7500 127601 151491 183791 153542 120019 121398 134983 163773 189958 248639 272357 231434 216861
7488 216861 181616 136754 173996 185027 140782 128047 125389 117619 106110 105468 81032 67977
7476 67977 39492 60052 80834 66018 63391 80531 89843 131361 136056 88467 70022 71895 59214
7463 59214 49898 45135 13828 -15317 17062 110096 185205 202767 185774 152051 121492 77518
7451 77518 17477 -26266 -12975 11140 55331 63817 50057 62257 56353 78623 100533 94079
7439 94079 59692 53576 42303 -23503 -17101 -12107 -31444 15271 7850 -16475 33722 34060 9355
$$ packed form
7525E5200L0624K8332K8469K195k227N4414L4109k7536m7969j5494L2810l833
7513A69094n5572m5841K7930J541k9483M681P143q553l937M4705K6393k2555J2055
7500A27601K3890L2300l0249l3523J379J3585K8790K6185N8681K3718m0923j4573
7488B16861l5245m4862L7242J1031m4245j2735k658p770j1509o42k4436j3055
7476F7977k8485K0560K0782j4816k627J7140R312M1518M695m7589j8445J873j2681
7463E9214r316m763l1307k9145L2379R3034P5109J7562j6993l3723l0559m3974
7451G7518o0041m3743J3291K4115M4191Q486j3760J2200n904K2270K1910o454
7439I4079l4387o116j1273o5806O402M994j9337M6715p421k4325N0197L38k4705
$$ plain form
7426 9355 -27404 -9073 5439 -10309 -38780 -82348 -116901 -91321 -40694 33392 50487 -17369
7414 -17369 -50954 -51238 -40924 -8798 13576 49700 103361 143928 92795 2062 -80827 -103205
7402 -103205 -79998 -59193 -48372 -95279 -184948 -165658 -117872 -92902 -15133 94369 129165
7391 129165 110486 72992 -8463 -66064 -75121 -56994 -63409 -80531 -53503 -21418 11097 34481
7379 34481 33642 31225 -1942 -77073 -105115 -60688 -14733 -39279 -57934 15228 55098 5534
7367 5534 -55281 -84587 -70066 -35104 -1233 -10986 -11840 -470 -33000 -47281 -5445 48555 69136
7354 69136 55832 60812 57803 3722 -29228 16352 77422 94562 59750 60868 48671 31295
7342 31295 8168 25476 67353 62558 31118 10111 -18439 -75409 -181206 -210182 -120578 -27641
$$ packed form
7426I355l6759J8331J4512j5748k8471m3568l4553K5580N0627P4086J7095o7856
7414a7369l3585k84J0314L2126K2374L6124N3661M0567n1133r0733q2889k2378
7402a03205K3207K0805J0821m6907q9669J9290M7786K4970P7769J09502L4796
7391A29165j8679l7494q1455n7601r057J8127o415j7122K7028L2085L2515K3384
7379C4481q39k417l3167p5131k8042M4427M5955k4546j8655P3162L9870m9564
7367E534o0815k9306J4521L4962L3871r753q54J1370l2530j4281M1836N4000K0581
7354F9136j3304M980l009n4081l2950M5580O1070J7140l4812J118j2197j7376
7342C1295k3127J7308M1877m795l1440k1007k8550n6970j05797k8976Q9604R2937
$$ plain form
7330 -27641 38134 64263 40263 -5805 18319 58203 66332 27877 -18864 2370 10127 1777
7318 1777 24743 44145 16948 -28401 -50013 -15372 40304 82049 100540 125458 129456 132969
7306 132969 143596 94266 38453 17280 -5552 -20139 -40777 -45807 -19364 8954 21963 -4973
7294 -4973 -40619 -60974 -69864 -97453 -46552 74550 156517 132071 66812 17203 -25087 -18834
7282 -18834 19567 16928 -32967 -2405 32168 21841 52280 35503 15460 1307 -39759 -77231
7270 -77231 -100879 -116138 -95588 -74083 -61503 -17769 2104 -2847 8699 19939 29435 10773
7258 10773 -47310 -60062 -13032 13640 -9866 -55918 -62725 -88105 -74750 -23744 29901 30681
7246 30681 -31811 -39403 -9976 9243 858 29033 86101 61560 5839 -46625 -70329 -50770
$$ packed form
7330b7641O5775K6129k4000m6068K4124L9884Q129l8455m6741K1234P757q350
7318A777K2966J9402k7197m5349k1612L4641N5676M1745J8491K4918L998L513
7306A32969J0627m9330n5813k1173k2832j4587k0638n030K6443K8318J3009k6936
7294d973l5646k0355q890k7589N0901J21102Q1967k4446o5259m9609m2290O253
7282a8834L8401k639m9895L0562L4573j0327L0439j6777k0043j4153m1066l7472
7270g7231k3648j5259K0550K1505J2580M3734J9873m951J1546J1240R496j8662
7258A0773n8083j2752M7030K6672k3506m6052o807k5380J3355N1006N3645P80
7246C0681o2492p592K9427J9219q385K8175N7068k4541n5721n2464k3704J9559
$$ plain form
7234 -50770 -57412 -66891 -28668 -14581 -43812 -53942 -44079 -43316 -5039 -163 -28024 -12503 16973
7221 16973 -42290 -69826 -49930 -10614 22247 88373 109145 73181 35387 -7302 -27764 -77041
7209 -77041 -125262 -146669 -125496 -57278 14315 23798 -43724 -53967 -25159 25632 85610 119468
7197 119468 106187 30819 -2747 19910 4985 -7516 790 17548 56294 86080 51861 34815
7185 34815 60395 79925 81086 60001 9028 -50969 -78373 -88064 -81114 -3723 71703 119490
7173 119490 121881 124635 162543 164918 127525 76872 -7258 -45711 -76757 -116709 -108025 -60255
7161 -60255 -34735 -69338 -107545 -154450 -163102 -131297 -119387 -95389 -73227 -63048 -94291 -96261
7149 -96261 -50617 -18399 145 55187 44138 -26742 -71845 -124261 -105954 -40388 -28810 -39744
$$ packed form
7234e0770o642r479L8223J4087k9231j0130R863P63L8277M876k7861J5521K9476
7221A6973n9263k7536J9896L9316L2861O6126K0772l5964l7794m2689k0462m9277
7209g7041m8221k1407K1173O8218P1593R483o7522j0243K8808N0791N9978L3858
7197A19468j3281p5368l3566K2657j4925j2501Q306J6758L8746K9786l4219j7046
7185C4815K5580J9530J161k1085n0973n9997k7404r691O950P7391P5426M7787
7173A19490K391K754L7908K375l7393n0653q4130l8453l1046l9952Q684M7770
7161f0255K5520l4603l8207m6905q652L1805J1910K3998K2162J0179l1243j970
7149i6261M5644L2218J8544N5042j1049p0880m5103n2416J8307O5566J1578j0934
$$ plain form
7137 -39744 -91865 -114379 -100249 -40128 13840 76139 111903 94008 59114 24863 -49245 -115959
7125 -115959 -152942 -154020 -110880 -66447 -50577 -57653 -71272 -72445 -24345 18258 8475 13405 85151
7112 85151 172505 216214 197219 162449 128739 101662 87969 74788 83986 70659 72745 88523
7100 88523 114170 117917 82018 51885 56122 61510 49341 -11472 -18471 34049 68371 99048 116280
7087 116280 70574 10361 -49459 -61001 -18931 36218 74330 85528 105343 139227 110941 67498
7075 67498 62060 28912 -11811 -60670 -47369 10506 119374 255301 260643 101879 -14754
7064 -14754 -64036 -85088 -98912 -85917 -108873 -103226 -62774 -39073 -11984 21763 31881 -18896
7052 -18896 -102040 -82694 -28796 5895 65303 80249 39246 -25340 -44647 -2248 -3575 -20610
$$ packed form
7137c9744n2121k2514J4130O0121N3968O2299L5764j7895l4894l4251p4108o6714
7125a15959l6983j078M3140M4433J5870p076j3619j173M8100M2603r783M930P1746
7112H5151Q7354M3709j8995l4770l3710k7077j3693j3181R198j3327K086J5778
7100H8523K5647L747l5899l0133M237N388j2169o0813o999N2520L4322L0677J7232
7087A16280m5706o0213n9820j1542M2070N5149L8112J1198J9815L3884k8286m3443
7075F7498n438l3148m0723m8859J3301N7875J08868J35927N342j58764j16633
7064a4754m9282k1052j3824J2995k2956N647M0452K3701K7089L3747J0118n0777
7052a8896q3144J9346N3898L4691N9408J4946m1003o4586j9307M2399j327j7035
$$ plain form
7040 -20610 -4076 13634 2273 38626 45063 30903 847 -21655 -24950 -56408 -121429 -149571
7028 -149571 -138921 -149076 -166142 -147609 -137783 -146681 -139351 -117260 -53945 -22634 7793 60229
7016 60229 79094 18044 -83111 -88476 -30232 12169 74794 77268 11759 -67514 -85642 -42277
7004 -42277 16588 29509 9640 -9359 -70880 -95938 -75283 -37573 -47315 -53255 -12590 45533
6992 45533 75704 56713 926 -16738 10536 19987 -16098 -78141 -82868 -28431 25904 38637
6980 38637 23645 14045 21964 -305 -50446 -34597 -44132 -95822 -109610 -88055 -86165 -88071 -72649
6967 -72649 -54338 -30918 -61348 -39532 1576 -6546 20843 46797 84437 88347 59023 44867
6955 44867 48494 -2442 -38731 -85476 -118688 -82420 -26457 -17802 -49564 -83167 -73692 -65691 -125745
$$ packed form
7040b0610J6534J7710j1361L6353O437j4160l0056k2502l295l1458o5021k8142
7028a49571J0650j0155j7066J8533R826q898P330K2091O3315L1311L0427N2436
7016F0229J8865o1050j01155n365N8244M2401O2625K474o5509p9273j8128M3365
7004d2277N8865J2921j9869j8999o1521k5058K0655L7710r742n940M0665N8123
6992D5533L0171j8991n5787j7664K7274R451l6085o2043m727N4437N4335J2733
6980C8637j4992r600P919k2269n0141J5849r535n1690j3788K1555J890j906J5422
6967g2649J8311K3420l0430K1816M1108q122K7389K5954L7640L910k9324j4156
6955D4867L627n0936l6289m6745l3212L6268N5963Q655l1762l3603R475Q001o0054
$$ plain form
6942 -125745 -188136 -204907 -153585 -133693 -182425 -197713 -134355 -80981 -65919 -74392 -94376 -85808
6930 -85808 -113007 -135161 -137129 -94477 -25806 6266 -26681 -67408 -61870 -23265 -17355 -2744
$$ packed form
6942a25745o2391j6771N1322J9892m8732j5288O3358N3374J5062q473j9984Q568
6930h5808k7199k2154j968M2652O8671L2072l2947m0727N538L8605N910J4611
$$ [...]
##END NTUPLES=NMR SPECTRUM
##END=
