##TITLE=C13_LR-742-BK-M
 H2O, 250 sc

 22.2.2023
##JCAMPDX= 6.0         $$ Bruker NMR JCAMP-DX V2.0
##DATA TYPE= NMR SPECTRUM
##DATA CLASS= NTUPLES
##ORIGIN= UXNMR, Bruker Analytische Messtechnik GmbH
##OWNER= root
$$ XWIN-NMR		Version 3.5
$$ Wed Feb 22 16:29:14 2023 Russian Standard Time (UT+4h)  she@DPX200
##.OBSERVE FREQUENCY= 50.327896
##.OBSERVE NUCLEUS= ^13C
##.ACQUISITION MODE= SIMULTANEOUS
##.ACQUISITION SCHEME= undefined
##.AVERAGES= 251
##.DIGITISER RES= 17
##SPECTROMETER/DATA SYSTEM= spect
##.PULSE SEQUENCE= zgpg30
##.SOLVENT NAME= Pyr
##.SHIFT REFERENCE= (INTERNAL, Pyr, 0, 222.624)
##AUDIT TRAIL= $$ (NUMBER, WHEN, WHO, WHERE, WHAT)
$$ ##TITLE= Audit trail, XWIN-NMR		Version 3.5
$$ ##JCAMPDX= 5.01
$$ ##ORIGIN= Bruker BioSpin GmbH
$$ ##OWNER= she
$$ F:/spectra/data/she/nmr/c13/1/pdata/1/auditp.txt
$$ ##AUDIT TRAIL=  $$ (NUMBER, WHEN, WHO, WHERE, WHAT)
(   1,<2023-02-22 16:28:10.23 +0400>,<she>,<DPX200>,
      <created by zg, POWCHK disabled, PULCHK disabled
       terminated by command 'halt'
       configuration hash MD5:
       00 E9 B6 7A A2 85 ED C7 34 08 36 98 17 FE 4E 26
       data hash MD5: 32K
       55 7E 0C 7C 0B 0D E6 00 8B 80 2F 7B 68 B7 2B 58>)
(   2,<2023-02-22 16:28:13.59 +0400>,<she>,<DPX200>,
      <Start of raw data processing
       efp BC_mod = 2 LB = 2 FT_mod = 6 PKNL = 1 PHC0 = -312.2361 PHC1 = 21.58447 SI = 32K 
       data hash MD5: 32K
       BB 12 C6 DE 66 DA FF 74 BE F6 64 89 BB 74 08 5A>)
(   3,<2023-02-22 16:28:16.64 +0400>,<she>,<DPX200>,
      <abs ABSG = 5 
       data hash MD5: 32K
       B3 51 E2 54 06 26 42 C9 F0 87 C1 30 B5 F7 10 E0>)
(   4,<2023-02-22 16:28:35.96 +0400>,<she>,<DPX200>,
      <pk PHC0 = -112.1317 PHC1 = 131.0001 
       data hash MD5: 32K
       CC 46 FF 79 24 E1 4A 07 23 1D 28 13 F7 06 03 85>)
(   5,<2023-02-22 16:28:39.78 +0400>,<she>,<DPX200>,
      <abs ABSG = 5 
       data hash MD5: 32K
       D7 0F AC C1 1B F2 72 FF 6B 36 EE 34 4D 02 C9 F1>)
$$ ##END=
$$ 
$$ hash MD5
$$ F5 4E 11 FF 38 90 CD 20 0F DB 11 CA A0 D1 65 E8
##$RELAX= 
##$RELAX= 
##$RELAX= 
##$RELAX= 
##$RELAX= 
##$RELAX= 
##$RELAX= 
##$RELAX= 
$$ Bruker specific parameters
$$ --------------------------
##$DU= <F:/spectra>
##$EXPNO= 1
##$NAME= <c13>
##$PROCNO= 1
##$TYPE= <nmr>
##$USER= <she>
##$AMP= (0..31)
100 100 100 100 100 100 100 100 100 100 100 100 100 100 100 100 100 100 
100 100 100 100 100 100 100 100 100 100 100 100 100 100 
##$AQSEQ= 0
##$AQ_mod= 1
##$AUNM= <au_zg>
##$AUTOPOS= <>
##$BF1= 50.322709
##$BF2= 200.13
##$BF3= 50.322709
##$BF4= 500.13
##$BF5= 500.13
##$BF6= 500.13
##$BF7= 500.13
##$BF8= 500.13
##$BYTORDA= 1
##$CFDGTYP= 0
##$CFRGTYP= 5
##$CHEMSTR= <none>
##$CNST= (0..31)
1 1 145 1 1 1 1 1 1 1 1 1 1 1 1 1 1 1 1 1 1 1 1 1 1 1 1 1 1 1 1 1 
##$CPDPRG= <waltz16>
##$CPDPRG1= <>
##$CPDPRG2= <waltz16>
##$CPDPRG3= <>
##$CPDPRG4= <mlev>
##$CPDPRG5= <mlev>
##$CPDPRG6= <mlev>
##$CPDPRG7= <mlev>
##$CPDPRG8= <mlev>
##$CPDPRGB= <>
##$CPDPRGT= <>
##$D= (0..31)
$$ [...]
##$SUBNAM4= <"">
##$SUBNAM5= <"">
##$SUBNAM6= <"">
##$SUBNAM7= <"">
##$SUBNAM8= <"">
##$SUBNAM9= <"">
##$SW= 239.972175391363
##$SWIBOX= (0..15)
0 1 3 0 0 0 0 0 0 0 0 0 0 0 0 0 
##$SW_h= 12077.2946859903
##$TD= 32768
##$TD0= 1
##$TE= 0
##$TE2= 300
##$TE3= 300
##$TEG= 300
##$TL= (0..7)
120 120 120 120 120 120 120 120 
##$TP= (0..7)
150 150 150 150 150 150 150 150 
##$TP07= 0
##$TPNAME0= <>
##$TPNAME1= <>
##$TPNAME2= <>
##$TPNAME3= <>
##$TPNAME4= <>
##$TPNAME5= <>
##$TPNAME6= <>
##$TPNAME7= <>
##$TPOAL= (0..7)
0.5 0.5 0.5 0.5 0.5 0.5 0.5 0.5 
##$TPOFFS= (0..7)
0 0 0 0 0 0 0 0 
##$TUNHIN= 0
##$TUNHOUT= 0
##$TUNXOUT= 0
##$USERA1= <user>
##$USERA2= <user>
##$USERA3= <user>
##$USERA4= <user>
##$USERA5= <user>
##$V9= 5
##$VALIST= <valist>
##$VCLIST= <CCCCCCCCCCCCCCC>
##$VD= 0
##$VDLIST= <DDDDDDDDDDDDDDD>
##$VPLIST= <PPPPPPPPPPPPPPP>
##$VTLIST= <TTTTTTTTTTTTTTT>
##$WBST= 1024
##$WBSW= 4
##$XGAIN= (0..3)
0 0 0 0 
##$XL= 0
##$YL= 0
##$YMAX_a= 1623420
##$YMIN_a= -519480
##$ZGOPTNS= <>
##$ZL1= 120
##$ZL2= 120
##$ZL3= 120
##$ZL4= 120
##$ABSF1= 222.624
##$ABSF2= -17.3728
##$ABSG= 5
##$ABSL= 3
##$ALPHA= 0
##$AQORDER= 0
##$ASSFAC= 0
##$ASSFACI= 0
##$ASSFACX= 0
##$ASSWID= 0
##$AUNMP= <proc_1d>
##$AZFE= 0.1
##$AZFW= 0.5
##$BCFW= 0
##$BC_mod= 2
##$BYTORDP= 0
##$COROFFS= 0
##$CY= -3
##$DATMOD= 1
##$DC= 0
##$DFILT= <>
##$DTYPP= 0
##$F1P= 0
##$F2P= 0
##$FCOR= 0.5
##$FTSIZE= 32768
##$FT_mod= 6
##$GAMMA= 0
##$GB= 0
##$INTBC= 1
##$INTSCL= 4.134877e-10
##$ISEN= 128
##$LB= 2
##$LEV0= 0
##$LPBIN= 0
##$MAXI= 10000
##$MC2= 0
##$MEAN= 0
##$ME_mod= 0
##$MI= 0.1934396
##$NCOEF= 0
##$NC_proc= -6
##$NLEV= 6
##$NOISF1= 120.0001
##$NOISF2= 80.00006
##$NSP= 0
##$NTH_PI= 0
##$NZP= 0
##$OFFSET= 222.624
##$PC= 1.4
##$PHC0= -424.3678
##$PHC1= 152.5846
##$PH_mod= 1
##$PKNL= yes
##$PPARMOD= 0
##$PSCAL= 0
##$PSIGN= 0
##$REVERSE= no
##$SF= 50.3227315983092
##$SI= 32768
##$SIGF1= 140
##$SIGF2= 120
##$SINO= 11.81781
##$SIOLD= 32768
##$SREGLST= <13C.CDCl3>
##$SSB= 0
##$STSI= 32768
##$STSR= 0
##$SW_p= 12077.2946859903
##$SYMM= 0
##$S_DEV= 0
##$TDeff= 32768
##$TDoff= 0
##$TI= <>
##$TILT= no
##$TM1= 0
##$TM2= 0
##$TOPLEV= 0
##$USERP1= <user>
##$USERP2= <user>
##$USERP3= <user>
##$USERP4= <user>
##$USERP5= <user>
##$WDW= 1
##$XDIM= 32768
##$YMAX_p= 506201922
##$YMIN_p= -48157277
$$ End of Bruker specific parameters
$$ ---------------------------------
##NTUPLES= NMR SPECTRUM
##VAR_NAME=  FREQUENCY,     SPECTRUM/REAL,   SPECTRUM/IMAG
##SYMBOL=    X,             R,               I
##VAR_TYPE=  INDEPENDENT,   DEPENDENT,       DEPENDENT
##VAR_FORM=  AFFN,          ASDF,            ASDF
##VAR_DIM=   32768,         32768,           32768
##UNITS=     HZ,            ARBITRARY UNITS, ARBITRARY UNITS
##FACTOR=    0.368581032318806, 1,           1
##FIRST=     11203.0474430531, 0,            0
##LAST=      -874.247242937185, 0,           0
##MIN=       -874.247242937185, -48157277,   0
##MAX=       11203.0474430531, 506201922,    0
$$ Real data points
##PAGE= N=1
##DATA TABLE= (X++(R..R)), XYDATA
$$ [...]
8854F269196q2149p17577K358J083083J518996K248293L542254M061529J652545
8845A9578528j321222k094128k721262l347140l717664m150318k809309L8854
8837e43661J597781j07651k342587j827901M82433J201629j63361j767360k303828
8828e774506j342420N62997O57263k49138L06596L72230m4131M22606J518943
8819c569560P91647r62863m24484J552032K224325j48187m390086o484730n413058
8810a6824964l839631l048587k527834q54080J78057N2923J500882L469641M407254
8801a7486339L986648L530259N152308O954935O023736K278705m70182J34543
8793A0104613K705742M634768L523234p86294n410879o326612l439294K45068
$$ plain form
8854 6269196 6187047 5469470 5471828 6554911 8073907 10322200 13864454 17925983 19578528
8845 19578528 18257306 16163178 13441916 10094776 6377112 2226794 -582515 -543661
8837 -543661 1054120 946469 -1396118 -3224019 -2741586 -1539957 -1703318 -3470678 -5774506
8828 -5774506 -7116926 -6553929 -5896666 -6145804 -5839208 -5466978 -5511109 -5088503 -3569560
8819 -3569560 -2777913 -3740776 -4165260 -2613228 -388903 -537090 -4927176 -11411906 -16824964
8810 -16824964 -20664595 -23713182 -26241016 -27095096 -26917039 -26864116 -25363234 -21893593 -17486339
8801 -17486339 -13499691 -9969432 -4817124 2137811 8161547 10440252 9970070 10104613
8793 10104613 12810355 17445123 20968357 20182063 14771184 8444572 5005278 5250346
8785E250346L369023M154357L225417K685479J408953o28669j711746j813164
8777A5939996k435690l798067l277049M6592L783751M978200K026221j781946
8769A5482008k912447k033423j801376j503384n03158j35622p05508j206375K08598
8760D889313L320915O003788N119175K452737J510723J188197K65578j278926
8752B3471500l397641m458055k798636j13796M50896j520101m090014n192207
8744B351946m163960j564030J745377M609065N344790M212674K007804n23438
8736A4020228j932674k379643j661265m36681r18004k452122k738607j344341
8728A56891Q590K38653J063577L347252M576613L115492Q01987N01325J872396
$$ plain form
8785 5250346 8619369 12773726 15999143 18684622 20093575 19464906 17753160 15939996
8777 15939996 13504306 9706239 6429190 6475782 10259533 15237733 17263954 15482008
8769 15482008 12569561 10536138 8734762 7231378 6728220 6592598 5887090 4680715 4889313
8760 4889313 8210228 14214016 19333191 21785928 23296651 24484848 24750426 23471500
8752 23471500 20073859 15615804 12817168 12703372 13154268 11634167 7544153 2351946
8744 2351946 -1812014 -3376044 -1630667 2978398 8323188 12535862 14543666 14020228
8736 14020228 12087554 9707911 8046646 7609965 6691961 4239839 1501232 156891
8728 156891 165481 404134 1467711 4814963 9391576 12507068 13309055 13810380 15682776
8719A5682776L178849L966148M825089M327709J233538k439600l696451j822669
8711B5255389L89096O97125q28520l750136n785071n208521l271936j744263k853969
8702B899194m480849l923056k224924p822K744438N124510O677722P064014O227293
8693B0100520L505699q77705l735992l820133l343855l254346l231702l739600
8685A602886l688655l946402o503458p962055m897692K92790L294359L100719
8677a8707508K344092K675455K708224J573739Q29691O90741J835822M141009
8669a908735M807517J989295j585782l304569l397658j918814R83763L996154
8661c38829M387999K402272J510463K898614L180286Q99399j334357n06261J861350
$$ plain form
8719 15682776 18861625 22827773 27652862 31980571 33214109 30774509 27078058 25255389
8711 25255389 25644485 26341610 25513090 21762954 15977883 10769362 7497426 5753163 2899194
8702 2899194 -1581655 -5504711 -7729635 -7737457 -4993019 131491 6809213 13873227 20100520
8693 20100520 23606219 22728514 18992522 15172389 11828534 8574188 5342486 1602886
8685 1602886 -2085769 -6032171 -12535629 -20497684 -25395376 -25102586 -21808227 -18707508
8677 -18707508 -16363416 -13687961 -10979737 -9405998 -8576307 -7885566 -6049744 -1908735
8669 -1908735 2898782 4888077 3302295 -2274 -3399932 -5318746 -4334983 -338829
8661 -338829 4049170 6451442 7961905 10860519 14040805 14940204 13605847 13099586 14960936
8652A4960936J986254L56702l15502m05782j201671j998922k878997k401032m6751
8643H055235Q15475q11335k706286l126713j274379Q98146J584979K340174K942459
8634H717755J335723q97454j231835m48588l83650o32031J85787K759649N735464
8625A5140820O457472N024812L363707R52803l171450o520193p135780n961757
8617H150434l316585L8571K400961L133132J833626n67834j591062j610172j957129
8608F513942k806720m305326n601174n375590k793393k41944M57251Q17854J993383
8599a1341717L629242L718168J251501q77311j463484j514981j50587K249526
8591d499643M040727K823662j056808l625510k754591M245J788351K355977L501884
$$ plain form
8652 14960936 16947190 17303892 16988390 16582608 15380937 13382015 10503018 8101986 8055235
8643 8055235 8870710 8059375 5353089 2226376 951997 1850143 3435122 5775296 8717755
8634 8717755 10053478 9156024 7924189 7475601 7091951 6459920 6645707 9405356 15140820
8625 15140820 21598292 26623104 29986811 30939614 27768164 21247971 14112191 8150434
8617 8150434 4833849 4872420 7273381 10406513 12240139 11672305 10081243 8471071 6513942
8608 6513942 3707222 -598104 -6199278 -11574868 -14368261 -14610205 -14152954 -13335100 -11341717
8599 -11341717 -7712475 -3994307 -2742806 -3620117 -5083601 -6598582 -6749169 -4499643
8591 -4499643 -458916 2364746 1307938 -2317572 -5072163 -5067918 -3279567 -923590 2578294
8582B578294M656555M128411M399003M676524J959580j035717j980339r71262
8574A8411049J415913J976358o08915m119737n037833k264414O49372R38107N20642
8565A1880542P98018q45723l668243l260350N18888M117704M836050K953025J788327
8556A9118238K291444J304369q71431k649249l415373m463477n677993n291818
8548C44710m622187m504918k598334Q94745J956148j80901k159883k639770k099198
8539a5609588q05543m35970J0657P05249Q46246Q23410N51376l38657k811335
8530a7064155m705687m235097j763276J027021J500552O09140J657407L522563
8522a9451532K917476m2926j296637M88021K451537K951250K114890O6161j210935
$$ plain form
8582 2578294 7234849 11363260 15762263 20438787 22398367 21362650 19382311 18411049
8574 18411049 19826962 21803320 21194405 17074668 12036835 9772421 10421793 11359900 11880542
8565 11880542 12678560 11832837 8164594 4904244 5423132 9540836 14376886 17329911 19118238
8556 19118238 21409682 22714051 21842620 19193371 15777998 11314521 5636528 344710
8548 344710 -4277477 -8782395 -11380729 -10485984 -8529836 -8710737 -10870620 -13510390 -15609588
8539 -15609588 -16415131 -16851101 -16840444 -16135195 -15288949 -14465539 -13914163 -14252820 -17064155
8530 -17064155 -21769842 -26004939 -27768215 -26741194 -25240642 -24631502 -22974095 -19451532
8522 -19451532 -16534056 -16576982 -17873619 -17385598 -14934061 -11982811 -9867921 -9801760 -11012695
8513a1012695n33707M42543R14308J142111J196698O35082p13610j600761j832548
8504a1362579k202184k004553n58453J954151M106089L219158P40437j064949
8496g172883k596996l934091l318034j065373R08436K259187L087674L433739
8488h398341L512123M516631O560565P965423N723378J229807j001811k63816
8480A9843959Q78910O68838j94704l53033J22595J327446K441010J796784l7964
8471B6493841j611591k690497l234940l893483l918813k532355k34280J361616
8463I739498J279431K3033j982456l380247k703669o67925J908312L211851K606310
8454A0034138M07673j990060l073935l771856n269672o022755m879655k140215
$$ plain form
8513 -11012695 -11546402 -11103859 -10189551 -9047440 -7850742 -7215660 -7929270 -9530031 -11362579
8504 -11362579 -13564763 -15569316 -16127769 -14173618 -10067529 -6848371 -6107934 -7172883
8496 -7172883 -9769879 -13703970 -17022004 -18087377 -17178941 -14919754 -11832080 -8398341
8488 -8398341 -4886218 -369587 6190978 14156401 19879779 21109586 20107775 19843959
8480 19843959 20722869 21391707 21197003 20843970 20966565 22294011 24735021 26531805 26493841
8471 26493841 24882250 22191753 18956813 15063330 11144517 8612162 8377882 9739498
8463 9739498 11018929 11041962 9059506 5679259 2975590 2307665 4215977 7427828 10034138
8454 10034138 10441811 8451751 5377816 1605960 -3663712 -9686467 -14566122 -16706337
8446a6706337P12724J700088L19875j134386j675508k339109l242710l093930
8438b5459293j066291J055184K581997L039257J768399J214134K613163M227949
8430a0025501N194197M338220Q31029l818508o222569m387356o77832J451378
8422a3316942J692941J611957K108973K381847K395423J113544k532484o357016
8414a0901757o451375k529718L65857L47272M05873N60524l33773j420554k495513
8405b2453164k154690L19967L325484N059287M592321K525830O87388O60535K210975
8396e226067K976197J387038j177527k191754j332372m51379j108592j830028
8388h954484r52540k26873o05362j200710n52210J743381L051909J583584j62309
$$ plain form
8446 -16706337 -15993613 -14293525 -13973650 -15108036 -16783544 -19122653 -22365363 -25459293
8438 -25459293 -26525584 -25470400 -22888403 -19849146 -18080747 -16866613 -14253450 -10025501
8430 -10025501 -4831304 -493084 337945 -3480563 -9703132 -14090488 -14768320 -13316942
8422 -13316942 -11624001 -10012044 -7903071 -5521224 -3125801 -2012257 -4544741 -10901757
8414 -10901757 -17353132 -19882850 -19516993 -19169721 -18763848 -18203324 -18537097 -19957651 -22453164
8405 -22453164 -24607854 -24287887 -20962403 -15903116 -11310795 -8784965 -8097577 -7437042 -5226067
8396 -5226067 -2249870 -862832 -2040359 -4232113 -5564485 -6015864 -7124456 -8954484
8388 -8954484 -9907024 -10133897 -10739259 -11939969 -12492179 -10748798 -7696889 -6113305 -6275614
8379f275614m60823m50073o94809j121637k221480l348372l715491l398985j498385
8370b3185669J260760L177038L579511K268464O03205k21353m86647q74797j447462
8361a5326950j346152r49923R0250K287573L798740L119774J432711R43665K144418
8352c805894K757111J675594O48128J79945J26082P70138J736055K598109L214601
8343I899869L615896K402678n55879k339788k434725k883791m785908n278538
8335b360186k202746R24671O13349j543220k842495k868964k381071p33828K192580
8326a1201910L773378K714358J005963k15023q81603k39967J014854J405054J380396
8317a244500J292112Q46328j81315j344375k411473j927996L38295K025027J151188
$$ plain form
8379 -6275614 -6736437 -7186510 -7881319 -9002956 -11224436 -14572808 -18288299 -21687284 -23185669
8370 -23185669 -21924909 -18747871 -15168360 -12899896 -12296691 -12518044 -13004691 -13879488 -15326950
8361 -15326950 -16673102 -17623025 -17532775 -15245202 -11446462 -8326688 -6893977 -5950312 -3805894
8352 -3805894 -1048783 626811 1274939 1454884 1580966 2351104 4087159 6685268 9899869
8343 9899869 13515765 15918443 15362564 13022776 10588051 7704260 2918352 -2360186
8335 -2360186 -4562932 -3638261 -3024912 -4568132 -7410627 -10279591 -12660662 -13394490 -11201910
8326 -11201910 -7428532 -4714174 -3708211 -3923234 -4804837 -5044804 -4029950 -2624896 -1244500
8317 -1244500 47612 893940 712625 -631750 -3043223 -4971219 -4632924 -2607897 -1456709
8308a456709p83290j046060q08119j817748k305843n09968J601425L216042L896274
8299a3996J707738j699646l659549l260197J06711N440720R639472R852492O056440
8290B4170185R48834k862326m542409k365208J591499L643340M085013L387967
8282B8056895K80925l785713o396280p156053n262436l169273l062604k647257
8274c141796p84805N28173R70385Q54841j077730k987107k144498m92349j409245
8265i684131k798176k665274j305063O68929J830311K141864J733908J405131
8257h672501J820172Q29889j885869l418731l588197k839357j407574J96563P86904
8248a8178701k80756q89183J221443M711369O572310M082790N10722l15084Q96289
$$ plain form
8308 -1456709 -2239999 -3286059 -4094178 -5911926 -8217769 -8727737 -7126312 -3910270 -13996
8299 -13996 1693742 -5904 -3665453 -6925650 -6818939 -1378219 8261253 18113745 24170185
8290 24170185 25119019 22256693 17714284 15349076 16940575 20583915 24668928 28056895
8282 28056895 28337820 24552107 18155827 10999774 5737338 2568065 -494539 -3141796
8274 -3141796 -3926601 -3398428 -2428043 -1573202 -2650932 -5638039 -7782537 -8274886 -9684131
8265 -9684131 -12482307 -15147581 -16452644 -15783715 -13953404 -11811540 -10077632 -8672501
8257 -8672501 -6852329 -6022440 -7908309 -11327040 -14915237 -17754594 -19162168 -18965605 -18178701
8248 -18178701 -18459457 -19348640 -18127197 -13415828 -6843518 -2760728 -2250006 -2565090 -1668801
8239a668801J702485O29073n09123R38159L424376L407430J455020j459417m632928
8230C286274n409021k090028K846138M976548M086427L766677L179959J53488
8222A4796462l451218l721659j461194p00757k566844l971017m589787m753268
8214a0419282m051682l452590l717705l821418j441974K238859M745530M902955
8206a5017307L387169K154558P87240j112991j553042r97069j429640k189405
8198a5970487k161835L01678M430158P446765Q234876O965865N359805L823073
8190A8429898J560898j281108k734988k568090p55892J214522R95152n86233j861530
8181A2412629l124596l623735l627591k877303k19406K203558L255691L222458
$$ plain form
8239 -1668801 33684 662757 153634 1091793 4516169 7923599 9378619 7919202 3286274
8230 3286274 -2122747 -4212775 -1366637 3609911 7696338 11463015 14642974 14796462
8222 14796462 11345244 7623585 6162391 5461634 2894790 -1076227 -5666014 -10419282
8214 -10419282 -14470964 -17923554 -21641259 -25462677 -26904651 -24665792 -19920262 -15017307
8206 -15017307 -11630138 -9475580 -8688340 -9801331 -11354373 -12351442 -13781082 -15970487
8198 -15970487 -18132322 -17830644 -13400486 -5953721 2281155 9247020 14606825 18429898
8190 18429898 19990796 18709688 15974700 13406610 12650718 13865240 14860392 14274159 12412629
8181 12412629 9288033 5664298 2036707 -840596 -1060002 1143556 4399247 7621705
8173G621705K292521J416892o68771m123867n229500k780536k13577M67623k35658
8164a453168j642540k446823k197880j591584l09960K562962M545927L606111
8156A073045N16503k784846l033935Q16332M123479M112474O49620m305551o533691
8147e366570l834695J990850N302370L338435j929470n651306n097089k336713
8139a3584188J46367L64664K19935J063820K56160k359321l966804l680362k372542
8130b3912271m47080P43752J76180j096870j228410q50141j172262q44513L74282
8121b8257333K292683L354822L307541L104554J814601J668975L663768N084258
8113c966131N260741L505351M22729k006838k961577k180838j295042j300513
$$ plain form
8173 7621705 9914226 11331118 10662347 6538480 1308980 -1471556 -1685133 -1217510 -1453168
8164 -1453168 -3095708 -5542531 -7740411 -9331995 -9641955 -7078993 -2533066 1073045
8156 1073045 1589548 -1195298 -4229233 -3412901 710578 4823052 5472672 1167121 -5366570
8147 -5366570 -9201265 -7210415 -1908045 1430390 -499080 -6150386 -11247475 -13584188
8139 -13584188 -13437821 -13073157 -12853222 -11789402 -11533242 -13892563 -17859367 -21539729 -23912271
8130 -23912271 -24359351 -23615599 -23439419 -24536289 -25764699 -26614840 -27787102 -28631615 -28257333
8121 -28257333 -25964650 -22609828 -19302287 -16197733 -14383132 -12714157 -9050389 -3966131
8113 -3966131 1294610 4799961 5222690 3215852 254275 -1926563 -3221605 -4522118
8105d522118k436336l012386j748512J668146N053659M152653l2523l431845m056628
8096h365890k630634k008762k124420j724389j297455r27738n95346n830l47776
8087b0028240n3510L263649N481174L722506J333364R12388K757337N521998P066054
8078I976720O435475N141658M692705M024623J321424k432898o047536q609231
8070A4502940q340896n052877k202579j222536L64069J417361L44103p89580j225752
8061b205747j370406J47819J531886R89936m91266j686404j504379q3855J694745
8052b977671L438154L535606J761405K50590p33718k070987l002387k674666j320030
8043c793704l57504m10073r29153j609556j061795O26174J240880K35632o58825
$$ plain form
8105 -4522118 -6958454 -9970840 -11719352 -10051206 -4997547 -844894 -877417 -4309262 -8365890
8096 -8365890 -10996524 -13005286 -15129706 -16854095 -18151550 -19079288 -19674634 -19680464 -20028240
8087 -20028240 -20081750 -16818101 -11336927 -7614421 -6281057 -5368669 -2611332 2910666 9976720
8078 9976720 16412195 21553853 26246558 30271181 31592605 29159707 23112171 14502940
8070 14502940 6162044 1109167 -1093412 -2315948 -1951879 -534518 -190415 -979995 -2205747
8061 -2205747 -3576153 -3428334 -1896448 -906512 -1397778 -3084182 -4588561 -4672416 -2977671
8052 -2977671 460483 3996089 5757494 6008084 5274366 3203379 200992 -2473674 -3793704
8043 -3793704 -4151208 -4561281 -5490434 -7099990 -8161785 -7535611 -6294731 -6059099 -6717924
8034f717924l59243P71596K754277M234088L044010P01250j13427Q72433K537257
8025G724317L119738J494477p88393k013697k292154k517762k156388K63924K346103
8016E180165J024650j449870k445537j660762R81752L316861L609387K461845
8008A1018491N32498j789772k370457j304888l7024O24358K14114j333435j719794
7999C834091J282999L829983L054210N71050j748266l794373n800360n962418
7991d733084l834090j035418J173891L186319M526172L748125K143469P67730
7983E943114j101734k771373k341803n22047R07264K083680L112368L593478L348500
7974A2251447K278169l85897k230705j789852K43735K343524K978297L063694
$$ plain form
8034 -6717924 -7077167 -6305571 -3551294 682794 3726804 4428054 4314627 5187060 7724317
8025 7724317 10844055 12338532 11550139 9536442 7244288 4726526 2570138 2834062 5180165
8016 5180165 6204815 4754945 2309408 648646 1630398 4947259 8556646 11018491
8008 11018491 11550989 9761217 7390760 6085872 6048848 6673206 6887320 5553885 3834091
7999 3834091 5117090 8947073 12001283 12572333 10824067 7029694 1229334 -4733084
7991 -4733084 -8567174 -9602592 -8428701 -5242382 -716210 3031915 5175384 5943114
7983 5943114 4841380 2070007 -271796 -793843 113421 2197101 5309469 8902947 12251447
7974 12251447 14529616 14143719 11913014 10123162 10366897 12710421 15688718 18752412
7966A8752412K049496O11871r84898l543182m939360l673011j761364j812778
7958D699186k859968k850859j763429N89854L461005M768976M127195K822198
7950A2994158J447925L57831l83508p01163l97078J8555j99637j066470j479534
7941A0591079j679586k565142l410701m437999n927750n030023j536117Q69835
7933a3126404J280980Q62441O50914M12878j665071l264895k165121n83861p01994
7924a8300133j364117j559140j711135q96549Q0983O30147J396978P34281j195205
7915b2183890k373664k081986l93454Q86485J112667J351964K610610M804594
7907a6266674O777152O380895M124041K107830J874575L334289N408996P214938
$$ plain form
7966 18752412 20801908 21413779 20428881 16885699 11946339 8273328 6511964 4699186
7958 4699186 1839218 -1011641 -2775070 -2185216 1275789 6044765 10171960 12994158
7950 12994158 14442083 14799914 14416406 13715243 13318165 13336720 13137083 12070613 10591079
7941 10591079 8911493 6346351 2935650 -1502349 -7430099 -12460122 -13996239 -13126404
7933 -13126404 -11845424 -10982983 -10332069 -9919191 -11584262 -14849157 -17014278 -17598139 -18300133
7924 -18300133 -19664250 -21223390 -22934525 -23831074 -23750091 -23119944 -21722966 -20988685 -22183890
7915 -22183890 -24557554 -26639540 -27032994 -26146509 -25033842 -23681878 -21071268 -16266674
7907 -16266674 -9489522 -3108627 1015414 3123244 4997819 8332108 13741104 20956042
7899B0956042O505858K841613L4259j51152r34043l333859n072132o086095m340428
7890A0420063m99511K959816N263007L841197j891471p983650r869009q029293
7882e788851m777008j318N822702R452905Q204135N327062L075852Q11805j162309
7873B0964975j430565R1497J271407J814569J886527K187329K288215K675414
7865C1749368K741472J077328r78289k614941l357215l189867l327923l285813
7857A8814120k472743k345112k916007k352547j013706K93681J376314J551324
7849A0935324J272086J114624P21162k2541q96479j668964k876258m028949l036692
7840A513313l38788J774421J180679j364779l452766m058282k655867L626J939521
$$ plain form
7899 20956042 27461900 30303513 30337772 30186620 29252577 25918718 20846586 14760491 10420063
7890 10420063 9920552 12880368 18143375 21984572 20093101 12109451 2240442 -5788851
7882 -5788851 -10565859 -10567177 -4744475 4708430 12912565 18239627 21315479 22127284 20964975
7873 20964975 19534410 19625907 20897314 22711883 24598410 26785739 29073954 31749368
7865 31749368 34490840 35568168 34589879 31974938 28617723 25427856 22099933 18814120
7857 18814120 16341377 13996265 11080258 8727711 7714005 8007686 9384000 10935324
7849 10935324 12207410 13322034 14043196 14020655 13124176 11455212 8578954 4550005 1513313
7840 1513313 1174525 2948946 4129625 2764846 -687920 -4746202 -7402069 -7398443 -5458922
7831e458922K858684J980744n29099r09848R28489K317633K147442L92086o05277
7822C121932p15828j051085p9558J483493J178602o32593j090476Q77717K416715
7813E508919J897315K018789J801949l39643j230468r04642j454017k146191k191480
7804B960531k598399k435947j389272R7044J197628J075287O16141j12812j386051
7795a975850j447388M42078K246324J339535j446628k257447j684171j440776
7787f224323N5326L298042M714051M132441L359145J329625j114805l178656m639226
7778A731620n300592n309378m701039l711461k380633j572141j21267J837999
7770a9526892K101157J147343J022263K381850M786533N573387M595444L797072
$$ plain form
7831 -5458922 -2600238 -619494 -1148593 -2058441 -1129952 1187681 3335123 3727209 3121932
7822 3121932 2406104 1355019 1275461 2758954 3937556 3304963 2214487 3092204 5508919
7813 5508919 7406234 9425023 11226972 10887329 9656861 8752219 7298202 5152011 2960531
7804 2960531 362132 -2073815 -3463087 -3366043 -2168415 -1093128 -476987 -589799 -1975850
7795 -1975850 -3423238 -2981160 -734836 604699 -841929 -3099376 -4783547 -6224323
7787 -6224323 -6168997 -2870955 1843096 5975537 9334682 10664307 9549502 6370846 1731620
7778 1731620 -3568972 -8878350 -13579389 -17290850 -19671483 -21243624 -21364891 -19526892
7770 -19526892 -17425735 -16278392 -15256129 -12874279 -8087746 -2514359 2081085 5878157
7762E878157L006154J366351m14043j337231j535514m96158J379805L005314M968044
7753A5820879N345761J858527k380221n085420o228256o210542n278144k286028
7745d443444P18626Q28185l4084j66258J073184K112959J381626j398614m800411
7736d728231o285294n956208n110914k799205R93522M665829O937935N762039
7728f520527J542526j970452k491168j348079k16009J53912l32686n23555J126406
7719a0579632M015186N668401M394954K185941J800122K597245K270111P19539
7711A3071867q53054j498913q70613q58985k852840m565251m282386l083958k375278
7702h169411j965098j629169r16357M34154K636503N027738M007411m09649m031520
$$ plain form
7762 5878157 8884311 10250662 9836619 8499388 6963874 6467716 7847521 10852835 15820879
7753 15820879 21166640 23025167 20644946 15559526 9331270 3120728 -2157416 -4443444
7745 -4443444 -3724818 -2896633 -2930717 -3096975 -2023791 89168 1470794 72180 -4728231
7736 -4728231 -11013525 -16969733 -22080647 -24879852 -23886330 -19220501 -12282566 -6520527
7728 -6520527 -4978001 -6948453 -9439621 -10787700 -11003709 -10849797 -11182483 -11706038 -10579632
7719 -10579632 -6564446 -896045 3498909 5684850 7484972 10082217 12352328 13071867
7711 13071867 12218813 10719900 9849287 8990302 6137462 1572211 -2710175 -5794133 -8169411
7702 -8169411 -10134509 -11763678 -12680035 -12245881 -9609378 -4581640 -574229 -983878 -5015398
7693e015398m253473k051899J380726M352341M608053L962112K860664L16487
7685F159613k009231l098457k534688q45924r8430o93444j720771j539192m15481
7676f796005j13103m80576p47329r74922j02834J580580J770994J631385L121608
7667a110202N825916O526540L484606m14615l071260m336694m609304n024975
7659b729988n149204k996768O40407L607305L933139J379069j217226k638059
7651e171325k414348o11692K544921N725115O408543L575372j359827m617230
7643D079529l438550j213227r60171j994335l797673l619786p95230J405616J710506
7634h623321R99558O01689P32872N90116R88014K536029L844474L826700L388131
$$ plain form
7693 -5015398 -9268871 -11320770 -9940044 -5587703 -979650 2982462 5843126 6159613
7685 6159613 4150382 1051925 -1482763 -2328687 -2427117 -3120561 -4841332 -6380524 -6796005
7676 -6796005 -6909108 -7389684 -8137013 -9111935 -9214769 -7634189 -5863195 -4231810 -1110202
7667 -1110202 4715714 11242254 14726860 14312245 11240985 6904291 2294987 -2729988
7659 -2729988 -7879192 -10875960 -10235553 -6628248 -2695109 -1316040 -2533266 -5171325
7651 -5171325 -7585673 -8197365 -5652444 72671 6481214 10056586 8696759 4079529
7643 4079529 640979 -572248 -1532419 -3526754 -7324427 -10944213 -11739443 -10333827 -8623321
7634 -8623321 -7623763 -7022074 -6289202 -5699086 -4711072 -2175043 1669431 5496131 8884262
7625H884262J960045Q05387J086844J58774j367301j01627K236369K171181J290152
7616A7124086J485285J780085O15946k356016l675040j683990Q64558J486611
7608A5641525J014344J285913K068512J997039N34319k694782o405582p747941
7600E693347n736228k407865R12759K170068J066402j73297k40541J32013r367
7591A407291P62988K152098J915236O74292J136833K430579J820884l82650k876194
7582I041357n456123o888897p292697o695414m220324j548881P88737K574171
7574a9698071M073096O288881P275142O211441M134219J078330j180404j900631
7566F282003j607273m93902o85927j565690k662294k922499j167810J154499Q14929
$$ plain form
7625 8884262 10844307 11649694 12736538 12895312 11528011 11426384 13662753 15833934 17124086
7616 17124086 18609371 20389456 21005402 18649386 14974346 13290356 14154914 15641525
7608 15641525 16655869 17941782 20010294 22007333 22541652 19846870 13441288 5693347
7600 5693347 -42881 -2450746 -1537987 632081 1698483 1525186 1284645 1416658 1407291
7591 1407291 2170279 4322377 6237613 6911905 8048738 10479317 12300201 11917551 9041357
7582 9041357 3585234 -3303663 -10596360 -17291774 -21512098 -23060979 -22272242 -19698071
7574 -19698071 -15624975 -9336094 -2060952 4150489 8284708 9363038 8182634 6282003
7566 6282003 4674730 4180828 3494901 1929211 -733083 -3655582 -4823392 -3668893 -2853964
7557b853964k519992m741610k776588P59354K131829J761049J75870j697562j896299
7548a1657913q70861j15876l65966j36236R72810K363186L859354N202534N529074
7539D780106L553548L24370k179331k256638L24110K608166J167329j672007k203372
7530D446281r42273J098728K606632P75579k299826l360485k915565j360333L42693
7521a608569P57533j06145j406621j172222J448770K623664P65711j356278k248537
7512b302694j901251j10728J938687K503778M59060l014540n337202n284113m110663
7503a7159666k863094r34433j277j17618J483213L594540K912232L48389k63320
7494a3001034J284392L041601M501888M645879M213689M106358L927052K899133
$$ plain form
7557 -2853964 -5373956 -10115566 -12892154 -12132800 -10000971 -8239922 -8064052 -9761614 -11657913
7548 -11657913 -12528774 -12644650 -13010616 -13146852 -12174042 -9810856 -5951502 -748968 4780106
7539 4780106 8333654 8658024 6478693 4222055 4546165 7154331 8321660 6649653 4446281
7530 4446281 3504008 4602736 7209368 7984947 5685121 2324636 -590929 -1951262 -1608569
7521 -1608569 -851036 -957181 -2363802 -3536024 -2087254 536410 1302121 -54157 -2302694
7512 -2302694 -4203945 -4314673 -2375986 127792 586852 -2427688 -7764890 -13049003 -17159666
7503 -17159666 -20022760 -20957193 -20958470 -21076088 -19592875 -15998335 -13086103 -12737714 -13001034
7494 -13001034 -11716642 -8675041 -4173153 472726 4686415 8792773 12719825 15618958
7486A5618958L50689k884904m840044n150594o057315p719812q022769n002441
7478b3708232K44001K884504K111421K022794K761874L074232K633287K069740
7470e906379K673040L596430L269465J442616j183424k836733j828745O00863
7462a72867J655522N49456j448417k344294j462188m96894L10384K057898M198371
7453B846971N411496N027136M239838L250876P45892j981017k483872k045313
7445A5012007k282714k984538l966506m422045l858704j968054J010080K761628
7437f98846K909769J459945j463692l827744m608110m158537l395697k386682
7429a6169594m87302K654663M422869K967030Q5521k143881l326549l311296k492880
$$ plain form
7486 15618958 15969647 13084743 8244699 3094105 -2963210 -10683022 -18705791 -23708232
7478 -23708232 -23464231 -20579727 -18468306 -16445512 -13683638 -10609406 -7976119 -5906379
7470 -5906379 -3233339 363091 3632556 5075172 3891748 1055015 -773730 -172867
7462 -172867 1482655 2032111 583694 -1760600 -3222788 -3719682 -3409298 -1351400 2846971
7453 2846971 8258467 13285603 17525441 20776317 21522209 19541192 17057320 15012007
7445 15012007 12729293 9744755 5778249 1356204 -2502500 -4470554 -3460474 -698846
7437 -698846 2210923 3670868 2207176 -1620568 -6228678 -10387215 -13782912 -16169594
7429 -16169594 -16656896 -14002233 -9579364 -6612334 -6526813 -8670694 -11997243 -15308539 -17801419
7420a7801419l92455K694655M592341L360505m12041k593975k652284j997907
7412a5202580J368169N323567N337163K402105m50050j266635o79540j58157N56414
7403b769544J017866J94572K16556L248612O509308O477437L422178o97912m299088
7394A3319985n351048l144288q86921m44342o89291o20880r77131j809039j478286
7385b081241r18999j469052j854170k226763k109031j321675o8295K650699L916034
7376e482493K653154R99897N38041J72902r50285k067489k571988k061508j748523
7367a0518292j577632r97547L63749K084028K461930K187878J621865k82212l456481
7358h112714n135714l305162m42336J31932k12473Q06764K792661N175343O563293
$$ plain form
7420 -17801419 -18193874 -15499219 -10906878 -7546373 -7958414 -10552389 -13204673 -15202580
7412 -15202580 -13834411 -8510844 -3173681 -771576 -1221626 -2488261 -3167801 -3325958 -2769544
7403 -2769544 -1751678 -1557106 -1340550 1908062 8417370 14894807 18316985 17619073 13319985
7394 13319985 7968937 4824649 3937728 3493386 2804095 2183215 1206084 -602955 -2081241
7385 -2081241 -3000240 -4469292 -6323462 -8550225 -10659256 -11980931 -12049226 -9398527 -5482493
7376 -5482493 -2829339 -1829442 -1291401 -1118499 -2068784 -4136273 -6708261 -8769769 -10518292
7367 -10518292 -12095924 -13093471 -12729722 -10645694 -8183764 -5995886 -4374021 -4656233 -8112714
7358 -8112714 -13248428 -16553590 -16995926 -16863994 -17076467 -16269703 -13477042 -8301699 -1738406
7349a738406N245546J918612r69864j481458j010842k117570l525830j853792
7341e533604J459534K921743L045215L190125K006807Q66773Q53559R17164L50937
7332A0078253o66367j985270k471646r88591j8800J91094J813591M195880O067416
7323A6215560N662518K126850j846088l636473l702412k613720j518887j149362
7315I537986k878841n594118o846261o269495l514266L03823L328024N634508
7307f298640P234381O542899K340753l625857p604788q433331n314110j013838
7299a6172531J162169J680266L038290M080824K824226J022566j22008p98127
7291c284325j965392l117866l010030j766526J784783P188245J0361037R587076
$$ plain form
7349 -1738406 3507140 5425752 4455888 2974430 1963588 -153982 -3679812 -5533604
7341 -5533604 -4074070 -1152327 1892888 5083013 7089820 7956593 8810152 9727316 10078253
7332 10078253 9411886 7426616 4954970 3966379 3947579 4138673 5952264 10148144 16215560
7323 16215560 21878078 24004928 22158840 18522367 14819955 12206235 10687348 9537986
7315 9537986 6659145 1065027 -5781234 -12050729 -15564995 -15261172 -11933148 -6298640
7307 -6298640 935741 7478640 9819393 6193536 -1411252 -9844583 -15158693 -16172531
7299 -16172531 -15010362 -13330096 -10291806 -6210982 -3386756 -2364190 -2486198 -3284325
7291 -3284325 -5249717 -8367583 -11377613 -13144139 -11359356 -4171111 6189926 15777002
7283A5777002O158271K738319J085101M24075k1741M57656N96668q12334j442965
7274B4960052j644667k920401m489983o657090p829417o316741l297994N28525
7266g667716M148648O597655P614846O678691K938920j008934k627223k388437
7258A4286450r40936L69179M28969N44204J378871K607444J979505j49318p51193
7249A9753175l2711N59613q30330l089478k810053p33518K56170l7039J49377
7240A3185206J980232L272416J697132q40351j720903r89677m70400P32973J718534
7231A8565162j32010m424440o617613n479244l562017q07303J796383K279475
7223A618393K043421K305656J912715Q86693o53684j445303r92362j411864k461895
$$ plain form
7283 15777002 21935273 24673592 25758693 26182768 26161027 26618683 27215351 26403017 24960052
7274 24960052 23315385 20394984 15905001 9247911 1418494 -4898247 -8196241 -7667716
7266 -7667716 -3519068 3078587 10693433 17372124 20311044 19302110 16674887 14286450
7258 14286450 13345514 13714693 14143662 14687866 16066737 18674181 20653686 20504368 19753175
7249 19753175 19720464 20280077 19449747 16360269 13550216 12816698 13072868 13035829 13185206
7240 13185206 15165438 18437854 20134986 19294635 17573732 16584055 16113655 16846628 18565162
7231 18565162 18433152 14008712 7391099 1911855 -1650162 -2457465 -661082 1618393
7223 1618393 3661814 5967470 7880185 8766878 8113194 6667891 5675529 4263665 1801770
7214A801770k704652j666801p51399p6310R80104J102247K043592K178452K13822
7205C120825j292177p78991J129978L061308M695517N029910M902715N162737
7197B5031822N115628N810171O188180M064588K266400J536893K89522o47221
7189D9655983J42622L043127P826363J2393842J4385581J5033545J7353495K3836164
7181A43670722L3143244M1376183M8047766N5724439O1995979N5450191K0394577
7174D59803101l3329768p2100147q1216833o9177724n0315453l3897575k2872012
7167I6893589j7362529j5305893j2002054o298790l254796l648140l525140r12821
7159C4583426L30190j908458m818538o487530o344904m789841l372492l001719
$$ plain form
7214 1801770 -902882 -2569683 -3321082 -3397392 -2417288 -1315041 728551 2907003 3120825
7205 3120825 1828648 1049657 2179635 5240943 9936460 14966370 19869085 25031822
7197 25031822 30147450 35957621 42145801 46210389 48476789 50013682 50303204 49655983
7189 49655983 49798605 52841732 60668095 73061937 87447518 102481063 119834558 143670722
7181 143670722 176813966 218190149 266237915 321962354 383958333 439408524 459803101
7174 459803101 426473333 354373186 273156353 203978629 153663176 119765601 96893589
7167 96893589 79531060 64225167 52223113 45924323 42669527 39021387 35496247 34583426
7159 34583426 34913616 33005158 28186620 21699090 15354186 10564345 7191853 4190134
7151D190134k597338j391885o95912p85403k737290n434556o115355m378268r06371
7142b0852244L159043P164917R531360P812808M523819L692315K695781l39467
7134A7388332l119609m287799m233404k941039l98375J986281L321709L802034
7126A1518130M249285L885196J859913j175460l857478n120062m666266k663377
7118D029881j348324k645752n066188n737598n652381n375954l959131q11895
7110b6567342L485422P296178R378689O668275P91478k323063k939557m047510
7102h257430n193315m627482k526201K11439J808056J994393K496496L033537
7094a1060507K961208L791416M875646M369863L998236L519915M37638j864300
$$ plain form
7151 4190134 1592796 200911 -495001 -1280404 -4017694 -9452250 -15567605 -19945873 -20852244
7142 -20852244 -17693201 -10528284 -996924 6815884 11339703 15032018 17727799 17388332
7134 17388332 14268723 9980924 5747520 2806481 2408106 4394387 7716096 11518130
7126 11518130 15767415 19652611 21512524 20337064 16479586 11359524 6693258 4029881
7118 4029881 2681557 35805 -5030383 -10767981 -16420362 -21796316 -25755447 -26567342
7110 -26567342 -23081920 -15785742 -6407053 261222 1052700 -1270363 -4209920 -8257430
7102 -8257430 -13450745 -18078227 -20604428 -20392989 -18584933 -16590540 -14094044 -11060507
7094 -11060507 -8099299 -4307883 567763 4937626 8935862 12455777 12893415 11029115
7086A1029115j55151K479536J957155p76360j756510j052127j109888j236954
7078I378816L41205J161214o46113j529543q8680J644048K241947K253224J207074
7069A5963192j090q58524j695088j964792j356554N9281K86185o23179j991315
7060G818116k793922k554753k640510k827299k728137m553897o442088m593381
7052b1315871j550270P46737L152741M829214M471563L016430J916360Q26032
7044c907064j660740m496737l999995j248042P36380L05612j527988q67863J061153
7035a5605284K106608J869770l09881k462810k624306j326465j017391j384836
7027b0754595J87694K638079M490113N161215M199640L130443K718692K212854
$$ plain form
7086 11029115 10873964 13353500 15310655 14534295 12777785 11725658 10615770 9378816
7078 9378816 9720021 10881235 10235122 8705579 8616899 10260947 12502894 14756118 15963192
7069 15963192 15962102 15103578 13408490 11443698 10087144 10146425 10432610 9809431 7818116
7060 7818116 5024194 2469441 -171069 -2998368 -5726505 -10280402 -16722490 -21315871
7052 -21315871 -22866141 -22119404 -18966663 -14137449 -9665886 -6649456 -4733096 -3907064
7044 -3907064 -5567804 -10064541 -14064536 -15312578 -14576198 -14270586 -15798574 -16666437 -15605284
7035 -15605284 -13498676 -11628906 -11938787 -14401597 -17025903 -18352368 -19369759 -20754595
7027 -20754595 -20566901 -17928822 -13438709 -8277494 -4077854 -947411 1771281 3984135
7019C984135K499005L353303L237556K087011M53502j959123m483571n568189
7011C603629m926804m449395l944273j811510J048080K744086K233189J702555
7003c800443K702250K991676M60867k667522k861448n68277J104742J918850K586951
6994A867646M307451N318918L554166K27333k779388n288529n748193l642003
6986b182599j669439l76624K75934l4211r16545k117117k316822j226179n22697
6977a1086299j448042k468405j345010J539694L697144L881684L211329K705066
6969a312839J177498R24859K796107K607018r83177n707402p935286n878052k053894
6960a6365168N36646K781234M962563N633474M892781L165813J169779l51821
$$ plain form
7019 3984135 6483140 9836443 13073999 15161010 15614512 13655389 9171818 3603629
7011 3603629 -1323175 -5772570 -9716843 -11528353 -10480273 -7736187 -5502998 -3800443
7003 -3800443 -1098193 1893483 2354350 -313172 -3174620 -3742897 -2638155 -719305 1867646
6994 1867646 6175097 11494015 15048181 15275514 12496126 7207597 1459404 -2182599
6986 -2182599 -3852038 -4228662 -3952728 -3986939 -4903484 -7020601 -9337423 -10563602 -11086299
6977 -11086299 -12534341 -15002746 -16347756 -14808062 -11110918 -7229234 -4017905 -1312839
6969 -1312839 -135341 789518 3585625 6192643 5209466 -497936 -8433222 -14311274 -16365168
6960 -16365168 -15828522 -13047288 -8084725 -2451251 2441530 5607343 6777122 6425301
6952F425301j414780j753665k086122l462284l389783q29114M78911p04968k895261
6943i631765l844781k584023j20901J928350J979757K038426M442061O058849
6935B65973L303320p59666j748480k96268J327774K507540K731465K702425L242025
6926A3276108L523699K419736m85410l324830m703308m400092l418411l085489
6918a97997j960758N67379J473554L75738o09069j73545K667916O077956P336196
6909A5557370O671108M337518Q81634k695033m812056m384490j556395J793511
6901A5793167L196069L418274K761443k43267m603160o543138m003995p96497
6893H978896J314025K271273J868996P66899j12256Q95615K161897J285926p36637
$$ plain form
6952 6425301 5010521 3256856 1170734 -2291550 -5681333 -6510447 -6031536 -6736504 -9631765
6943 -9631765 -13476546 -16060569 -16181470 -14253120 -12273363 -10234937 -5792876 265973
6935 265973 3569293 2809627 1061147 764879 2092653 4600193 7331658 10034083 13276108
6926 13276108 16799807 19219543 18734133 15409303 10705995 6305903 2887492 -197997
6918 -197997 -2158755 -1591376 -117822 257916 -351153 -524698 2143218 8221174 15557370
6909 15557370 22228478 26565996 27447630 24752597 19940541 15556051 13999656 15793167
6901 15793167 18989236 22407510 25168953 24925686 20322526 13779388 9775393 8978896
6893 8978896 10292921 12564194 14433190 15200089 15087833 15983448 18145345 19431271 18694634
6884A8694634k111186l575150m482488k893045N56797K654045J197394j178952
6876H862049j579658j72068K150525M030766N687819O357336M016486p06590m497377
6867B4149288n009474l674729j053249J237260L55265k770428m109107l462282
6859E662544l238981k809676j561673j816231m762381o993390o511788n715085
6851b7746661l988925r48045J115680J797844K367578M459040O649892P426298
6843h867299O331553M490864L576800K667413R19883m84341j329347q95993Q71084
6834G280617K356101L060594K317572l08632l382695l331599P93641M103114L530463
6825A6419176K159156J329033r4274k813578n611668o282137n387045m498458
$$ plain form
6884 18694634 16583448 13008298 8525810 5632765 6189562 8843607 10041001 8862049
6876 8862049 7282391 7110323 9260848 13291614 18979433 25336769 29353255 28646665 24149288
6867 24149288 19139814 15465085 14411836 15649096 16004361 13233933 9124826 5662544
6859 5662544 2423563 -386113 -1947786 -3764017 -8526398 -15519788 -22031576 -27746661
6851 -27746661 -31735586 -32683631 -31567951 -29770107 -27402529 -22943489 -16293597 -8867299
6843 -8867299 -2535746 1955118 5531918 8199331 9119214 8634873 7305526 6409533 7280617
6834 7280617 9636718 12697312 15014884 14706252 11323557 7991958 8785599 12888713 16419176
6825 16419176 18578332 19907365 19813091 16999513 11387845 5105708 -281337 -4779795
6817d779795l501089j411862Q68733J462583N82299J049331K181605L46372k105827
6808e307650j945433j181355O28053M035245N402427M043484K490065K248512
6800A0413348L970867N622211N510502L954769Q97551j899623l418567m306584
6792B0744474n382230o217105m390657j000790Q60333J278690J211975Q47923
6784G952613N07269Q58197N27028j772146l214562q30223M035758N979368L391702
6775A7435004m8473j501601k3216L020228M714193L041501j468162n055168n373830
6766A4740476n159546o587170o916021m326189j220146o15607j775098j667591
6758a3526892p18347q09698p75812l06459l79088P91990M254113P189652P728242
$$ plain form
6817 -4779795 -8280884 -9692746 -8824013 -7361430 -6779131 -5729800 -3548195 -3201823 -5307650
6808 -5307650 -7253083 -8434438 -7806385 -3771140 1631287 5674771 8164836 10413348
6800 10413348 14384215 20006426 25516928 29471697 30369248 28469625 25051058 20744474
6792 20744474 15362244 9145139 4754482 3753692 4614025 5892715 7104690 7952613
6784 7952613 8459882 9318079 9845107 8072961 4858399 4028176 8063934 14043302 17435004
6775 17435004 17386531 15884930 15861714 18881942 23596135 26637636 25169474 20114306 14740476
6766 14740476 9580930 2993760 -3922261 -8248450 -9468596 -10084203 -11859301 -13526892
6758 -13526892 -14245239 -15054937 -15830749 -16137208 -16516296 -15724306 -11470193 -4280541 3447701
6749C447701O025451L359398J251861O43713J260495J560098Q54043o22206k834972
6740A4945582m560194m490442j967390M83302J266056R04936n74746j580337k700048
6731A726719m012592m018878l245843k544802j754315J069190M819295N782288
6723b178938L669961J006240j235221l376534n263359o335271m109090L43721
6715a7478491K807982J860354j058492k605442j389011n32369n92230K94257P75265
6706a7918177P01112K637126L697843J845078m75004n67722K825495O284835N267182
6697D297768J066099j148525n00352r4179l88789n42370j206192j756884p38333
6688a011757O43747Q31732K73388j12717m43597q50081p14620o37005n02134j26050
$$ plain form
6749 3447701 9473152 12832550 14084411 14728124 15988619 17548717 18402760 17780554 14945582
6740 14945582 10385388 5894946 3927556 4410858 5676914 6581850 6007104 4426767 1726719
6731 1726719 -2285873 -6304751 -9550594 -12095396 -13849711 -12780521 -7961226 -2178938
6723 -2178938 1491023 2497263 1262042 -2114492 -7377851 -13713122 -17822212 -17478491
6715 -17478491 -14670509 -12810155 -13868647 -16474089 -17863100 -18395469 -18987699 -18693442 -17918177
6706 -17918177 -17217065 -14579939 -10882096 -9037018 -9512022 -10079744 -7254249 -969414 4297768
6697 4297768 5363867 4215342 3714990 3620811 3232022 2689652 1483460 -273424 -1011757
6688 -1011757 -368010 463722 737110 624393 180796 -669285 -1383905 -2020910 -2523044 -2649094
6678b649094J73451n50266k417600l319960j845739n70736j068632k29701L358089
6669i120188M822146K307652j248640l581899m073033l608915k498805L48245
6661a6653437L631321M145673K524843R92092O85564J010111K59842k97783J753035
6652a948739M315353M007046J815155J921959L715728K953939P0985j304350k054934
6643A3492142l711446n239976m199584n71492J946068J558010P4720r83706j280231
6634A084505n31184J300931J775836J636508K454431K280730J201582J110460
6626A2313799K150997L422008L686162K719826O60942k232005m370600m645259
6618A3705870l951917l121560j305930K43089J65938O59261J649744J466849N29299
$$ plain form
6678 -2649094 -2475643 -3025909 -5443509 -8763469 -10609208 -11179944 -12248576 -12478277 -9120188
6669 -9120188 -4298042 -1990390 -3239030 -6820929 -10893962 -14502877 -17001682 -16653437
6661 -16653437 -13022116 -8876443 -6351600 -5359508 -4673944 -3663833 -3403991 -3701774 -1948739
6652 -1948739 2366614 6373660 8188815 10110774 13826502 16780441 16851426 15547076 13492142
6643 13492142 9780696 4540720 341136 -230356 1715712 3273722 3348442 2364736 1084505
6634 1084505 553321 1854252 3630088 5266596 7721027 10001757 11203339 12313799
6626 12313799 14464796 17886804 21572966 24292792 24953734 22721729 18351129 13705870
6618 13705870 9753953 6632393 5326463 5569552 5735490 6394751 8044495 9511344 10040643
6609A0040643J93259Q38608J443906K41207j709238k989727l083544j816733j053639
6600B104742n93943m85408j418566j679579l38145J746061K566217K028298K002256
6591E931933K499403J181277j952735m895702o530769n723192l295234r13674
6583a3698693J230424K933101M764902O960168P234447O200621N191536K740281
6575B3556787n12936k032337k017275j616826k100876n046546p338994n974318
6567c083321j196680M457782P647558P187213M274504O83207k005612m380261
6559A3584390n377647k629663J553970L451739K853258J519967o60424k691964
6551A1603626l559212l574073k941548k789199l671329k740112M14372K345726
$$ plain form
6609 10040643 10233902 11072510 12516416 12757623 11048385 8058658 4975114 3158381 2104742
6600 2104742 1510799 1025391 -393175 -2072754 -2410899 -664838 1901379 3929677 5931933
6591 5931933 8431336 9612613 7659878 2764176 -3766593 -9489785 -12785019 -13698693
6583 -13698693 -12468269 -9535168 -4770266 2189902 9424349 15624970 20816506 23556787
6575 23556787 23043851 21011514 18994239 17377413 15276537 10229991 2890997 -3083321
6567 -3083321 -4280001 177781 7825339 15012552 19287056 19970263 17964651 13584390
6559 13584390 8206743 5577080 7131050 10582789 13436047 14956014 14295590 11603626
6551 11603626 8044414 4470341 1528793 -1260406 -4931735 -7671847 -7257475 -4911749
6543d911749J425267j873634m665753l725492J47160K930910L883649L926501
6535b863141K993333K544077J742339j099465m012294m752361l957494k933117
6527a2338123k061763p12351j62699j196498k518552j256931J385667J450327
6519a7410923p86807j428346L13542K743623M790750M988112L970865L306266
6511D87082K605464J559305Q72433Q52472L48807m94650k08189Q94497J250737
6502H167958K074613L956371L260218p12808m001045n140710m552023j343332
6494A709242K68048j683796k927843k711122k019029j815821j818096K8560L522913
6485g446944N081814N385581N890679L407665j058694l013959l553538m704643
$$ plain form
6543 -4911749 -3486482 -5360116 -10025869 -13751361 -13604201 -10673291 -6789642 -2863141
6535 -2863141 130192 2674269 4416608 3317143 -695151 -5447512 -9405006 -12338123
6527 -12338123 -14399886 -15112237 -15274936 -16471434 -18989986 -20246917 -18861250 -17410923
6519 -17410923 -18197730 -19626076 -19312534 -16568911 -11778161 -6790049 -2819184 487082
6511 487082 3092546 4651851 5524284 6376756 6725563 6230913 6022724 6917221 8167958
6502 8167958 10242571 14198942 17459160 16746352 12745307 7604597 3052574 1709242
6494 1709242 1977290 293494 -2634349 -5345471 -7364500 -9180321 -10998417 -10969857 -7446944
6485 -7446944 -2365130 3020451 8911130 12318795 11260101 8246142 4692604 -12039
6477a2039n007871l261940j719575j935296j648343J63031J386939J361250N48240
6468a0125604K83437J008568J041505K86521m56621j356655j980165l35711K949002
6459h685723M328802L278375K585470J873078K21005j031812p01679K84694R23840
6450C076050K147317L196725K416587R24239j169763m548996o530941m612517
6442e101299p94265J115782N99767p1019J464469M454753M808164J408920k452298
6433E432974l787910k165659Q9570J005690J048311K246136K953603J564895J136148
6424I523758K027919K286699J183824m16512j853774l018739l067760m48051K857321
6415I074685L149985K018327J010634r78396l285792m351956m194297l701580
$$ plain form
6477 -12039 -5019910 -8281850 -10001425 -11936721 -13585064 -13422033 -12035094 -10673844 -10125604
6468 -10125604 -9842167 -8833599 -7792094 -7505573 -7962194 -9318849 -11299014 -11634725 -8685723
6459 -8685723 -4356921 -1078546 1506924 3380002 3601007 2569195 1867516 2152210 3076050
6450 3076050 5223367 8420092 10836679 11760918 10591155 6042159 -488782 -5101299
6442 -5101299 -5895564 -4779782 -4180015 -4251034 -2786565 1668188 6476352 7885272 5432974
6433 5432974 1645064 -520595 -431025 574665 1622976 3869112 6822715 8387610 9523758
6424 9523758 11551677 13838376 15022200 14605688 12751914 9733175 6665415 6217364 9074685
6415 9074685 12224670 14242997 15253631 14275235 10989443 6637487 2443190 -1258390
6407a258390l150226k027682M69886N006462Q148984O716853K189529k987653
6399A3107763o806389p680932n635597j443620K854589N548911N804760M048793
6391I798278R84014k091088k342734m33698M09758m3546j245372k623018k277905
6382A34689o96542P82477K900265N483631N474266L013801J398861J352319J165473
6373B1009240o1061p55952k36353M44347J933325L816432N016319N046183L841476
6364D0053956M689232Q568782J2762736J5954155J9266105K2834992K7498823
6357A51628781L4941304M5163869N6093626O7161910P4367852O2193347J4651233
6350E06201922m7067773p9575602p8419891o5193926n2231657m1344198l1573627
$$ plain form
6407 -1258390 -4408616 -6436298 -5966412 -959950 7189034 13905887 16095416 13107763
6399 13107763 6301374 -1379558 -7015155 -8458775 -5604186 -55275 5749485 9798278
6391 9798278 10782292 8691204 6348470 5914772 6324530 6280984 5035612 2412594 134689
6382 134689 -561853 220624 3120889 8604520 14078786 17092587 18491448 19843767 21009240
6373 21009240 20948179 20192227 19955874 20400221 22333546 26149978 31166297 36212480 40053956
6364 40053956 44743188 53311970 66074706 82028861 101294966 124129958 151628781
6357 151628781 186570085 231733954 287827580 354989490 429357342 491550689 506201922
6350 506201922 459134149 379558547 301138656 235944730 183713073 142368875 110795248
6343A10795248k2394392j5229598j1979226j0921658q391097m526265k147052
6336C5205960k316494k924070l447658m431333m788754m129408k465706N80428
6328A1282965L406417L941107J590135j632383l315304m052527l225181j437030
6320F558199n92066J61585P25868O34603n33702j919734k123095k270726l162910
6311b521978l540395l335145l073975r2035M616183O245815N133122L030463j294761
6302E167294l759594j306495K450480M346832L831450J179806j233128j151251
6294I525394K69642J094717J47088j685880l255544l987258l719840k548331j715811
6285e875823r94007o76583p91383q01690n06094M13902J971013J737737j14549
$$ plain form
6343 110795248 88400856 73171258 61192032 50270374 41879277 37353012 35205960
6336 35205960 32889466 29965396 26517738 22086405 17297651 13168243 10702537 11282965
6328 11282965 14689382 18630489 20220624 18588241 15272937 11220410 7995229 6558199
6320 6558199 5966133 6127718 6853586 7488189 6954487 5034753 2911658 640932 -2521978
6311 -2521978 -6062373 -9397518 -12471493 -12563528 -7947345 -1701530 3431592 6462055 5167294
6302 5167294 1407700 101205 2551685 6898517 10729967 11909773 10676645 9525394
6294 9525394 9795036 10889753 11036841 9350961 6095417 2108159 -1611681 -4160012 -5875823
6285 -5875823 -6869830 -7546413 -8337796 -9139486 -9645580 -9231678 -7260665 -5522928 -5637477
6276e637477r29600j698865k214490j017669j20526r50789j742289j797768j533901
6267a7643374j674834k003467q33680O87908n13351k689261j975796J137129M004975
6258b1503751N457371N875461M995607L385418K177365J487881J022521K73120
6250C170993l78831J45338J322679J858552M62820l222579o877864n553998k89104
6241i361994K982366K659719Q79844m79184k52651J373707K283831J380514n96119
6232H70033k184302k318766p50890M29238k22210j410603k860160l217880j415409
6223a3080949J773539M192599L180652P80299J80554J90682r36929k051107O8937
6214e701723M025922N967070M828896J821698r79181j949027j65829K669295L654420
$$ plain form
6276 -5637477 -6567077 -8265942 -10480432 -11498101 -11618627 -12569416 -14311705 -16109473 -17643374
6267 -17643374 -19318208 -21321675 -22155355 -21467447 -21980798 -24670059 -26645855 -25508726 -21503751
6258 -21503751 -16046380 -10170919 -5175312 -1789894 387471 1875352 2897873 3170993
6250 3170993 2792162 2937500 4260179 6118731 6581551 3358972 -3518892 -9072890 -9361994
6241 -9361994 -6379628 -3719909 -2840065 -3319249 -3571900 -2198193 85638 1466152 870033
6232 870033 -1314269 -3633035 -4383925 -3954687 -4176897 -5587500 -8447660 -11665540 -13080949
6223 -13080949 -11307410 -7114811 -3934159 -3153860 -2973306 -2782624 -3719553 -5770660 -5701723
6214 -5701723 -1675801 4291269 9120165 10941863 9962682 8013655 7847826 10517121 14171541
6205A4171541J331743k005779k382276m55191N23692j1508p67689j241541k589301
6196F573691n712732p933546p425654n322588j720867K270496M207769L694533
6188a1368898K242229J564032J636650R79784M12514K18808J54677J406522L071452
6179C17770L149549J400287p98447j286456J435669M341364L916732N05883k820845
6170A0161506l298531j689191K70567J792066K629217J297670k505068m511411
6162D146825l557148l732911n764172o501088k319361L640949O347377N903696
6154a835833L785255M76765k948758l865120j960409M98659J408098K417746M754258
6145B730661M753576J238759k744718m350075l745196k381346j539829j567593
$$ plain form
6205 14171541 15503284 13497505 11115229 10660038 11183730 11172222 10404533 9162992 6573691
6196 6573691 860959 -7072587 -14498241 -19820829 -21541696 -19271200 -15063431 -11368898
6188 -11368898 -9126669 -7562637 -5925987 -4946203 -4533689 -4314881 -4160204 -2753682 317770
6179 317770 3467319 4867606 4069159 2782703 4218372 8559736 12476468 12982351 10161506
6170 10161506 6862975 5173784 5444351 7236417 9865634 11163304 8658236 4146825
6162 4146825 589677 -3143234 -8907406 -15408494 -17727855 -14086906 -7739529 -1835833
6154 -1835833 1949422 2426187 -522571 -4387691 -6348100 -5849441 -4441343 -2023597 2730661
6145 2730661 7484237 8722996 5978278 1628203 -2116993 -4498339 -6038168 -7605761
6137g605761j247471k77487k04808j994826l191596j0548N153655P880120P464864
6128E966142N182802K198233n08702j870513j662899j357912k247194m001357
6120A698600o390103o158717l316642j583639p11296K54226N81251R58343K005859
6111a2662118L266272L405058K496454K513558L101135J942959o87708k773725
6103F01885l122424l003530m415394o600039o408885k802848K825791P786297
6095a5139147Q882795N463843J070065j049000k256414l310207l952085l711790
6087a4001940l014257j679716J31561r9403j111756l27374J089446K440288L897079
6078a2676072M883993M705146L033949M49767k118018l168976k421180j084627
$$ plain form
6137 -7605761 -8853232 -9130719 -9335527 -11330353 -14521949 -14532497 -9378842 -1498722 5966142
6128 5966142 11148944 13347177 12838475 10967962 9305063 7947151 5699957 1698600
6120 1698600 -4691503 -10850220 -14166862 -15750501 -16461797 -16207571 -15626320 -14667977 -12662118
6111 -12662118 -9395846 -5990788 -3494334 -980776 2120359 4063318 3375610 601885
6103 601885 -2520539 -5524069 -9939463 -16539502 -22948387 -25751235 -22925444 -15139147
6095 -15139147 -6256352 -792509 277556 -771444 -3027858 -6338065 -10290150 -14001940
6087 -14001940 -17016197 -18695913 -18564352 -18663755 -19775511 -20102885 -19013439 -16573151 -12676072
6078 -12676072 -7792079 -3086933 -52984 396783 -1721235 -4890211 -7311391 -8396018
6070h396018l60394Q9212Q79608O64633J736818M669954O098652M693277K759991
6061A2835733J500541l70682j784318p22867J212901J023459j454765j499690
6053A0740312O73365J089397j049589l637573m056025l179913l136473l043075
6045e599574j931863n35098J301615K811218K066028j7862j245631j088247n16807
6036d756221p68714j079535n99332J122010K798847K267616r25892n067155o942787
6027a3951163o291650m213539q48998K283794M622893N597754M786370L973132
6019d041407M706787O123587N951608M038825O57487k829111l189421m24728L123022
6010A4116649M844954L260766l11401j040449J721574K028172j443048m290518
$$ plain form
6070 -8396018 -8756412 -8667200 -7787592 -7122959 -5386141 -716187 5382465 10075742 12835733
6061 12835733 14336274 13965592 12181274 11458407 12671308 13694767 12240002 10740312
6053 10740312 11413677 12503074 11453485 7815912 3759887 579974 -2556499 -5599574
6045 -5599574 -7531437 -8066535 -6764920 -3953702 -1887674 -1905536 -3151167 -4239414 -4756221
6036 -4756221 -5524935 -6604470 -7203802 -6081792 -3282945 -1015329 -1941221 -7008376 -13951163
6027 -13951163 -20242813 -24456352 -25305350 -23021556 -18398663 -12800909 -8014539 -4041407
6019 -4041407 665380 6788967 12740575 16779400 17436887 14607776 11418355 10993627 14116649
6010 14116649 18961603 22222369 21910968 20870519 22592093 24620265 23177217 18886699
6002A8886699m007166j722815l61922q82261j916852k946061l284214k974824
5994G90584k485471j574957j786253l222634l278466k146725j949906k380022
5986a8033850j640769J164538M243376M664903K110180n21809j224611m09090
5978i647132J337110J937537Q58282n12357o36884J64571j326101l786757l259873
5969a4871604j432797R3245J498203K518168L877475M526825K992907O63875R01927
5960G68224K993649L907133K798166P77313n96156j611894l344234n181785n688742
5951e178326m338017r24196K663836M979828N772918L155446j302992m107532
5943G20965m467887j453192L145057M947142L864180K539641J065871j438884
$$ plain form
6002 18886699 14879533 13156718 12794796 11912535 9995683 7049622 3765408 790584
5994 790584 -1694887 -3269844 -5056097 -8278731 -11557197 -13703922 -15653828 -18033850
5986 -18033850 -19674619 -18510081 -14266705 -9601802 -7491622 -8013431 -9238042 -9647132
5978 -9647132 -8310022 -6372485 -5514203 -6026560 -6663444 -6498873 -7824974 -11611731 -14871604
5969 -14871604 -16304401 -16211156 -14712953 -12194785 -8317310 -3790485 -797578 -133703 768224
5960 768224 3761873 7669006 10467172 11244485 10648329 9036435 5692201 510416 -5178326
5951 -5178326 -9516343 -10440539 -7776703 -2796875 2976043 6131489 4828497 720965
5943 720965 -3746922 -5200114 -2055057 2892085 6756265 9295906 10361777 8922893
5935H922893k549484J085002M803570L284615j547714m530894n035879n529616
5927a097507m665585k120686l52751Q66749K886118M208032L628442J138062k847964
5918A642910n512089m813358l184904j664277l9319J96707k3623J452863L867093
5909h077997M828300M796250L583340J104669j987410m539709m921251k132250
5901g346058K532204N810068N485889K426760j101775m444494n266766l317608
5893e221780j478611q18891m05147J119282K876677L540302L202216K748689J347557
5884F910294j508677k670019J60376M110459M286596k5392m099454m725898m206148
5875a767863l592154j698842N92359K139836J692858p3297p52682n79065j401645
$$ plain form
5935 8922893 6373409 7458411 12261981 15546596 13998882 9467988 4432109 -1097507
5927 -1097507 -5763092 -7883778 -8236529 -7369780 -4483662 -275630 3352812 4490874 1642910
5918 1642910 -3869179 -8682537 -11867441 -13531718 -13571037 -13374330 -13397953 -11945090 -8077997
5909 -8077997 -3249697 1546553 5129893 6234562 4247152 -292557 -5213808 -7346058
5901 -7346058 -4813854 996214 6482103 8908863 7807088 3362594 -1904172 -5221780
5893 -5221780 -6700391 -7519282 -7924429 -6805147 -3928470 -388168 2814048 5562737 6910294
5884 6910294 5401617 2731598 2891974 7002433 11289029 11263637 7164183 2438285 -1767863
5875 -1767863 -5360017 -7058859 -6466500 -4326664 -2633806 -2707103 -3459785 -4038850 -5440495
5866e440495l219392l379059r79253K759807M156870K642716J96354j672642j688180
5857f623274j66398J72429j140929j832983k820465l465055k380070j915810j767560
5848b1940115K5921J987075K887669L296578L144897L596718M823790M669001
5840B491534L380466K618936K223380J338525N73993J282861L685749O379802
5832B3975246O150670K681320k071199n254177o060707n069498j857865K091759
5824A4585549L235230J663849k31881q10602l49668j367491l588285m895225m592468
5815C649008l520402l672791l529789j004997J041220L29040j086245j922613
5807i717569k543894k063225j274305k474499l052272j892755o69702n95699M59831
$$ plain form
5866 -5440495 -8659887 -12038946 -13018199 -10258392 -6101522 -3458806 -3262452 -4935094 -6623274
5857 -6623274 -6789672 -6617243 -7758172 -9591155 -12411620 -15876675 -18256745 -20172555 -21940115
5848 -21940115 -21914194 -19927119 -17039450 -13742872 -10597975 -7001257 -2177467 2491534
5840 2491534 5872000 8490936 10714316 12052841 12626834 13909695 17595444 23975246
5832 23975246 30125916 32807236 30736037 25481860 19421153 14351655 12493790 14585549
5824 14585549 17820779 19484628 19252747 18442145 18092477 16724986 13136701 8241476 3649008
5815 3649008 128606 -3544185 -7073974 -8078971 -7037751 -6708711 -7794956 -9717569
5807 -9717569 -12261463 -14324688 -15598993 -18073492 -21125764 -23018519 -23688221 -24283920 -23824089
5798b3824089L893949P240637Q783491Q134476O366000L710039o8449k559978
5790A1676076k791800j983887j835437j320783R40715R11521j937107l209427
5782D49871j634016R1388N31783L83457P24613J268768K244393M100641M339076
5773A2499974J809348j59549p2294j18983l01600K59753J915607L623239L380816
5764B2836311J114503j394053l704227n677713n548991l107274m02680o4881k033087
5755B017908l717396m548062n102193n258619m029743k64659M191065N155652
5747a1556047K958971K066594K552240K542567K461199L352131L829524K122989
5739A0330168O63933P65177N73617k32268j901448l996469l969420j487655O40938
$$ plain form
5798 -23824089 -19930140 -12689503 -3906012 4228464 10594464 14304503 14236054 11676076
5790 11676076 8884276 6900389 5064952 3744169 4684884 5596405 3659298 449871
5782 449871 -1184145 -1092757 -560974 -177517 547096 1815864 4060257 8160898 12499974
5773 12499974 14309322 14149773 14077479 13958496 13656896 13916649 15832256 19455495 22836311
5764 22836311 23950814 22556761 18852534 13174821 7625830 4518556 4115876 4050995 2017908
5755 2017908 -1699488 -6247550 -11349743 -16608362 -20638105 -20902764 -16711699 -11556047
5747 -11556047 -8597076 -6530482 -3978242 -1435675 1025524 4377655 8207179 10330168
5739 10330168 10994101 11759278 12332895 12100627 10199179 6202710 2233290 745635 1386573
5730A386573J009513J31506J47508K020294L788123J922076j176616r9117K401807
5721A1531667K186169q65729m942348o125764l061258J410317L933720K768157
5713F834931N23038P06846K538461L771479L259300K205887J162072O26789P45433
5704B2374236N02864r18618k864362m455667n495379n340397l915398k476345
5696b589066r55337k43945j031418k797230m661783n132754k592550J492716L108705
5687a5402662J965292N25951M9422P81509J807339K249362K277379J667581Q51989
5678c226838J809702M904431N776071K154059j168451q04227J455645K374302
5670A3274694L63981l367051n489233l813297j204098Q06211J886841J085902
$$ plain form
5730 1386573 2396086 2527592 2675100 4695394 8483517 10405593 9228977 9129860 11531667
5721 11531667 13717836 12852107 7909759 1783995 -1277263 133054 4066774 6834931
5713 6834931 7357969 8064815 10603276 14374755 17634055 19839942 21002014 21628803 22374236
5704 22374236 22877100 21958482 19094120 14638453 9143074 3802677 -112721 -2589066
5696 -2589066 -3544403 -3788348 -4819766 -7616996 -12278779 -17411533 -20004083 -18511367 -15402662
5687 -15402662 -13437370 -12911419 -12861997 -12080488 -10273149 -8023787 -5746408 -4078827 -3226838
5678 -3226838 -1417136 3487295 9263366 11417425 10248974 9444747 10900392 13274694
5670 13274694 13638675 10271624 4782391 969094 -235004 571207 2458048 3543950
5662C543950K88952M46140R8146j946558m823153o090702m322723j442444J441664
5653a2806728M121752N461312N706145N333006K347011j016278q87591Q1346m64397
5644G875578j934175k895761k971207l313074k800508P51422N499741P815646
5636H027662P659306M509586O86873r35275j820648l647410o451486p281405l840993
5627c093790J076791K575500J27864k410175j903818K00314J984963K136424l911
5618F90162k987832l405463j854284j648376j939462j074237k14103P22680J784090
5609i926825J080935o42481j065247P23774L154846L172760K357846L931432O435931
5600I222971N725632J491016k167973l478006m114395n724828n451255j549528
$$ plain form
5662 3543950 3832902 4279042 4377188 2430630 -2392523 -8483225 -12805948 -14248392 -12806728
5653 -12806728 -8684976 -3223664 2482481 7815487 10162498 9146220 8258629 8339975 7875578
5644 7875578 5941403 3045642 74435 -3238639 -6039147 -5287725 212016 8027662
5636 8027662 15686968 20196554 20883427 19948152 18127504 14480094 8028608 747203 -3093790
5627 -3093790 -2016999 558501 686365 -1723810 -3627628 -3427314 -1442351 694073 690162
5618 690162 -2297670 -5703133 -7557417 -9205793 -11145255 -12219492 -12433595 -11710915 -9926825
5609 -9926825 -8845890 -9488371 -10553618 -9829844 -6674998 -3502238 -1144392 2787040 9222971
5600 9222971 14948603 16439619 14271646 10793640 6679245 954417 -4496838 -6046366
5592f046366J830259L295388J985026j339825k259855n64923J144436L889568
5584A933708P117133O903395K561344k348783m724981m084484k410697j835870
5576C110765j080991K61420Q38880Q01303J74934r75234k306426k751021p07725
5567b634095J627663J307192k5445N46776J516159N1662o89074N37181J217882
5558C455901J236147J498798J294605j640728m661668n152580k992618L76542
5550f585601J407584J234956K871347M583531M244046K444444j05889j891093
5542H203325k831929k942258j034715Q98672N35140j854448m154028m941137n121317
5533a3242695l804813j214958J274945M162606O368490N955401M798996M767235
$$ plain form
5592 -6046366 -4216107 -920719 1064307 -275518 -2535373 -3100296 -1955860 1933708
5584 1933708 9050841 15954236 18515580 16166797 11441816 7357332 4946635 3110765
5576 3110765 2029774 2291194 3130074 3931377 4106311 3131077 824651 -1926370 -2634095
5567 -2634095 -1006432 300760 275315 822091 2338250 2389912 1700838 2238019 3455901
5558 3455901 4692048 6190846 7485451 5844723 1183055 -3969525 -6962143 -6585601
5550 -6585601 -5178017 -3943061 -1071714 3511817 7755863 10200307 10094418 8203325
5542 8203325 5371396 2429138 1394423 2293095 2828235 973787 -3180241 -8121378 -13242695
5533 -13242695 -17047508 -18262466 -16987521 -12824915 -6456425 -501024 4297972 9065207
5525I065207L137874j694217n793395n102414k01543L740883L456582K044348
5517H653325J053809j466232n031452n775368l435013j613895k04315J029240
5509f789901m99929k583557k102594j191868m6255K373147K972819O65801r80070
5500h182407O35769J672279R7007j105923j7723K300544L684303L255555L87432
5491B726836l808047o337528n811444l571689m04181K729304M186451M779694
5483e510604M903509L934079K517290J249389J007562P09945j96550p27474j206673
5474F680473j511086k670557n107024m863204p16991K272456K080923q78339m258383
5465h971732m850889l027816k038535j669470j121022q73696k87590K2970p77792
$$ plain form
5525 9065207 12203081 10508864 4715469 -386945 -588488 3152395 6608977 8653325
5517 8653325 9707134 8240902 3209450 -2565918 -6000931 -7614826 -7819141 -6789901
5509 -6789901 -7289830 -9873387 -11975981 -13167849 -13214104 -10840957 -7868138 -7202337 -8182407
5500 -8182407 -7546638 -5874359 -5777352 -6883275 -6900998 -4600454 -916151 2339404 2726836
5491 2726836 -1081211 -7418739 -13230183 -16801872 -17206053 -14476749 -10290298 -5510604
5483 -5510604 -607095 3326984 5844274 7093663 8101225 8811170 8614620 7887146 6680473
5474 6680473 5169387 2498830 -2608194 -7471398 -8188389 -5915933 -3835010 -4713349 -8971732
5465 -8971732 -13822621 -16850437 -18888972 -20558442 -21679464 -22553160 -22840750 -22817780 -23595572
5456b3595572j737268j518319k25872M97512J021145L490030N444585L545531
5448a3078228j37540j012275j27747p4506J258594M261647N863830O250262N386923
5439H590960L346130K432920J923421P72072M90667N71928r41101k682600k773678
5430A1730719j210728O53420K015525J997187J088126j197408l945121l888095
5422G243625j583228p41268j664829k036831o48016J903652L520080K894742O15357
5413I503284k094628n279506p053473n436076k572271q14491Q91115J496876K6469
5404a1332701j181709o80016L14456J73175p63497k93525K383500M926480N552652
5395i01185M703196L679294K790680Q08342j270327k631613l753853k970853N8220
$$ plain form
5456 -23595572 -25332840 -26851159 -27077031 -26579519 -25558374 -22068344 -16623759 -13078228
5448 -13078228 -13215768 -14228043 -14355790 -14430296 -13171702 -8910055 -3046225 3204037 8590960
5439 8590960 11937090 14370010 16293431 17065503 17556170 18128098 17186997 14504397 11730719
5430 11730719 10519991 11173411 13188936 15186123 16274249 15076841 11131720 7243625
5422 7243625 5660397 4919129 3254300 1217469 569453 2473105 5993185 8887927 9503284
5413 9503284 7408656 2129150 -4924323 -10360399 -12932670 -13747161 -12856046 -11359170 -11332701
5404 -11332701 -12514410 -13194426 -12879970 -12706795 -13470292 -13763817 -11380317 -6453837 -901185
5395 -901185 3802011 7481305 10271985 11080327 9810000 7178387 3424534 453681 511901
5386E11901J957502K325197K355007J641281P28033p24587k956217l155821l49726
5377B332570J394354k0489k010930k505466k583272l196252l882381k904935N69916
5368a2806885L101912K896353J519518m5288j235955q24947P31045J117265Q56967
5359d690015J425885J465478O90226Q75117K329835K158649l46747j973942j896318
5350C8168k076499k044827j955406j966252l62934K398608M676896N445080N763855
5341I916689N244676K546042j885887n650221o957675n356357k051138R6772K98787
5332c798312J363037M741928O955462N176789N98781l906224o524656o575280
5324a968475m070495j458494j551734k821274k428227q7399K237142K722924J905043
$$ plain form
5386 511901 2469403 4794600 7149607 8790888 9518921 8794334 5838117 2682296 2332570
5377 2332570 3726924 3706435 1695505 -809961 -3393233 -6589485 -10471866 -13376801 -12806885
5368 -12806885 -9704973 -6808620 -5289102 -5334390 -6570345 -7395292 -6664247 -5546982 -4690015
5359 -4690015 -3264130 -1798652 -1108426 -233309 2096526 4255175 3908428 1934486 38168
5350 38168 -2038331 -4083158 -6038564 -8004816 -8367750 -5969142 -1292246 4152834 9916689
5341 9916689 15161365 17707407 15821520 10171299 3213624 -2142733 -4193871 -4097099 -3798312
5332 -3798312 -2435275 2306653 9262115 14438904 15037685 11131461 4606805 -1968475
5324 -1968475 -6038970 -7497464 -9049198 -11870472 -14298699 -14386098 -12148956 -9426032 -7520989
5315g520989J642635K832856M513877N236822L306390P01162J73831O90732M20764
5306A1998080m89110j295459j048307K50540P84817j87487q57939j797847l607650
5297C749638n124901m739447l255222j641984n47126j400685l141080k796679
5289a8897486k35824K577093M569353M415944K682879K081077L162284M229174
5281D584494L016006N43464R80907K798139L123203K240634J421848J2810k358318
5272A6363187m145401l527313q67264K287228M234408K748185p34147k851172
5264A3507711l430830k761316r13982J237732K063376N67376k025767k811304
5256E432996q74965J108480J504733J962433K050987R74829N89172J349204J106869
$$ plain form
5315 -7520989 -5878354 -3045498 1468379 6705201 10011591 10712753 10886584 11577316 11998080
5306 11998080 11508970 10213511 9165204 9415744 10200561 10013074 9155135 7357288 3749638
5297 3749638 -1375263 -6114710 -9369932 -11011916 -11559042 -12959727 -16100807 -18897486
5289 -18897486 -19133310 -16556217 -11986864 -7570920 -4888041 -2806964 355320 4584494
5281 4584494 7600500 8143964 9124871 11923010 15046213 17286847 18708695 18721505 16363187
5272 16363187 12217786 8690473 7823209 10110437 14344845 17093030 16358883 13507711
5264 13507711 10076881 7315565 6401583 7639315 9702691 10270067 8244300 5432996
5256 5432996 4558031 5666511 7171244 9133677 11184664 12159493 12748665 14097869 15204738
5247A5204738p83079k586839k655174r28382K53368j299229l417899k667302J996113
5238C116315O882213P568065N027022J146899l081333n434952n777141n476600
5230C970488n017558l501245j863209j857581k364158j540508r50067j052065
5222a4175903Q37765L361581L167047J114436K17291Q23472K253271L905333N045778
5213F550071N531219M519362J986368J52960j294802l660431o123775p420863
5205B40109n677381k615982j506587r08866J755335M700435N898351N758389L932797
5196A1576600M33469k342029k689566j122025Q47243K821672K910316k89810k237914
5187I907956j747975j065214p98874p25921q10760j031701j200298k090954k157001
$$ plain form
5247 15204738 14421659 11834820 9179646 8251264 8504632 7205403 3787504 1120202 3116315
5238 3116315 9998528 17566593 22593615 23740514 20659181 15224229 9447088 3970488
5230 3970488 -1047070 -4548315 -6411524 -8269105 -10633263 -12173771 -13123838 -14175903
5222 -14175903 -13338138 -9976557 -6809510 -5695074 -5477783 -4654311 -2401040 1504293 6550071
5213 6550071 12081290 16600652 18587020 18739980 17445178 13784747 7660972 240109
5205 240109 -5437272 -8053254 -9559841 -10468707 -8713372 -4012937 1885414 7643803 11576600
5196 11576600 12010069 9668040 6978474 5856449 6703692 9525364 12435680 12145870 9907956
5187 9907956 8159981 7094767 6295893 5569972 4759212 3727511 2527213 436259 -1720742
5178a720742j304493j041159K46457J980181J483512j083897l494577m647230
5170i581948l030597Q49890M353036N534419M066369J297330j979489m396132
5162b887122m689082l141602j695559j884955l595751n102700n975032o826390
5154c5798193o850275l833103J360743N905204P075511M449358J670270J513132
5146b4507353K845275L282129K280193R10596L88732L43741m68868q25615m06915
5137a6158085j06093N73290O0619j349893m33403K150309L389850K310820L13753
5128i248833n35012j16395R45732J906097P77775j266355j515547j242904j899433
5119a2194875k923480l472547l858248m389586l229356k011135k164574k194465
$$ plain form
5178 -1720742 -3025235 -4066394 -3819937 -1839756 -356244 -1440141 -4934718 -9581948
5170 -9581948 -12612545 -11762655 -7409619 -1875200 2191169 3488499 1509010 -2887122
5162 -2887122 -7576204 -10717806 -12413365 -14298320 -17894071 -22996771 -28971803 -35798193
5154 -35798193 -42648468 -46481571 -45120828 -39215624 -32140113 -27690755 -26020485 -24507353
5146 -24507353 -21662078 -18379949 -16099756 -15189160 -14800428 -14456687 -14925555 -15751170 -16158085
5137 -16158085 -16264178 -15690888 -15630269 -16980162 -17413565 -15263256 -11873406 -9562586 -9248833
5128 -9248833 -9783845 -9900240 -8954508 -7048411 -6270636 -7536991 -9052538 -10295442 -12194875
5119 -12194875 -15118355 -18590902 -22449150 -26838736 -30068092 -32079227 -34243801 -36438266
5111c6438266j445071K60296K333254M487728N706682N277874M292386L820690
5103a1704427K942015R66562n35265j1791J332743J726724J587491L073616N947653
5094E325321O863602L735929j766388m928869m092578k277669j804159k147013
5086a091824j653384Q44984L261726K816099Q08696L86435J854094K399077J224164
5077A0850067L39312P00319J542199J398725r56970m304183n348251l054987j12541
5068A053690K031724L068876K977473J295849k025178m882415m468431l36350
5060a284762L568688L611921J611509J397822K754002L564755K884787K22288
5052A8331010k354612k811020j715759n01008n28798k108519l935483m985134
$$ plain form
5111 -36438266 -37883337 -37623041 -35289787 -30802059 -25095377 -19817503 -15525117 -11704427
5103 -11704427 -8762412 -7795850 -8331115 -8342906 -7010163 -5283439 -3695948 -622332 5325321
5094 5325321 12188923 15924852 14158464 9229595 5137017 2859348 1055189 -1091824
5086 -1091824 -2745208 -1900224 1361502 4177601 4986297 5372732 7226826 9625903 10850067
5077 10850067 11189379 11889698 13431897 14830622 13873652 9569469 4221218 1166231 1053690
5068 1053690 3085414 6154290 9131763 10427612 8402434 3520019 -948412 -1284762
5060 -1284762 2283926 5895847 7507356 8905178 11659180 15223935 18108722 18331010
5052 18331010 15976398 13165378 11449619 10948611 10419813 8311294 4375811 -609323
5044f09323n377003m132095j004243J137730K6433k494587m231218l574619m66083
5035b0725008K181721K647389M86684r49171J8337J372252K474101L561179L610462
5026e322054K122600n28711k149403j093938R1574n55294L5859J540489O50262
5017e208616r59077q10490k86584k78360L30446K105052L171410K620583K389472
5008C073836K938948L709961M951239M949041K526683l79140k277674k594306
5000A6898588k154900k413296k534628j025012Q74820L31890j340706j164470
4992G472286J0413J082632K083862Q14272k970546n989715n638172k816863j765444
4983g717275m118104o802964o148523l671597j234856J536168L767652M452054
$$ plain form
5044 -609323 -5986326 -10118421 -11122664 -9984934 -9958501 -12453088 -16684306 -20258925 -20725008
5035 -20725008 -18543287 -15895898 -15409214 -16358385 -16340048 -14967796 -12493695 -8932516 -5322054
5026 -5322054 -3199454 -3728165 -5877568 -6971506 -6879932 -7435226 -7399367 -5858878 -5208616
5017 -5208616 -6167693 -6978183 -7264767 -7543127 -7212681 -5107629 -1936219 684364 3073836
5008 3073836 6012784 9722745 14673984 19623025 22149708 21770568 19492894 16898588
5000 16898588 14743688 12330392 9795764 8770752 9645572 9977462 8636756 7472286
4992 7472286 7482699 8565331 10649193 11463465 8492919 2503204 -3134968 -5951831 -7717275
4983 -7717275 -11835379 -18638343 -24786866 -28458463 -29693319 -28157151 -24389499 -19937445
4975a9937445N055006O303994N982174M026851K119981O27864j465610j924848
4967G87967m395Q71847m1416j868718m777135o532658m767133k54542L764737
4958a2821446M396593K549044L05192j973850k495306l98288J434979J566501
4950g436581N71573l0821N77474J310390M07220j201110j398465k197414n425399
4941a4823133p174738n450125k354622K234381P253708R210133P121041L928601
4933e4754K172205J592195J62733j309864k039320j677100j77680r0946j339444
4924b761975j211213K88178J321231J470949N83599n34246j376131k014043l312538
4915g546189m483232m215281k115599J292628L094460K299092J650308K472295
$$ plain form
4975 -19937445 -14882439 -8578445 -2596271 1430580 3550561 4178425 2712815 787967
4967 787967 783572 1655419 1614003 -254715 -5031850 -11564508 -16331641 -16586183 -12821446
4958 -12821446 -8424853 -5875809 -5570617 -7544467 -10039773 -10438061 -9003082 -7436581
4950 -7436581 -6865008 -6895829 -6318355 -5007965 -4600745 -5801855 -7200320 -9397734 -14823133
4941 -14823133 -21997871 -27447996 -29802618 -27568237 -20314529 -11104396 -3983355 -54754
4933 -54754 2117451 3709646 3872379 2562515 523195 -1153905 -1331585 -1422531 -2761975
4924 -2761975 -3973188 -3685010 -2363779 -892830 -309231 -843477 -2219608 -4233651 -7546189
4915 -7546189 -12029421 -16244702 -18360301 -17067673 -13973213 -11674121 -10023813 -7551518
4907g551518K221925L59084p61681N82323K423174K535259K215110K331657K619656
4898F974989J547962j872358n871431o029531k543987j32364P96848J653118K801850
4889b674904L386688J813086j031579j535787K191295O299227O574132L248923
4881A8271081j276487m088094l666294j774164n26809j232599l369939m760208
4873b423513m493884l421845j296784J196223J989779P10148K6444J654836K327708
4864c730888n5384k106364j349139J079859L049835K162683j607683l458802j926964
4855g942847o4995J78284J65180J490163K009581O29793J25201J664519L626144
4846A881023N100549M547332J613101l84742j088594j590298j591758j610607
$$ plain form
4907 -7551518 -5329593 -4970509 -5732190 -5149867 -2726693 -191434 2023676 4355333 6974989
4898 6974989 8522951 6650593 779162 -5250369 -7794356 -7926720 -7129872 -5476754 -2674904
4889 -2674904 711784 2524870 1493291 -42496 2148799 8448026 15022158 18271081
4881 18271081 16994594 12906500 9240206 7466042 6939233 5706634 2336695 -2423513
4873 -2423513 -6917397 -10339242 -11636026 -10439803 -8450024 -7739876 -7713432 -6058596 -3730888
4864 -3730888 -3786272 -5892636 -7241775 -6161916 -3112081 -949398 -2557081 -6015883 -7942847
4855 -7942847 -8007842 -7829558 -7664378 -6174215 -4164634 -3534841 -3409640 -1745121 1881023
4846 1881023 6981572 11528904 13142005 12757263 11668669 10078371 8486613 6876006
4838F876006q03019m12175j634627k051704j385751n20051J496646M276907O986283
4829A2828515Q440602O963860J963689l588053o705716p024820o434977o282528
4821A60572n135677k469763Q06943K869982L555314K670375K22382r44040J856072
4812C592160N102608N163982L209362M10493k638627l684953k885777j382068
4804F887180o19539o68061q1107J505242K690232K219663J316690J549591L405902
4795A8205793M524302K699782O69614j466931n401367q121907q629146q498400
4787f018260q161680o856080l631291K470315O900715N121562J267607M35998
4779h471114K245493K745461J620377J513706K338203J944260R12181p94372l505419
$$ plain form
4838 6876006 6072987 5660812 4026185 1974481 588730 68679 1565325 5842232 12828515
4829 12828515 21269117 28232977 30196666 26608613 19902897 12878077 6443100 160572
4821 160572 -4975105 -7444868 -6637925 -3767943 -212629 2457746 2680128 1736088 3592160
4812 3592160 8694768 13858750 17068112 17478605 14839978 11155025 8269248 6887180
4804 6887180 6267641 5599580 5518473 7023715 9713947 11933610 13250300 14799891 18205793
4795 18205793 22730095 25429877 26099491 24632560 19231193 11109286 2480140 -6018260
4787 -6018260 -14179940 -21036020 -24667311 -22196996 -15296281 -10174719 -8907112 -8471114
4779 -8471114 -6225621 -3480160 -1859783 -346077 1992126 3936386 4848567 4054195 548776
4770E48776l490065o3432M318848O611277O802892N718146K820666P23993K47877
4761B4238978L01858K6355j114877k558429m216338n498327m316075j471883L02399
4752E693661m63040j895173k547495k487723k111515k334045k706391m082450
4744a2934171l867010N70814N169293O143578M544423K834676N69422k773254
4736B57771n195514l926794N36106L679324L229115K209519K492753J549162l65039
4727D466403j712158j524892N87335J515372K64773j171833k977744l818995j693186
4718f064925J051409J416623J60405N33211J759376J846291R74280l78041m38522
4709H60107n37569k545880m563030l688557k71922K744460L217728K607745J802492
$$ plain form
4770 548776 -2941289 -3004721 1314127 7925404 14728296 20446442 23267108 23991101 24238978
4761 24238978 24540836 24567191 23452314 20893885 16677547 11179220 6863145 5391262 5693661
4752 5693661 5230621 3335448 787953 -1699770 -3811285 -6145330 -8851721 -12934171
4744 -12934171 -16801181 -16230367 -11061074 -4917496 -373073 2461603 3031025 257771
4736 257771 -4937743 -8864537 -8328431 -4649107 -1419992 789527 3282280 4831442 4466403
4727 4466403 2754245 1229353 1816688 3332060 3596833 2425000 -552744 -4371739 -6064925
4718 -6064925 -5013516 -3596893 -3436488 -2903277 -1143901 702390 1676670 1298629 860107
4709 860107 322538 -2223342 -6786372 -10474929 -10746851 -8002391 -4784663 -2176918 -374426
4700c74426R32737J271865K094927K131883K009096J061075j375688l199228k897251
4691A654990j295669j057991m191446n980360k841596J540600L687776L190687
4683e293009K117368J300910k98137k243076l019602k221041q2145K463064L965058
4674c310610M896648M584359K605035O55614n78568l33764O3660r51275k052352
4665E578747k019155j299759j025271j12321J707265K222941J326744O21377J501889
4656H502457L852411M448243K737743Q07111j006030k994090m525801m881448
4648F940596l668554k127264k272810k185692r99888p75675j923905l054615j833280
4639a1901087J031568L727795M830656L728887L318583M752812N981001N223937
$$ plain form
4700 -374426 558311 1830176 3925103 6056986 8066082 9127157 7751469 4552241 1654990
4691 1654990 359321 -698670 -4890116 -10870476 -13712072 -12171472 -8483696 -5293009
4683 -5293009 -3175641 -1874731 -2172868 -4415944 -7435546 -9656587 -9738732 -7275668 -3310610
4674 -3310610 1586038 6170397 8775432 9431046 8852478 8518714 8582374 7631099 5578747
4665 5578747 3559592 2259833 1234562 1122241 2829506 5052447 6379191 7000568 8502457
4656 8502457 12354868 16803111 19540854 20347965 19341935 16347845 11822044 6940596
4648 6940596 3272042 1144778 -1128032 -3313724 -4313612 -5089287 -7013192 -10067807 -11901087
4639 -11901087 -10869519 -7141724 -2311068 1417819 4736402 9489214 15470215 20694152
4631B0694152K334953K95347J083426K969021L348796J819258q61107l926520
4623B7757326n875006n475897l019202o45386r26118k676654j734379K386049
4615I790733N546446M146505L90819j696967l023791l942871k703709j594606
4607F912559k102993j211561Q62722J268973p73592k646851k208451j962575l383791
4598e245560l956803k144154Q8749Q97467K57260j070709j570151n95943K331379
4589a1008465O608308Q090368M847545L79864k415869k595724j71730J961957
4581E696254J572930J1857l69475K46572O2738j617367l705503l996149j770970
4572c869113J240718K557318K094540P97141O61316L253680N050537L350475q36768
$$ plain form
4631 20694152 23029105 23324452 24407878 27376899 30725695 32544953 31683846 27757326
4623 27757326 21882320 16406423 13387221 12741835 11815717 9139063 7404684 9790733
4615 9790733 15337179 19483684 19874503 18177536 15153745 11210874 8507165 6912559
4607 6912559 4809566 3598005 4460727 5729700 4956108 2309257 100806 -1861769 -5245560
4598 -5245560 -9202363 -11346517 -11257768 -10360301 -10103041 -11173750 -12743901 -13339844 -11008465
4589 -11008465 -4400157 3690211 8537756 8917620 6501751 3906027 3734297 5696254
4581 5696254 7269184 7281041 6911566 7158138 7220876 5603509 1898006 -2098143 -3869113
4572 -3869113 -2628395 -71077 2023463 2820604 3481920 6735600 11786137 15136612 14299844
4563A4299844m101202m544741l589819l957482m616374k074093K199238N045579
4555a339050M949985L643478L871064L453142J170036q63957k392438m213995
4547H278265m009285j661434o18362k326304m119820m028183k687918j574596
4539a2747637r82659n62157p92358o29985K33786Q41270K265444M650682N637026
4530b086588M526605K697940R12916k86997N7429J942769L087876K004967J38059
4521A2994976k302250m859110n226662k389622J549816M087495L818036J719046
4513I391725j27570n34353p27910j685864j364921K53987O84687N68372J160831
4504G618984R98667O09793O45845q0225j531714l323522m196854m051432l729562
$$ plain form
4563 14299844 10198642 5653901 2064082 -1893400 -6509774 -8583867 -6384629 -1339050
4555 -1339050 3610935 7254413 11125477 14578619 15748655 14884698 12492260 8278265
4547 8278265 4268980 2607546 1989184 -337120 -4456940 -8485123 -11173041 -12747637
4539 -12747637 -13730296 -14292453 -15084811 -15714796 -15481010 -14639740 -12374296 -7723614 -2086588
4530 -2086588 2440017 5137957 6050873 5763876 5821305 7764074 10851950 12856917 12994976
4521 12994976 10692726 5833616 606954 -1782668 -232852 3854643 7672679 9391725
4513 9391725 9264155 8729802 8001892 6316028 4951107 5205094 5889781 6458153 7618984
4504 7618984 8617651 9227444 9873289 9793064 8261350 4937828 740974 -3310458 -7040020
4495g040020k787932q94750J903312K749704O62028n214J152170J788417J307570
4486a164715O80237J035035K75800k223239m330829m338747j874217R41836J678902
4477i319937R93615J71180m63804M43613K038552J401009p74748j820405L706
4468g327219K243657K408023K439145K541827J452186j462501k666343j2740K189674
4459A805709P12064k507826l353668o55906K714126L541719K908536J400149k25055
4450F339848p5319L69348k96724j769724k790160l690691m603551m685553l414257
4441a4616783j501409o9129M24056M82804Q91558J201487J040770l64457j432935
4432a3944038j110643m16764M36312J324117J990935K074438J836886Q98846m54125
$$ plain form
4495 -7040020 -9827952 -10722702 -8819390 -6069686 -5407658 -5412872 -4260702 -2472285 -1164715
4486 -1164715 -484478 550557 826357 -1396882 -5727711 -10066458 -11940675 -10998839 -9319937
4477 -9319937 -8326322 -8155142 -8618946 -8175333 -6136781 -4735772 -5510520 -7330925 -7327219
4468 -7327219 -5083562 -2675539 -236394 2305433 3757619 2295118 -371225 -383965 1805709
4459 1805709 2517773 9947 -3343721 -3999627 -1285501 2256218 5164754 6564903 6339848
4450 6339848 6264529 6633877 6337153 4567429 1777269 -1913422 -6516973 -11202526 -14616783
4441 -14616783 -16118192 -16187321 -15763265 -15280461 -14388903 -13187416 -12146646 -12511103 -13944038
4432 -13944038 -15054681 -15471445 -15035133 -13711016 -11720081 -9645643 -7808757 -6909911 -7364036
4423g364036j482885l100559l989654l095743k460173k138466m93943J175262
4415b2950197O26230j97711K32786J514829K469729K207162J278796J061555L435154
4406a0321667N620241N175895L499957K376302J077126j518126m274221o223702
4398d588195n534536k869275j803091j873185k034317j497622O70284K632473
4390a6897464K330586J190393L37878k22136M29252K34876j821121k054685L79677
4381a6092744K376129K475575K227519J831898R32465P09550J059690Q20898J291478
4372b367542K084851J331106O1821j410309k603967j124277K278022L404331J872732
4363C526768R92192P48772L36159L50228L69235m48299r46112r46754n84931l06967
$$ plain form
4423 -7364036 -8846921 -11947480 -15937134 -19032877 -21493050 -23631516 -24125459 -22950197
4415 -22950197 -22323967 -22521678 -22288892 -20774063 -18304334 -16097172 -14818376 -13756821 -10321667
4406 -10321667 -4701426 474469 3974426 6350728 7427854 5909728 1635507 -4588195
4398 -4588195 -10122731 -12992006 -14795097 -16668282 -18702599 -20200221 -19529937 -16897464
4390 -16897464 -14566878 -13376485 -13038607 -13260743 -12831491 -12596615 -14417736 -16472421 -16092744
4381 -16092744 -13716615 -11241040 -9013521 -7181623 -6249158 -5539608 -4479918 -3659020 -2367542
4372 -2367542 -282691 1048415 1110236 -300073 -2904040 -4028317 -1750295 1654036 3526768
4363 3526768 4518960 5267732 5603891 5954119 6323354 5875055 4928943 3982189 3397258 3090291
4353C090291m18052J541191M945909N042739J612832j775732m137587m588208
4345E313383k645133q83700j632736k345494m38606L488706O745945O244711J895614
4336A5742690m016255p764461q210051o751140m909302m130088l818656j610652
4328b5467915K536293N601948O094286M303996K097719N25591k8852L73057J275022
4319b688855M26152k090816k162851K50184J522695J122202N77580N70283J196393
4310a277033N86869j836325k934172j414806J336394L053746L417426K831574
4302C763673K170359K038312J925794Q82527k53017q41737k257422m725230o045997
4293c342738n561235l072487j87512K45319q98280p73285L98730O10774P34489
$$ plain form
4353 3090291 2672239 4213430 9159339 14202078 15814910 14039178 9901591 5313383
4345 5313383 2668250 1784550 151814 -2193680 -2632286 856420 7602365 13847076 15742690
4336 15742690 11726435 3961974 -4248077 -10999217 -15908519 -20038607 -23857263 -25467915
4328 -25467915 -22931622 -17329674 -11235388 -6931392 -4833673 -4308082 -4336934 -3963877 -2688855
4319 -2688855 -2262703 -4353519 -6516370 -6266186 -4743491 -3621289 -3043709 -2473426 -1277033
4310 -1277033 -690164 -2526489 -5460661 -6875467 -5539073 -2485327 932099 3763673
4302 3763673 5934032 7972344 9898138 10780665 10527648 9685911 7428489 2703259 -3342738
4293 -3342738 -8903973 -11976460 -12163972 -11918653 -12816933 -13590218 -13191488 -12580714 -11846225
4284a1846225K713634N844218P313705O113178K419489p40096l85689J390847
4276A2823061J285107p96644j310015q4291L2947m35482j075345k287482j825855
4267F326001l46925j58715j185982k772044l383952k177111k89741J059752K533505
4258c95212M111490M202299K814987J90360m53560K421252M359615K148475j813712
4249A7585994l023622j516871p85565k564648n175540n085612j447630K168276
4241A54782L451665J778926j968788m050009k789627j123355r11729j653203j487517
4232h598855P53511M490120P204196O918475M619299J869517k96247q78437j087640
4223A4993939j711959j884865k347375l004469k319531j711470l024161l991350
$$ plain form
4284 -11846225 -9132591 -3288373 4025332 10138510 12557999 11817903 11432214 12823061
4276 12823061 14108168 13311524 12001509 11917218 11950165 11514683 10439338 8151856 6326001
4267 6326001 5979076 5820361 4634379 1862335 -1521617 -3698728 -3988469 -2928717 -395212
4258 -395212 3716278 7918577 10733564 10923924 10470364 12891616 17251231 19399706 17585994
4249 17585994 14562372 13045501 12259936 9695288 4519748 -565864 -2013494 154782
4241 154782 3606447 5385373 3416585 -633424 -3423051 -4546406 -5458135 -7111338 -8598855
4232 -8598855 -7845344 -3355224 3848972 10767447 15386746 17256263 16960016 16081579 14993939
4223 14993939 13281980 11397115 9049740 6045271 3725740 2014270 -1009891 -5001241
4215e001241l131946n82792K722588L988889K804411Q97405q16861j516747j448455
4206b084749o86932j53963j017794j394207m58955J705509L604042L287344J750694
4197D550989K84474j770571l401408l004703j795999q89674J014856L529612N378408
4188C895984N162994K588399J71289k2315n60386k737586l754986k588534n54600
4179A600259R40518J378805R95630n20262j259234J14518J308771L71316j190687
4170C739634j933859j338143N25679J666063P45072k22852k004978n165656o054847
4161a0043887l254259J294363L645506L004634J275357n88538j734038k138302
4153h539164k438699j179884J301966L334296K960776j93041l642453l830397
$$ plain form
4215 -5001241 -8133187 -8715979 -5993391 -2004502 799909 1697314 880453 -636294 -2084749
4206 -2084749 -2771681 -2925644 -3943438 -5337645 -5796600 -4091091 -487049 2800295 4550989
4197 4550989 4835463 3064892 -336516 -3341219 -5137218 -6026892 -5012036 -1482424 3895984
4188 3895984 9058978 11647377 11818666 11796351 11235965 8498379 4743393 2154859 1600259
4179 1600259 2540777 3919582 4915212 4394950 3135716 3250234 4559005 4930321 3739634
4170 3739634 1805775 467632 993311 2659374 3404446 3181594 1176616 -3989040 -10043887
4161 -10043887 -13298146 -12003783 -8358277 -5353643 -4078286 -4666824 -6400862 -8539164
4153 -8539164 -10977863 -12157747 -10855781 -7521485 -4560709 -4753750 -8396203 -12226600
4145a2226600r23460R06608k24545j591861j080510J4317J84122j104606k989777
4136a9036312m390449m265214k158941l71708j244162k175458n70608Q27580J166053
4127c2219219J473867J258048N13692L91945J16238q58448j973440k136719O0836
4118c3373200L749343P148521P593363M557451J119728r94328l005405l114902
4110a6319429M15589M825814P092730O298491M396283L340046K741711Q24339
4102A3615574j294968j012717N89988R35759O43806O26097r89660l064192k262673
4093G787014J73978J643529J398419j57432k766508n022579l684016P69895L902217
4084D044517L323758M22508l590934o693330n926815j861303J598515J319384
$$ plain form
4145 -12226600 -13150060 -12243452 -12467997 -14059858 -15140368 -15126051 -14941929 -16046535 -19036312
4136 -19036312 -23426761 -27691975 -29850916 -30222624 -31466786 -33642244 -34212852 -33385272 -32219219
4127 -32219219 -30745352 -29487304 -28973612 -28581667 -28465429 -29323877 -31297317 -33434036 -33373200
4118 -33373200 -29623857 -22475336 -14881973 -10324522 -9204794 -10199122 -13204527 -16319429
4110 -16319429 -15903840 -11078026 -3985296 2313195 6709478 10049524 12791235 13615574
4102 13615574 12320606 11307889 11897877 12833636 13477442 14103539 13113879 10049687 7787014
4093 7787014 7960992 9604521 11002940 10845508 8079000 3056421 -627595 142300 4044517
4084 4044517 7368275 7790783 4199849 -2493481 -8420296 -10281599 -8683084 -7363700
4076g363700j588296l868310l195307j0792K549373L095778K298760J144699J042581
4067e895214K377002M390480N426713M935940M273918L308772J393344j113758
4059A9097197l877287m134706j746804n24058j277150j597048q87314k83497N92141
4050E361474N79400r78211j612270j422462j549512j128738q35362Q46066L376398
4041B636783L774263K957819K009556P62237j06974n82274J25969K090220L315057
4032A6982656K019019J8762k52032j91879m2253k82373j995424k709721j684856
4023A1861899j153091p16580m73019j521689k451840k519731k930094k170384
4015b074529J072540L392155K918291R41177q57507m86220J180135J347998m77038
$$ plain form
4076 -7363700 -8951996 -12820306 -16015613 -16026405 -13477032 -10381254 -8082494 -6937795 -5895214
4067 -5895214 -3518212 872268 6298981 11234921 15508839 18817611 20210955 19097197
4059 19097197 15219910 11085204 9338400 8814342 7537192 5940144 5052830 4769333 5361474
4050 5361474 5940874 4962663 3350393 1927931 378419 -750319 -1585681 -739615 2636783
4041 2636783 6411046 9368865 11378421 12140658 12033684 11451410 11577379 13667599 16982656
4032 16982656 19001675 19020437 18768405 18576526 18534273 18251900 16256476 13546755 11861899
4023 11861899 10708808 9992228 9519209 7997520 5545680 3025949 95855 -2074529
4015 -2074529 -1001989 2390166 5308457 6249634 5392127 4905907 6086042 7434040 6957002
4006F957002k859469m539835o160292o229770l478562J288095N331462N971428
3998c719941M728403K868716N15340J92224J889478L989871M977291K199222k851646
3989A4788958n325396m295953k878572l477026m438735l836570k831558j563157
3981a3858009L81156K449120K372262J47800j516336r14915J899704M912316N837334
3972A710432M440491K403075k3047k674605l209697j168180J017670J572887L16533
3963D385559j681466k385461j680074p02846n24742r70480j191209o5146K486241
3954b329624M639363N240855L711347O06536k630500m222351m366276m925403
3946d276053o037214o294196m283132N9476L255404K248260M07911o50385j477373
$$ plain form
4006 6957002 4097533 -442302 -6602594 -12832364 -16310926 -15022831 -9691369 -3719941
3998 -3719941 1008462 3877178 4392518 4584742 6474220 10464091 15441382 17640604 14788958
3989 14788958 9463562 5167609 2289037 -1187989 -5626724 -9463294 -12294852 -13858009
3981 -13858009 -13476853 -11027733 -8655471 -8507671 -10024007 -10938922 -9039218 -4126902 1710432
3972 1710432 6150923 8553998 8530951 5856346 2646649 1478469 2496139 4069026 4385559
3963 4385559 2704093 318632 -1361442 -2064288 -2589030 -3559510 -4750719 -4815865 -2329624
3954 -2329624 2309739 7550594 11261941 11868477 9237977 5015626 649350 -4276053
3946 -4276053 -10313267 -16607463 -20890595 -20831119 -17575715 -15327455 -14919544 -15569929 -17047302
3937a7047302m39093K111911M183089M709058L213260J527931J321581J547760
3929A128195K368995M097822M400481K040920j719763n105762n451912k263456
3921e04480Q87982M27305k522357m185686l231344j029007P88711J426274J95035
3912g747567j555183j674735L61102L076257N198787O314575M583444j20916l512886
3903D922878l025482m82760J062754Q72901J136755P42040k157860n161630n819236
3894g909640n267771m515482j412687K638968M670292N041541M149414J911906
3886f93459j223366k464827m19496K442070L717449M388030L978116J707386r31970
3877A0499933l466692o052239p952376p817527m431072O66211L931168M041239
$$ plain form
3937 -17047302 -17486395 -15374484 -11191395 -6482337 -3269077 -1741146 -419565 1128195
3929 1128195 3497190 7595012 11995493 14036413 12316650 7210888 1758976 -504480
3921 -504480 383502 810807 -1711550 -5897236 -9128580 -10157587 -9368876 -7942602 -7747567
3912 -7747567 -9302750 -10977485 -10616383 -7540126 -2341339 3973236 8556680 8435764 4922878
3903 4922878 1897396 1414636 2477390 3350291 4487046 5229086 3071226 -2090404 -7909640
3894 -7909640 -13177411 -17692893 -19105580 -16466612 -11796320 -6754779 -2605365 -693459
3886 -693459 -1916825 -4381652 -4801148 -2359078 1358371 5746401 9724517 11431903 10499933
3877 10499933 7033241 981002 -6971374 -14788901 -19219973 -18553762 -14622594 -10581355
3869a0581355K573353m4343j945267p58408J395175K719152L510134L708887J036474
3860A613802k458877l410065k836187k942377k758215j728033q35907j06549K85677
3851a5176731J152303K271124K842294M328001O915361R652425J0596976P574488
3843C0156241K670567j345518n530387p343577n725052m470833m073591l357974
3835I79876k988570k580199j154824P14815P04964j543549l881375m345440j857564
3826a5951866K609575O035500O250802M547713K265827O19436Q8369l32519j545116
3817D587721k473242j880692j124037j608014k010095p93582J88087j522897l181246
$$ plain form
3869 -10581355 -8008002 -8052345 -9997612 -10756020 -9360845 -6641693 -3131559 577328 1613802
3860 1613802 -845075 -4255140 -7091327 -10033704 -12791919 -14519952 -15355859 -15462408 -15176731
3851 -15176731 -14024428 -11753304 -8911010 -4583009 2332352 11984777 22581753 30156241
3843 30156241 32826808 31481290 25950903 18607326 12882274 8411441 4337850 979876
3835 979876 -2008694 -4588893 -5743717 -5028902 -4323938 -5867487 -9748862 -14094302 -15951866
3826 -15951866 -13342291 -7306791 -1055989 3491724 5757551 6376987 6465356 6132837 4587721
3817 4587721 2114479 233787 -890250 -2498264 -4508359 -5301941 -5113854 -6636751 -9817997
$$ [...]
##END NTUPLES=NMR SPECTRUM
##END=
