##TITLE=C13_LR-726-CR4-H5
 CD3CN, 2600 sc

 30.5.2022
##JCAMPDX= 6.0         $$ Bruker NMR JCAMP-DX V2.0
##DATA TYPE= NMR SPECTRUM
##DATA CLASS= NTUPLES
##ORIGIN= UXNMR, Bruker Analytische Messtechnik GmbH
##OWNER= root
$$ XWIN-NMR		Version 3.5
$$ Mon May 30 16:37:41 2022 Russian Standard Time (UT+4h)  she@DPX200
##.OBSERVE FREQUENCY= 50.327896
##.OBSERVE NUCLEUS= ^13C
##.ACQUISITION MODE= SIMULTANEOUS
##.ACQUISITION SCHEME= undefined
##.AVERAGES= 2601
##.DIGITISER RES= 17
##SPECTROMETER/DATA SYSTEM= spect
##.PULSE SEQUENCE= zgpg30
##.SOLVENT NAME= CDCl3
##.SHIFT REFERENCE= (INTERNAL, CDCl3, 0, 222.653)
##AUDIT TRAIL= $$ (NUMBER, WHEN, WHO, WHERE, WHAT)
$$ ##TITLE= Audit trail, XWIN-NMR		Version 3.5
$$ ##JCAMPDX= 5.01
$$ ##ORIGIN= Bruker BioSpin GmbH
$$ ##OWNER= she
$$ F:/spectra/data/she/nmr/c13/1/pdata/1/auditp.txt
$$ ##AUDIT TRAIL=  $$ (NUMBER, WHEN, WHO, WHERE, WHAT)
(   1,<2022-05-30 16:35:39.31 +0400>,<she>,<DPX200>,
      <created by zg, POWCHK disabled, PULCHK disabled
       terminated by command 'halt'
       configuration hash MD5:
       00 E9 B6 7A A2 85 ED C7 34 08 36 98 17 FE 4E 26
       data hash MD5: 32K
       C4 A1 F4 3A CF 02 D6 D5 9A 7F BD B7 C4 1A CB 84>)
(   2,<2022-05-30 16:35:43.70 +0400>,<she>,<DPX200>,
      <Start of raw data processing
       efp BC_mod = 2 LB = 1 FT_mod = 6 PKNL = 1 PHC0 = -369.096 PHC1 = 29.16232 SI = 32K 
       data hash MD5: 32K
       23 FE DC 59 4E 18 B0 5E 82 93 A1 DA 34 2E 59 80>)
(   3,<2022-05-30 16:35:46.53 +0400>,<she>,<DPX200>,
      <abs ABSG = 5 
       data hash MD5: 32K
       0B 16 27 58 94 8C 0E BE 90 D6 9D E0 9B 09 5B 84>)
(   4,<2022-05-30 16:36:15.85 +0400>,<she>,<DPX200>,
      <pk PHC0 = 1.967885 PHC1 = -0.8 
       data hash MD5: 32K
       08 6F D1 04 05 D4 85 B2 B1 C8 FB F2 3A 87 97 51>)
$$ ##END=
$$ 
$$ hash MD5
$$ F3 F9 E7 63 AB 70 CA 27 85 F0 BE A5 9A A8 F7 4D
##$RELAX= 
##$RELAX= 
##$RELAX= 
##$RELAX= 
##$RELAX= 
##$RELAX= 
##$RELAX= 
##$RELAX= 
$$ Bruker specific parameters
$$ --------------------------
##$DU= <F:/spectra>
##$EXPNO= 1
##$NAME= <c13>
##$PROCNO= 1
##$TYPE= <nmr>
##$USER= <she>
##$AMP= (0..31)
100 100 100 100 100 100 100 100 100 100 100 100 100 100 100 100 100 100 
100 100 100 100 100 100 100 100 100 100 100 100 100 100 
##$AQSEQ= 0
##$AQ_mod= 1
##$AUNM= <au_zg>
##$AUTOPOS= <>
##$BF1= 50.322709
##$BF2= 200.13
##$BF3= 50.322709
##$BF4= 500.13
##$BF5= 500.13
##$BF6= 500.13
##$BF7= 500.13
##$BF8= 500.13
##$BYTORDA= 1
##$CFDGTYP= 0
##$CFRGTYP= 5
##$CHEMSTR= <none>
##$CNST= (0..31)
1 1 145 1 1 1 1 1 1 1 1 1 1 1 1 1 1 1 1 1 1 1 1 1 1 1 1 1 1 1 1 1 
##$CPDPRG= <waltz16>
##$CPDPRG1= <>
##$CPDPRG2= <waltz16>
##$CPDPRG3= <>
##$CPDPRG4= <mlev>
##$CPDPRG5= <mlev>
##$CPDPRG6= <mlev>
##$CPDPRG7= <mlev>
##$CPDPRG8= <mlev>
##$CPDPRGB= <>
##$CPDPRGT= <>
##$D= (0..31)
0 2 0.00345 0 0 0 0 0 0 0 0 0.03 2e-05 3e-06 0 0 0 0 0 0 0 0 0 0 0 0 0 
0 0 0 0 0 
##$DATE= 1653905316
##$DBL= (0..7)
120 120 120 120 120 120 120 120 
##$DBP= (0..7)
150 150 150 150 150 150 150 150 
$$ [...]
##$SUBNAM4= <"">
##$SUBNAM5= <"">
##$SUBNAM6= <"">
##$SUBNAM7= <"">
##$SUBNAM8= <"">
##$SUBNAM9= <"">
##$SW= 239.972175391363
##$SWIBOX= (0..15)
0 1 3 0 0 0 0 0 0 0 0 0 0 0 0 0 
##$SW_h= 12077.2946859903
##$TD= 32768
##$TD0= 1
##$TE= 0
##$TE2= 300
##$TE3= 300
##$TEG= 300
##$TL= (0..7)
120 120 120 120 120 120 120 120 
##$TP= (0..7)
150 150 150 150 150 150 150 150 
##$TP07= 0
##$TPNAME0= <>
##$TPNAME1= <>
##$TPNAME2= <>
##$TPNAME3= <>
##$TPNAME4= <>
##$TPNAME5= <>
##$TPNAME6= <>
##$TPNAME7= <>
##$TPOAL= (0..7)
0.5 0.5 0.5 0.5 0.5 0.5 0.5 0.5 
##$TPOFFS= (0..7)
0 0 0 0 0 0 0 0 
##$TUNHIN= 0
##$TUNHOUT= 0
##$TUNXOUT= 0
##$USERA1= <user>
##$USERA2= <user>
##$USERA3= <user>
##$USERA4= <user>
##$USERA5= <user>
##$V9= 5
##$VALIST= <valist>
##$VCLIST= <CCCCCCCCCCCCCCC>
##$VD= 0
##$VDLIST= <DDDDDDDDDDDDDDD>
##$VPLIST= <PPPPPPPPPPPPPPP>
##$VTLIST= <TTTTTTTTTTTTTTT>
##$WBST= 1024
##$WBSW= 4
##$XGAIN= (0..3)
0 0 0 0 
##$XL= 0
##$YL= 0
##$YMAX_a= 16995747
##$YMIN_a= -11479591
##$ZGOPTNS= <>
##$ZL1= 120
##$ZL2= 120
##$ZL3= 120
##$ZL4= 120
##$ABSF1= 222.6533
##$ABSF2= -17.34351
##$ABSG= 5
##$ABSL= 3
##$ALPHA= 0
##$AQORDER= 0
##$ASSFAC= 0
##$ASSFACI= 0
##$ASSFACX= 0
##$ASSWID= 0
##$AUNMP= <proc_1d>
##$AZFE= 0.1
##$AZFW= 0.5
##$BCFW= 0
##$BC_mod= 2
##$BYTORDP= 0
##$COROFFS= 0
##$CY= -3
##$DATMOD= 1
##$DC= 0
##$DFILT= <>
##$DTYPP= 0
##$F1P= 0
##$F2P= 0
##$FCOR= 0.5
##$FTSIZE= 32768
##$FT_mod= 6
##$GAMMA= 0
##$GB= 0
##$INTBC= 1
##$INTSCL= 4.134877e-10
##$ISEN= 128
##$LB= 1
##$LEV0= 0
##$LPBIN= 0
##$MAXI= 10000
##$MC2= 0
##$MEAN= 0
##$ME_mod= 0
##$MI= 0.1934396
##$NCOEF= 0
##$NC_proc= 1
##$NLEV= 6
##$NOISF1= 120.0001
##$NOISF2= 80.00006
##$NSP= 0
##$NTH_PI= 0
##$NZP= 0
##$OFFSET= 222.6533
##$PC= 1.4
##$PHC0= -367.1281
##$PHC1= 28.36232
##$PH_mod= 1
##$PKNL= yes
##$PPARMOD= 0
##$PSCAL= 0
##$PSIGN= 0
##$REVERSE= no
##$SF= 50.3227301270918
##$SI= 32768
##$SIGF1= 140
##$SIGF2= 120
##$SINO= 11.81781
##$SIOLD= 32768
##$SREGLST= <13C.CDCl3>
##$SSB= 0
##$STSI= 32768
##$STSR= 0
##$SW_p= 12077.2946859903
##$SYMM= 0
##$S_DEV= 0
##$TDeff= 32768
##$TDoff= 0
##$TI= <>
##$TILT= no
##$TM1= 0
##$TM2= 0
##$TOPLEV= 0
##$USERP1= <user>
##$USERP2= <user>
##$USERP3= <user>
##$USERP4= <user>
##$USERP5= <user>
##$WDW= 1
##$XDIM= 32768
##$YMAX_p= 360117916
##$YMIN_p= -1765847
$$ End of Bruker specific parameters
$$ ---------------------------------
##NTUPLES= NMR SPECTRUM
##VAR_NAME=  FREQUENCY,     SPECTRUM/REAL,   SPECTRUM/IMAG
##SYMBOL=    X,             R,               I
##VAR_TYPE=  INDEPENDENT,   DEPENDENT,       DEPENDENT
##VAR_FORM=  AFFN,          ASDF,            ASDF
##VAR_DIM=   32768,         32768,           32768
##UNITS=     HZ,            ARBITRARY UNITS, ARBITRARY UNITS
##FACTOR=    0.368581032318806, 1,           1
##FIRST=     11204.5221821229, 0,            0
##LAST=      -872.77250386736, 0,            0
##MIN=       -872.77250386736, -1765847,     0
##MAX=       11204.5221821229, 360117916,    0
$$ Real data points
##PAGE= N=1
##DATA TABLE= (X++(R..R)), XYDATA
$$ [...]
7747 412316 217621 212828 367108 488142 378825 268209 257555 275142 492909 588183 720838
7736 720838 741094 544767 520462 380873 556169 941589 1303358 1468802 1290978 1176228
7726 1176228 1010110 741467 797408 829528 396196 46420 240379 376333 440623 479281
7716 479281 364796 322403 705019 1182498 1605185 1834494 1661417 1586271 1573649 1789019
7706 1789019 1772060 1609578 1978248 2249323 2160136 2055064 1998463 1937759 1651893 1576329
7696 1576329 1913522 2024257 2214593 2367415 2591876 2858455 2991709 3031518 2810467 2820403
7686 2820403 3043457 3178044 3170648 3353824 3632192 3696407 3868221 3979330 3611612 3154889
7676 3154889 3083779 3316038 3329839 3120860 2917003 2912431 2801453 2591217 2984371 3362693
7666 3362693 3284956 2804338 2174032 2009586 2074396 2021186 1738351 1336428 1107904 1250411
7656 1250411 1506119 1450620 1341088 1287512 1680748 2158903 2216087 2145427 1890432 1610631
7646 1610631 1391883 1027412 557130 395164 263807 214160 418506 603141 646936 697791
7636 697791 828038 832267 706203 625645 379582 278261 657759 706160 390861 125338
7626 125338 -214537 -418397 -586774 -597437 -755614 -763224 -459332 -354657 -346534 -22239 465516
7615 465516 800697 856492 920437 1116050 1176346 1265025 1284314 1240104 961665 865341 972943
7604 972943 743473 322188 46877 56231 269557 375650 203001 93966 101401 273004
7594 273004 387998 306951 286316 363737 442517 348377 -16276 4459 252952 344082 303876
7583 303876 178125 90822 17662 -137540 -85740 52230 193556 255641 454536 615867
7573 615867 532427 292274 232372 567588 624483 271399 47765 141988 87036 -81157 155560
7562 155560 519355 709736 476080 12951 -262486 -224859 -301573 -360415 -212438 -116930
7552 -116930 -18976 -29451 -295230 -538807 -462955 -434802 -163924 -124626 -230858 -238662 -219432
7541 -219432 -12097 348564 680054 581222 221613 151688 275677 258046 85935 -12634
7531 -12634 -30937 -142236 -279063 -422232 -499084 -466486 -303067 153640 499342 628305
7521 628305 409156 290317 403643 499926 224365 31923 -16167 -46691 -69228 -155197 -449025
7510 -449025 -500704 -490816 -285533 -153441 -275404 -244684 -183875 82853 227151 -42579 -268674
7499 -268674 -306803 -451064 -609376 -620448 -409362 -223550 -187784 -309650 -470684 -575397
7489 -575397 -583938 -283483 69951 118679 -161646 -252139 -211891 -442926 -531510 -465159 -650091
7478 -650091 -603322 -375169 -267569 41286 199638 221604 343679 601721 761490 846460
7468 846460 669700 372808 173806 246457 345935 433161 475050 453830 397415 369874 240437
7457 240437 140659 85910 398603 719170 813898 767797 583607 537868 431052 296412 110559
7446 110559 -85270 -63705 291184 220924 -61210 -49945 169842 394476 298047 213928 358622
7435 358622 574015 240173 1530 25008 110045 288941 652925 873781 647776 511024
7425 511024 546576 557910 557792 309626 -151718 -517857 -686570 -719056 -699786 -760003 -755805
7414 -755805 -457547 -322941 -96960 272511 492731 459539 476637 171741 -344197 -523743
7404 -523743 -482077 -570046 -481900 -350977 -207007 206867 486643 332786 105838 77906
7394 77906 -31392 57182 236870 9307 -335434 -414326 -427814 -467018 -581276 -800919 -549405
7383 -549405 -207554 -29148 93384 -73762 -72689 -30238 -173328 59551 559081 722536
7373 722536 412868 127065 -176323 -652507 -820955 -551865 -199147 139902 421193 536480
7363 536480 337818 -76131 -157245 201907 465221 272960 -232268 -487930 -304473 -128153
7353 -128153 -130439 -223474 -192612 -393152 -518432 -554263 -515552 -371686 -321550 -553430 -503957
7342 -503957 -149845 46510 173686 370710 171052 -34738 -197721 -470497 -770055 -875877
7332 -875877 -844554 -684900 -527590 -516846 -458304 -399279 -557475 -878529 -806470 -659410 -618775
7321 -618775 -464517 -267271 -184749 -292489 -681970 -1122222 -813075 -321917 -54864 -31480
7311 -31480 -65176 -128283 -284444 -324358 -370829 -360256 -372397 -469973 -539488 -476489 -83381
7300 -83381 154639 -34209 -98065 43485 315201 243288 148013 360975 314308 209373 152505
7289 152505 -90707 -197096 -138885 -109447 91604 265795 -110903 -719434 -865849 -712553
7279 -712553 -544204 -540529 -521171 -291964 -179074 -160344 -9174 289890 357380 256020 106139
7268 106139 165596 85184 -21947 -211490 -209953 -343278 -696206 -620162 -509585 -500404 -639016
7257 -639016 -686501 -420531 -126659 -100785 62290 239374 370751 615076 560599 124744
7247 124744 -309003 -539155 -544746 -266330 69508 -9506 -523689 -1020504 -1077317 -750534
7237 -750534 -383883 -167404 -349843 -375803 -394646 -516201 -372013 134730 235947 183739
7227 183739 289161 425087 501787 498169 552135 609082 744527 932675 788162 711593 774476
7216 774476 560634 105549 -171963 -175751 -226787 -599705 -700069 -797048 -777893 -410731 -93377
7205 -93377 191168 450664 411192 64911 -45324 -361001 -890752 -894525 -643699 -516521
7195 -516521 -487004 -485740 -623611 -816973 -895934 -566091 -518112 -875382 -1005520 -984668 -944811
7184 -944811 -728813 -595463 -813517 -695188 -318799 -127935 -27864 -205600 -530055 -690437
7174 -690437 -972971 -988235 -843075 -808160 -567456 -311991 -688430 -1199859 -1293891 -885803
7164 -885803 -286590 222586 384058 230021 224063 28353 -72763 190207 438873 214434
7154 214434 80347 299119 501208 531385 432842 113458 -227619 -296389 -287893 -181898 129177
7143 129177 290234 241775 40235 -314238 -663590 -781941 -539727 -534801 -603193 -476440
7133 -476440 -252709 -44160 -11448 -123483 -449988 -1051682 -1074803 -895616 -678261 -533616
7123 -533616 -511208 -483274 -249870 123697 150790 93582 -156284 -195131 179722 645914 793331
7112 793331 693147 582752 423011 -55031 -277876 -93972 12634 165080 457939 776026
7102 776026 898095 684387 610524 661915 432887 236798 223992 -109736 -356694 -285691
7092 -285691 -359186 -546232 -493711 -319196 -183485 215396 604287 383112 -80732 -192188
7082 -192188 -128793 -64646 268472 729786 1048309 976324 819247 897405 956427 875757 708453
7071 708453 576710 480166 569798 820426 1121083 1177469 836010 435126 524056 789613
7061 789613 980293 1049371 813486 382617 13201 -294406 -487242 -619100 -578237 -358156
7051 -358156 -368937 -236183 25548 197385 111539 -132103 -246205 -274752 -208834 -202042 -126086
7040 -126086 -298990 -399672 -554390 -654073 -648275 -361943 -168310 7862 -4122 -476493
7030 -476493 -950782 -897795 -660187 -700579 -877525 -846518 -726469 -702131 -660454 -583939 -651583
7019 -651583 -515118 -115348 191518 250970 60520 72789 82918 57434 7762 -96940 -87928
7008 -87928 -79766 -101128 -193356 -238533 -324915 -325839 -4455 395102 637734 561631 596308 937987
6996 937987 934979 569088 351453 387055 352480 78169 -365972 -397213 -33840 82514 -82901
6985 -82901 -188211 -140087 143250 396296 478729 435410 235439 129352 241788 321958 197522
6974 197522 5977 -282849 -143169 212306 101483 -107388 -61837 -19799 -200713 -368309
6964 -368309 -347066 -110630 250896 355336 168026 93179 31000 -285686 -304133 -384299 -517316
6953 -517316 -516845 -435962 -496466 -689634 -520588 -286780 -52113 -269757 -593289 -851818 -888312
6942 -888312 -551671 -353071 -401940 -142985 224916 329672 120813 -116685 -64479 -252263
6932 -252263 -592319 -504621 -272733 -325398 -374225 -593290 -656975 -377131 -299876 -193158 104550
6921 104550 176698 -76308 -389622 -793901 -904588 -766305 -568637 -143281 185736 378817
6911 378817 526305 238366 -127665 -324828 -258018 -44154 48237 79313 128738 304989
6901 304989 671316 747716 526458 246278 364333 506519 234424 20207 76039 236912
6891 236912 216627 172536 196211 315999 154023 92781 38684 -44861 157797 363125 784025
6880 784025 1091799 939230 622757 335546 104196 -36765 168983 176427 -253650 -624132
6870 -624132 -721771 -619383 -314864 -39533 -178273 -551697 -659762 -503070 -350138 -415725
6860 -415725 -536587 -568159 -777608 -1129127 -1138864 -719486 -382759 -259335 -263474 -244488 -256730
6849 -256730 -321543 -68271 94833 42668 -187358 -433394 -530003 -257965 146678 234008
6839 234008 60026 -311817 -724742 -885508 -597280 -288220 9581 418511 317897 82542
6829 82542 63363 298931 376608 202320 1517 -267460 -647574 -927202 -1024525 -921344
6819 -921344 -582389 -355451 -148860 -109488 -194118 -61800 40036 270766 170934 174087 555207
6808 555207 711821 640368 650684 279242 38403 16960 -140780 -277694 -249197 -318715 -508523
6797 -508523 -468149 -387458 -458795 -570870 -404529 -103918 -252967 -560682 -286371 107772
6787 107772 382379 706739 1084532 1274467 944633 561539 162409 86343 51026 -319095
6777 -319095 -443612 -569210 -428837 -330393 -462154 -369201 -206549 43335 299275 563603
6767 563603 549861 381367 353641 418586 411543 -49599 -657518 -860039 -657600 -358113 -394919
6756 -394919 -461224 -475687 -636470 -636614 -341637 -180426 -9601 -182322 -411621 -599226 -675044
6745 -675044 -448479 -444207 -160857 149789 338165 473194 416690 348113 618305 707890 418155
6734 418155 264173 473031 653064 390356 -55900 -321103 -300980 -315873 -288742 -252212
6724 -252212 -41719 9643 -69383 34677 -163495 -246199 -245290 -379957 -446181 -304528 255195
6713 255195 848975 890574 556706 151273 -3103 -161650 -176610 92473 280632 148591
6703 148591 224530 432532 591584 368817 195771 263344 403493 479051 586798 798514
6693 798514 797350 830228 821883 767122 830060 943864 739396 413591 220023 -112513 -315998
6682 -315998 -330271 -599885 -309732 232616 636479 916786 1087194 923066 519103 490309
6672 490309 467482 55670 -154327 -8346 148799 507107 816160 611613 512466 174584
6662 174584 -133559 -137737 -311715 -530072 -354094 -29275 211111 202510 89058 48067 194014
6651 194014 327477 227915 -149892 -359767 5965 312676 149653 60956 202798 151152
6641 151152 89016 -75780 -415159 -530677 -484134 -361604 -255343 -352524 -219426 48710
6631 48710 -153864 -227795 51881 187971 247669 -166465 -244022 -185754 -258360 -546610 -739708
6620 -739708 -599000 -195396 279742 597830 619977 612140 366837 48873 -102625 -86122
6610 -86122 -140103 110701 487040 406782 332280 406808 490080 424565 418407 320933 159212
6599 159212 113993 259557 285883 7341 -292447 -609947 -757490 -777835 -829770 -1179144
6589 -1179144 -1438512 -1405826 -924402 -330857 -166610 -119195 153839 369859 495976 327809
6579 327809 -75993 -196035 -22775 172504 393587 432164 402996 7597 -506048 -539426
6569 -539426 -259789 60256 222592 -112980 -421071 -506543 -620929 -740300 -537671 -352497
6559 -352497 -336830 -324902 -384918 -277492 -248631 -262968 -8962 -236025 -559837 -382265 -44278
6548 -44278 290877 296908 38318 -140433 89711 246394 70715 -94233 -463472 -463380 -95996
6537 -95996 44502 -22915 15727 -34719 -96315 -113587 -73120 -214459 -343706 -222952 -183240
6526 -183240 -274506 -234265 -336595 -583050 -582598 -402145 -352436 -421078 -313242 -306980 -432920
6515 -432920 -545704 -682005 -714026 -426467 -320357 -180762 -303016 -265446 -137488 20617
6505 20617 317476 434449 260078 79948 164721 386450 482105 650248 718547 577682
6495 577682 490155 596395 632291 431841 218467 115511 454661 837052 677970 503881
6485 503881 492989 459207 350759 463907 384221 99383 -342996 -264350 180866 141158 -278956
6474 -278956 -312639 58276 230519 71121 -170838 -344847 -119859 172670 20326 -146848
6464 -146848 -308252 -169491 -18948 -43985 -32154 -62850 9880 79482 111760 -193096 -388411
6453 -388411 -589992 -919540 -880746 -747904 -689684 -647181 -681225 -617263 -461646 -311316 -360646
6442 -360646 -638492 -714450 -399671 -98616 -179044 -261127 -317530 -364493 -540612 -720785 -565750
6431 -565750 -444258 -99583 191200 41196 -278494 -359860 -328787 -167772 -88052 -84046 138108
6420 138108 273375 160537 74789 45236 -1433 50346 118023 -107985 -511685 -640333 -540232
6409 -540232 -420625 -321701 -169396 7388 87058 -109549 -162672 13700 52177 -260090
6399 -260090 -457752 -444306 -466682 -123120 278086 268365 15746 -56790 -155000 -361129 -331125
6388 -331125 -192437 -286176 -400169 -232263 -175572 -387856 -576327 -407013 -203853 -159123
6378 -159123 -232719 -590289 -995812 -956488 -682816 -494030 -457485 -377421 -176874 -97679 102567
6367 102567 375768 588673 696880 554575 210500 -110985 -211247 -96070 -166019 -613813
6357 -613813 -769429 -565259 -472464 -750884 -975265 -853455 -768455 -803198 -753542 -519885
6347 -519885 -299399 -158822 -198046 -60619 258039 114347 -118747 -548352 -922742 -873731
6337 -873731 -771532 -536178 -223197 -142266 -189710 -258431 -175863 -45591 90808 214178
6327 214178 89685 -242912 -169772 206878 228350 49511 -174314 -203093 -349107 -370848
6317 -370848 -393004 -963534 -1012247 -534668 -142245 92923 -27856 -104082 49129 44850 -133089
6306 -133089 -212513 -179423 -192483 -330310 -416008 -535451 -514935 -104673 154478 77314 -197777
6295 -197777 -250801 -84335 86638 197519 286999 242674 -188197 -590288 -616836 -243113
6285 -243113 172982 310202 33024 -291631 -385803 -527110 -483544 -304211 126473 446836
6275 446836 307858 221177 296249 198413 -383519 -743225 -868809 -878690 -650770 -531224 -333266
6264 -333266 -8948 99884 -245262 -520364 -394881 8490 397695 361031 82402 50848
6254 50848 34894 25543 101142 224304 395988 123738 -459903 -604277 -420010 -249907 -275145
6243 -275145 -231696 -519431 -405469 -165710 -244213 -98003 297664 412675 248905 -12638
6233 -12638 -153758 -383134 -404169 166661 683381 765846 440887 132867 185183 416733
6223 416733 704301 633905 313167 323736 724979 1192886 1024260 644536 443865 440304
6213 440304 146514 28050 90211 62947 -52847 -222108 -250265 -220094 53216 268255
6203 268255 91038 -26530 73920 -114999 -394884 -533592 -774458 -859916 -657578 -321602
6193 -321602 -296106 -446116 -647379 -862705 -1082564 -1061935 -689570 -110847 320925 430677
6183 430677 185614 35381 137880 167713 242743 407958 128847 -334283 -724024 -890628
6173 -890628 -651618 -256331 31849 222689 474791 676961 660731 404884 425597 550769
6163 550769 419173 320061 329663 679990 1148057 987469 488171 280359 254704 938
6153 938 -359108 -502913 -423574 -84054 228680 196149 -54410 -185024 -308465 -601716 -655820
6142 -655820 -572501 -481998 -260823 -54876 -332880 -917511 -1075794 -893921 -726210 -528985
6132 -528985 -272768 -164265 -115880 115949 72810 953 -40872 -240268 -354455 -11307
6122 -11307 382565 535463 658334 734715 553173 151580 -196403 -43077 436842 547967
6112 547967 491095 233486 73762 84206 77549 151553 189531 -193713 -408977 -421860 -486867
6101 -486867 -461126 -299540 -49583 61156 -271374 -381714 311 66394 -294151 -672489
6091 -672489 -464705 -132514 -95935 -337298 -396854 -385639 -669031 -392892 70210 199110
6081 199110 28459 -279668 -403355 -251728 74724 175281 143645 8565 -190629 -341923
6071 -341923 -181139 163231 -83693 -303990 -371480 -295113 -190970 56742 133939 59040
6061 59040 229072 333714 98572 -63189 -276059 -355842 -144596 -88726 34528 222505
6051 222505 512846 268319 -157363 -325582 50412 251110 113923 94063 225328 151313
6041 151313 -66956 -221805 -268405 -82213 352710 615040 481579 366345 255588 110203
6031 110203 120132 172711 176707 351260 412120 401298 288408 35642 -44056 10112 -36960
6020 -36960 29093 83280 46627 -176778 -237405 -329589 -466078 -777682 -1241502 -1310958 -878084
6009 -878084 -442625 -356113 -315707 -151727 -38396 -33302 -125286 -262855 -456656 -752331 -1030628
5998 -1030628 -1129269 -702367 -85077 132513 73999 -133798 -187884 -45112 9143 -126265
5988 -126265 -260643 -252561 -109668 290817 550842 715035 816755 597933 160046 -420272
5978 -420272 -656914 -338109 239796 531056 598146 502741 277605 256718 262789 225370 92687
5967 92687 -93474 -282421 -426345 -672286 -1002914 -1067298 -849754 -649917 -598803 -346187
5957 -346187 20645 167840 96987 160782 480313 464743 295000 371856 614371 747834
5947 747834 699499 368614 -209390 -771966 -777058 -417092 -86963 -25254 311786 654290
5937 654290 629129 177246 -543795 -867935 -822009 -994077 -1157965 -1340239 -1243554 -1056288
5927 -1056288 -1042921 -1118537 -1115140 -1109065 -1225140 -1068892 -410105 -60408 -47991 -116410 -234640
5916 -234640 -213219 -210676 -240792 -262048 -3373 160808 30890 -10830 59375 -106936 -307792
5905 -307792 -352246 -311313 -96568 34492 178437 208366 341362 298167 -39105 -31727 56981
5894 56981 74471 -233833 -126375 255278 204149 -85074 -419549 -570494 -670063 -518939
5884 -518939 -200965 -281489 -190378 5325 -188840 -298334 -227403 -106637 -96277 -129052 -238675
5873 -238675 -490935 -607712 -429866 15775 134773 -278806 -564932 -339254 135994 259809
5863 259809 243162 -43216 -256547 -135082 102479 203215 41375 -25835 -27001 -153936
5853 -153936 -248638 -344612 -527385 -591252 -694730 -432770 -95594 158019 -191574 -842656
5843 -842656 -1023297 -1013821 -1060028 -1231235 -1262076 -1033344 -965328 -976369 -793109 -606247 -593996
5832 -593996 -622171 -617702 -653650 -619093 -372938 -53454 678391 1285590 1399593 1169602 741243
5821 741243 455218 284120 402728 414381 147840 -30077 56035 221184 415150 351182
5811 351182 116148 -8243 -269458 -337244 -154006 -229416 -550147 -633225 -703033 -807333
5801 -807333 -731359 -717777 -754621 -671783 -428423 -260487 -163720 -99134 -104083 -52609 53094
5790 53094 -96475 -347571 -420555 -461186 -713736 -956347 -1119464 -1213229 -1047552 -786862
5780 -786862 -603780 -498371 -232382 -148158 -227806 -414441 -649469 -730795 -927107 -1069779
5770 -1069779 -1054640 -960161 -627601 -429011 -247912 -412796 -531594 -459710 -377272 -210750
5760 -210750 -193709 -157336 -86581 -95689 -424790 -684627 -961868 -963857 -639277 -515315 -392707
5749 -392707 -303114 94021 297777 61037 -85715 -105174 23697 405410 440147 189729
5739 189729 -210739 -557521 -562804 -528882 -190818 5385 12978 36336 58507 38416 159372
5728 159372 321237 2551 -369271 -433832 -363592 -247038 -421561 -438026 -120590 91089
5718 91089 41465 -311153 -471268 -459284 -373248 -333928 -616145 -885679 -784664 -423345 3320
5707 3320 249622 357688 485051 604905 750972 498572 -149479 -415443 -246475 104253
5697 104253 131998 -73193 -300076 -254973 -236394 -184175 -87586 -221367 -346049 -479742 -511665
5686 -511665 -342164 -422322 -599059 -570399 -491971 -654323 -725115 -576883 -433606 -364227 -508704
5675 -508704 -800353 -974410 -904279 -651485 -474510 -537509 -338421 -266489 -356835 -138149
5665 -138149 -93543 52653 164321 285887 505182 116706 -68420 72551 410507 598452
5655 598452 415519 -178152 -513040 -421180 -303643 -793628 -1284007 -1049499 -616130 -545056
5645 -545056 -877581 -1129299 -978079 -585335 -423327 -488537 -872249 -1105945 -928469 -752240
5635 -752240 -839989 -811609 -632713 -480849 -279778 -343723 -319737 -9762 94072 186737 346218
5624 346218 371548 339349 321577 303243 244314 419754 594456 289332 86111 99819 17258
5613 17258 -70573 -56494 -326702 -700026 -565057 -197418 38730 177365 294954 214135
5603 214135 99348 150738 89544 -181848 -526917 -854274 -1017139 -761342 -63422 245639
5593 245639 267116 125639 -217983 -521726 -674798 -1077348 -1225136 -1129832 -905108 -498523
5583 -498523 -322007 -625908 -920919 -1222668 -1220642 -1051246 -837849 -860433 -789869 -641932
5573 -641932 -415689 -539254 -785242 -496780 -388719 -386226 -105088 -136968 -365132 -418760
5563 -418760 -238794 81160 306895 403468 385102 397147 196332 70778 -77235 -502028
5553 -502028 -751627 -553068 -262815 -191532 -271412 -493489 -675296 -667435 -556440 -362590
5543 -362590 -679227 -825708 -545977 -302798 -104269 -56303 -306231 -699275 -1238170 -1494809
5533 -1494809 -1448700 -960033 -471623 -188525 -150548 -150232 -367032 -653640 -721345 -380478 48671
5522 48671 46444 -189368 -452635 -517368 -463613 -596263 -769541 -375314 14752 57234 155840
5511 155840 174484 438604 518090 307470 455171 711357 918189 866210 548785 215500
5501 215500 98065 -125965 -237183 -571405 -989381 -1052197 -1176460 -1126861 -1009132 -905843
5491 -905843 -594282 -357575 -565124 -808772 -508401 -56595 -105157 -177634 -104277 -443216
5481 -443216 -923114 -1103672 -1059879 -824375 -602300 -732767 -876176 -683553 -318828 -71717
5471 -71717 21267 -82154 -330286 -173808 -84306 -253296 -458559 -661432 -731689 -374718
5461 -374718 -47225 -141530 -296307 -257459 -187906 -42088 214218 247254 215950 900 -181503
5450 -181503 48773 286915 696514 709881 458275 141692 -316758 -463697 -266162 -407164
5440 -407164 -364301 -92689 -237357 -413182 -428842 -593998 -811336 -551557 -38000 204829
5430 204829 141420 109073 131909 235628 190574 -70468 -150168 -103515 76970 462181 786988
5419 786988 627582 345390 -13383 -84151 284240 649467 610426 374644 -16462 -321912
5409 -321912 -307533 -521583 -604222 -559272 -465253 -66237 503764 630204 334146 -47341
5399 -47341 -448095 -503080 -287104 -282790 -517917 -777743 -663742 -471000 -512375 -775193 -1075859
5388 -1075859 -1089175 -771400 -418374 -153756 -120377 -390253 -813547 -1088287 -1065492 -746612
5378 -746612 -394886 -158203 -73003 11410 143471 -174730 -310499 -249029 -181904 -59608
5368 -59608 -38667 -92350 -63858 -145118 -342821 -303965 -39295 297573 258336 84909 -167293
5357 -167293 -248632 -314560 -407984 -498114 -613046 -565687 -464130 -669816 -881406 -860234 -645019
5346 -645019 -288757 28671 104547 -124774 -240984 -416727 -669011 -757410 -843791 -742635
5336 -742635 -605680 -410314 -92171 95849 -55276 -273879 -509998 -421621 -127293 -110715
5326 -110715 -234998 -119270 -170158 -270194 161120 460011 206011 -102558 -217916 -157238
5316 -157238 -75916 308382 353280 80032 136369 224151 66990 -33506 73232 -114005
5306 -114005 -233605 -197544 -14115 -3463 19186 231244 546606 395323 128833 210041
5296 210041 105266 -165355 -105633 -4762 -174745 -131560 -44999 -157785 -239043 -101384
5286 -101384 109662 237710 -64414 -567887 -718911 -626109 -726993 -846296 -975266 -907023
5276 -907023 -739577 -559720 -414906 -631204 -1068313 -1242905 -1231724 -1291714 -1154064 -744727
5266 -744727 -482802 -433635 -268509 -146856 -367838 -293476 -277393 -236627 -291133 -186354 52195
5255 52195 -132691 -154748 167021 216443 4582 -68003 -209017 -366165 -351386 -135878 -38941
5244 -38941 -317492 -555057 -576147 -609370 -618612 -590561 -625148 -546865 -187514 -118267 -207583
5233 -207583 -426706 -466833 -482454 -306883 -122449 -372411 -812476 -881918 -370804 -98861
5223 -98861 35549 208594 163126 -104663 -126026 43051 -158696 -445480 -468849 -467642 -749820
5212 -749820 -875632 -775514 -225525 28742 6628 -178509 -169349 -56054 -87027 -216196
5202 -216196 -189262 -402837 -552824 -629918 -649616 -621741 -630960 -635551 -605342 -298291 101609
5191 101609 128041 -217599 -386864 -298611 -96537 99794 35007 -355475 -567968 -580050
5181 -580050 -393179 -374659 -587763 -710976 -670134 -474446 -235236 -204485 -350103 -644685
5171 -644685 -953718 -1153442 -1105597 -859870 -438736 -167790 -395490 -751137 -676685 -453885
5161 -453885 -482800 -615442 -608188 -647330 -457619 -215062 47529 -86712 -558911 -953174
5151 -953174 -1129334 -991692 -770052 -423742 -431317 -881200 -1087898 -1106904 -993047 -1047929
5141 -1047929 -1094332 -1130225 -1006622 -781871 -687889 -929929 -1162116 -1277273 -1320912 -1247147
5131 -1247147 -1249450 -1097195 -942054 -598676 -90865 59122 -82545 -180440 -290899 -546785
5121 -546785 -639247 -587483 -777471 -1033573 -898916 -559182 -189240 103974 122193 -331344
5111 -331344 -694585 -740378 -554116 -363113 -558881 -878616 -844374 -360624 167370 485771
5101 485771 595858 564941 518206 395545 215085 337710 402898 422752 280995 407230
5091 407230 277911 45928 -18633 -3044 -83847 -203974 -570372 -635394 -367956 -122360
5081 -122360 -146854 -603347 -881049 -808857 -410811 -113752 43554 -191442 -475502 -510807
5071 -510807 -343641 -124418 48834 263575 667684 756204 721208 359562 -265949 -857299
5061 -857299 -1011799 -787889 -369437 -64297 -68400 -363779 -532260 -507629 -212576 -191565
5051 -191565 -370611 -270474 -209189 -315559 -295904 8518 258651 384256 280633 51568
5041 51568 -289761 -613532 -759954 -790433 -924894 -865906 -587547 -469468 -780817 -1199520
5031 -1199520 -1397959 -1366301 -1064378 -893024 -639544 -388411 -632242 -858724 -771429 -485542
5021 -485542 -219823 -215884 -310906 -376345 -209181 60299 397452 337372 -145850 -305339 -457431
5010 -457431 -569397 -617148 -413368 -208014 -250813 -367527 -255821 -35527 -38043 -130035 -183219
4999 -183219 -159910 -317965 -761524 -1072881 -1032161 -956852 -795733 -300297 -163671 -118586
4989 -118586 -136210 -346507 -495576 -489299 -416941 -195178 -147171 -53478 -285307 -462212 -495199
4978 -495199 -401691 -256286 38244 440197 429216 361484 209302 -315597 -653331 -595664
4968 -595664 -437824 -382319 -483009 -482460 -546692 -497026 -617654 -970384 -1042677 -846135 -537438
4957 -537438 -305726 -111593 -152750 -373990 -541046 -590039 -683432 -778062 -820620 -820513 -655700
4946 -655700 -435760 -386654 -476894 -615050 -837935 -726659 -570274 -370098 -122244 205045
4936 205045 457402 305704 93839 123297 58382 -250837 -452021 -306621 -134825 -207743
4926 -207743 -142513 -6395 73058 203735 11741 -242719 -329337 -278967 9189 -99930
4916 -99930 -274317 -20897 312060 299407 -27198 -40874 116142 5976 -7055 188455
4906 188455 298080 24101 -299583 -570510 -750987 -592071 -511762 -625285 -594333 -330370
4896 -330370 150880 395510 189152 -40469 -242974 -197531 -164228 -72895 54188 68333
4886 68333 -105756 -555514 -709429 -619610 -784152 -731165 -461649 -315048 -408039 -644519
4876 -644519 -745606 -763192 -732372 -614753 -593280 -740856 -1072522 -1154816 -963518 -555232
4866 -555232 -395516 -510291 -484822 -591155 -383482 -122538 -143115 -454140 -881848 -910470
4856 -910470 -676906 -314947 46174 -25539 -263001 -254089 -310840 -512855 -283769 92047
4846 92047 -9824 -169363 -131202 -200603 -226347 -108136 -190947 -577085 -529920 -326224 -254809
4835 -254809 -142958 -360107 -689366 -921324 -1031244 -704571 -442294 -490376 -401417 -367798
4825 -367798 -320425 -198636 -73148 -220141 -447072 -487896 -585585 -660771 -608902 -427639 -300635
4814 -300635 -511567 -430732 -184342 -170493 -257608 -331856 -206089 -252120 -551892 -614319 -320336
4803 -320336 -203371 -246893 -3853 207932 -119068 -449995 -515903 -395849 -196553 -38187
4793 -38187 -9612 -89819 -208309 4308 259299 450166 356784 -127511 -245562 -127393
4783 -127393 -75697 -224641 -260183 54220 571809 1073030 1385641 1877608 2108227 2295013
4773 2295013 2980232 3614410 4110369 3986254 3485578 2654793 1726541 1170833 1250623 1383041
4763 1383041 1177210 816314 383806 257445 -14387 -125877 229362 345543 120202 46802
4753 46802 256822 119851 -50248 -83415 -267949 -511899 -512896 -489052 -365780 -201153 -116977
4742 -116977 -63875 -45715 -133943 -340553 -194033 -136459 -508572 -705475 -469379 -162563
4732 -162563 -80112 -245595 -201075 -66637 21105 -111772 -194814 -99990 -273286 -478537 -470082
4721 -470082 -149919 -156146 -483320 -658359 -383806 77874 337570 295049 250326 232714 345190
4710 345190 12075 -275672 -97192 146026 181397 184076 41488 -55434 43417 -71030 -180032
4699 -180032 14515 79518 -197934 -492574 -648658 -549975 -510132 -397765 -256825 -80923
4689 -80923 -63861 -144288 -117555 -49173 -175980 -471720 -775702 -805795 -694667 -446003 -322011
4678 -322011 -167757 64492 220147 307754 293768 225279 228129 442808 240342 -311595 -613549
4667 -613549 -561711 -238876 -47762 36921 19374 -200079 -327759 -69520 184281 -90213
4657 -90213 -292399 -201198 49549 -8457 -321909 -583681 -526793 -242049 28471 152011
4647 152011 -98338 -260978 -269967 -293559 -202705 -1740 -240098 -574615 -511394 -330553 -284623
4636 -284623 -209059 -182774 -221931 -297928 -133219 41661 91193 68521 139238 222738 322979
4625 322979 199534 -177721 -323537 -353556 -295106 -420396 -549574 -824198 -909580 -518676
4615 -518676 -315600 -570969 -414928 -127756 -52259 -49664 -177928 -274129 -280204 -135910 18121
4604 18121 105070 86637 344233 484264 252694 -82325 -76068 -47562 -59077 -130706 -134803
4593 -134803 -465026 -822449 -863193 -786698 -552790 -631805 -714855 -743094 -566409 -137867 -201
4582 -201 -362413 -584392 -708380 -903394 -513089 143156 389481 365136 -109442 -334782
4572 -334782 -133560 -124099 -221354 -72206 -206148 -239612 -182706 -232491 -359852 -278076 -169557
4561 -169557 -174970 -309997 -476954 -515044 -400631 -347770 -663517 -825847 -707442 -450789
4551 -450789 -16290 260287 40244 174125 382450 468409 557275 708213 606324 444247
4541 444247 375847 205967 -50475 -148188 -124003 69527 433373 695831 565314 182200
4531 182200 -104763 -367517 -560724 -739159 -464690 -81766 46048 183402 182923 22773
4521 22773 -277604 -497198 -580236 -660378 -746950 -797545 -927924 -1200235 -1051846 -490575 -117561
4510 -117561 103815 85519 -127428 -197633 -256413 -443421 -521146 -497364 -645668 -990905 -1031327
4499 -1031327 -908863 -745186 -546788 -640978 -537240 -172631 -211782 -500187 -762856 -850064
4489 -850064 -755393 -263625 103593 433653 653202 504345 347653 53050 -343922 -532589
4479 -532589 -443816 -283794 -116561 57845 233908 410293 319808 -49208 -491412 -1052575
4469 -1052575 -1354825 -1219035 -1039850 -1143418 -1107749 -902006 -788456 -608435 -605343 -795256
4459 -795256 -550068 -278185 -124373 -104246 -294059 -550621 -641957 -275904 -174668 -208458
4449 -208458 -176180 -234049 -7322 283681 186814 -202367 -514091 -416530 -97319 17755
4439 17755 -119566 -336220 -611092 -696191 -550727 -185158 7123 150900 154637 19365
4429 19365 -86201 -231357 -254318 -209452 -76846 127401 97906 -80190 -67895 -92402 -329221
4418 -329221 -691060 -885353 -820057 -597907 -502269 -560572 -673617 -667492 -493883 -334816 -360564
4407 -360564 -317371 -218967 -23131 183985 25797 -287717 -378977 -367662 -412699 -684164 -902356
4396 -902356 -709088 -432707 -290802 -246424 -324218 -353028 -515795 -536607 -197786 -146121 -129502
4385 -129502 -307212 -504714 -547620 -432290 -294937 -315059 -508205 -675579 -306040 414451
4375 414451 657198 430649 193670 -111283 -463261 -385512 -74214 -16208 -200305 -430993
4365 -430993 -503252 -493324 -251629 136311 406610 605417 726706 712861 568187 313657
4355 313657 284534 339165 185440 74814 -57247 -197334 -88381 -55300 -140176 -27680
4345 -27680 180200 250495 227614 326473 230027 -70651 -192213 -50243 216916 364009 189601
4334 189601 27905 -92584 -165565 -199849 -316746 -400086 -557872 -368467 -116138 -337149
4324 -337149 -634298 -647937 -496166 -289785 -221002 -181538 -235293 -31112 156723 -52891
4314 -52891 -369708 -572517 -533223 -215536 -38617 -120304 -420418 -672094 -876293 -1141040
4304 -1141040 -999722 -430615 88087 164100 -42520 -112832 -38310 -48783 108745 181715
4294 181715 245390 257834 197674 215340 478880 548653 420451 198562 95652 265224 150409
4283 150409 -231913 -476928 -648026 -769925 -709498 -445885 -392681 -340105 -137297 -29621
4273 -29621 69156 75310 167153 -6195 -371376 -352777 -252417 -341903 -315194 -647166 -1068465
4262 -1068465 -1273708 -1092274 -706013 -366656 -465641 -772304 -737815 -532692 -341373 -153737
4252 -153737 -44792 108134 50686 -232057 -478984 -516967 -287920 -283444 -357183 -233403 -1063
4241 -1063 138233 326392 390971 445893 496043 492423 500763 466999 333732 -160573 -536400
4230 -536400 -529049 -222653 139684 316451 274184 5276 -145540 -220747 -339025 -370025 -407861
4219 -407861 -363955 -30675 128079 -191821 -370828 -391527 -179311 -43407 155966 295797
4209 295797 295711 352637 567411 529754 142810 -25070 6048 109288 17350 -3073 58007
4198 58007 -21155 -360728 -576434 -470413 -577337 -811049 -723300 -518024 -432621 -349636 -307708
4187 -307708 -104892 -130753 -492903 -484007 -202679 -115455 -107835 -326631 -581554 -690690 -749885
4176 -749885 -741857 -690124 -429523 -124033 -65776 151403 99069 -384476 -570118 -357574 -11294
4165 -11294 -6259 54642 295413 348932 51593 -378020 -256834 102430 2880 -342405 -487187
4154 -487187 -306605 50750 -44428 -253872 -180865 -276548 -180816 196972 734707 992068
4144 992068 796430 407478 75685 101639 443330 556217 298534 -97551 -156204 -234786
4134 -234786 -498295 -527914 -382702 -227461 -69343 28031 -237275 -478565 -547746 -482110
4124 -482110 -379514 -227604 -15006 21707 -90468 -473208 -1070235 -1287976 -1040839 -661474
4114 -661474 -244114 21682 115855 79784 -18997 -36811 89790 177775 -39809 -103297 -124726
4103 -124726 -375794 -684322 -705959 -432222 -12964 159052 199614 279324 226091 333462
4093 333462 442114 353043 172470 156124 22003 -434964 -373381 230003 376859 211912
4083 211912 223870 137015 236843 480197 410790 60566 10068 201829 259940 178455 -135169
4072 -135169 -302989 -104673 -16506 -156626 -321330 -415290 -597932 -509414 -159954 -72464
4062 -72464 -140149 -250186 -609599 -876791 -884122 -568859 -175414 -21432 18526 -58826 -236024
4051 -236024 -469324 -425316 -213637 -560084 -900076 -870797 -827443 -650570 -470015 -517811
4041 -517811 -655731 -530624 -376009 -241673 -268786 -308031 -201658 -97006 55799 76023
4031 76023 -77445 -269927 -464268 -590463 -365748 -307028 -226182 -200361 -233832 -368478 -448970
4020 -448970 -455000 -558073 -582002 -630885 -509446 -271178 -366129 -626153 -735788 -771555 -593436
4009 -593436 -148163 53798 -242971 -519974 -608460 -525276 -630775 -454300 -38575 140937
3999 140937 33515 23965 -153431 -343672 -169248 13613 110053 93737 -76829 -173423 -41965
3988 -41965 -59860 -434148 -403562 -59775 296514 409348 14236 -294080 -203477 -335049
3978 -335049 -233886 -115165 -88642 57403 161902 321796 711066 906882 735337 357879
3968 357879 10168 -157886 -169446 -196143 -433504 -469743 -569380 -856215 -788937 -655384 -607137
3957 -607137 -67860 162663 -17396 -57799 -163207 -213155 -11362 90518 133418 282620
3947 282620 129972 -72821 -87242 24791 194167 255394 21455 -176928 -332183 -383315
3937 -383315 -145296 -57770 -280674 -208664 2058 -9582 -87184 -292213 -482015 -464533 -450683
3926 -450683 -597267 -579121 -216527 -23511 9259 -358052 -702801 -893088 -922035 -799163
3916 -799163 -737996 -656103 -656422 -366439 -165295 -171316 -215876 -216379 65279 244194 46513 -74559
3904 -74559 -170486 -545168 -472348 -196576 -83681 -448038 -472075 -159801 -104607 -11428 -29272
3893 -29272 -117735 -377770 -692157 -694140 -754095 -666257 -737124 -803101 -557236 -197961 77787
3882 77787 235294 141696 83235 135158 152879 96467 -63112 -355233 -480549 -479307 -631922
3871 -631922 -742910 -486123 -260337 -204595 -278631 -481682 -271756 48523 -93208 -344418
3861 -344418 -270089 -402840 -619308 -644769 -951461 -1234211 -1005027 -825998 -872084 -1013259
3851 -1013259 -970380 -703069 -227113 294335 556434 367608 208911 99100 -176295 -415520
3841 -415520 -400365 -298677 -376585 -674655 -788908 -716242 -535181 -335177 -79323 239484
3831 239484 395815 352108 455905 427675 117439 -66779 -73424 -3737 -106400 -312295 -490247
3820 -490247 -736539 -746365 -689429 -713284 -614271 -625011 -899923 -1061598 -824784 -247554 205961
3809 205961 281386 428930 592899 483979 206669 118216 411760 532123 388747 -82953
3799 -82953 -115739 54946 -68996 43296 63107 -23272 -75310 -146130 -195510 -298062 -480706
3788 -480706 -348663 4503 298957 376343 418561 490671 517362 403380 426932 776095 682001
3777 682001 405621 245464 187094 -165536 -536295 -720291 -877503 -794913 -843646 -1018819
3767 -1018819 -774304 -479220 -310239 -17115 218496 74437 -319136 -500304 -380114 -160869
3757 -160869 -46004 -212135 -433146 -733626 -705625 -789190 -681767 -268726 -317557 -304335
3747 -304335 -124927 -103933 60105 359854 555226 484457 295342 215445 -1925 27928
3737 27928 267269 300206 133954 -89817 -130087 -275702 -380128 -362025 -569435 -806944
3727 -806944 -829081 -656067 -583330 -714722 -463007 -372433 -653761 -706102 -495204 -357613
3717 -357613 -244672 -128542 145622 413124 489961 362996 -17466 -414704 -621301 -549993
3707 -549993 -447976 -345504 -421751 -438242 -233498 36390 417101 643747 728932 530546
3697 530546 127135 52954 204320 316322 460702 516184 402865 131142 -32389 -29594
3687 -29594 14975 4712 -201592 -198722 -202693 -200230 -340032 -397388 -300313 -140815 117356 -15075
3675 -15075 -401831 -640175 -707734 -746317 -613582 -25669 374622 364216 172551 -26598
3665 -26598 -60313 -70624 -209751 -616636 -777038 -634605 -388699 -62813 251374 286667
3655 286667 57213 -35271 255692 626551 648002 107625 -478637 -493235 -517784 -523527 -304693
3644 -304693 -293688 -461386 -426014 -126251 134319 197527 -9149 -20668 -41024 -480993 -978751
3633 -978751 -835205 -446364 -182530 -166619 -135634 72099 215300 139241 -98386 -219587
3623 -219587 -50835 -71943 -506788 -689040 -795272 -788157 -741822 -614175 -506439 -559670 -565399
3612 -565399 -600561 -431892 -307584 -279838 -293284 -362920 -190017 189313 159501 -222829 -280159
3601 -280159 -203406 -357390 -292435 -339635 -309716 8701 -137034 -276878 -64813 -31207 -139737
3590 -139737 -73783 135083 17830 -16101 99728 -30228 -430781 -910367 -1168511 -1091501
3580 -1091501 -888559 -765361 -581392 -537955 -512165 -415778 -270812 -413015 -650590 -654115
3570 -654115 -557947 -575178 -666581 -582956 -576941 -409272 227594 426492 130853 140985 81522
3559 81522 -206090 -161673 6935 -94974 -169631 154138 358664 140501 -233360 -312698
3549 -312698 -44422 221249 247250 143464 242778 221152 59321 147638 556481 865053
3539 865053 873201 751197 874168 1081120 1026350 811615 686047 353524 -86814 -504290
3529 -504290 -939620 -883811 -436730 -202645 -189917 -134332 -17962 135333 263598 344821
3519 344821 526525 678223 400474 306564 426209 242008 -224007 -636022 -527203 -8076
3509 -8076 333791 430994 304218 150127 -159677 -280659 -175976 -86091 -177515 -336101 -253134
3498 -253134 -161332 -192276 -57401 -70578 -173995 -25351 207460 147710 177113 216968 -31555
3487 -31555 -290536 -559016 -664995 -619447 -901511 -1023585 -704707 -273196 -3489 84803
3477 84803 135219 254611 178471 -11626 -95433 -119917 -127532 -214618 -124064 -118782 -433613 -999359
3465 -999359 -1537812 -1275160 -678677 -186868 -43866 -194971 -250623 -363122 -557709 -528186
3455 -528186 -235728 134599 122955 -345378 -501851 -519833 -623747 -526239 -348391 -439189
3445 -439189 -436206 -530595 -656358 -471519 -280797 -269216 -314064 -305820 -274532 -287258 -504009
3434 -504009 -880091 -1138752 -1037596 -835200 -830079 -761962 -737380 -709594 -799723 -799276 -643256
3423 -643256 -510657 -470482 -718240 -695927 -441782 -605103 -875400 -795685 -441794 -85037
3413 -85037 -238039 -617560 -838797 -856005 -625377 -135443 134837 362089 604146 348562
3403 348562 -30444 -342994 -549629 -311452 -398100 -741930 -849640 -896325 -1248483 -1462949
3393 -1462949 -1241527 -964945 -1132751 -1481329 -1214514 -857574 -776888 -619445 -607789 -423644
3383 -423644 -231295 -55400 -179109 -527301 -699212 -576311 -428410 -444811 -344568 -329420
3373 -329420 -404256 -494285 -285098 163251 409018 350112 260526 109462 138750 170631 -11738
3362 -11738 -296377 -281810 -6573 58315 -77586 -453668 -592149 -603775 -564497 -798991 -736489
3351 -736489 -762773 -968754 -924191 -669088 -354554 55326 211099 116154 93521 80566 153161
3340 153161 141867 53465 64293 57004 -192862 -357010 -274325 -263878 -33803 624746 954027
3329 954027 762120 525914 22915 -31116 186723 110076 52176 143303 310382 127584
3319 127584 -194231 -232720 -138860 -295859 -511597 -356116 -234644 1640 150825 -57783
3309 -57783 -27171 53901 104724 148893 1469 47607 180393 46646 -40831 -42118 73445
3298 73445 -50243 -270814 -653708 -766760 -551607 -560575 -666020 -743646 -691414 -737558 -879777
3287 -879777 -953616 -1045507 -1037979 -1044049 -1010526 -804316 -303001 229232 240114 97571 -39555
3276 -39555 -142190 28525 -12029 -14697 -187639 -725911 -1112990 -979209 -813092 -803060 -842314
3265 -842314 -820150 -732255 -652032 -216726 7396 -20879 -123656 -341484 -536810 -554457 -586739
3254 -586739 -434853 -258859 -441655 -627358 -615349 -155197 147499 246527 383593 518050
3244 518050 413483 253376 226286 365576 66840 -181827 -144650 -25690 34706 22237
3234 22237 49083 117925 -62279 -413899 -660485 -877246 -867436 -863258 -971084 -1033722 -1084561
3223 -1084561 -1069345 -792871 -525599 -437617 -468744 -660218 -657789 -488577 -752713 -966639
3213 -966639 -985720 -985722 -685993 -538451 -521899 -593743 -395327 -120676 18015 108671 257634
3202 257634 534086 803827 732959 654178 527475 415891 302431 372835 292094 -14162
3192 -14162 -210098 -234776 -473188 -758206 -356988 14482 60103 96828 -22011 -183083
3182 -183083 -447148 -605691 -629045 -694505 -1039973 -1276066 -1242742 -1269962 -1310015 -1129159 -953316
3171 -953316 -724750 -440456 -310123 -409606 -621098 -764939 -785329 -572672 -485192 -839988
3161 -839988 -1309935 -1254391 -1023243 -831845 -550299 -342721 90204 143309 -103086 -268498
3151 -268498 -371495 -576177 -669231 -507697 -446748 -233118 4434 -2782 -57981 -167355 -333780
3140 -333780 -495399 -584286 -413202 -357909 -463990 -466140 -526475 -619106 -588563 -432463 -226633
3129 -226633 104650 513803 777800 577588 240088 80185 55154 -152748 -452622 -786366
3119 -786366 -1150520 -1013625 -558535 -114529 -51135 -336459 -484289 -331488 12584 186415
3109 186415 386249 646989 689015 443087 409069 483135 365583 103810 -10437 -56480
3099 -56480 -115087 -180155 -298535 -214203 -220861 -242149 -49137 42225 -106086 -271969 -293942
3088 -293942 -168710 7494 23092 -32209 -90174 -151848 -284389 -539463 -822631 -1045537
3078 -1045537 -1131521 -1037029 -914520 -944506 -878896 -926904 -1033637 -935708 -910453 -734263 -287096
3067 -287096 -7202 142017 268870 443509 491954 41696 -422068 -386533 -275441 -39806
3057 -39806 150824 74149 -210413 -297564 -369421 -163891 -107627 -244778 -239356 -277165 -412681
3046 -412681 -764804 -959575 -805655 -274024 59722 135965 66923 144299 -23602 -78431
3036 -78431 179046 294551 272194 146059 -50210 -312546 -533432 -841946 -657774 -346054
3026 -346054 -278828 -502889 -636203 -527968 -514436 -376708 -205973 -180331 -311602 -558145
3016 -558145 -668262 -736153 -476563 -217834 -403026 -195369 64729 220868 175956 -8787
3006 -8787 -446592 -853113 -1096830 -1140788 -1104327 -869605 -295077 17968 -19681 -6203 -18813
2995 -18813 -580203 -1056090 -964814 -565572 -353737 -392181 -529031 -694929 -774232 -766557 -781611
2984 -781611 -622143 -623424 -689477 -593000 -398889 -400187 -317813 -130049 79913 62242 -107044
2973 -107044 -560035 -688633 -571507 -510696 -407678 -258507 -207651 -253132 -361999 -622862
2963 -622862 -866127 -1176954 -1135334 -735391 -467977 -337878 -469638 -579354 -569739 -752184
2953 -752184 -859969 -713374 -608927 -768706 -1114090 -1095756 -802798 -718625 -538226 -145354
2943 -145354 24636 -122120 -166532 -194438 -263039 163244 513681 468232 202701 13232
2933 13232 57442 36530 -330415 -536962 -461733 -346824 -470432 -663711 -630609 -455424 -436023
2922 -436023 -480141 -320272 -91957 26766 214684 154760 193338 253178 320689 303017 78051
2911 78051 -72240 -136734 -559202 -853151 -516498 -200100 23722 251569 201403 114444
2901 114444 149984 -13890 -155457 -292357 -669235 -577530 -555698 -595618 -576249 -376963 -136806
2890 -136806 -299835 -610206 -574186 -542916 -647828 -681302 -438333 -218426 -454451 -416197
2880 -416197 -147480 115983 79400 -24988 85254 261125 357230 189048 197308 149531 169344
2869 169344 77278 4471 78838 -139604 -442435 -442198 -430949 -622462 -730955 -769456 -1009292
2858 -1009292 -1035911 -813522 -638776 -675782 -511983 -149442 -71788 -221829 -402102 -508626
2848 -508626 -468671 -353894 -130967 -142842 -458789 -643827 -824286 -914123 -594136 -388051
2838 -388051 -475158 -400747 -299815 -89046 137080 81817 255567 330515 -49081 -471530
2828 -471530 -944609 -1056317 -749979 -304537 145236 369523 186650 -116004 -396123 -429378
2818 -429378 -336989 -464471 -404424 -129959 42818 106014 5579 -102316 -356232 -439135
2808 -439135 -267818 -144495 -118668 -110502 -291913 -285883 -227442 -166660 -12927 80748 124615
2797 124615 262792 412843 454262 354972 124870 67612 257155 296561 148518 -320259
2787 -320259 -513861 -345401 -278144 -218091 -90193 -206077 -421554 -544563 -554117 -274375
2777 -274375 -134940 -71012 -162079 -315371 -521745 -620547 -529341 -474480 -264541 -57012 -200915
2766 -200915 -453655 -240860 42017 199847 197865 -112998 -162690 -29783 -203109 -435506
2756 -435506 -314600 -191081 -272866 -393687 -473523 -90886 185865 151179 194136 31791
2746 31791 -80103 -87222 -142245 -92474 137295 395029 70755 -543200 -754660 -776955 -812393
2735 -812393 -674487 -496099 -90903 371366 281924 51950 88761 227411 9346 -39460
2725 -39460 218495 188598 111198 65775 65251 135518 -79306 -523559 -582143 -374495 -324010
2714 -324010 -333183 -240967 150361 423401 494155 586762 427352 334179 299631 200167 235458
2703 235458 252794 79398 -89416 26576 220901 155240 -156829 -499314 -712901 -879282
2693 -879282 -830233 -839244 -913536 -639072 -170785 108402 230373 161474 -63289 -129402 68661
2682 68661 344130 581155 376073 185784 -103297 -247340 -121239 -252651 -253026 175952
2672 175952 339113 90579 280221 430275 442999 652088 538006 380608 518601 802072
2662 802072 939020 837463 552603 599052 722490 754029 600743 191439 -131561 11756
2652 11756 271720 599361 723365 948742 1215212 1045794 814182 832556 709091 568890
2642 568890 727380 905936 871632 549494 256850 215035 148794 516006 727390 996376
2632 996376 921037 627511 507944 658145 965483 908697 543369 460990 533194 458952 228921
2621 228921 -150457 -369696 -217101 -30146 273272 453189 599211 676122 728309 597529
2611 597529 374618 660247 1513857 1830935 1938852 2076898 2347192 2646740 2929001 3091181
2601 3091181 3387665 3894065 4322689 5250894 7011241 8941251 11247064 14200635 18370984
2592 18370984 24601643 33884174 45063748 51691026 45223066 32474863 22774724 16593258
2584 16593258 12733854 10122670 8322776 7014435 6017528 5366179 4757552 4380953 4093030
2575 4093030 3351439 2496825 1894715 1835131 2192186 2259032 2005333 2069930 2312674 2271724
2565 2271724 2130023 2224245 2303010 2268573 2566494 2891326 3185393 3532131 3837249 3917056
2555 3917056 4231324 4825943 5196225 5303574 5963646 6905094 7618396 7741564 8219777 8952077
2545 8952077 10164311 11499008 13462181 16162725 19397447 23551061 29364047 37315859
2537 37315859 48974820 65416910 88877727 120571818 151034881 148981720 113976970
2530 113976970 80268481 57901731 43750167 33925465 27064599 22167918 18412169 15580386
2522 15580386 13455396 11777659 10695068 9825047 8942043 7982025 7168414 6272197 5817731
2513 5817731 5309817 4678525 4524113 4595070 4655403 4960149 5164143 5132545 5236858 5523734
2503 5523734 5911156 6193081 6693296 7480678 8463166 9648287 10824749 11453788 11537105
2494 11537105 12127554 12911398 13592694 14670357 16479286 18863096 21830803 25834232 30846328
2485 30846328 36855401 44168611 54167588 68081557 88433487 117531802 159008465 216624503
2477 216624503 283540229 309493644 256069935 181339731 128118729 94075676 71867995
2470 71867995 56561244 45547482 37393563 31455529 27114474 23643031 20631176 17990737
2462 17990737 15828751 14258280 13268573 12613025 11740309 10619826 10014842 9853257 9724294
2453 9724294 9219620 8627899 8437601 8582493 8429083 8267986 8412234 8941135 9624369 10618421
2443 10618421 11583398 12856840 14594974 15845981 15652461 15337536 15711662 16495766 17249920
2434 17249920 18649649 20978928 24162105 28106150 33206123 39223637 47220135 57944186
2426 57944186 72783570 93417832 123024026 164936347 224949812 302398754 360117916
2419 360117916 329114128 241123881 169187518 122410512 92411117 71681717 57566951
2412 57566951 47521973 39862484 33603699 29080312 24969010 21500671 18850968 16920992
2404 16920992 15505201 14647375 13649903 12602698 11711566 11390385 11428588 11447613 10871041
2395 10871041 10106456 9373741 8617019 8156401 8079665 8122388 8235318 8676888 9348469 10225851
2385 10225851 11454974 12657301 13114856 13092463 13187269 13446091 13662709 14601175 16485521
2376 16485521 19114498 22483373 26585776 31746137 38295112 46447371 57464740 72807497
2368 72807497 95224025 127134101 172782492 234120758 296523135 301172636 234729264
2361 234729264 164667559 117360015 87044596 66780845 52834116 42695533 35410109
2354 35410109 29822001 25613517 22056158 19117685 16899927 15323594 13929024 12881789
2346 12881789 11690202 10582590 9645039 9303364 9122548 9199869 8908920 8059400 7097100
2337 7097100 6360046 5988720 5780726 5595172 5752352 5950641 6199707 6627706 6973339 7263714
2327 7263714 7694267 7769170 7624866 7346300 7406436 8014866 9138875 10626348 12150647
2318 12150647 13766863 15847185 18184512 21676175 26818444 34113888 44137137 58386700
2310 58386700 78402192 106083330 139416705 156315953 133303516 95328735 67058851
2303 67058851 49033055 37570253 29539879 23735920 19403890 16102224 13667298 11679194
2295 11679194 9875826 8532372 7482283 6743998 6323788 5924713 5311301 4942648 4879879
2286 4879879 5163880 5325535 4967540 4408555 4186944 3932920 3656333 3823204 3717761 3186347
2276 3186347 2633902 2433854 2546015 2780608 2926645 3033606 3224720 3321284 3204576 3223298
2266 3223298 3363081 3747782 4049903 4193086 4612293 5244994 6274835 7388638 8471537
2257 8471537 10277000 12883077 17154732 23267246 31489532 42076276 50910459 47824041
2249 47824041 35545270 25104081 18039535 13556135 10530566 8410580 7092366 6462637
2241 6462637 5700115 4970155 4245779 3574748 3146894 3025079 2920209 2428339 1965232 2000220
2231 2000220 1902349 2032887 2103420 1889396 1664175 1515694 1218465 918979 617448 346375
2221 346375 204893 794 -135440 79866 164968 238000 103420 3140 115433 316245
2211 316245 473788 762969 908895 806592 549002 504906 573913 658336 741360 529297
2201 529297 699248 954132 737416 470015 506077 774562 767605 617022 535987 433509
2191 433509 457152 435116 213324 56947 98959 457431 848704 806401 420773 81409
2181 81409 17711 92496 75718 -46946 -114014 -246559 -541032 -595386 -407300 -256029 -167413
2170 -167413 50250 296281 354534 230428 -80956 -321382 -269321 107323 445256 813201
2160 813201 811637 704390 506917 -4572 -403079 -417210 -435675 -452037 -277700 -218073 49907
2149 49907 290547 561887 1158776 1454086 1076971 742363 840819 1012909 837359 365333
2139 365333 -213551 -346297 -259121 64016 188149 145384 -95062 -315996 -479494 -420057
2129 -420057 -312132 -552945 -769188 -773647 -1022061 -932711 -483889 -141330 -85836 -72614 67502
2118 67502 307118 220026 235420 152812 176472 470807 654196 452211 203897 533942 808846
2107 808846 887586 1170417 1215545 889926 544201 447853 443237 766688 809597 705311 572820
2096 572820 349412 88206 56773 112205 128073 91384 -44623 -290970 -597627 -805668
2086 -805668 -398785 -217323 -103424 224623 352950 209475 146993 -108087 -403744 -361510
2076 -361510 -502719 -595200 -305205 -192214 -251218 -102705 184336 150361 -190046 -702113
2066 -702113 -1110103 -1227091 -991663 -678672 -592475 -617355 -523308 -339126 -280375 -346500 -138789
2055 -138789 -138615 -239640 -363283 -502907 -544794 -707896 -923132 -827765 -432543 -15737 466812
2044 466812 592790 164855 -188623 -388820 -385884 -397739 -313392 -424573 -283770 67305
2034 67305 126079 198045 109778 -100351 -150091 -79789 -226209 -572842 -507744 -485866 -731271
2023 -731271 -718619 -530987 -268293 -1390 96556 -4557 30505 71974 207849 267617 372110
2012 372110 771268 757957 413741 -72375 -424013 -689188 -706920 -603654 -444097 -377690
2002 -377690 -595385 -734807 -464513 -249431 -299557 -595741 -647767 -613216 -592844 -362213
1992 -362213 -137971 328284 502238 326458 203293 116924 -9239 18485 78678 152151
1982 152151 220338 75087 54479 48342 38243 267846 441769 398724 84486 -41672 -109098
1971 -109098 -322188 -295816 -198271 -276187 -125915 320465 464928 68002 34199 255674
1961 255674 1768 -404830 -787103 -906270 -698304 -487770 -363065 -176670 95158 84805
1951 84805 25711 226061 365867 389145 704242 986436 997505 590478 75459 -23224 77880
1940 77880 38356 -97935 -243984 -238161 -232896 -368756 -484287 -536534 -477263 -311087 -496152
1929 -496152 -912897 -908168 -781844 -721709 -662919 -434502 -12454 175795 176295 -9484 -226222
1918 -226222 -470935 -538621 -440457 -533032 -517282 -488784 -741953 -755908 -408966 -57895 276114
1907 276114 441516 429632 455877 457919 353939 353732 512971 475140 339973 300860 331177
1896 331177 132969 -287649 -629969 -829678 -828649 -559652 -152036 81698 70412 -198633
1886 -198633 -288377 -295659 -395486 -505701 -566060 -629375 -729156 -818878 -981179 -997333 -851190
1875 -851190 -439505 -67321 19106 -81675 -139937 -115073 -157626 -239540 -52102 -171873 -376533
1864 -376533 -603020 -777344 -859028 -638267 -539985 -555141 -594715 -503519 -129367 93896 188807
1853 188807 337713 -156337 -884028 -1272438 -1221415 -1043395 -796795 -720113 -706898 -358804
1843 -358804 -21594 -296246 -596931 -935397 -956549 -474822 -134682 -59001 -342727 -408409
1833 -408409 -265293 -165936 -161167 -496452 -559054 -189169 -3467 27468 571 -65679 90763
1822 90763 288633 222811 113718 -39670 101542 455772 392215 170065 136731 108292 -95527
1811 -95527 -384269 -515973 -343360 -134168 -92366 77820 269520 -114186 -496468 -523723
1801 -523723 -488232 -358655 -166821 -175704 -93044 132926 312391 209095 335840 320049 498743
1790 498743 663247 424471 213915 94075 -145438 -330180 -478787 -579118 -632225 -295415
1780 -295415 171282 336539 156309 72581 178696 480174 720857 607682 799026 1062008
1770 1062008 827234 391779 179223 72718 284755 267472 104547 12664 -17439 -59505
1760 -59505 -48350 -1905 -30020 -72699 -397887 -651273 -521020 -305143 -249910 -126059 61352
1749 61352 -189161 -504058 -284975 -164386 -179930 -77009 323320 421019 -200821 -491885
1739 -491885 -302393 -87431 -138008 -220974 73655 362556 242032 203920 210205 259726 355673
1728 355673 354647 560799 603163 460741 423932 201925 -118584 -321471 -214081 257786
1718 257786 770461 799995 387030 -13258 -32113 56001 -76720 -329008 -684649 -576332
1708 -576332 -440903 -487145 -545259 -473154 -377757 -638809 -904478 -936429 -1143242 -1236365 -695739
1697 -695739 -351178 -296012 -395311 -342867 -177844 -200444 -350569 -328039 -109971 -16686 26716
1686 26716 176493 300535 612807 748027 760656 472011 258117 227708 87877 -40533
1676 -40533 -534586 -704421 -49777 387347 264098 197967 446152 661972 606240 390882
1666 390882 90940 -229796 -397425 -130111 342377 348565 -106996 -368420 -301185 -21503
1656 -21503 229808 292780 127165 -51323 -19458 224376 351769 180952 -150133 -424126
1646 -424126 -421876 -454878 -621825 -659775 -513220 -220211 65806 -258436 -635793 -877282
1636 -877282 -1015477 -968544 -928429 -866933 -669320 -555720 -566831 -584757 -522850 -461955 -430140
1625 -430140 -243690 37458 22931 -104897 37054 -114642 -294184 -160068 8826 -229260
1615 -229260 -766362 -911319 -685563 -470041 -342862 -265944 -129401 -170355 -357279 -457588
1605 -457588 -521076 -345657 171465 208410 128855 297726 -1143 -356856 -567244 -621208
1595 -621208 -671410 -515442 -751109 -1210566 -1023565 -621541 -610700 -564202 -313784 77380
1585 77380 371928 315254 475990 559127 286523 234148 464021 632631 544931 333380 96993
1574 96993 144125 403191 599741 748037 554480 153139 -217129 -348212 -122137 55206
1564 55206 136476 250099 350481 229084 -332921 -581054 -350253 -148240 172996 492333
1554 492333 150094 -427695 -524859 -270971 -72796 -92909 -225121 -358700 -634288 -814088
1544 -814088 -771141 -592258 -132066 264221 292792 250949 365276 362891 235806 336632 350342
1533 350342 215022 176587 166467 183292 85259 219040 458049 360503 -92291 -94797 46973
1522 46973 -28387 -34101 -26950 -202057 -433524 -231178 -66030 -76678 -11877 188949 486859
1511 486859 721060 810639 646602 267446 120678 271794 109321 -108685 -189898 -126719
1501 -126719 53722 284579 440620 518434 449080 420855 668095 422605 -468749 -650259
1491 -650259 -323293 -154252 11173 -12471 -141000 -158626 -144543 -157837 -544084 -881890
1481 -881890 -726776 -425867 -368642 -381100 -438801 -661181 -628460 -483392 -271963 -1636
1471 -1636 162394 94870 102192 57526 77482 319626 78427 53240 171348 93727 123421
1460 123421 68052 -92908 -278914 -331287 63400 286396 308479 466128 674201 900567
1450 900567 906700 434834 -50348 -338458 -502798 -647489 -576641 -438108 -140354 35795
1440 35795 250195 547378 783314 603705 434248 477244 532740 608517 667759 556632 364138
1429 364138 71723 63526 241787 389805 336202 8833 -161518 -162057 -114711 -122461 -343112
1418 -343112 -564919 -843079 -1104779 -856304 -572651 -481976 -82508 228520 311837 350621
1408 350621 439079 423116 381359 358923 148337 146354 125560 -9369 -166798 -91413 -20157
1397 -20157 333338 646691 617376 434527 184593 175824 344910 10025 -314996 -85113
1387 -85113 316291 494932 417986 195228 -151461 -86891 53662 -243034 -594303 -783847
1377 -783847 -709940 -573954 -540600 -803747 -833422 -648996 -408349 -170472 -138224 -258181
1367 -258181 -368943 -332026 25671 341418 425494 263615 163837 109967 30100 89131 331036
1356 331036 376026 335864 258823 99802 -154161 -208995 -246951 -318704 -352503 -388910 -331165
1345 -331165 -234137 -128197 118565 65393 226331 538442 140230 -228593 -251076 -387046
1335 -387046 -534321 -488507 -285964 -89276 -107041 -89758 115034 555506 899162 836913
1325 836913 293464 -198065 -236249 -207574 -370689 -354846 -108694 -19598 133068 230494 416213
1314 416213 518211 497559 397977 337531 192990 -127300 -301107 -311031 -208018 -56653 15119
1303 15119 281702 275681 122548 265837 520615 626375 482501 160274 -67094 -42230
1293 -42230 -177844 -597138 -927529 -1381689 -1622705 -1153942 -514552 -98137 326255 617197
1283 617197 527978 153921 -266609 -565066 -727343 -789108 -844123 -654795 -391989 -130629
1273 -130629 156633 108595 56364 117253 143938 151643 -110303 -426358 -455967 -450791 -526831
1262 -526831 -407559 4270 257963 149754 40236 -93450 -61403 222223 481460 408244
1252 408244 17391 -143167 -163837 -64106 -27991 -105648 -194450 -260448 -156849 99350 28380
1241 28380 -176797 -6020 379548 152677 -239481 -188082 -281475 -595797 -930443 -885373
1231 -885373 -751083 -1101739 -1210170 -896892 -544728 -339511 -409733 -299975 -266439 -330151
1221 -330151 -747532 -1288525 -1107727 -518548 -194861 71934 242595 245609 647044 795226
1211 795226 378988 386841 659213 577555 361742 430724 591968 665396 482969 -18888 -72518
1200 -72518 -122696 -417910 -534026 -539074 -527581 -444477 -46538 95277 -10250 274880 657395
1189 657395 589466 361040 232322 245 -211792 -376378 -662813 -827806 -808386 -782660
1179 -782660 -711567 -720520 -576501 -197860 88347 -64593 -98394 -38729 34908 117093 485572
1168 485572 545747 419288 480004 474439 236068 -63772 -220207 -155721 45780 261638 480415
1157 480415 607631 590006 512075 428309 322452 469574 375706 -17555 -283374 -401876
1147 -401876 -462734 -636787 -599512 -420031 -217546 96726 335197 471895 466977 489595 607792
1136 607792 546183 306184 149035 131596 -62914 55185 377192 334996 223244 115529
1126 115529 125739 206917 325889 494966 683470 1103863 1118122 567845 100687 -234793
1116 -234793 -476174 -593524 -549672 -351568 -394826 -676723 -602114 -408717 -213658 -282609
1106 -282609 -188162 -87131 -75465 -21267 -72930 13025 30050 -471592 -821700 -974413 -940509
1095 -940509 -575434 -362080 -354286 37162 232289 48747 145857 361155 589020 586739 289336
1084 289336 149499 291684 338934 330692 112846 -298795 -292947 -158048 -106243 -109775 2051
1073 2051 92126 39954 97261 384637 799699 826454 456247 216066 12098 -303116 -555718
1062 -555718 -593572 -569176 -533995 -651519 -662196 -486139 -142018 481193 973488 1011747 634795
1051 634795 261472 121109 4363 46836 176210 235111 -82659 -163769 -37627 24988
1041 24988 -5295 -14002 -340009 -726246 -911897 -956676 -800031 -494261 -283974 21141 197722
1030 197722 32283 -344814 -423589 -276560 -59605 141048 110147 168731 183140 86084 319589
1019 319589 502087 577945 697939 778614 840882 750295 420227 249813 237058 -59811 -385952
1008 -385952 -274176 -239844 -289135 20748 413540 797145 801943 688613 379646 249150
998 249150 394568 354404 74905 -178321 -275667 -149465 214604 558701 619731 323749
988 323749 105731 -309128 -331283 -142927 -77007 40513 59932 12253 49836 59403 -247362
977 -247362 -331722 -143030 -302109 -652474 -965727 -1209871 -998799 -411879 109001 419629
967 419629 542455 582499 803827 836830 463371 475900 614102 349384 104321 289148
957 289148 170253 223222 228693 247923 431343 319260 -198346 -653573 -980291 -961501 -434594
946 -434594 2497 319408 466418 562838 254284 -51448 -194824 -302717 -287253 -142486
936 -142486 -147231 -254104 -44440 173151 601364 873596 677864 378838 239008 248615 108222
925 108222 173457 361595 307133 265421 241561 396999 346468 -11858 -403922 -868426 -755693
914 -755693 -480452 -115294 162236 179867 355879 439989 154815 -168594 -455601 -511055
904 -511055 -582504 -376062 111265 460391 409596 275029 386728 399871 561099 849379
894 849379 927753 976471 814926 547811 219871 60218 -52052 -142686 -347173 -158714
884 -158714 153671 211706 154340 293326 494107 172756 -112047 -126910 -126910 -117516 -213611 -316104
872 -316104 -351439 -263831 -289902 -297713 -490512 -670841 -674067 -460945 -234454 -423233 -627210
861 -627210 -779421 -947172 -678623 -358182 -173748 -52019 -62538 -34789 203027 401733
851 401733 227150 -122294 -140516 -59792 -154093 -64784 139445 289281 508949 435819 -2822
840 -2822 -317656 -287370 -142122 -22025 306193 368287 276 -263090 -513347 -498279 -361706
829 -361706 -202302 -180180 -190051 -254210 -258082 -145825 13302 157484 203834 71848 -17837
818 -17837 193257 601258 1059556 1152579 693947 289495 143704 170361 118010 -200507 -211416
807 -211416 -57075 -96355 -200665 102827 149315 10585 -262152 -665964 -466733 -204069
797 -204069 14412 73853 131176 344891 261333 268947 312827 178047 84689 162517 127767
786 127767 -106058 -428909 -530176 -185611 30251 -84268 74021 155608 162372 106640 13809
775 13809 204172 540623 628588 368397 225736 208347 201773 39044 -162225 -138615 -430762
764 -430762 -592521 -357784 -46225 129843 -89957 -562445 -871112 -736033 -479842 -28631
754 -28631 339122 374767 213405 8232 -457468 -572249 -723042 -953462 -790993 -343588
744 -343588 -121265 -218583 45912 255013 45187 42683 130351 146114 86095 -40723 -205599
733 -205599 -252922 -16683 129788 -2566 -81161 -46179 178199 162510 3929 86821 368398
722 368398 372875 118798 39274 124716 70119 68954 338958 336946 327083 413469 567243 698057
710 698057 943057 1103670 1167848 914510 417656 150091 242459 172638 -282374 -757989
700 -757989 -742873 -475773 -276385 -98715 -99810 -559037 -854201 -851833 -829198 -641256 -363991
689 -363991 -318306 -93320 142457 149774 379144 479039 203745 -1054 17809 324834 522549
678 522549 418367 124145 -113202 -7030 131515 110998 35581 -55069 -477441 -711774
668 -711774 -516082 -369182 -109474 177048 148303 143599 303753 173406 29631 10704 -229702
657 -229702 -394899 -454078 -502238 -502116 -526666 -440202 -327069 -321235 -266959 -254120 -278205 -336001
645 -336001 -290019 -112578 286366 587529 607537 439616 317004 125045 -165129 -193750
635 -193750 93809 273132 155232 183757 346066 376111 238534 -226403 -545954 -356000
625 -356000 -260487 -95250 181199 356381 276217 167029 44759 64369 129367 161279 265421
614 265421 117809 -83569 -145516 -310168 -463525 -648872 -583373 -204259 138491 171976
604 171976 135952 115714 25679 151976 261531 130404 20000 -45554 -105791 -115999 135855
593 135855 500672 603670 644849 570873 174215 53523 245815 453025 524441 766061
583 766061 914368 685936 544571 356467 226577 325472 351293 84228 -127100 5590
573 5590 567590 812419 457069 120760 -123969 -191115 -253319 -128829 -140586 -192477 116266
562 116266 364069 391900 292084 18830 -40512 -140032 -265215 -225125 -215116 -73755 74250
551 74250 86252 187052 242402 272005 319911 331481 553360 588434 308759 70196 177438
540 177438 487858 557906 826360 973743 816707 584127 258695 99542 251486 614319
530 614319 949490 1421983 1223978 558914 141244 400136 838360 800427 482078 89146
520 89146 37978 211845 85711 -296309 -614700 -602103 -541519 -381775 -241055 -122557 39548
509 39548 -50608 -220994 -145991 -116384 62067 133552 137591 154805 311576 335851 212982
498 212982 301748 535604 653825 531102 546701 579337 367745 69942 -223208 -266771 -150879
487 -150879 -113583 -82336 -335192 -575893 -508871 -125892 435670 630398 306305 -23887
477 -23887 67990 332040 500358 416957 253277 49563 -247951 -193206 46294 254830 115958
466 115958 -75652 93142 156704 150583 -2623 -388954 -516960 -558863 -241411 -16577 -75640
455 -75640 27858 123439 -338445 -629233 -461744 -158026 -50278 -251555 -467678 -471527 -491963
444 -491963 -409031 -92599 -2284 -252026 -536186 -430068 -164157 34636 112096 -81384
434 -81384 -141082 115230 388540 308178 233205 468040 832997 670752 234999 86653 55752
423 55752 -233662 -339663 -43543 -41690 27119 195812 98287 -219501 -526855 -786974 -673325
412 -673325 -449320 -387485 -410728 -440130 -179815 -149188 -237018 -228989 -252831 -240571 -188716 -93744
400 -93744 -269 -75656 -19782 191594 112837 -50969 -135454 -161054 -223198 -80878 -16733
389 -16733 -303955 -599086 -412029 13978 304810 271043 235755 478673 604027 790859
379 790859 803723 521716 191289 -186670 -450187 -475592 -418082 -308749 -218060 -71151 -55833
368 -55833 -177981 -128130 130039 169628 48917 329322 555535 658802 711588 574831 315012
357 315012 93824 75465 75551 -211841 -449892 -343794 55117 142801 -104846 -440318 -774969
346 -774969 -1064758 -1106912 -812024 -513463 -468540 -407375 -353342 -310129 82234 349000 324016
335 324016 551934 752690 734385 639261 698421 720325 629493 640744 711645 620927 422991
324 422991 395323 339817 240375 331009 360300 428805 300219 -7847 -403684 -792332 -628390
313 -628390 -169748 101144 186167 510644 841972 913241 705330 252561 -131920 -346685
303 -346685 -514754 -430931 -122064 49423 -113931 -282013 -177884 -37781 112371 48195
293 48195 168249 126329 -125747 -48944 44495 126297 147391 30576 25416 401656 899555
282 899555 1164698 1064252 738627 797447 981046 884271 889082 740562 526230 192936 -175695
271 -175695 -339701 -201102 120716 236954 304145 134203 -163504 -315485 -273814 -207197
261 -207197 -243756 -186164 -114567 -65633 14784 64087 115658 280300 339475 269155 295063 387885
249 387885 260665 247906 165753 365436 723514 686398 717620 816820 732674 528382 480552
238 480552 457945 379671 443484 498372 278692 178730 449291 760278 879206 761910 509968
227 509968 222823 75763 183641 -19292 -118957 44215 222656 270416 92105 -122342
217 -122342 -210369 -347030 -454640 -357381 -252911 -171860 -72313 55688 5620 -238449 -122957
206 -122957 109884 180857 323626 386673 424805 396435 322972 378483 477293 409635 235218
195 235218 117634 39407 -145255 -369817 -139478 152210 72270 -73831 -93789 4399 348873
184 348873 486501 399184 405041 347819 151267 -43082 -256035 -335666 -125580 89856 274965
173 274965 426929 515754 428533 201899 -23639 105886 232544 168228 172870 217501 116791
162 116791 -28471 -26782 136069 52137 -222297 -449049 -310646 60623 369434 315758 147383
151 147383 131757 63661 -8305 2176 126511 344007 650915 714905 500004 416585 339260
140 339260 19568 -60931 57890 238326 435982 416452 593633 704877 402868 200015
130 200015 155286 59602 18001 120146 244634 205124 230866 336797 145784 -44381 138094
119 138094 156638 172069 366763 293922 146186 -139048 -446735 -654066 -730582 -722754 -521681
108 -521681 -331318 -204041 -57256 260354 426644 330360 353364 357327 161741 21558 -54838
97 -54838 -29473 84793 -3105 -79136 -98745 -34578 235165 386238 364892 374903 299671 120798
85 120798 -121683 -286594 -421408 -424311 -167843 -48588 -101430 -79577 154899 470437 574873
74 574873 349537 365779 597540 680494 658951 738819 802664 876420 682430 427596 307663
63 307663 166022 283677 366688 356779 197199 143830 117494 41952 141760 171805 -30849
52 -30849 2254 92399 122618 206481 282550 365944 398124 321966 144735 65243 139820 303419
40 303419 552812 637512 513981 499627 452078 348451 328601 369938 327580 130104 51530
29 51530 119173 119161 80661 38778 -154633 -326346 -249682 -48417 357851 618824 492238 315100
17 315100 245272 593624 816530 846651 700079 522270 431722 253090 -9590 -207248 -237952
6 -237952 -154520 -63931 60298 96817 174646 252960
0 252960
$$ Imaginary data points
##PAGE= N=2
##DATA TABLE= (X++(I..I)), XYDATA
32767 528627 631756 714546 734719 558362 555931 557714 486159 475231 556842 484134 412276
32756 412276 501217 647598 717504 692734 572125 478955 617545 793791 722578 435287
32746 435287 225933 356437 541349 670876 726956 774263 818237 860633 750373 456157
32736 456157 373162 557116 752571 860831 947903 1110692 1068938 814655 726847 777364
32726 777364 1016814 1351922 1423011 1361143 1507370 1599234 1567131 1496879 1330376 1091147
32716 1091147 961212 991978 1192212 1474707 1528084 1411174 1408852 1488040 1661266 1814993
32706 1814993 1637987 1430653 1373259 1290296 1451710 1477510 1379266 1572485 1813870 1830518
32696 1830518 1612891 1503431 1582597 1659031 1502490 1323329 1176214 1093484 1246599 1682246
32686 1682246 2008876 2028745 1990778 1741046 1354173 1285947 1503942 1605534 1446282 1406347
32676 1406347 1653446 1948528 2017017 2029811 2202068 2413251 2438224 2245612 2083011 2124953
32666 2124953 2089602 1898774 1859943 1843015 1645311 1571975 1637109 1824165 1869181 1772319 1809881
32655 1809881 1853720 1875363 2011000 2118792 2096464 2301277 2383961 2476283 2510286 2475237 2496073
32644 2496073 2540542 2609033 2602217 2483569 2324100 2255232 2121480 2100229 2107412 1958071 1893425
32633 1893425 2017188 2282248 2560447 2689422 2580343 2498719 2661485 2544042 2285729 2120489
32623 2120489 2056453 2172109 2311801 2583141 2947842 3154437 3021791 2849477 2905170 2761369
32613 2761369 2612740 2728481 2809721 2579833 2474975 2513256 2406778 2368193 2300824 2621315
32603 2621315 3014990 3112247 2922376 2730748 2794964 3021606 3130692 3060092 2791350 2802150
32593 2802150 3069490 3334888 3307649 3112408 3143770 3162446 3235919 3247389 3163010 3039681
32583 3039681 2962178 3037553 3192514 3314110 3375184 3278498 3059834 2864445 2563726 2534748
32573 2534748 2806943 3021532 2906779 2870822 2985700 2771605 2879317 3139545 3107520 3201327
32563 3201327 3591223 3664970 3328969 3033858 2891179 2962520 3145245 3142278 2876944 2771791
32553 2771791 3204939 3502655 3560944 3389978 3193400 2796401 2574619 2888297 3176401 3294669
32543 3294669 3153259 2990828 2977386 3188680 3519400 3794233 3889917 3979488 4222817 3993238
32533 3993238 3591003 3593415 3437165 3395458 3419965 3491723 3772721 3848506 3824987 3601998 3543494
32522 3543494 3645719 3532913 3517368 3241925 2814516 2810659 3212446 3643571 3977752 4056861
32512 4056861 3864961 3802460 3901527 3904842 3777119 3769023 3919399 3786225 3420932 3288461
32502 3288461 3139318 3054154 3258098 3444427 3347462 3209858 3300250 3668221 3895887 3621578
32492 3621578 3464684 3580983 3587209 3423688 3400419 3505030 3516695 3570713 3575662 3390171 3427720
32481 3427720 3566789 3601283 3738786 3776048 3649718 3785119 3900286 4033706 4085553 3935758
32471 3935758 3863041 3722094 3483176 3332639 3569570 3964653 3998908 3695037 3485761 3348485
32461 3348485 3065115 3100575 3504642 3893114 4128384 3974749 3842385 3638362 3576840 3980083
32451 3980083 4271742 4318657 4257239 4345027 4479696 4418800 4211157 3965880 3968739 4195438
32441 4195438 4505562 4808202 4956848 5012868 4919236 4494499 4167436 4089542 4182858 4184351
32431 4184351 3988870 3852851 3939333 3954911 3617476 3234334 2889651 2817185 3211104 3652150
32421 3652150 3952506 3892363 3741520 3959919 4119642 3952347 3984341 4269794 4505422 4546917
32411 4546917 4356362 4231821 4282442 4336785 4171010 4233878 4517807 4589994 4389134 4161787
32401 4161787 3941977 3892570 3982624 3987224 3971063 3985541 4334240 4685749 4626862 4389418 4452187
32390 4452187 4695894 4827988 4901408 4786881 4472186 4279297 3953733 3786353 3912771 4058071
32380 4058071 4144194 4219832 4247699 4488202 4731926 4667651 4498449 4373710 4483668 4721836
32370 4721836 4829703 4675462 4509460 4553037 4606505 4666289 4820734 4950238 4996224 4790742
32360 4790742 4662600 4460638 4377788 4354721 4328971 4444130 4402837 4300229 4484418 4753775
32350 4753775 4865917 4857970 4515187 4140779 4208838 4394462 4429413 4279814 4040888 4068549
32340 4068549 4067486 3985211 4060526 4286718 4475224 4420745 4425257 4406490 4504982 4662948 4870400
32329 4870400 4989527 4987530 4793098 4792176 4973432 4943054 4792310 4707492 4751659 4804383 4833913
32318 4833913 4870273 4823360 4777998 4891143 5192248 5314406 5280167 5340664 5452752 5513023
32308 5513023 5125688 4759301 4632423 4615009 4685222 4735403 4799121 4508340 4034288 3924913
32298 3924913 4387202 4687283 4823015 4986080 5081560 5310385 5487642 5450585 5395831 5267845
32288 5267845 5167541 5201089 4830488 4684113 4719255 4501644 4423651 4468755 4445769 4353704
32278 4353704 4414057 4626130 4839640 4804290 4650270 4700729 4912573 4955870 4954156 4767527
32268 4767527 4408702 4500239 4585257 4659234 4885995 5138802 5182300 5027231 4706750 4500486
32258 4500486 4267525 4208463 4331576 4295746 4244451 4305678 4317547 4436201 4684097 4965162
32248 4965162 5190300 5238292 5072952 5138406 5014337 4913687 4755869 4549766 4576254 4688882
32238 4688882 4864048 5016793 4996136 4933977 4893616 4847901 4701382 4263770 3962353 4231290
32228 4231290 4602838 4782295 4754290 4562313 4583197 4606161 4836994 5054095 5092169 4843364
32218 4843364 4380869 4038468 3962947 4395761 4824092 4819762 5037177 5438826 5563486 5413623
32208 5413623 5340804 5367975 5448530 5588069 5734805 5516401 5124410 5040919 5099167 5242620
32198 5242620 5305029 4915582 5066923 5226506 5162218 4948657 4635112 4494951 4424042 4420384
32188 4420384 4698044 5080572 5295411 5399815 5377466 5379321 5528292 5562122 5520845 5703405
32178 5703405 5843583 5917119 5861177 5627035 5295594 5337507 5352347 5141237 5147111 5016673
32168 5016673 4643613 4374845 4379088 4313606 4522531 4721000 4875992 5004316 4984220 5045391
32158 5045391 5114497 5086229 4891664 4725446 5107874 5737100 5994157 5784364 5171441 4684075
32148 4684075 4491514 4304930 4053558 3868929 4149077 4467559 4628808 4653024 4576345 4394055
32138 4394055 4481538 4898148 5114213 5115478 5104923 4975304 4975710 5025083 5180633 5492924 5472758
32127 5472758 5297611 5316173 5291251 5206518 5125492 4992635 4954266 4866790 4498128 4377078
32117 4377078 4527272 4599698 4802235 4675379 4453683 4430252 4745995 4745459 4702907 4698082 4872403
32106 4872403 5359116 5672628 5442469 5082552 4713985 4687832 4773089 4808035 4917570 4731765
32096 4731765 4823728 5057336 5117002 5200084 4806387 4480350 4447170 4501338 4693846 4889186
32086 4889186 4827617 4662812 4594131 4786631 4889493 4933944 4902294 4783761 4848929 5043601
32076 5043601 5220382 5287201 5351131 5258742 4839151 4666724 4893036 5156879 5245778 5091756
32066 5091756 4911524 4860838 5058704 5078946 5109128 5210167 5250743 5394380 5449967 5260462
32056 5260462 5103606 4981722 4973587 5029476 5126959 5218095 5347555 5529884 5502101 5226603
32046 5226603 5044930 5200833 5302731 5156395 5226085 5399465 5397854 5340318 5042655 5008104
32036 5008104 5203694 5415240 5554650 5442959 5049316 5048880 5590442 5637746 5388651 5455418
32026 5455418 5527887 5572823 5387412 5412691 5663110 5670364 5434527 5075959 5134370 5289956
32016 5289956 4815906 4560348 4695266 4699535 4885339 5329631 5365833 5258936 5269512 5192238
32006 5192238 5315400 5424665 5450360 5281668 5130798 5222115 5238136 5345502 5669391 5895769
31996 5895769 5622657 5624527 5611352 5230108 5071252 5017020 4992827 5096391 5420610 5783150
31986 5783150 5901359 5989066 5684286 5151045 4863736 4825988 4740894 4733548 5157367 5585855
31976 5585855 5517675 5348225 5332085 5200654 5352279 5652739 5644570 5282603 4900896 4510872
31966 4510872 4434780 4837389 5039974 4977446 5154025 5145648 5117859 5208315 5280303 5530946 5721287
31955 5721287 5939328 6139205 5782173 5552129 5604511 5542747 5469743 5566921 5898508 5966562
31945 5966562 5797556 5784462 5739211 5653170 5503796 5293479 5016077 4831740 4957215 5395643
31935 5395643 5510673 5096593 4933466 5082871 5194252 5252355 5048538 4822986 4596560 4645484
31925 4645484 4841534 5058328 5248293 5102375 4820037 4884594 5068686 5044018 5209307 5517667
31915 5517667 5305135 5153473 5398296 5715214 5837432 5723723 5658506 5605859 5479209 5508162
31905 5508162 5430898 5388816 5553192 5890073 6009182 5651163 5307201 5144269 5184573 5224577
31895 5224577 5325376 5381644 5593662 5617646 5313216 5321759 5416962 5378891 5270842 5297270 5459571
31884 5459571 5600895 5600949 5425666 5515607 5558570 5253366 5312032 5493689 5508523 5521425 5449323
31873 5449323 5113481 4818463 4886331 5031041 5277862 5534135 5485481 5250646 5060293 4883856
31863 4883856 4965818 5101850 4941445 4826132 4954727 5009066 5025836 5273320 5339888 5415785
31853 5415785 5506496 5685843 5856350 5819104 5498794 5321589 5325638 5470677 5318801 5169340
31843 5169340 5175816 4948480 4858122 4906976 4839691 4691045 4933927 5269758 5355664 5290060 5134170
31832 5134170 4874338 4717971 4713596 4863360 5331594 5690001 5500521 5203593 4969497 4854672
31822 4854672 4782573 4617728 4534689 4784543 4970804 4616152 4384378 4631760 4904121 4725794
31812 4725794 4506544 4659778 4882815 4897526 4990453 5361038 5711154 5667745 5350683 5146318
31802 5146318 5114453 5307302 5429836 5534126 5532262 5440858 5340541 5458281 5884316 6146430
31792 6146430 5979416 5797706 5712640 5996855 6224510 5937730 5608660 5392170 5144026 4807771
31782 4807771 4901984 5109679 5057058 4944021 4940793 5110123 5574162 5730115 5742379 5892739
31772 5892739 5977468 5901684 5731338 5410219 4955741 4725358 4853850 5122144 5275611 5414779
31762 5414779 5536595 5290560 5103287 5474089 5434840 5290155 5533142 5612320 5486080 5266672
31752 5266672 4944292 4659957 4831717 5010856 5032066 5175212 5268862 5125205 4930552 4767948
31742 4767948 4850401 4866263 4947356 4993983 4920460 4873759 4712684 4914140 5167330 5038188
31732 5038188 4949484 5107257 5102773 4916054 4937147 5156395 5127035 5156712 5415199 5720417
31722 5720417 5603171 5224767 4889929 4754128 4731204 4649292 4834933 5304199 5786463 5966724
31712 5966724 5814765 5659532 5505055 5258022 5167229 5284159 4983008 4782082 4742728 4813158
31702 4813158 5107540 5338190 5391697 5361471 5307034 5406030 5479595 5639947 5762741 5634693
31692 5634693 5570706 5692757 5384726 5039789 4946405 5156304 5502772 5650575 5341891 5077204
31682 5077204 4991771 5174650 5446992 5332188 5108865 4945815 4714084 4590777 4633420 4765018
31672 4765018 4872205 5025177 5040731 4833064 4494720 4621389 5080655 5402032 5519021 5428314
31662 5428314 5117370 5058702 5473673 5354753 4929772 4866862 4906371 4793440 4921962 5162003
31652 5162003 5305570 5498505 5635301 5441072 5131414 5003355 5117340 5648680 5814142
31643 5814142 5612005 5811294 6038261 6226562 6033690 5830832 5903273 5885184 5571223 5270466
31633 5270466 5190916 5215301 5045245 4909888 5158590 5436456 5286335 4760597 4191660 4137882
31623 4137882 4630050 5032680 5271947 5356041 5313094 5196808 5267972 5530998 5548302 5348612
31613 5348612 5233481 5216766 5102947 5047962 5157423 5101160 4918466 4916416 4689246 4305063
31603 4305063 4377636 4517656 4663271 4905413 5152774 5352227 5376530 5410812 5523513 5445194
31593 5445194 5482639 5699712 5479199 5188299 4966522 4716064 4447439 4510519 4787211 4954967
31583 4954967 5174242 5328923 5319840 5059704 4778063 4909417 5403396 5722097 5533780 5253945
31573 5253945 5272574 5245595 5243102 5212204 5092261 5240178 5349650 5272785 5307452 5434620 5534549
31562 5534549 5486114 5623488 5613788 5861507 6177355 6140431 6001798 5957670 6047245 5854293
31552 5854293 5937464 5817851 5623402 5616327 5756783 5534140 4894588 4486735 4502650 4510190
31542 4510190 4483481 4533112 4781513 5023963 5167922 5317326 5223841 5058933 4858721 4582161
31532 4582161 4527323 4657330 4874421 5065232 5297052 5306435 4803642 4497186 4436538 4371143
31522 4371143 4452896 4616817 5033231 5217881 5216851 5176331 5229136 5374937 5397570 5401473 5602557
31511 5602557 5611472 5149331 4922021 5370167 5732961 5673654 5521736 5244910 5161218 5319019
31501 5319019 5448630 5142512 4989446 4846363 4783049 4974404 4921609 4750140 4652378 4584384
31491 4584384 4452839 4415584 4587464 4785625 5136460 5606136 5654664 5594878 5601711 5665483
31481 5665483 5702294 5347764 4617344 4237916 4222846 4263999 4626106 4949762 5095264 5253093
31471 5253093 5491467 5622162 5688260 5825608 5877177 5690821 5278904 4978071 5148790 5408140
31461 5408140 5344553 5501365 5652750 5540515 5463364 5284444 5295404 5501623 5323343 5167374
31451 5167374 5274891 5224070 4851260 4684470 4440820 4318457 4392101 4706853 5187009 5250601
31441 5250601 5018467 5042837 5146364 5511157 5585047 5411965 5374732 5245422 5249897 5087833
31431 5087833 4946093 4668448 4495689 4596278 4825591 4976638 5090883 5257570 5413028
31422 5413028 5772674 6103023 6015786 5875126 5509169 4957070 5084330 5191483 5167044 5018035
31412 5018035 4526429 4723222 5247226 5286130 5070919 4866528 4817654 5047594 5152619 4942325
31402 4942325 4844561 5088284 5239831 5330828 5322777 5250761 5246313 5249528 5311409 5623880 5877192
31391 5877192 5832814 6036829 6033845 5685128 5422403 5285104 5435322 5415473 5090077 4907778
31381 4907778 4913385 4625147 4459174 4690473 5031571 5200184 5166232 5190391 5136856 4823966
31371 4823966 4575697 4430317 4446515 4441306 4478155 4354822 4483575 4793954 4965506 5206350
31361 5206350 5415240 5491745 5215170 4985651 4628951 4371013 4507897 4777034 5250446 5140142
31351 5140142 4875816 5058017 5238903 5015342 4951577 5170288 4935096 4698654 4913566 5132292
31341 5132292 5145404 5002601 4563247 4477780 4662701 4848578 4857953 4860628 5236311 5597238
31331 5597238 5811255 5830235 5743821 5672303 5317890 4985207 4797286 4638782 4734576 5005186
31321 5005186 4926228 4684928 4979977 5398812 5712900 5998703 6109882 6007550 5807507 5606887
31311 5606887 5395435 5287768 5372301 5734939 6155534 6204289 5929442 5867587 5879879 6078243
31301 6078243 6128680 6037207 5609945 5229988 5415031 5604796 5517310 5424744 5375603 5459879
31291 5459879 5407288 5301848 5407530 5460704 5578977 5649503 5716230 5581558 5377589 5145457
31281 5145457 5019760 5097635 5347793 5346294 5350047 5388117 5513442 5725713 5671095 5582829 5514340
31270 5514340 5410911 5514691 5477418 5467800 5424054 5118231 4834802 4803944 4893113 4956997 4857251
31259 4857251 4673315 4555342 4734108 5042453 5098332 4987208 4867917 4932336 5109471 5125679
31249 5125679 4923484 4941669 5104676 5234860 5464418 5611466 5430868 5551577 5484795 5108524
31239 5108524 4963081 4845060 4937430 4860840 4928633 5206772 5459937 5718069 5889575 6033719
31229 6033719 6130278 6254472 6209899 5888333 5481257 5265102 5361377 5365876 5097235 5248310
31219 5248310 5604656 5628355 5208601 5114921 5297174 5577456 5715022 5519676 5308965 4935781
31209 4935781 4576122 4376328 4209167 4300534 4488047 4728074 4950647 5070597 5135776 5223980
31199 5223980 5309656 5262913 5264105 5454934 5799712 5800886 5555329 5571364 5944995 5973207 5723868
31188 5723868 5507997 5459994 5658338 5704038 5631589 5717412 5622557 5409727 5308838 5424660
31178 5424660 5680497 5695589 5481205 5122336 5065430 5307911 5407027 5457804 5164353 4850243
31168 4850243 5010629 5367167 5654170 5628882 5382854 5243362 5394074 5617910 5563270 5340145
31158 5340145 5149808 4864903 4680135 4713365 4990762 5201189 5067799 4860628 5058202 5157567
31148 5157567 5014537 5247359 5796285 5788687 5348221 4800513 4448157 4477058 4868913 5390310
31138 5390310 5658735 5849938 6054617 6240777 6314921 6303144 6140209 5712501 5238288 5183251
31128 5183251 5608280 5964025 6126463 6351594 6645395 6772820 6494695 6393848 6320963 6098832
31118 6098832 6050381 6064472 6072641 6059351 5757478 5591572 5739586 5867005 5648466 5510346
31108 5510346 5367417 5380403 5526626 5504041 5469025 5437224 5433655 5515536 5564897 5359427 5258915
31097 5258915 5358795 5467800 5796347 5567263 4944859 4576665 4448197 4611882 5020158 5216578
31087 5216578 5375753 5386396 5232714 5258103 5196875 5158075 5107922 5373044 5748957 5543700
31077 5543700 5038846 4880740 4937807 4922989 4820156 4963228 5076233 4985412 4809662 4920163
31067 4920163 5040267 5042759 4801886 4649986 4713068 4639895 4549583 4465146 4612308 4952599
31057 4952599 5393089 5585104 5394179 4932212 4654779 4530797 4872868 5503377 5442379 5079746
31047 5079746 5188690 5185907 5012012 4820763 4644964 4391353 4284695 4636903 5070165 5376939
31037 5376939 5378033 5259697 5435423 5713265 5938349 6000495 5867944 5559036 5031005 4924752
31027 4924752 5259656 5423997 5436756 5493272 5250512 5092180 4999479 4853295 5019794 5090927
31017 5090927 5135211 5391038 5747091 5800439 5624460 5478832 5319357 5209055 5140109 5076946
31007 5076946 4959576 4855430 4537044 4376603 4827786 5348926 5309440 4993632 4820252 4885801
30997 4885801 5008711 5063000 5041127 5277340 5433917 5449192 5360759 5382753 5303477 5238538 4969601
30986 4969601 4982232 5262713 5327605 5108102 4856483 4666820 4574587 4808224 4976056 5227453
30976 5227453 5290160 5067294 4868813 4628080 4694642 5113096 5335777 5435165 5504701 5429145
30966 5429145 5495190 5573657 5500225 5203456 4935807 4872901 4827826 4804157 5089060 5288592
30956 5288592 5395873 5628839 5740828 5746472 5695939 5562891 5454165 5380587 4979993 4538688
30946 4538688 4551254 4791943 4964041 5265954 5634019 5522947 5476282 5673967 5614887 5759541
30936 5759541 5908631 5870734 5872690 5603886 5123760 4869916 4650547 4349602 4439344 4858328
30926 4858328 4974526 5010588 5300780 5387458 5318484 5328156 5583986 5700841 5721673 5734478 5836725
30915 5836725 5911959 5958312 6000361 5770903 5377089 5256020 5353835 5219482 4938501 4694763
30905 4694763 4802472 4908737 5160968 5436968 5602989 5626651 5660990 5863708 6084754 6156924
30895 6156924 5664437 4987145 4675690 4752088 4874156 4793652 4827182 5072974 5381338 5457379
30885 5457379 5268527 5326752 5648566 5639406 5407478 5262469 5016208 5006217 5161894 5467245
30875 5467245 5740160 5699097 5435345 5119154 4794715 4716065 4637527 4270029 4160247 4322641
30865 4322641 4844663 5470647 5657023 5564367 5818814 6025851 5746196 5203934 5075293 5323667
30855 5323667 5447232 5529961 5634468 5537248 5223788 5544201 5790333 5427596 5087898 4875097
30845 4875097 4935925 5092140 5260642 5245310 5233487 5335372 5582880 5586978 5402974 5289247
30835 5289247 5289333 5305796 5391379 5200905 5022101 5134837 5263704 5227654 5417550 5705111 5777411
30824 5777411 5888531 5787442 5567138 5527204 5357763 5358289 5297437 5275669 5086222 4607625
30814 4607625 4381200 4480963 4553537 4847000 5260098 5493220 5613203 5391818 5035074 4845132
30804 4845132 4858855 4979934 5301391 5500588 5476172 5709550 5874963 5759751 5449304 5238223
30794 5238223 5420015 5596607 5571444 5361525 5299476 5173741 4964000 4998677 5074375 5160590
30784 5160590 5220585 5235427 5335883 5372080 5396444 5455770 5643932 5630070 5639651 5837434 5832172
30773 5832172 5532706 5331077 5311428 5095361 4954611 5053890 5125634 5531020 5591266 5246229
30763 5246229 5190868 5110011 4876484 4572219 4602817 4697613 4831215 4959707 5278028 5782417
30753 5782417 5987780 5685336 5477285 5627026 5916447 6422714 6736272 6269285 5752745
30744 5752745 5576593 5299214 5170169 5030099 4784596 4715033 4772026 5034495 5089639 5045456
30734 5045456 5067268 5095916 5253632 5264342 5112945 5236977 5684905 5776054 5841980 5628376
30724 5628376 5352781 5197941 4993209 4947079 5069737 5150350 4966529 4953000 5297829 5633258
30714 5633258 5899354 6203584 6206766 6109464 6177408 6262506 6225262 6128522 6226512 6563476 6780555
30703 6780555 6789113 6470481 6226994 6120605 5783240 5367572 5303970 5373366 5387086 5484482
30693 5484482 5609497 5725632 5976827 6159715 5905133 5501031 5134687 4930870 4880320 5060333
30683 5060333 5211059 5403187 5671006 5590645 5371119 5277555 5110057 4934559 4689536 4577644
30673 4577644 4562551 4863857 5312327 5542767 5756903 5583921 5340329 4990621 4962022 5104856
30663 5104856 5342862 5836514 6008890 5957809 5780485 5573805 5324751 5111210 4758425 4571166
30653 4571166 4748045 5208072 5442094 5445547 5543184 5651717 5752062 5639792 5128196 4885094
30643 4885094 5060178 5412880 5858528 5852053 5715272 5891165 5932779 5431015 5136257 5203608
30633 5203608 5526257 5829130 5945863 5937626 5771568 5743769 5790585 5622636 5137202 4671667
30623 4671667 4392529 4346773 4760630 5177183 5373943 5374204 4943554 4432793 4310167 4476813
30613 4476813 4735956 5057500 4977136 4885339 4750506 4852210 5199222 5367425 5673472 5671398
30603 5671398 5552712 5432006 5221188 5264635 5011096 4721252 4773532 4847515 4903637 5426775
30593 5426775 5701684 5728943 5852222 5869073 5862574 5684296 5204187 5049072 5001662 4912610
30583 4912610 4837840 4741334 4502924 4280144 4368013 4591519 4683917 4888778 5448567 5698365
30573 5698365 5518377 5421959 5497263 5414615 5422074 5544943 5782215 5823876 5789159 5790434 5676197
30562 5676197 5658680 5678624 5414957 5272815 5563742 5628272 5169577 5039823 5186587 5132465
30552 5132465 4914917 4685121 4582931 4617822 4929578 5093898 5169487 5467446 5663935 5781347
30542 5781347 5830438 5798605 5932927 6040631 5998656 5668002 5186444 4980721 5010718 5109115
30532 5109115 5330244 5393625 5216787 5107096 5328618 5473920 5452122 5530360 5729560 5816221
30522 5816221 5595560 5430235 5518712 5543782 5482067 5341505 5079555 4998536 5067372 4934352
30512 4934352 4786995 4845635 4884225 5081133 5349349 5301766 5234712 5430521 5639480 5891047
30502 5891047 6057307 5695782 5435699 5407865 5450265 5520047 5468087 5504265 5691277 6102162
30492 6102162 6305393 6442622 6454113 6237727 6068084 5828027 5834844 5696447 5509195 5535682
30482 5535682 5796991 5879102 5866300 5932837 5747853 5737575 5595159 5327504 5193250 5076154
30472 5076154 5154834 5526218 5844093 5973900 5975311 5726694 5419540 5265869 5115490 4973751
30462 4973751 5079238 5326571 5442606 5372068 4963740 4956101 5078097 5142122 5268279 5358234
30452 5358234 5352383 5396448 5353510 5101799 5003090 4896504 4748046 4741513 4828318 4959582 5190113
30441 5190113 5177832 5092290 5412302 5598430 5701531 6068735 6174371 6016889 6122426 6235060
30431 6235060 6099522 6032277 5737282 5313002 5203257 5195023 5329463 5535748 5527049 5159267
30421 5159267 4695806 4762482 4728794 4742614 5095920 5267818 5067029 4736050 4653744 5096528
30411 5096528 5701730 6022765 6085583 5989005 5847809 5410489 4683126 4271989 4528831 5048946
30401 5048946 5293350 5147523 5073771 5046416 5000284 4854118 4823654 4860265 5069250 5334932
30391 5334932 5449662 5522588 5522602 5655187 5616322 5297135 4929548 4894609 5010403 5276798 5661436
30380 5661436 6211279 6495052 6405942 6216172 6243492 6449413 6415350 6356599 6356426 6106188 5729150
30369 5729150 5390467 5256909 5228397 5146587 5029066 4480275 4486759 4948093 5517991 5739119
30359 5739119 5553786 5636518 5891701 5848503 5282617 4615540 4512762 4954496 5082036 4921818
30349 4921818 5038167 5209330 5520692 5845603 6016352 6341063 6572142 6508175 6289759 6003300
30339 6003300 5629690 5252608 5387981 5644447 5605532 5553709 5657294 5864569 5976947 5701477
30329 5701477 5263201 5284037 5595907 5606670 5648223 5710449 5822590 6174033 6120652 6094890
30319 6094890 6237623 6257161 5979470 5617021 5360947 5026563 5106310 5461195 5484228 5099799
30309 5099799 5045374 5185542 5087430 5077165 5433421 5884354 5974526 5736983 5319103 5017629
30299 5017629 5141381 5221587 5124066 5121548 5074970 5300308 5618859 6028876 6160841 6005269
30289 6005269 5830481 5547453 5255236 4874464 4597121 4620603 4697029 4880946 4936835 4629063
30279 4629063 4539418 4506048 4388558 4303567 4246113 4421628 4714479 4966289 5058086 4880215
30269 4880215 5213090 5415232 5325575 5367464 5095836 5062235 5285726 5538289 5623619 5440023
30259 5440023 5367829 5361455 5447253 5331915 5143091 5284208 5599195 5647201 5417624 5443955
30249 5443955 5460308 5371971 5366728 5578333 5788721 5763871 5633122 5267755 5300003 5754792
30239 5754792 5853505 5582411 5495602 5575600 5449440 5276214 5260234 5394743 5467751 5531913
30229 5531913 5522178 5460855 5347713 5306938 5388539 5172972 4939009 5013192 5092263 4946845 5141398
30218 5141398 5665632 5784622 5749394 5904507 5789544 5632803 5466458 5375781 5548869 5670676
30208 5670676 5569303 5443934 5405734 5304766 5151421 5186817 5110506 4953207 5008663 4925689
30198 4925689 4468256 4328147 4701735 4596325 4445473 4678091 4909513 5136617 5236644
30189 5236644 4931949 4886787 4911339 4515868 3968168 3923211 4432000 4713999 4735292 4990614
30179 4990614 5267582 5333895 5448886 5597081 5596257 5449212 5210186 5026251 5018576 5232287
30169 5232287 5560377 5414710 5194971 5175406 5320741 5486626 5386472 5362493 5376765 5234416
30159 5234416 5006704 4858656 5138003 5482629 5478454 5581101 5811990 5947689 5872201 5729094
30149 5729094 5639889 5719583 5796613 5532698 5362808 5712744 5811992 5385078 5175963 5347814
30139 5347814 5431724 5481995 5484970 5721070 5982036 5845475 5718975 5533557 5304556 5401675
30129 5401675 5434050 5361873 5348076 5563662 5657994 5432559 5195631 5166907 5300808 5499949
30119 5499949 5756284 5646700 5348795 5159593 5147360 5238294 5437926 5612667 5849205 5858320
30109 5858320 5601183 5525464 5440834 5481408 5157977 5020118 5259778 5417850 5613328 5910616
30099 5910616 6209924 6143353 5702974 5103856 4967815 5080641 5424190 5787496 5657124 5387912
30089 5387912 5382371 5645105 5879918 5874292 5633082 5587544 5692967 5475473 5273017 5242765
30079 5242765 5179939 5005290 4932359 5093468 5150022 5010204 4849975 4738302 4748384 4700971
30069 4700971 4542021 4431001 4698419 5066437 5404658 5597171 5422551 5148929 4890488
30060 4890488 4914618 5216805 5442335 5426048 5108859 4891943 4753510 4472220 4529422 4832701
30050 4832701 5118944 5489736 5896284 6009880 6216798 6502409 6188916 6022917 6071123 5770535
30040 5770535 5451932 5279492 5337135 5366372 5421076 5409757 5550187 5635296 5570182 5632213 5628778
30029 5628778 5522270 5628228 5755830 5543615 5510737 5615496 5577861 5251623 5047702 5024426
30019 5024426 5061559 5501890 6019853 6222132 6127364 5901646 5618494 5564787 5452544 5211638
30009 5211638 4898291 4742281 4846284 4665952 4457233 4756632 5169084 5141094 5264380 5533439
29999 5533439 5588378 5483860 5622630 5848119 6013838 6036007 5735914 5157215 4834235 4878438
29989 4878438 4793855 4835609 5170745 5254613 5014984 4770470 4688035 4864553 5057443 4979897
29979 4979897 4863879 4978951 5095843 5301941 5357422 5414357 5426526 5458466 5552039 5401544
29969 5401544 5318040 5278672 5382969 5645932 5744708 5645219 5575214 5548692 5670877 5863486
29959 5863486 5492843 5249617 5491698 5874925 5819364 5571839 5501175 5451309 5396522 5497423
29949 5497423 5339622 5332917 5554975 5653036 5853460 5869611 5879079 5919531 5932893 5947324 5981017
$$ [...]
##END NTUPLES=NMR SPECTRUM
##END=
