##TITLE=C13_LR-695-CR5-K1
 CDCl3, 22400 sc

 25.2.2020
##JCAMPDX= 6.0         $$ Bruker NMR JCAMP-DX V2.0
##DATA TYPE= NMR SPECTRUM
##DATA CLASS= NTUPLES
##ORIGIN= UXNMR, Bruker Analytische Messtechnik GmbH
##OWNER= root
$$ XWIN-NMR		Version 3.5
$$ Wed Feb 26 13:55:01 2020 Russian Standard Time (UT+4h)  she@DPX200
##.OBSERVE FREQUENCY= 50.327896
##.OBSERVE NUCLEUS= ^13C
##.ACQUISITION MODE= SIMULTANEOUS
##.ACQUISITION SCHEME= undefined
##.AVERAGES= 22400
##.DIGITISER RES= 17
##SPECTROMETER/DATA SYSTEM= spect
##.PULSE SEQUENCE= zgpg30
##.SOLVENT NAME= D2O
##.SHIFT REFERENCE= (INTERNAL, D2O, 0, 222.624)
##AUDIT TRAIL= $$ (NUMBER, WHEN, WHO, WHERE, WHAT)
$$ ##TITLE= Audit trail, XWIN-NMR		Version 3.5
$$ ##JCAMPDX= 5.01
$$ ##ORIGIN= Bruker BioSpin GmbH
$$ ##OWNER= she
$$ F:/spectra/data/she/nmr/c13/1/pdata/1/auditp.txt
$$ ##AUDIT TRAIL=  $$ (NUMBER, WHEN, WHO, WHERE, WHAT)
(   1,<2020-02-26 13:52:34.40 +0400>,<she>,<DPX200>,
      <created by zg, POWCHK disabled, PULCHK disabled
       terminated by command 'halt'
       configuration hash MD5:
       00 E9 B6 7A A2 85 ED C7 34 08 36 98 17 FE 4E 26
       data hash MD5: 32K
       05 55 60 61 1D 12 1D 1D 17 81 99 A5 10 82 5F 2A>)
(   2,<2020-02-26 13:52:42.14 +0400>,<she>,<DPX200>,
      <Start of raw data processing
       efp BC_mod = 2 LB = 1 FT_mod = 6 PKNL = 1 PHC0 = -206.5268 PHC1 = 11.60638 SI = 32K 
       data hash MD5: 32K
       35 C2 DC B6 5C 26 D4 ED CE F5 01 EB DB B1 74 7A>)
(   3,<2020-02-26 13:52:45.60 +0400>,<she>,<DPX200>,
      <abs ABSG = 5 
       data hash MD5: 32K
       85 41 44 62 36 62 71 0D D3 FF 5D B6 47 A8 44 3A>)
(   4,<2020-02-26 13:53:16.37 +0400>,<she>,<DPX200>,
      <pk PHC0 = -5.698137 PHC1 = 12.4 
       data hash MD5: 32K
       D7 EE 27 17 20 C4 50 6C 86 B9 6E BE 3A CE 46 55>)
(   5,<2020-02-26 13:53:19.82 +0400>,<she>,<DPX200>,
      <abs ABSG = 5 
       data hash MD5: 32K
       F9 C6 68 E1 61 99 A3 98 B5 72 CA 82 98 AB 9E 3C>)
(   6,<2020-02-26 13:53:58.28 +0400>,<she>,<DPX200>,
      <pk PHC0 = -14.41446 PHC1 = 26.40001 
       data hash MD5: 32K
       EE AF 6B 51 D1 93 D4 1C A0 D0 5D AD 54 53 EA A4>)
(   7,<2020-02-26 13:54:01.32 +0400>,<she>,<DPX200>,
      <abs ABSG = 5 
       data hash MD5: 32K
       0F E6 C0 7D 3D 40 8D FE E9 5C F4 DE 69 05 CA 4F>)
$$ ##END=
$$ 
$$ hash MD5
$$ 33 AE 13 00 36 C7 43 29 2C 56 B5 C2 BE 05 EB A3
##$RELAX= 
##$RELAX= 
##$RELAX= 
##$RELAX= 
##$RELAX= 
##$RELAX= 
##$RELAX= 
##$RELAX= 
$$ Bruker specific parameters
$$ --------------------------
##$DU= <F:/spectra>
##$EXPNO= 1
##$NAME= <c13>
##$PROCNO= 1
##$TYPE= <nmr>
##$USER= <she>
##$AMP= (0..31)
100 100 100 100 100 100 100 100 100 100 100 100 100 100 100 100 100 100 
100 100 100 100 100 100 100 100 100 100 100 100 100 100 
##$AQSEQ= 0
##$AQ_mod= 1
##$AUNM= <au_zg>
##$AUTOPOS= <>
##$BF1= 50.322709
##$BF2= 200.13
##$BF3= 50.322709
##$BF4= 500.13
##$BF5= 500.13
##$BF6= 500.13
##$BF7= 500.13
##$BF8= 500.13
##$BYTORDA= 1
##$CFDGTYP= 0
##$CFRGTYP= 5
##$CHEMSTR= <none>
$$ [...]
##$SUBNAM4= <"">
##$SUBNAM5= <"">
##$SUBNAM6= <"">
##$SUBNAM7= <"">
##$SUBNAM8= <"">
##$SUBNAM9= <"">
##$SW= 239.972175391363
##$SWIBOX= (0..15)
0 1 3 0 0 0 0 0 0 0 0 0 0 0 0 0 
##$SW_h= 12077.2946859903
##$TD= 32768
##$TD0= 1
##$TE= 0
##$TE2= 300
##$TE3= 300
##$TEG= 300
##$TL= (0..7)
120 120 120 120 120 120 120 120 
##$TP= (0..7)
150 150 150 150 150 150 150 150 
##$TP07= 0
##$TPNAME0= <>
##$TPNAME1= <>
##$TPNAME2= <>
##$TPNAME3= <>
##$TPNAME4= <>
##$TPNAME5= <>
##$TPNAME6= <>
##$TPNAME7= <>
##$TPOAL= (0..7)
0.5 0.5 0.5 0.5 0.5 0.5 0.5 0.5 
##$TPOFFS= (0..7)
0 0 0 0 0 0 0 0 
##$TUNHIN= 0
##$TUNHOUT= 0
##$TUNXOUT= 0
##$USERA1= <user>
##$USERA2= <user>
##$USERA3= <user>
##$USERA4= <user>
##$USERA5= <user>
##$V9= 5
##$VALIST= <valist>
##$VCLIST= <CCCCCCCCCCCCCCC>
##$VD= 0
##$VDLIST= <DDDDDDDDDDDDDDD>
##$VPLIST= <PPPPPPPPPPPPPPP>
##$VTLIST= <TTTTTTTTTTTTTTT>
##$WBST= 1024
##$WBSW= 4
##$XGAIN= (0..3)
0 0 0 0 
##$XL= 0
##$YL= 0
##$YMAX_a= 36277843
##$YMIN_a= -144951138
##$ZGOPTNS= <>
##$ZL1= 120
##$ZL2= 120
##$ZL3= 120
##$ZL4= 120
##$ABSF1= 222.624
##$ABSF2= -17.3728
##$ABSG= 5
##$ABSL= 3
##$ALPHA= 0
##$AQORDER= 0
##$ASSFAC= 0
##$ASSFACI= 0
##$ASSFACX= 0
##$ASSWID= 0
##$AUNMP= <proc_1d>
##$AZFE= 0.1
##$AZFW= 0.5
##$BCFW= 0
##$BC_mod= 2
##$BYTORDP= 0
##$COROFFS= 0
##$CY= -3
##$DATMOD= 1
##$DC= 0
##$DFILT= <>
##$DTYPP= 0
##$F1P= 0
##$F2P= 0
##$FCOR= 0.5
##$FTSIZE= 32768
##$FT_mod= 6
##$GAMMA= 0
##$GB= 0
##$INTBC= 1
##$INTSCL= 4.134877e-10
##$ISEN= 128
##$LB= 1
##$LEV0= 0
##$LPBIN= 0
##$MAXI= 10000
##$MC2= 0
##$MEAN= 0
##$ME_mod= 0
##$MI= 0.1934396
##$NCOEF= 0
##$NC_proc= 2
##$NLEV= 6
##$NOISF1= 120.0001
##$NOISF2= 80.00006
##$NSP= 0
##$NTH_PI= 0
##$NZP= 0
##$OFFSET= 222.624
##$PC= 1.4
##$PHC0= -226.6394
##$PHC1= 50.40639
##$PH_mod= 1
##$PKNL= yes
##$PPARMOD= 0
##$PSCAL= 0
##$PSIGN= 0
##$REVERSE= no
##$SF= 50.3227315989248
##$SI= 32768
##$SIGF1= 140
##$SIGF2= 120
##$SINO= 11.81781
##$SIOLD= 32768
##$SREGLST= <13C.CDCl3>
##$SSB= 0
##$STSI= 32768
##$STSR= 0
##$SW_p= 12077.2946859903
##$SYMM= 0
##$S_DEV= 0
##$TDeff= 32768
##$TDoff= 0
##$TI= <>
##$TILT= no
##$TM1= 0
##$TM2= 0
##$TOPLEV= 0
##$USERP1= <user>
##$USERP2= <user>
##$USERP3= <user>
##$USERP4= <user>
##$USERP5= <user>
##$WDW= 1
##$XDIM= 32768
##$YMAX_p= 486156297
##$YMIN_p= -3215737
$$ End of Bruker specific parameters
$$ ---------------------------------
##NTUPLES= NMR SPECTRUM
##VAR_NAME=  FREQUENCY,     SPECTRUM/REAL,   SPECTRUM/IMAG
##SYMBOL=    X,             R,               I
##VAR_TYPE=  INDEPENDENT,   DEPENDENT,       DEPENDENT
##VAR_FORM=  AFFN,          ASDF,            ASDF
##VAR_DIM=   32768,         32768,           32768
##UNITS=     HZ,            ARBITRARY UNITS, ARBITRARY UNITS
##FACTOR=    0.368581032318806, 1,           1
##FIRST=     11203.0474431902, 0,            0
##LAST=      -874.247242800138, 0,           0
##MIN=       -874.247242800138, -3215737,    0
##MAX=       11203.0474431902, 486156297,    0
$$ Real data points
##PAGE= N=1
##DATA TABLE= (X++(R..R)), XYDATA
$$ [...]
$$ plain form
15948 -995336 -824875 -493268 -236821 172945 94753 -419275 -560088 -628734 -820942 -529260
15938 -529260 -34237 92784 136039 248882 638348 985210 623895 367427 271195 47784
15928 47784 79341 -235488 -645995 -791288 -338421 252372 314492 222820 488972 611018
15918 611018 934979 1084670 1129064 1222979 1143425 817139 65302 -365084 -420310 -568539
15908 -568539 -439379 -458956 -495150 -418172 -461830 -277965 -191937 -645411 -937018 -868177 -974126
15897 -974126 -717099 -353026 -579151 -946709 -945932 -769172 -704956 -734585 -402237 -576121
15887 -576121 -920749 -1239764 -1269567 -1112932 -1002207 -956467 -1006782 -739867 -437052 -372833
15877 -372833 -205293 235843 523496 69456 -287278 -299529 -421910 -583956 -803821 -1030936
$$ packed form
15948i95336J70461L31607K56447M09766p8192n14028j40813o8646j92208K91682
15938e29260M95023J27021M3255J12843L89466L46862l61315k56468r6232k23411
15928D7784L1557l14829m10507j45293M52867N90793O2120r1672K66152J22046
15918F11018L23961J49691M4394R3915p9554l26286p51837m30386n5226j48229
15908e68539J29160j9577l6194P6978m3658J83865Q6028m53474k91607O8841j05949
15897i74126K57027L64073k26125l67558P77J76760O4216k9629L32348j73884
15887e76121l44628l19015k9803J56635J10725M5740n0315K66915L02815O4219
15877c72833J67540M41136K87653m54040l56734j2251j22381j62046k19865k27115
$$ plain form
15867 -1030936 -1032078 -949717 -639651 -300503 -111978 219455 670862 312341 -247556 -219833
15857 -219833 -187604 -102906 -51225 -124919 121002 457757 459277 536774 498056 482033 200677
15846 200677 121411 214735 -52731 -224503 -440642 -519255 -430255 -208457 -44670 -30056
15836 -30056 -110747 -4378 -113111 -474173 -612571 -655311 -79488 272140 277361 -99041
15826 -99041 -308047 -45375 197454 309258 451868 317107 -78331 -9970 240604 73151
15816 73151 -330858 -743157 -715009 -302671 -22692 -211262 -509094 -556649 -295146 244681
15806 244681 376780 939 34982 609043 775295 697241 640507 462888 497789 712821
15796 712821 355254 253099 688842 1223586 944826 64974 -448459 -480267 -480323 -345701
$$ packed form
15867a030936j142Q2361L10066L39148J88525L31433M51407l58521n59897K7723
15857b19833L2229Q4698N1681p3694K45921L36755J520P7497l8718j6023k81356
15846B00677p9266R3324k67466j71772k16139p8613Q9000K21798J63787J4614
15836c0056q0691J06369j08733l61062j38398m2740N75823L51628N221l76402
15826i9041k09006K62672K42829J11804J42610j34761l95438O8361K50574j67453
15816G3151m04009m12299K8148M12338K79979j88570k97832m7555K61503N39827
15806B44681J32099l75841L4043N74061J66252p8054n6734j77619L4901K15032
15796G12821l57567j02155M35743N34744k78760q79852n13433l1808n6J34622
$$ plain form
15786 -345701 -331310 -86030 -128434 -592417 -648781 -819583 -692433 -376618 -255568 -355484
15776 -355484 -399147 -51658 383520 1036187 1636150 1625654 1094357 335027 81695 98524
15766 98524 -207179 -636075 -803494 -463531 -165166 -361735 -289936 202847 366819 237782
15756 237782 60359 -128990 1538 -321636 -608655 -396108 -598023 -635094 -346482 259500
15746 259500 335325 -7132 -135017 -246154 -172686 265603 684363 774266 475375 620131
15736 620131 1103183 1395842 1314061 1130933 725931 474234 409179 326307 360864 224257
15726 224257 -118103 -64335 -57908 -20803 244964 74276 -22774 262270 948895 1119894
15716 1119894 561103 148980 45950 -165511 -248107 -166990 -63201 182026 316729 453202
$$ packed form
15786c45701J4391K45280m2404m63983n6364j70802J27150L15815J21050r9916
15776c55484m3663L47489M35178O52667N99963j0496n31297p59330k53332J6829
15766I8524l05703m28896j67419L39963K98365j96569P1799M92783J63972j29037
15756B37782j77423j89349J30528l23174k87019K12547k01915l7071K88612O05982
15746B59500P5825l42457j27885j11137P3468M38289M18760Q9903k98891J44756
15736F20131M83052K92659q1781j83128m05002k51697o5055q2872L4557j36607
15726B24257l42360N3768O427L7105K65767j70688r7050K85044O86625J70999
15716A119894n58791m12123j03030k11461q2596Q1117J03789K45227J34703J36473
$$ plain form
15706 453202 686334 693519 679945 770731 789918 748400 942822 822232 314008 -200013 -283405
15695 -283405 -361916 -975288 -1028405 -877283 -912650 -1038776 -832585 -604289 37330 99004
15685 99004 -553579 -1120352 -1222083 -1293476 -1249448 -1136539 -1318053 -959079 -436084 149106
15675 149106 463478 423461 169756 -1391 -58265 -159892 -248266 -513923 -555821 -350756
15665 -350756 -77001 124081 -358151 -995361 -1520614 -1490845 -1007303 -618537 -340230 -238340
15655 -238340 -80072 335570 289036 102683 105601 10450 54769 39658 -141339 83169 55954
15644 55954 -48399 -214826 -512319 -871052 -530199 -49925 364892 635529 410323 168695
15634 168695 74705 -86910 -477278 -896738 -1115379 -981364 -576056 -399378 -332601 -342627
$$ packed form
15706D53202K33132P185j3574R0786J9187m1518J94422j20590n08224n14021q3392
15695b83405p8511o13372n3117J51122l5367j26126K06191K28296O41619O1674
15685I9004o52583n66773j01731p1393M4028J12909j81514L58974N22995N85190
15675A49106L14372m0017k53705j71147n6874j01627q8374k65657m1898K05065
15665c50756K73755K01082m82232o37210n25253K9769M83542L88766K78307J01890
15655b38340J58268M15642m6534j86353K918r5151M4319j5111j80997K24508k7215
15644E5954j04353j66427k97493l58733L40853M80274M14817K70637k25206k41628
15634A68695r3990j61615l90368m19460k18641J34015M05308J76678O6777j0026
$$ plain form
15624 -342627 -720540 -799250 -504645 -416316 -769014 -823825 -520217 25862 315652 376385
15614 376385 242985 -127147 -622394 -395612 599179 927685 677851 396200 -17379 -301291
15604 -301291 25482 350215 280142 -86597 -336647 -563540 -1002220 -626743 -31084 147375
15594 147375 91963 -474828 -978435 -777103 -567362 -957387 -602067 -117020 -151264 -125136
15584 -125136 -244376 -334741 -294263 -15735 105930 457752 614352 262953 79763 341447
15574 341447 267776 6113 127819 178468 795266 1087605 828651 891542 759038 318363
15564 318363 -55562 -368320 -361714 34443 140380 170663 -72519 -441056 -554239 -475820
15554 -475820 -238769 -31585 -422167 -1063727 -1123448 -1160468 -929195 -864165 -489239 130607
$$ packed form
15624c42627l77913p8710K94605Q8329l52698n4811L03608N46079K89790O0733
15614C76385j33400l70132m95247K26782R94791L28506k49834k81651m13579k83912
15604c01291L26773L24733p0073l66739k50050k26893m38680L75477N95659J78459
15594A47375n5412n66791n03607K01332K09741l90025L55320M85047l4244K6128
15584a25136j19240r0365M0478K78528J21665L51822J56600l51399j83190K61684
15574C41447p3671k61663J21706N0649O16798K92339k58954O2891j32504m40675
15564C18363l73925l12758O606L96157J05937L0283k43182l68537j13183P8419
15554d75820K37051K07184l90582o41560n9721l7020K31273O5030L74926O19846
$$ plain form
15544 130607 224300 -110317 -179689 59414 176624 4440 94688 548422 1160837 1404570
15534 1404570 1385350 1047068 488842 133844 -13107 -373252 -1114311 -1257363 -831004 -289762
15524 -289762 -103134 -374524 -413887 -166936 177385 500497 406029 260895 321780 612386
15514 612386 997752 1019448 662245 251434 129805 191004 161740 -367279 -503816 -448113
15504 -448113 -394548 -9627 211991 496694 835329 755312 445869 179401 262244 709406
15494 709406 1016927 714771 130402 17822 156558 462024 537532 266500 130715 376829
15484 376829 288815 -274492 -775125 -734655 -297174 -96821 -280844 -761653 -1243415 -804870
15474 -804870 76669 586038 624479 -24823 -508142 -865368 -1017798 -881495 -1117845 -1212088
$$ packed form
15544A30607R3693l34617o9372K39103J17210j72184R0248M53734O12415K43733
15534A404570j9220l38282n58226l54998j46951l60145p41059j43052M26359N41242
15524b89762J86628k71390l9363K46951L44321L23112r4468j45134O0885K90606
15514F12386L85366K1696l57203m10811j21629O1199k9264n29019j36537N5703
15504d48113N3565L84921K21618K84703L38635q0017l09443k66468Q2843M47162
15494G09406L07521l02156n84369j12580J38736L05466P5508k71032j35785K46114
15484C76829q8014n63307n00633M0470M37481K00353j84023m80809m81762M38545
15474h04870Q81539N09369L8441o49302m83319l57226j52430J36303k36350r4243
$$ plain form
15464 -1212088 -875441 -819181 -963012 -1124185 -1079575 -1060221 -1103500 -996251 -878030 -275134
15454 -275134 -166370 -534483 -628080 -272014 -102979 232372 276145 103738 -56015 166182
15444 166182 482789 811629 1139920 1143420 1012348 843881 602629 392601 229127 66232
15434 66232 262679 204048 -215797 -236340 -133170 -260771 -117785 504601 980048 1189705
15424 1189705 1550446 1808015 1940397 1772147 1284924 716223 3271 -518873 -561720 -490743
15414 -490743 -515473 -408674 -183629 -285209 -44122 323929 355648 217789 25299 78943
15404 78943 97556 190184 255158 232158 573676 754991 921162 830311 309254 -75957 107876
15393 107876 27016 -208708 -203731 -416621 -445491 -591460 -511847 -203917 -57032 216526
$$ packed form
15464a212088L36647N6260j43831j61173M4610J9354m3279J07249J18221O02896
15454b75134J08764l68113r3597L56066J69035L35351M3773j72407j59753K22197
15444A66182L16607L28840L28291L500j31072j68467k41252k10028j63474j62895
15434F6232J96447n8631m19845k0543J03170j27601J42986O22386M75447K09657
15424A189705L60741K57569J32382j68250m87223n68701p12952n22144m2847P0977
15414d90743k4730J06799K25045j01580K41087L68051L1719j37859j92490N3644
15404G8943J8613R2628O4974k3000L41518J81315J66171r0851n21057l85211J83833
15393A07876q0860k35724M977k12890k8870j45969P9613L07930J46885K73558
$$ plain form
15383 216526 361501 454207 756409 948247 852061 842869 856535 409424 44764 150996
15373 150996 80057 -132676 -322080 -456005 -512700 -145374 274671 516958 466649 65059
15363 65059 -328630 -498995 -24541 481353 831924 483152 -212951 -490291 -352353 -297597
15353 -297597 -429634 -438209 -195511 -228585 -453169 -548644 -568420 -706713 -940285 -1247694
15343 -1247694 -1174322 -741340 -504708 -141201 255149 364419 236889 218860 506657 689946
15333 689946 610373 307539 458756 774350 380013 -151567 24072 579945 870371 871640
15323 871640 620968 698078 532086 -74852 -29062 210359 -138504 -390738 -618444 -858035
15313 -858035 -738239 -275703 30897 206300 303311 107976 363398 738248 551972 -77145
$$ packed form
15383B16526J44975R2706L02202J91838r6186r192J3666m47111l64660J06232
15373A50996p0939k12733j89404j33925n6695L67326M20045K42287n0309m01590
15363F5059l93689j70365M74454N05894L50571l48772o96103k77340J37938N4756
15353b97597j32037q575K42698l3074k24584r5475j9776j38293k33572l07409
15343a247694P3372M32982K36632L63507L96350J09270j27530j8029K87797J83289
15333F89946p9573l02834J51217L15594l94337n31580J75639N55873K90426J269
15323H71640k50672P7110j65992o06938M5790K39421l48863k52234k27706k39591
15313h58035J19796M62536L06600J75403R7011j95335K55422L74850j86276o29117
$$ plain form
15303 -77145 -361869 135991 519118 230172 -435583 -789782 -813448 -740202 -456897 -198096
15293 -198096 -292048 -472836 -656627 -841915 -879887 -1024666 -822152 -260656 -21407 199932
15283 199932 455766 468720 270415 -72540 -230902 -367648 -684515 -1092376 -1083107 -971938
15273 -971938 -1034669 -784172 -699580 -578262 -565950 -782787 -775840 -494506 -193230 -354466
15263 -354466 -442753 -292262 -353976 -654765 -791325 -567466 -108203 -4967 -48351 -150100
15253 -150100 -19194 526736 412540 139608 144556 464269 695207 752242 628213 207775
15243 207775 -1893 203940 347424 281702 -40564 137333 595511 781329 748996 520197
15233 520197 355640 50794 -173125 -195249 -81996 -106275 16449 169712 -36629 -452573
$$ packed form
15303g7145k84724M97860L83127k88946o65755l54199k3666P3246K83305K58801
15293a98096r3952j80788j83791j85288l7972j44779K02514N61496K39249K21339
15283A99932K55834J2954j98305l42955j58362j36746l16867m07861R269J11169
15273i71938o2731K50497Q4592J21318J2312k16837O947K81334L01276j61236
15263c54466q8287J50491o1714l00789j36560K23859M59263J03236m3384j01749
15253a50100J30906N45930j14196k72932M948L19713K30938N7035j24029m20438
15243B07775k09668K05833J43484o5722l22266J77897M58178J85818l2333k28799
15233E20197j64557l04846k23919k2124J13253k4279J22724J53263k06341m15944
$$ plain form
15223 -452573 -925202 -1043333 -931441 -754329 -310540 -173547 -427336 -594568 -604221 -511667
15213 -511667 -657655 -581902 -604354 -579131 -387633 -370203 -393268 -423674 -190650 -132591 -262154
15202 -262154 39945 279750 396976 -61033 -539404 -470487 -578306 -755843 -823069 -738371
15192 -738371 -953177 -1519191 -1479776 -1207866 -1107053 -830996 -278272 -50732 -40174 -84172
15182 -84172 -264954 -117688 33216 -236098 -476045 -579310 -583604 -619055 -711230 -713865 -795816
15171 -795816 -1253533 -1512502 -1465368 -1515789 -1079987 -73607 425425 700293 725294 258856
15161 258856 -55900 -451397 -529224 -169807 166232 -62481 -331764 -485543 -454132 -223892
15151 -223892 -4634 -120419 -95870 150338 13054 -226471 -366078 -383601 -254032 -90070
$$ packed form
15223d52573m72629j18131J11892J77112M43789J36993k53789j67232r653R2554
15213e11667j45988P5753k2452K5223J91498J7430k3065l0406K33024N8059j29563
15202b62154L02099K39805J17226m58009m78371O8917j07819j77537o7226Q4698
15192g38371k14806n66014L9415K71910J00813K76057N52724K27540J0558m3998
15182h4172j80782J47266J50904k69314k39947j03265m294l5451r2175k635q1951
15171g95816m57717k58969M7134n0421M35802J006380M99032K74868K5001m66438
15161B58856l14756l95497p7827L59417L36039k28713k69283j53779L1411K30240
15151b23892K19258j15785K4549K46208j37284k39525j39607j7523J29569J63962
$$ plain form
15141 -90070 397750 495621 140671 -163727 -45390 167796 -261937 -883317 -1150278 -1220043
15131 -1220043 -1277341 -1199132 -995098 -583828 141684 640791 754798 702790 193968 -609333
15121 -609333 -1083605 -1211499 -1152429 -743192 -593661 -1027420 -1785630 -2470035 -2480521 -2317348
15111 -2317348 -1912172 -1299868 -579985 -259556 -70923 12635 -221082 36059 318897 -26454
15101 -26454 -854638 -1472618 -1259367 -485059 -390648 -828074 -521225 141113 691996 908938
15091 908938 432957 48654 -303793 -283160 318809 827386 889864 334620 -363511 -395065
15081 -395065 50629 266087 151634 94465 582880 985690 697703 324208 23458 -52519
15071 -52519 43143 -165256 -265983 -230840 -109273 135670 129408 2446 166688 202572 -175633
$$ packed form
15141i0070M87820R7871l54950l04398J18337K13186m29733o21380k66961o9765
15131a220043n7298P8209K04034M11270P25512M99107J14007n2008n08822q03301
15121f09333m74272j27894N9070M09237J49531m33759p58210o84405j0486J63173
15111b317348M05176O12304P19883L20429J88633Q3558k33717K57141K82838l45351
15101b6454q28184o17980K13251P74308R4411m37426L06849O62338N50883K16942
15091I08938m75981l84303l52447K0633O01969N08577O2478n55244o98131l1554
15081c95065M45694K15458j14453n7169M88415M02810k87987l73495l00750p5977
15071e2519R5662k08399j00727L5143J21567K44943o262j26962J64242L5884l78205
$$ plain form
15060 -175633 -226188 -256294 -566291 -662290 -653489 -697288 -634201 -672884 -931019 -912463 -893603
15049 -893603 -847123 -635352 -720347 -1139643 -1026496 -485016 -373727 -515887 -48298 534705
15039 534705 917282 968491 1002981 649710 156324 245206 186233 -350306 -798455 -1050862
15029 -1050862 -1069991 -825446 -599078 -516094 -819547 -984310 -1120834 -1534602 -1515095 -1043144
15019 -1043144 -1071581 -989846 -621618 -337511 4240 81300 -42153 -349715 -809551 -1105478
15009 -1105478 -660559 109724 102786 -412458 -858954 -1164944 -959371 -736930 -661248 9334
14999 9334 746860 780769 417152 178430 488095 740772 471525 204910 180654 -48371
14989 -48371 -255713 -209203 -121899 -134813 -19209 11691 -161062 -295885 -688927 -959219
$$ packed form
15060a75633n0555l0106l09997r5999Q801m3799O3087l8683k58135J8556J8860
15049h93603M6480K11771q4995m19296J13147N41480J11289j42160M67589N83003
15039E34705L82577N1209L4490l53271m93386Q8882n8973n36539m48149k52407
15029a050862j9129K44545K26368Q2984l03453j64763j36524m13768J9507M71951
15019a043144k8437Q1735L68228K84107L41751P7060j23453l07562m59836k95927
15009a105478M44919P70283o938n15244m46496l05990K05573K22441P5682O70582
14999I334P37526L3909l63617k38722L09665K52677k69247k66615k4256k29025
14989d8371k07342M6510Q7304j2914J15604L0900j72753j34823l93042k70292
$$ plain form
14979 -959219 -618153 -366600 -377764 -201986 -418726 -419617 -79926 162899 378043 608266
14969 608266 668042 415085 -160125 -367359 -325992 -293676 -303145 -258000 -96714 -207273 -458584
14958 -458584 -424089 -117289 203203 572755 493941 154738 -90328 70437 77461 -572799
14948 -572799 -769419 -520271 34755 528698 715365 368989 169521 -20616 5536 -155608
14938 -155608 -367219 -277464 -354339 -102113 188269 35983 -132813 246637 485144 242915
14928 242915 611 146569 390568 617779 571178 417257 249673 15583 43905 71441
14918 71441 138130 -193934 -672149 -480456 -330776 -571948 -473048 -65830 -148111 -191251
14908 -191251 51729 408823 182805 -222396 -626538 -969206 -1025269 -1149336 -1289523 -1432632
$$ packed form
14979i59219L41066K51553j1164J75778k16740q91L39691K42825K15144K30223
14969F08266N9776k52957n75210k07234M1367L2316r469M5145J61286j10559k51311
14958d58584L4495L06800L20492L69552p8814l39203k45066J60765P024o50260
14948e72799j96620K49148N55026M93943J86667l46376j99468j90137K6152j61144
14938a55608k11611Q9755p6875K52226K90382j52286j68796L79450K38507k42229
14928B42915k42304J45958K43999K27211m6601j53921j67584k34090K8322K7536
14918G1441O6689l32064m78215J91693J49680k41172R8900M07218q2281m3140
14908a91251K42980L57094k26018m05201m04142l42668n6063j24067j40187j43109
$$ plain form
14898 -1432632 -986250 -417536 -432712 -846799 -1208523 -990291 -559362 -383808 -510438 -751923
14888 -751923 -614526 -167747 -123017 -315635 -333415 -345311 -619635 -755988 -745583 -863555
14878 -863555 -1027437 -913007 -319240 -123393 -215998 -122356 -231722 -448165 -281272 -146493
14868 -146493 -57740 6861 22522 154261 154942 113394 239114 -155725 -603106 -382697 68129
14857 68129 454604 269815 -141869 -259869 -403925 -445557 -382803 -234539 -134585 -136902 -417867
14846 -417867 -321616 38763 -105616 -461368 -532364 -576502 -877676 -690109 -531190 -792305
14836 -792305 -914546 -731446 -477970 -769948 -1426909 -1852476 -1836084 -1448120 -1067192 -1114205
14826 -1114205 -1308943 -1369526 -1156699 -850185 -615819 -833572 -970204 -829999 -662778 -488623
$$ packed form
14898a432632M46382N68714j5176m14087l61724K18232M30929J75554j26630k41485
14888g51923J37397M46779M4730j92618j7780j1896k74324j36353J0405j17972
14878h63555j63882J14430N93767J95847r2605R3642j09366k16443J66893J34779
14868a46493Q8753O4601J5661J31739O81m1548J25720l94839m47381K20409M50826
14857F8129L86475j84789m11684j18000j44056m1632O2754J48264R9954k317k80965
14846d17867R6251L60379j44379l55752p0996m4138l01174J87567J58919k61115
14836g92305j22241J83100K53476k91978o56961m25567J6392L87964L80928m7013
14826a114205j94738o0583K12827L06514K34366k17753j36632J40205J67221J74155
$$ plain form
14816 -488623 -354762 -144813 91874 168266 382747 373544 98870 -161657 158915 177761
14806 177761 252683 377710 226763 154972 457087 448310 -198707 -332236 -217376 158860
14796 158860 618327 688261 265877 86094 288199 350113 448609 739481 885710 522093
14786 522093 91324 -269966 -381843 186322 296904 90863 397650 165261 1828 200878
14776 200878 142353 -74845 -192833 -373241 -904688 -990204 -598453 -427539 -162639 116267
14766 116267 -203470 -558203 -841970 -1159446 -909818 -631786 -962164 -1084776 -742179 -574453
14756 -574453 -872013 -672416 -336896 -209087 -302851 -60878 353189 602774 960708 1144412
14746 1144412 804313 403672 -71957 -413836 -388216 -76197 14680 -185221 -268976 -280676
$$ packed form
14816d88623J33861K09949K36687P6392K14481r203k74674k60527L20572J8846
14806A77761P4922J25027j50947p1791L02115q777o47017j33529J14860L76236
14796A58860M59467O9934m22384j79783K02105O1914R8496K90872J46229l63617
14786E22093m30769l61290j11877N68165J10582k06041L06787k32389j63433J99050
14776B00878n8525k17198j17988j80408n31447q5516L91751J70914K64900K78906
14766A16267l19737l54733k83767l17476K49628K78032l30378j22612L42597J67726
14756e74453k97560J99597L35520J27809r3764K41973M14067K49585L57934J83704
14746A144412l40099m00641m75629l41879K5620L12019R0877j99901q3755j1700
$$ plain form
14736 -280676 -181640 -196021 -400582 -13312 363020 269070 94148 100857 -139804 -309253
14726 -309253 142342 772947 868619 573196 272054 331270 521028 350723 84286 69210
14716 69210 227856 73080 -289466 -215710 -72472 226849 539157 483473 199890 -82221
14706 -82221 -174054 -300349 -504909 -427547 -650402 -860323 -391108 -294381 -150222 322004
14696 322004 647979 143877 -330558 -173043 -109275 -154050 -669501 -906235 -813954 -527806
14686 -527806 9980 239241 184497 13018 -188993 -254402 -127130 -68875 -206762 -841182
14676 -841182 -1202323 -1250090 -1328354 -1103427 -843701 -368683 152576 -110488 -465467 -442029
14666 -442029 -525552 -567075 -395511 68569 97612 233518 826355 759812 108663 -24734
$$ packed form
14736b80676R9036j4381k04561L87270L76332r3950j74922O709k40661j69449
14726c09253M51595O30605R5672k95423l01142N9216J89758j70305k66437j5076
14716F9210J58646j54776l62546P3756J43238K99321L12308n5684k83583k82111
14706h2221r1833j26295k04560P7362k22855k09921M69215R6727J44159M72226
14696C22004L25975n04102m74435J57515O3768m4775n15451k36734R2281K86148
14686e27806N37786K29261n4744j71479k02011o5409J27272N8255j37887o34420
14676h41182l61141m7767p8264K24927K59726M75018N21259k63064l54979K3438
14666d42029q3523m1523J71564M64080K9043J35906N92837o6543o51149j33397
$$ plain form
14656 -24734 -37935 -59464 184730 436420 586017 645845 422839 460739 132829 53676 415575
14645 415575 758618 971817 703995 325969 4875 -249947 -572637 -953483 -1320735 -1125084
14635 -1125084 -261383 396479 719584 1028199 1018561 898344 603583 489263 563868 740497
14625 740497 747907 698223 775494 555220 388408 512994 447103 -72569 -616045 -834918
14615 -834918 -810540 -778891 -903111 -1197836 -1341469 -1436707 -1454629 -1509601 -1386549 -1019045
14605 -1019045 -896337 -659562 -611908 -385959 -448193 -440709 45470 500487 874837 844579
14595 844579 793620 899489 1209200 1419025 1110074 623838 391174 657718 602791 184990
14585 184990 205426 4142 -382404 -468168 -79274 271141 595634 634829 207364 -28181
$$ packed form
14656b4734j3201k1529K44194K51690J49597N9828k23006L7900l27910p9153L61899
14645D15575L43043K13199k67822l78026l21094k54822l22690l80846l67252J95651
14635a125084Q63701O57862L23105L08615r638j20217k94761j14320P4605J76629
14625G40497P410m9684P7271k20274j66812J24586o5891n19672n43476k18873
14615h34918K4378L1649j24220k94725j43633r5238j7922n4972J23052L67504
14605a019045J22708K36775M7654K25949o2234P484M86179M55017L74350l0258
14595H44579n0959J05869L09711K09825l08951m86236k32664K66544n4927m17801
14585A84990K0436k01284l86546q5764L88894L50415L24493L9195m27465k35545
$$ plain form
14575 -28181 102853 237473 214327 46092 -212806 -18170 153 296338 593291 273703
14565 273703 18548 90993 215363 115003 236035 801888 871917 438095 256553 276040
14555 276040 46613 -348857 -256590 339685 668651 924054 1076915 1271912 1195613 1158796
14545 1158796 1146413 221889 -751874 -835754 -592826 -351892 -149197 42298 -19 -326427
14535 -326427 -528314 -828390 -536948 25042 -24121 -216749 -256754 3290 150402 174594
14525 174594 165929 34095 -322141 -746673 -697812 -374613 -494509 -753423 -699093 -410994
14515 -410994 28499 508476 430338 353255 418841 646906 641990 117587 -211665 -319418
14505 -319418 -551935 -977540 -1025378 -633333 -254171 89952 307136 398402 615215 650437
$$ packed form
14575b8181J31034J34620k3146j68235k58898J94636J8323K96185K96953l19588
14565B73703k55155P2445J24370j00360J21032N65853P0029m33822j81542J9487
14555B76040k29427l95470R2267N96275L28966K55403J52861J94997p6299l6817
14545A158796j2383r24524r73763q3880K42928K40934K02695J91495m2317l26408
14535c26427k01887l00076K91442N61990m9163j92628m0005K60044J47112K4192
14525A74594q665j31834l56236m24532M8861L23199j19896k58914N4330K88099
14515d10994M39493M79977p8138p7083O5586K28065m916n24403l29252j07753
14505c19418k32517m25605m7838L92045L79162L44123K17184R1266K16813L5222
$$ plain form
14495 650437 497479 194712 -134585 -151983 -60115 -87074 -5390 99309 -106381 -193538
14485 -193538 -820517 -1465191 -1337009 -1164260 -1210232 -1361590 -1377525 -1140766 -987999 -824379
14475 -824379 -427634 -46090 336452 192996 212932 238672 5417 -130932 31565 90642
14465 90642 -41850 42553 250463 285346 22100 53976 -203570 -595795 -956841 -979662
14455 -979662 -600113 -529823 -668396 -707790 -465987 -427135 -600041 -570208 -709064 -878101
14445 -878101 -365942 -92827 57268 349628 249309 -193697 -239242 -134564 79708 155242
14435 155242 279158 355035 278292 62178 -147518 -77179 83179 367912 844796 1141543
14425 1141543 601797 -270201 -908532 -1264315 -1147717 -1039231 -898593 -639652 -243318
$$ packed form
14495F50437j52958l02767l29297j7398R1868k6959Q1684J04699k05690q7157
14485a93538o26979o44674J28182J72749m5972j51358j5935K36759J52767J63620
14475h24379L96745L81544L82542j43456J9936K5740k33255j36349J62497N9077
14465I0642j32492Q4403K07910L4883k63246L1876k57546l92225l61046k2821
14455i79662L79549P0290j38573l9394K41803L8852j72906K9833j38856j69037
14445h78101N12159K73115J50095K92360j00319m43006m5545J04678K14272P5534
14435A55242J23916P5877p6743k16114k09696P0339J60358K84733M76884K96747
14425A141543n39746q71998o38331l55783J16598J08486J40638K58941L96334
$$ plain form
14416 -243318 12201 -319169 -755162 -1060275 -1052218 -1016739 -961131 -507145 -83306 -415729
14406 -415729 -887626 -466763 554707 997929 984662 1054571 1186471 936162 247319 -229880
14396 -229880 29007 587077 441237 -269025 -258330 -22397 2801 28882 -133640 -120890
14386 -120890 152579 131373 -39348 -27913 541563 746628 429088 183815 95843 -119099
14376 -119099 -259098 -187676 17699 211053 344128 199191 -153724 -220924 -434037 -649058
14366 -649058 -668071 -732570 -680529 -961864 -1186824 -792740 -327987 -224841 -490724 -728827
14356 -728827 -755329 -402821 -255311 -622801 -755944 -473632 -399484 -440014 -294337 -49684
14346 -49684 -121954 79357 219785 -227724 -540739 -775509 -1160273 -1072097 -793868 -651902
$$ packed form
14416b43318K55519l31370m35993l05113Q057L5479N5608M53986M23839l32423
14406d15729m71897M20863J021470M43222j3267O9909J31900k50309o88843m77199
14396b29880K58887N58070j45840p10262J0695K35933K5198K6081j62522J2750
14386a20890K73469k1206j70721J1435N69476K05065l17540k45273q7972k14942
14376a19099j39999P1422K05375J93354J33075j44937l52915o7200k13113k15021
14366f49058j9013o4499N2041k81335k24960L94084M64753J03146k65883k38103
14356g28827k6502L52508J47510l67490j33143K82312P4148m0530J45677K44653
14346d9684p2270K01311J40428m47509l13015k34770l84764Q8176K78229J41966
$$ plain form
14336 -651902 -540747 -576035 -515683 -463375 -242117 -35761 101315 157528 94852 -344616
14326 -344616 -476850 -300205 184984 965342 1373431 1135548 787973 546017 361857 -122323
14316 -122323 -642750 -922303 -1014692 -733112 -314465 -315260 -623062 -481909 -166306 209357
14306 209357 462469 474513 161073 275392 685185 788824 696344 347715 75819 -238981
14296 -238981 -349184 -197760 -45343 -484744 -870041 -1047741 -926162 -333444 426009 808989
14286 808989 572270 858075 920289 469319 174914 24542 -191122 -435864 -410442 -36266
14276 -36266 2953 336360 334753 90427 -408013 -933268 -809236 -431936 -99365 100321
14266 100321 358907 985902 946933 418546 357795 380126 -312600 -690369 -737512 -936771
$$ packed form
14336f51902J11155l5288O0352N2308K21258K06356J37076N6213o2676m39468
14326c44616j32234J76645M85189P80358M08089k37883l47575k41956j84160m84180
14316a22323n20427k79553r2389K81580M18647p95l07802J41153L15603L75663
14306B09357K53112J2044l13440J14319M09793J03639r2480l48629k71896l14800
14296b38981j10203J51424J52417m39401l85297j77700J21579N92718P59453L82980
14286H08989k36719K85805O2214m50970k94405j50372k15664k44742K5422L74176
14276c6266L9219L33407j607k44326m98440n25255J24032L77300L32571J99686
14266A00321K58586O26995l8969n28387o0751K2331o92726l77769m7143j99259
$$ plain form
14256 -936771 -851760 -626919 -745385 -707324 -436771 -193432 81760 437646 746375 531004
14246 531004 77397 -24494 -60213 -113659 -451863 -455119 36276 390896 864019 1076636
14236 1076636 1083578 937627 544025 6819 -211588 -230853 -176506 64477 -51787 -150483
14226 -150483 14983 11958 -246362 -330556 -473283 -658014 -561965 -225661 -87633 220662
14216 220662 295937 56052 288030 349891 430639 565504 570342 436963 49990 -398059
14206 -398059 -666241 -593192 -167913 -70575 -577681 -1044010 -842378 -416059 -3381 58147
14196 58147 268017 706048 793753 534810 639875 738331 382770 208586 -203160 -322679
14186 -322679 -199242 -509803 -1015599 -1316672 -898794 12430 326666 428304 772700 534529
$$ packed form
14256i36771Q5011K24841j18466L8061K70553K43339K75192L55886L08729k15371
14246E31004m53607j01891l5719n3446l38204l256M91395L54620M73123K12617
14236A076636O942j45951l93602n37206k18407j9265N4347K40983j16264r8696
14226a50483J65466l025k58320q4194j42727j84731R6049L36304J38028L08295
14216B20662P5275k39885K31978O1861Q0748J34865M838j33379l86973m48049
14206c98059k68182P3049M25279R7338n07106m66329K01632M26319M12678O1528
14196E8147K09870M38031Q7705k58943J05065R8456l55561j74184m11746j19519
14186c22679J23437l10561n05796l01073M17878R11224L14236J01638L44396k38171
$$ plain form
14176 534529 -113306 -119622 440335 553508 405651 167661 -111394 -258998 -86300 419918
14166 419918 536770 257468 97137 26505 62410 193493 -90240 -504061 -275328 -110632
14156 -110632 -222877 -415459 -258245 10303 13900 -316689 -991114 -987868 -110725 607546
14146 607546 653312 976146 1014893 635094 123922 -552497 -571818 -416104 -97424 231731
14136 231731 135689 -9686 125975 340955 293832 237841 43902 -68699 -91711 -473032
14126 -473032 -994760 -912848 -263391 40584 -368493 -435794 -226335 -53400 264608 200577
14116 200577 -186048 -184674 152592 608300 1180000 1066827 900407 1202625 1038686 598426
14106 598426 665510 525595 101030 176637 224441 107921 -110877 -134130 -149265 -312347
$$ packed form
14176E34529o47835o316N59957J13173j47857k37990k79055j47604J72698N06218
14166D19918J16852k79302j60331p0632L5905J31083k83733m13821K28733J64696
14156a10632j12245j92582J57214K68548L597l30589o74425L246Q77143P18271
14146F07546M5766L22834L8747l79799n11172o76419j9321J55714L18680L29155
14136B31731r6042j45375J35661K14980m7123n5991j93939j12601k3012l81321
14126d73032n21728Q1912O49457L03975m09077o7301K09459J72935L18008o4031
14116B00577l86625J374L37266M55708N71700j13173j66420L02218j63939m40260
14106E98426O7084j39915m24565P5607M7804j16520k18798k3253j5135j63082
$$ plain form
14096 -312347 157094 439767 266965 -84315 -710442 -786123 -646823 -664129 -467239 -209254
14086 -209254 -6232 85766 338872 614452 630742 553492 664134 984653 1076848 1001889
14076 1001889 762574 398474 -293151 -1167492 -1285554 -1244536 -1300884 -941871 -365698 -368990
14066 -368990 -775739 -876673 -896401 -429462 192415 507164 879130 811516 950917 985479
14056 985479 1005410 1239095 1316402 1220158 894121 1002309 1299362 1188343 706348 65809
14046 65809 93513 287634 -85685 -478240 -556998 -525193 -606620 -389956 105914 185876 -118901
14035 -118901 -668733 -932198 -726001 -662279 -894493 -885410 -924127 -468639 -135436 -166101
14025 -166101 -224291 -407453 -716070 -1028105 -1175107 -902552 -880639 -876335 -600032 -317715
$$ packed form
14096c12347M69441K82673j72802l51280o26127p5681J39300j7306J96890K57985
14086b09254K03022R1998K53106K75580J6290p7250J10642L20519R2195p4959
14076A001889k39315l64100o91625q74341j18062M1018n6348L59013N76173l292
14066c68990m06749j00934j9728M66939O21877L14749L71966o7614J39401L4562
14056I85479J9931K33685P7307r6244l26037J08188K97053j11019m81995o40539
14046F5809K7704J94121l73319l92555p8758L1805q1427K16664M95870P9962l04777
14035a18901n49832k63465K06197O3722k32214R083l8717M55488L33203l0665
14025a66101n8190j83162l08617l12035j47002K72555K1913M304K76303K82317
$$ plain form
14015 -317715 -133585 -86042 -321756 -241006 152073 127670 126580 160841 346360 389099 177219
14004 177219 -263904 -326134 -27868 -216684 -529353 -578581 -560153 -389833 -318440 -304487
13994 -304487 -105813 232612 389445 27677 -135053 51816 97263 18252 -14722 60709
13984 60709 -1475 -370549 -775706 -697853 -260787 145385 252655 336092 196107 -49116
13974 -49116 -85623 -271703 -476576 -596271 -627739 -599072 -669624 -556745 -337030 -212975
13964 -212975 41267 296956 347429 383405 419919 438017 52946 -320272 -701408 -737392
13954 -737392 -679615 -543222 -299097 -480937 -720438 -671628 -690343 -521564 -613217 -664845
13944 -664845 -445030 -210150 306161 469567 30653 -749302 -974863 -1155623 -993020 -587163
$$ packed form
14015c17715J84130M7543k35714Q0750L93079k4403j090L4261J85519M2739k11880
14004A77219m41123o2230K98266j88816l12669m9228J8428J70320P1393J3953
13994c04487J98674L38425J56833l61768j62730J86869M5447p9011l2974P5431
13984F0709o2184l69074m05157P7853M37066M06172J07270Q3437j39985k45223
13974d9116l6507j86080k04873j19695l1468K8667p0552J12879K19715J24055
13964b12975K54242K55689N0473L5976L6514J8098l85071l73218l81136l5984
13954g37392N7777J36393K44125j81840k39501M8810j8715J68779r1653n1628
13944f64845K19815K34880N16311J63406m38914p79955k25561j80760J62603M05857
$$ plain form
13934 -587163 -586046 -1019028 -1229894 -682424 -376080 -403761 -443470 -640252 -822610 -1141113
13924 -1141113 -840347 -160402 -106373 -316155 -457206 -346733 -261476 -154355 -282055 -708595
13914 -708595 -757760 -681628 -587965 -643873 -657475 -709906 -843589 -472679 -80539 139239 315825
13903 315825 405705 274905 340452 602862 800885 647886 132880 -429462 -874561 -847985
13893 -847985 -838789 -1128714 -1339477 -1373350 -1320394 -1331844 -1207240 -702169 -388766 -403775 -161212
13882 -161212 68920 144859 305353 768253 1150464 621243 -212039 -433934 -524038 -885889
13872 -885889 -1175297 -1002441 -886538 -1088769 -1010516 -306660 317108 283734 -213034 -800391
13862 -800391 -884752 -684066 -455674 -309219 -677064 -1132481 -1230966 -1202940 -1300688 -1239783
$$ packed form
13934e87163J117m32982k10866N47470L06344k7681l9709j96782j82358l18503
13924a141113L00766O79945N4029k09782j41051J10473Q5257J07121j27700m26540
13914g08595m9165P6132R3663n5908j3602n2431j33683L70910L92140K19778J76586
13903C15825Q9880j30800O5547K62410J98023j52999n15006n62342m45099K6576
13893h47985R196k89925k10763l3873N2956j1450J24604N05071L13403j5009K42563
13882a61212K30132P5939J60494M62900L82211n29221q33282k21895r0104l61851
13872h85889k89408J72856J15903k02231P8253P03856O23768l3374m96768n87357
13862h00391q4361K00686K28392J46455l67845m55417r8485K8026r7748O0905
$$ plain form
13852 -1239783 -922011 -755383 -716556 -926847 -1086255 -991972 -633438 -46958 -3263 -170507
13842 -170507 -128154 -13851 145684 557727 272356 -302495 -7704 542175 136127 -567657
13832 -567657 -812381 -733923 -725594 -870369 -926513 -900963 -664165 -408961 -287864 -443505
13822 -443505 -564625 -869349 -705944 -35537 453238 957630 1082445 683642 141426 -195442
13812 -195442 31109 321397 352879 156689 -192025 -438116 -176554 -166176 -363083 -543471
13802 -543471 -971518 -1013908 -815920 -1043396 -1762175 -1981948 -1596275 -1279166 -965020 -478818
13792 -478818 -125440 74086 216464 -95716 -265542 -227166 -83509 18313 -337502 -781794
13782 -781794 -990219 -906547 -763643 -597157 -753027 -764948 -597974 -232282 -96682 40873
$$ packed form
13852a239783L17772J66628L8827k10291j59408R4283L58534N86480M3695j67244
13842a70507M2353J14303J59535M12043k85371n74851K94791N49879m06048p03784
13832e67657k44724P8458Q329j44775n6144K5550K36798K55204J21097j55641
13822d43505j21120l04724J63405O70407M88775N04392J24815l98803n42216l36868
13812a95442K26551K90288L1482j96190l48714k46091K61562J0378j96907j80388
13802e43471m28047m2390J97988k27476p18779k19773L85673L17109L14146M86202
13792d78818L53378J99526J42378l12180j69826L8376J43657J01822l55815m44292
13782g81794k08425Q3672J42904J66486j55870j1921J66974L65692J35600J37555
$$ plain form
13772 40873 -20899 -279363 -405556 -552357 -624774 -671571 -622774 -341023 -509660 -1196973
13762 -1196973 -1469684 -1107993 -496454 -196672 -303177 6251 315527 314308 187369 289000
13752 289000 -10647 -415509 -248105 252628 640530 742817 716756 601988 632080 469378
13742 469378 166523 148274 152538 -36367 41607 341170 387467 373328 428438 177625 -148118
13731 -148118 -68807 276337 380167 435171 247166 -481097 -690320 -543094 -339428 -262915
13721 -262915 -803864 -1143758 -1294112 -1413802 -878147 -387053 -175235 -83108 -205384 -244900
13711 -244900 -461544 -386924 -272253 -302165 -176305 -120791 65546 507010 409879 62577
13701 62577 56762 29771 55989 -14418 -156716 -172202 -372274 -603461 -605226 -95410 405569
$$ packed form
13772D0873o1772k58464j26193j46801p2417m6797M8797K81751j68637o87313
13762a196973k72711L61691O11539K99782j06505L09428L09276j219j26939J01631
13752B89000k99647m04862J67404N00733L87902J02287k6061j14768L0092j62702
13742D69378l02855j8249M264j88905P7974K99563M6297j4139N5110k50813l25743
13731a48118P9311L45144J03830N5004j88005p28263k09223J47226K03666P6513
13721b62915n40949l39894j50354j19690N35655M91094K11818R2127j22276l9516
13711b44900k16644P4620J14671k9912J25860N5514J86337M41464r7131l47302
13701F2577n815k6991K6218p0407j42298j5486k00072k31187j765N09816N00979
$$ plain form
13690 405569 466505 66274 -476015 -723748 -523198 -411717 -298344 -266716 -179218 -213271
13680 -213271 -312197 -454515 -488379 -99158 212875 554882 730753 276834 -502446 -810284
13670 -810284 -651180 -706470 -588190 -162307 -338168 -735267 -341986 46327 250783 81425
13660 81425 -544150 -854593 -752183 -893859 -848550 -484666 -183534 -540168 -485345 75552
13650 75552 258270 78612 -250220 -520718 -768539 -897909 -942244 -1084053 -503778 -14908
13640 -14908 -183588 -607759 -909854 -1049305 -1021592 -909725 -812094 -652381 -635833 -686130
13630 -686130 -945110 -993552 -819714 -624657 -666929 -487726 -125092 -150189 -643055 -972989
13620 -972989 -596323 -182101 -25746 -151427 -415932 -419439 -6319 266292 38748 -44102
$$ packed form
13690D05569O0936m00231n42289k47733K00550J11481J13373L1628Q7498l4053
13680b13271r8926j42318l3864L89221L12033L42007J75871m53919p79280l07838
13670h10284J59104n5290J18280M25883j75861l97099L93281L88313K04456j69358
13660H1425o25575l10443J02410j41676M5309L63884L01132l56634N4823N60897
13650G5552J82718j79658l28832k70498k47821j29370m4335j41809N80275M88870
13640a4908j68680m24171l02095j39451K7713J11867R7631J59713J6548n0297
13630f86130k58980m8442J73838J95057m2272J79203L62634k5097m92866l29934
13620i72989L76666M14222J56355j25681k64505l507M13120K72611k27544q2850
$$ plain form
13610 -44102 315968 131543 -369786 -283950 -210689 90159 331020 625522 1062885 734839
13600 734839 287887 163765 214383 205849 -449783 -825539 -769296 -858857 -877133 -672954 -821575
13589 -821575 -714567 -576737 -749609 -866106 -755427 -726084 -568758 -227855 45811 434068
13579 434068 494166 246283 303685 652426 892951 701712 521671 691630 802803 723577
13569 723577 83017 -673704 -691075 -635661 -619805 -843753 -1053501 -691976 -310978 -389843
13559 -389843 -432762 -300747 -248417 -183416 4915 254391 -105861 -29411 406186 212312
13549 212312 155094 227365 -127817 -668448 -1280809 -1270859 -519621 309159 772029 932441
13539 932441 571026 45038 -167577 -203836 -392040 -722645 -952587 -742073 -188781 -246852
$$ packed form
13610d4102L60070j84425n01329Q5836P3261L00848K40861K94502M37363l28046
13600G34839m46952j24122N0618q534o55632l75756N6243q9561j8276K04179j48621
13589h21575J07008J37830j72872j16497J10679K9343J57326L40903K73666L88257
13579D34068O0098k47883N7402L48741K40525j91239j80041J69959J11173p9226
13569G23577o40560p56721j7371N5414J5856k23948k09748L61525L80998p8865
13559c89843m2919J32015N2330O5001J88331K49476l60252P6450M35597j93874
13549B12312n7218P2271l55182n40631o12361R950P51238Q28780M62870J60412
13539I32441l61415n25988k12615l6259j88204l30605k29942K10514N53292n8071
$$ plain form
13529 -246852 -494494 -290125 -170175 -97234 5055 344554 691702 876279 1048636 518377
13519 518377 81753 -220526 -452401 -367037 -412624 -502311 16047 638690 650377 374508
13509 374508 -143185 -252109 -73825 333130 333759 58073 -2300 57016 -195807 -836515
13499 -836515 -988159 -541316 -189928 -17921 362597 475320 404281 445328 46240 -553055
13489 -553055 -982603 -1100170 -886453 -399652 -231049 -308204 -459268 -753226 -783188 -1083338
13479 -1083338 -1347032 -1011752 -872890 -745177 -642410 -743530 -701443 -369308 247124 318259
13469 318259 258851 503705 833664 1062156 1023446 1053141 940531 838308 1001098 832292
13459 832292 252873 -180026 20612 166414 22939 121252 751716 913512 640383 507127
$$ packed form
13529b46852k47642K04369J19950P2941J02289L39499L47148J84577J72357n30259
13519E18377m36624l02279k31875Q5364m5587q9687N18358O22643J1687k75869
13509C74508n17693j08924J78284M06955O29k75686o0373N9316k52823o40708
13499h36515j51644M46843L51388J72007L80518J12723p1039M1047l99088n99295
13489e53055m29548j17567K13717M86801J68603p7155j51064k93958k9962l00150
13479a083338k63694L35280J38862J27713J02767j01120M2087L32135O16432P1135
13469C18259n9408K44854L29959K28492l8710K9695j12610j02223J62790j68806
13459H32292n79419m32899K00638J45802j43475R8313O30464J61796k73129j33256
$$ plain form
13449 507127 568898 321268 127753 238374 407126 767061 784352 333424 -297865 -736756
13439 -736756 -1075746 -1133408 -740441 -338725 2067 442761 564157 304519 117733 210511
13429 210511 523670 861340 1193307 823822 494778 481254 474089 318841 9535 -64527
13419 -64527 255932 644413 843820 748475 645545 229556 -345526 -464603 -101368 256493
13409 256493 500177 438486 537457 656893 553844 438327 517641 575266 151282 457026
13399 457026 1074819 1018358 478385 312674 560253 662455 575799 511843 77488 -257652
13389 -257652 -471752 -503144 -319341 -414156 -553568 -753134 -1146413 -1296662 -774623 -454050
13379 -454050 -645399 -495047 210611 689130 841077 1053567 743401 398094 348995 284280
$$ packed form
13449E07127O1771k47630j93515J10621J68752L59935J7291m50928o31289m38891
13439g36756l38990n7662L92967M01716L40792M40694J21396k59638j86786R2778
13429B10511L13159L37670L31967l69485l29044j3524p165j55248l09306p4062
13419f4527L20459L88481J99407r5345j02930m15989n75082j19077L63235L57861
13409B56493K43684o1691R8971J19436j03049j15517P9314N7625m23984L05744
13399D57026O17793n6461n39973j65711K47579J02202q6656o3956m34355l35140
13389b57652k14100l1392J83803r4815j39412j99566l93279j50249N22039L20573
13379d54050j91349J50352P05658M78519J51947K12490l10166l45307m9099o4715
$$ plain form
13369 284280 230395 -163206 15987 54876 -176428 106280 459411 514348 266623 -85077
13359 -85077 -140802 -192490 -32441 -114845 -10453 224676 225539 255535 345017 569353 731959
13348 731959 903489 901907 711907 521044 64323 -465243 -581017 -360607 -231869 217853
13338 217853 351090 481591 829223 1019925 850533 644643 1004053 843948 650200 656065
13328 656065 657530 740486 797344 439398 602408 422933 -40633 -66109 -303971 -468785
13318 -468785 -513153 -186604 802571 1596320 1632787 1357161 1394522 1348569 1064768 869322
13308 869322 850982 1002332 1368231 1315461 1227878 949463 812253 590487 415894 401585
13298 401585 230745 296993 305663 349140 486071 418823 391428 497769 344435 122370 -7704
$$ packed form
13369B84280n3885l93601J79193L8889k31304K82708L53131N4937k47725l51700
13359h5077n5725n1688J60049q2404J04392K35129Q63K9996Q9482K24336J62606
13348G31959J71530j582j90000j90863m56721n29566j15774K20410J28738M49722
13338B17853J33237J30501L47632J90702j69392k05890L59410j60105j93748N865
13328F56065J465Q2956N6858l57946J63010j79475m63566k5476k37862j64814
13318d68785m4368L26549R89175P93749L6467k75626L7361m5953k83801j95446
13308H69322j8340J51350L65899n2770q7583k78415j37210k21766j74593j4309
13298D01585j70840O6248Q670M3477J36931o7248k7395J06341j53334k22065j30074
$$ plain form
13287 -7704 127772 -40253 -613618 -798537 -435227 -476764 -619467 1231 642452 1124874
13277 1124874 1212595 1226536 1514394 1203388 866000 1112195 1334642 1175481 994541 968160
13267 968160 1229526 1488336 1146314 701544 610113 499653 234562 36315 11392 38992
13257 38992 142164 373986 409704 443117 695948 778103 702167 819902 699999 189562
13247 189562 123886 498112 742207 714912 779490 993393 1021418 894778 556744 62851
13237 62851 -165384 -413838 -715613 -560177 -163740 -444409 -837324 -726454 -497632 -216742
13227 -216742 -389732 -372759 -167524 21278 143376 29785 -25596 530358 767366 536386
13217 536386 381009 127977 -135698 -366701 -386342 -107998 318858 755612 930460 634136
$$ packed form
13287g704J35476j68025n73365j84919L63310m1537j42703O20698O41221M82422
13277A124874Q7721J3941K87858l11006l37388K46195K22447j59161j80940k6381
13267I68160K61366K58810l42022m44770r1431j10460k65091j98247k4923K7600
13257C8992J03172K31822L5718L3413K52831Q2155p5936J17735j19903n10437
13247A89562o5676L74226K44095k7295O4578K13903K8025j26640l38034m93893
13237F2851k28235k48454l01775J55436L96437k80669l92915J10870K28822K80890
13227b16742j72990J6973K05235J88802J22098j13591n5381N55954K37008k30980
13217E36386j55377k53032k63675k31003j9641K78344M26856M36754J74848k96324
$$ plain form
13207 634136 61980 -224521 -62885 37826 221174 267401 199517 185374 60183 279728
13197 279728 627881 810500 748151 857017 1002686 499678 332266 329896 394 -131651
13187 -131651 293350 494641 401519 761924 1382845 2153115 1935467 1127959 548737 610705
13177 610705 958664 1063379 1025302 1347414 1802791 1836537 1408978 911055 623207 741715
13167 741715 1157100 1526027 1739626 1803627 1732413 1657447 1355421 1350361 1519808 1529399 1193635
13156 1193635 1105071 1300409 1409584 1317499 1121062 1046198 743991 397667 501842 1042202
13146 1042202 1234297 1255172 1402569 1486540 1352068 1317976 1207869 762489 157656 -133222
13136 -133222 48203 125938 104327 44348 165094 703185 1371988 2035893 2291364 1952155
$$ packed form
13207F34136n72156k86501J61636J00711J83348M6227o7884j4143j25191K19545
13197B79728L48153J82619o2349J08866J45669n03008j67412k370l29502j32045
13187a31651M25001K01291r3122L60405O20921P70270k17648q07508n79222O1968
13177F10705L47959J04715l8077L22112M55377L3746m27559m97923k87848J18508
13167G41715M15385L68927K13599O4001p1214p4966l02026n060J69447R591l35764
13156A193635q8564J95338J09175r2085j96437p4864l02207l46324J04175N40360
13146A042202J92095K0875J47397Q3971j34472l4092j10107m45380o04833k90878
13136a33222J81425P7735k1611n9979J20746N38091O68803O63905K55471l39209
$$ plain form
13126 1952155 1711978 1530536 1417539 1567962 1219616 837471 987974 1285996 1219967 1058022
13116 1058022 1123365 1344935 1722959 2282060 2405153 1831321 1334497 793447 525207 611660
13106 611660 556983 436286 203466 338161 705921 1302847 1949537 2004431 1750091 2052852
13096 2052852 2453734 2409629 2444732 2285090 1864629 1552155 1716733 2208295 2709332 2828510
13086 2828510 2378350 2183441 2293156 2740711 2551374 2028457 1610089 1526839 1682546 2096185
13076 2096185 2358492 2407488 2545455 2920735 2817657 2832548 2526143 1932581 1776655 1708856
13066 1708856 1984943 1987262 1539959 1081952 805281 1230327 1729505 1710398 1747631 1675879
13056 1675879 1542878 1270091 1213520 1679730 2110984 2428195 2708231 2664123 2429494 2480024
$$ packed form
13126A952155k40177j81442j12997J50423l48346l82145J50503K98022o6029j61945
13116A058022O5343K21570L78024N59101J23093n73832m96824n41050k68240Q6453
13106F11660n4677j20697k32820J34695L67760N96926O46690N4894k54340L02761
13096B052852M00882m4105L5103j59642m20461l12474J64578M91562N01037J19178
13086B828510m50160j94909J09715M47555j89337n22917m18368q3250J55707M13639
13076B096185K62307M8996J37967L75280j03078J4891l06405n93562j55926o7799
13066A708856K76087K319m47303m58007k76671M25046M99178j9107L7233p1752
13056A675879j33001k72787n6571M66210M31254L17211K80036m4108k34629N0530
$$ plain form
13046 2480024 2439153 2234115 2233449 2607976 3110873 3741497 3975714 4030410 4266115 4143600
13036 4143600 4079696 3899112 3578067 3436674 3474933 3412937 3024127 3127345 3149501 3022531
13026 3022531 3146899 3503555 3681092 3557390 3448186 3477350 3446646 3480695 3992856 4547198
13016 4547198 4993466 5182605 5017735 5020240 5094139 5170995 5570038 6042272 6711016 7220451
13006 7220451 7479213 7937111 8240093 8913999 9905605 10637414 11024082 11189743 11549607
12997 11549607 12690123 14187489 15562307 16950871 18878738 21083022 23373489 26358111
12989 26358111 29477368 33190893 38004342 44147043 52706985 64353480 78854775 97053105
12981 97053105 121159725 154211815 199528073 260901132 339271901 421568103 472723990
$$ packed form
13046B480024m0871k05038o66L74527N02897O30624K34217N4696K35705j22515
13036D143600o3904j80584l21045j41393L8259o1996l88810J03218K2156j26970
13026C022531J24368L56656J77537j23702j09204K9164l0704L4049N12161N54342
13016D547198M46268J89139j64870K505P3899P6856L99043M72234O68744N09435
13006G220451K58762M57898L02982O73906R91606P31809L86668J65661L59864
12997A1549607J140516J497366J374818J388564J927867K204284K290467K984622
12989B6358111L119257L713525M813449O142701Q559942J1646495J4501295J8198330
12981I7053105K4106620L3052090M5316258O1373059P8370769Q2296202N1155887
$$ plain form
12974 472723990 460900260 397025152 319187891 251472283 199456891 160857783 131979215
12967 131979215 110042374 93202132 79924735 69178848 60351039 53192019 46740241
12960 46740241 40905967 36244741 33218707 30473504 27369561 25056050 23530335 21840089
12952 21840089 20644373 19849026 18650203 17577481 16867373 16211407 15515739 15016498 14551235
12943 14551235 13803876 12823303 12246969 11838195 11585377 11465217 11725700 11723282 11143747 10460399
12933 10460399 10099932 9953202 9662525 9281990 8938636 8997242 9365779 9249258 9569889
12924 9569889 11005795 11794244 12353589 13191632 14250419 15822967 17915866 20159744 21590298
12915 21590298 21482115 20100113 18783059 18084499 17769589 17863228 18443783 19318017 20284571
$$ packed form
12974D72723990j1823730o3875108p7837261o7715608n2015392l8599108k8878568
12967A31979215k1936841j6840242j3277397j0745887q827809p159020o451778
12960D6740241n834274m661226l026034k745203l103943k313511j525715j690246
12952B1840089j195716p95347j198823j072722p10108o55966o95668m99241m65263
12943A4551235p47359r80573n76334m08774k52818j20160K60483k418n79535o83348
12933A0460399l60467j46730k90677l80535l43354N8606L68537j16521L20631
12924I569889J435906P88449N59345Q38043J058787J572548K092899K243878J430554
12915B1590298j08183j382002j317054o98560l14910R3639N80555Q74234R66554
$$ plain form
12906 20284571 21450969 22865993 24971434 27969121 31719816 36061487 41179663 48018394
12898 48018394 57381179 69385665 84803271 104393007 130258664 165866013 215268172
12891 215268172 282707637 366956962 448355136 486156297 455957934 381792452 302352375
12884 302352375 236501805 186941545 150499547 123800368 103808159 88043396 75451036
12877 75451036 65336428 56841211 49867180 44192027 39545951 36223135 32968224 30284625
12869 30284625 28170769 25889305 24028225 22391584 20543114 18981324 17548995 16374551
12861 16374551 15518407 14901662 14275823 13577208 12572607 11557251 11055291 10626335 10613042
12852 10613042 10877230 10822290 10814480 10923733 10441772 9749625 9347130 9040597 8790908 8760103
$$ packed form
12906B0284571J166398J415024K105441K997687L750695M341671N118176O838731
12898D8018394R362785J2004486J5417606J9589736K5865657L5607349M9402159
12891B15268172O7439465Q4249325Q1398174L7801161l0198363p4165482p9440077
12884C02352375o5850570m9560260l6441998k6699179j9992209j5764763j2592360
12877G5451036j0114608q495217o974031n675153m646076l322816l254911k683599
12869C0284625k113856k281464j861080j636641j848470j561790j432329j174444
12861A6374551q56144o16745o25839o98615j004601j015356n01960m28956j3293
12852A0613042K64188n4940p810J09253m81961o92147m02495l06533k49689l0805
$$ plain form
12842 8760103 9017420 9297802 9331948 9092564 9113082 9418424 9650248 9707213 10118272 10378253
12832 10378253 10325602 10482126 10760915 11111217 11604786 11686772 11500743 11815864 12503314 13744280
12822 13744280 15277651 16880860 18373395 19734530 21802031 24713549 27832754 31368416
12814 31368416 35939369 41815823 49589338 59436784 71755724 88128246 109232705 137651109
12806 137651109 176666282 230066567 300677324 383547466 454291660 473706065 430246234
12799 430246234 354826653 280253478 220062055 175354994 142576379 118369418 99773225
12792 99773225 84983521 73015310 62917807 54607672 47932655 42605654 37939612 33880922
12784 33880922 30483933 27806802 25438860 23320596 21299629 19576521 17989452 16214306
$$ packed form
12842H760103K57317K80382L4146k39384K0518L05342K31824N6965M11059K59981
12832A0378253n2651J56524K78789L50302M93569Q1986j86029L15121O87450J240966
12822A3744280J533371J603209J492535J361135K067501K911518L119205L535662
12814C1368416M570953N876454P773515R847446J2318940J6372522K1104459K8418404
12806A37651109L9015173N3400285P0610757Q2870142P0744194J9414405m3459831
12799D30246234p5419581p4573175o0191423m4707061l2778615k4206961j8596193
12792I9773225j4789704j1968211j0097503q310135o675017n327001m666042m058690
12784C3880922l396989k677131k367942k118264k020967j723108j587069j775146
$$ plain form
12776 16214306 14813516 13477369 12587658 12076320 11504132 11028072 10329923 9599071 8685336
12767 8685336 7974028 7552269 7326976 7280918 7108825 6771456 6532381 6304984 6520803 6684899
12757 6684899 6408758 6171440 6064365 5840623 5490283 4983658 4662264 4575916 4226781 4067820
12747 4067820 4180264 4149815 3583839 3387357 4024309 3969696 3631658 3527092 3812931 3784727
12737 3784727 3226702 3306143 3509243 3332692 3567782 3721455 3796740 3827744 3297942 2907669
12727 2907669 3052732 3334144 3424204 3603193 3671274 3225775 3031688 3332219 3299812 2767102
12717 2767102 1835480 1322619 1313914 1394623 1518047 1456234 1516453 1617501 1689741 2062054
12707 2062054 1985635 1485967 1285393 1301390 1434403 1562673 1407910 1403784 1014938 525633
$$ packed form
12776A6214306j400790j336147q89711n11338n72188m76060o98149p30852r13735
12767H685336p11308m21759k25293m6058j72093l37369k39075k27397K15819J64096
12757F684899k76141k37318j07075k23742l50340n06625l21394q6348l49135j58961
12747D067820J12444l0449n65976j96482O36952n4613l38038j04566K85839k8204
12737C784727n58025P9441K03100j76551K35090J53673P5285L1004n29802l90273
12727B907669J45063K81412R0060J78989O8081m45499j94087L00531l2407n32710
12717B767102r31622n12861q705Q0709J23424o1813O0219J01048P2240L72313
12707B062054p6419m99668k00574J5997J33013J28270j54763m126l88846m89305
$$ plain form
12697 525633 385854 123780 97197 254438 676384 987992 1149545 929971 671154 574929
12687 574929 544544 773572 961028 1124330 1744597 2327704 2334009 1985109 1738089 1714102
12677 1714102 1523306 1080037 654395 521641 297698 354551 573463 800065 1328179 1666447
12667 1666447 1530460 1319082 1522469 1844644 1741109 1390744 919580 404465 161390
12658 161390 546468 873447 1345419 1650304 1398052 1192681 1084949 1245454 1249139 1383743
12648 1383743 1912005 1745978 1213876 1009407 1047329 1038967 1448282 1905182 2259600 2381616
12638 2381616 2054867 1693094 1324237 1225624 1157749 855859 470001 31990 54844 -13445
12628 -13445 -91412 228963 496462 591055 980064 1640459 1540535 1052452 480505 455183
$$ packed form
12697E25633j39779k62074k6583J57241M21946L11608J61553k19574k58817r6225
12687E74929l0385K29028J87456J63302O20267N83107O305l48900k47020k3987
12677A714102j90796m43269m25642j32754k23943N6853K18912K26602N28114L38268
12667A666447j35987k11378K03387L22175j03535l50365m71164n15115k43075
12658A61390L85078L26979M71972L04885k52252k05371j07732J60505L685J34604
12648A383743N28262j66027n32102k04469L7922q362M09315M56900L54418J22016
12638B381616l26749l61773l68857r8613o7875l01890l85858m38011K2854o8289
12628a3445p7967L20375K67499R4593L89009O60395r9924m88083n71947k5322
$$ plain form
12618 455183 1039137 1321686 1026008 714584 498129 308110 361517 667828 953873 922325
12608 922325 816803 704771 688327 804205 877897 1132341 1167882 981772 1039860 841234
12598 841234 415219 113297 134302 -93163 -381345 -529107 -100394 563890 938829 750313
12588 750313 412199 410949 764655 1249565 1156283 792917 468119 335867 219980 243645
12578 243645 461532 804398 1110067 1348508 960582 314199 89853 306586 677615 617804
12568 617804 536332 476057 539219 582577 795259 911487 861318 763177 641275 953412 1097504
12557 1097504 870706 453377 -84316 -360604 -420301 221824 741517 849440 732196 525021
12547 525021 434260 683111 795230 774453 565995 73631 -210260 161341 953666 1177105
$$ packed form
12618D55183N83954K82549k95678l11424k16455j90019N3407L06311K86045l1548
12608I22325j05522j12032j6444J15878P3692K54444L5541j86110N8088j98626
12598H41234m26015l01922K1005k27465k88182j47762M28713O64284L74939j88516
12588G50313l38114j250L53706M84910r3282l63366l24798j32252j15887K3665
12578B43645K17887L42866L05669K38441l87926o46383k24346K16733L71029n9811
12568F17804q1472o0275O3162M3358K12682J16228n0169r8141j21902L12137J44092
12557A097504k26798m17329n37693k76288n9697O42125N19693J07923j17244k07175
12547E25021r0761K48851J12119k0777k08458m92364k83891L71601P92325K23439
$$ plain form
12537 1177105 1155660 1331440 1142707 889786 726962 257754 277021 334504 226689 410866
12527 410866 658301 509981 -66297 -339457 178150 1014414 1653120 1582824 993570 800993
12517 800993 1058199 1560282 1984984 1569193 866727 499940 442686 383231 145057 60949
12507 60949 155557 294288 542330 871105 707125 316716 -190169 -453840 29683 307346
12497 307346 304226 804462 1242645 1056692 429718 -398598 -724184 -464803 4362 396030
12487 396030 622076 513587 -48404 -681317 -979516 -671574 -183362 264468 325193 130374
12477 130374 89588 244196 865935 930952 614462 818437 752174 524044 418886 664745
12467 664745 892290 986197 852912 513193 368974 -47004 131261 542493 843233 1267973
$$ packed form
12537A177105k1445J75780j88733k52921j62824m69208J9267N7483j07815J84177
12527D10866K47435j48320n76278k73160N17607Q36264O38706p0296n89254j92577
12517H00993K57206N02083M24702m15791p02466l66787n7254n9455k38174q4108
12507F0949R4608J38731K48042L28775j63980l90409n06885k63671M83523K77663
12497C07346l120N00236M38183j85953o26974q28316l25586K59381M69165L91668
12487C96030K26046j08489n61991o32913k98199L07942M88212M47830O0725j94819
12477A30374m0786J54608O21739O5017l16490K03975o6263k28130j05158K45859
12467F64745K27545R3907j33285l39719j44219m15978J78265M11232L00740M24740
$$ plain form
12457 1267973 1535158 1227042 736238 604693 925890 1522068 1853828 1772103 1368377 783013
12447 783013 531869 172958 -137341 80742 768369 1285592 1267716 1136347 649064 182746
12437 182746 380301 487424 296196 426857 715956 996152 1062982 1053358 990275 782507
12427 782507 500051 -277796 -198715 21817 -330183 -716005 -842977 -948416 -1009789 -707290
12417 -707290 -362986 -9923 49368 -97617 8564 168749 -109538 -148723 -404738 -737711
12407 -737711 -731870 -356900 149314 270806 38666 -6803 122571 449434 344625 -104699
12397 -104699 -196686 91167 132479 -111701 -194274 -177996 -375745 -638438 -712270 -556687
12387 -556687 -158597 623463 872421 308486 58206 155406 427713 910780 1391772 1461704
$$ packed form
12457A267973K67185l08116m90804j31545L21197N96178L31760q1725m03726n85364
12447G83013k51144l58911l10299K18083O87627N17223j7876j31369m87283m66318
12437A82746J97555J07123j91228J30661K89099K80196O6830r624o3083k07768
12427G82507k82456p77847P9081K20532l52000l85822j26972j05439o1373L02499
12417g07290L44304L53063N9291j46985J06181J60185k78287l9185k56015l32973
12407g37711N841L74970N06214J21492k32140m5469J29374L26863j04809m49324
12397a04699r1987K87853M1312k44180q2573J6278j97749k62693p3832J55583
12387e56687L98090P82060K48958n63935k50280R7200K72307M83067M80992O9932
$$ plain form
12377 1461704 1382278 1148508 929368 993492 697530 464744 557693 628375 647443 1080142
12367 1080142 1533146 1260290 677468 150631 452020 652199 501371 410200 362662 199934
12357 199934 226949 192440 -86062 57216 318489 193933 179722 410159 557722 509593
12347 509593 625801 688339 479881 417362 206377 309897 676631 841122 525819 127904
12337 127904 120508 228305 292816 368254 737980 702425 366396 147151 38061 13526 -18401
12326 -18401 -60782 -431793 -607244 -149402 -31640 -168965 96489 245516 134557 263127
12316 263127 320163 268834 364377 707986 721411 204712 -335512 -711582 -674841 -538615
12306 -538615 -483941 -234464 -251670 -441490 -344651 40891 246370 -169772 -916781 -1090084
$$ packed form
12377A461704p9426k33770k19140O4124k95962k32786R2949P0682J9068M32699
12367A080142M53004k72856n82822n26837L01389K00179j50828r1171m7538j62728
12357A99934K7015l4509k78502J43278K61273j24556j4211K30437J47563m8129
12347E09593J16208O2538k08458o2519k10985J03520L66734J64491l15303l97915
12337A27904p396J07797O4511P5438L69726l5555l36029k19245j09090k4535l1927
12326a8401m2381l71011j75451M57842J17762j37325K65454J49027j10959J28570
12316B63127N7036n1329R5543L43609J3425n16699n40224l76070L6741J36226
12306e38615N4674K49477j7206j89820R6839L85542K05479m16142p47009j73303
$$ plain form
12296 -1090084 -1086245 -871610 -752902 -760374 -724649 -305982 -347088 -519082 -296836 30625
12286 30625 321632 301054 338992 292551 240575 207797 -21466 -467401 -621379 -191959 161385
12275 161385 382338 352727 403806 946293 1024677 561281 -124350 -745039 -919832 -995863
12265 -995863 -949553 -646539 -437015 203392 900786 894976 694553 574666 506577 382570
12255 382570 346504 410113 619845 535685 192096 268397 313015 384608 477449 330852 -73065
12244 -73065 -262042 -113636 42517 -88325 -51748 6669 -297648 -512926 -341241 -256356
12234 -256356 -197826 -153677 41727 -110924 -390627 193855 943519 883084 675884 436185
12224 436185 -66103 -260439 176934 476563 516838 560924 657817 461365 362677 320445
$$ packed form
12296a090084L839K14635J18708p472L5725M18667m1106j71994K22246L27461
12286C0625K91007k0578L7938m6441n1976l2778k29263m45935j53978M29420L53344
12275A61385K20953k9611N1079N42487P8384m63396o85631o20689j74793p6031
12265i95863M6310L03014K09524O40407O97394n810k00423j19887o8089j24007
12255C82570l6066O3609K09732q4160l43589P6301M4618P1593R2841j46597m03917
12244g3065j88977J48406J56153j30842L6577N8417l04317k15278J71685Q4885
12234b56356N8530M4149J95404j52651k79703N84482P49664o0435k07200k39699
12224D36185n02288j94336M37373K99629M0275M4086R6893j96452r8688m2232
$$ plain form
12214 320445 143732 -84507 -241718 -563165 -750090 -410758 -110959 -332172 -296031 142434
12204 142434 108280 -48259 -244559 -324243 -360942 -513216 -372549 -54531 71860 -207612
12194 -207612 -509822 -541962 -188225 217431 620799 712445 780973 950330 783036 552514
12184 552514 810580 1172911 814716 357694 295873 525549 557298 138419 -434539 -530221
12174 -530221 -309305 -314043 -342243 -381192 -386555 -10211 451021 1057018 1281314 1033395 813952
12163 813952 675761 185268 -256550 -382869 -396702 -220709 340234 543004 585084 751526
12153 751526 676221 428855 550083 779615 492375 74498 -85023 437594 890348 1073240
12143 1073240 931258 715777 269533 -259549 -418225 -543346 -500180 -289418 174618 893187
$$ packed form
12214C20445j76713k28239j57211l21447j86925L39332K99799k21213L6141M38465
12204A42434l4154j56539j96300p9684l6699j52274J40667L18018J26391k79472
12194b07612l02210l2140L53737M05656M03368R1646O8528J69357j67294k30522
12184E52514K58066L62331l58195m57022o1821K29676L1749m18879n72958r5682
12174e30221K20916m738k8200l8949n363L76344M61232O05997K24296k47919k19443
12163H13952j38191m90493m41818j26319j3833J75993N60943K02770M2080J66442
12153G51526p5305k47366J21228K29532k87240m17877j59521N22617M52754J82892
12143A073240j41982k15481m46244n29082j58676j25121M3166K10762M64036P18569
$$ plain form
12133 893187 1034507 424504 -184509 -449955 -740895 -897622 -670763 -535522 -606547 -496702
12123 -496702 -188535 369124 418905 157133 -127169 -74459 347501 556673 113284 -389004
12113 -389004 -798436 -1215258 -1079871 -726986 -486836 -475935 -147208 754631 441245 -450520
12103 -450520 -510816 -166891 -138019 -244312 -76568 190245 498834 422892 -75684 -126559
12093 -126559 54174 24934 -295049 -598657 -825991 -945312 -681988 -511605 -575921 -616891
12083 -616891 -435497 -402640 -202635 8037 109395 343175 72274 -155502 15027 -42774
12073 -42774 -268387 -368666 -243887 -170587 1793 -22267 -190371 -128903 -526903 -962264
12063 -962264 -1093143 -807525 -549006 -582383 -547704 -345519 48380 -96717 -439431 -532393
$$ packed form
12133H93187J41320o10003o09013k65446k90940j56727K26859J35241p1025J09845
12123d96702L08167N57659M9781k61772k84302N2710M21960K09172m43389n02288
12113c89004m09432m16822J35387L52885K40150J0901L28727R01839l13386q91765
12103d50520o0296L43925K8872j06293J67744K66813L08589p5942m98576n0875
12093a26559J80733k9240l19983l03608k27334j19321K63324J70383o4316m0970
12083f16891J81394L2857K00005K10672J01358K33780k70901k27776J70529n7801
12073d2774k25613j00279J24779P3300J72380k4060j68104O1468l98000m35361
12063i62264j30879K85618K58519l3377L4679K02185L93899j45097l42714r2962
$$ plain form
12053 -532393 -274376 -55294 103083 368186 405767 353839 407663 411983 332770 53657 -341542
12042 -341542 -816259 -1051069 -894083 -826859 -539906 -422741 -231284 -65216 -10431 201917
12032 201917 274134 157389 -128306 -236811 -340207 -339636 -345005 -424753 -657864 -1064725 -1294757
12021 -1294757 -1167824 -990268 -711331 -354482 -101374 -209555 -496131 -377718 -57627
12012 -57627 14451 -133674 -42297 -108223 -370378 -636753 -720260 -360818 167059 484744
12002 484744 318302 274265 779871 1041716 810299 64304 -904031 -1144062 -645667 -605417
11992 -605417 -985033 -916140 -713161 -519064 -312878 238679 321319 326105 550806 612336
11982 612336 567723 135388 -285103 -635299 -738659 -443178 53271 420311 551919 629387
$$ packed form
12053e32393K58017K19082J58377K65103L7581n1928N3824M320p9213k79113l95199
12042c41542m74717k34810J56986O7224K86953J17165J91457J66068N4785K12348
12032B01917P2217j16745k85695j08505j03396N71n369p9748k33111m06861k30032
12021a294757J26933J77556K78937L56849K53108j08181k86576J18413L20091
12012e7627P2078j48125R1377o5926k62155k66375q3507L59442N27877L17685
12002D84744j66442m4037N05606K61845k31417p45995r68335k40031M98395M0250
11992f05417l79616O8893K02979J94097K06186N51557Q2640M786K24701O1530
11982F12336m4613m32335m20491l50196j03360K95481M96449L67040J31608P7468
$$ plain form
11972 629387 947545 686873 166461 237600 519954 479945 260459 -12125 -463333 -767091
11962 -767091 -523791 -310054 -354678 -209818 -20014 310177 140594 -188982 -734449 -870320
11952 -870320 -503241 -193082 -124867 -354137 -682033 -425722 136922 366096 83007 -54346
11942 -54346 435471 960468 590072 -101148 -169763 71604 47629 275807 295248 191917
11932 191917 334806 7444 22329 4970 -159052 42836 179355 -91917 -709244 -939810
11922 -939810 -703874 -336851 -487577 -842732 -486507 -131133 9097 320645 111700 -34898
11912 -34898 -48269 -350723 -53622 632885 605096 860143 1115299 1142848 956921 411957
11902 411957 -50533 -244785 -158249 -103069 -140737 -375224 -425084 -502757 -476195 -402892 -542759
$$ packed form
11972F29387L18158k60672n20412P1139K82354m0009k19486k72584m51208l03758
11962g67091K43300K13737m4624J44860J89804L30191j69583l29576n45467j35871
11952h70320L67079L10159O8215k29270l27896K56311N62644K29174k83089j37353
11942e4346M89817N24997l70396o91220o8615K41367k3975K28178J9441j03331
11932A91917J42889l27362J4885j7359j64022K01888J36519k71272o17327k30566
11922i39810K35936L67023j50726l55155L56225L55374J40230L11548k08945j46598
11912c4898j3371l02454K97101O86507k7789K55047K55156K7549j85927n44964
11902D11957m62490j94252Q6536N5180l7668k34487m9860p7673K6562P3303j39867
$$ plain form
11891 -542759 -616091 -446969 -187082 21815 -301136 -706683 -809006 -846439 -789611 -514116
11881 -514116 -380504 -207958 138734 242544 103028 332149 750610 895888 808237 226951
11871 226951 -278769 -202522 322098 690017 849656 740790 524225 464378 589409 801575
11861 801575 560636 312903 365350 128069 -172929 -40728 380896 460703 783622 1417515
11851 1417515 1453504 1354052 1263975 876282 454862 -32616 -37084 -112037 -274628 -194153 -260431
11840 -260431 -573848 -570329 -472543 -558470 -525854 40558 414004 74525 -359867 -772718
11830 -772718 -1079117 -1084746 -1089665 -688563 383927 944185 726691 69329 -217011 -430747
11820 -430747 -408378 -178648 -100499 -255229 -503858 -286116 -19943 -18885 -385349 -514789
$$ packed form
11891e42759p3332J69122K59887K08897l22951m05547j02323l7433N6828K75495
11881e14116J33612J72546L46692J03810j39516K29121M18461J45278q7651n81286
11871B26951n05720P6247N24620L67919J59639j08866k16565n9847J25031K12166
11861H01575k40939k47733N2447k37281l00998J32201M21624P9807L22919O33893
11851A417515L5989r9452r0077l87693m21420m87478m468p4953j62591Q0475o6278
11840b60431l13417L519R7786q5927L2616N66412L73446l39479m34392m12851
11830g72718l06399n629m919M01102J072490N60258k17494o57362k86340k13736
11820d30747K2369K29730P8149j54730k48629K17742K66173J058l66464j29440
$$ plain form
11810 -514789 -317764 -184658 -657464 -997556 -722233 -701088 -796496 -926995 -1137080 -988693
11800 -988693 -829435 -1024187 -1352000 -1452915 -1325638 -922830 -796625 -1037638 -978149 -1357693
11790 -1357693 -1540323 -1364244 -1139643 -825056 -368076 40985 -58066 -327337 -275617 -25463
11780 -25463 319497 228636 -269 -134674 26007 -28628 -314182 -76255 -9477 -381839
11770 -381839 216158 923892 1011300 635343 153786 -124858 -214422 -237160 -64426 14660
11760 14660 -55323 188621 516752 779595 771273 436988 507710 21358 -1098822 -1368816
11750 -1368816 -1169718 -893718 -553120 -207690 122961 374315 652348 912812 932834 981473
11740 981473 1333577 1071002 607697 503615 191625 37107 69387 -129917 -299444 -251142
$$ packed form
11810e14789J97025J33106m72806l40092K75323K1145r5408j30499k10085J48387
11800i88693J59258j94752l27813j00915J27277M02808J26205k41013N9489l79544
11790a357693j82630J76079K24601L14587M56980M09061r9051k69271N1720K50154
11780b5463L44960r0861k28905j34405J60681n4635k85554K37927O6778l72362
11770c81839N97997P07734Q7408l75957m81557k78644q9564k2738J72734P9086
11760A4660o9983K43944L28131K62843q322l34285P0722m86352j120180k69994
11750a368816J99098K76000L40598L45430L30651K51354K78033K60464K0022M8639
11740I81473L52104k62575m63305j04082l11990j54518L2280j99304j69527M8302
$$ plain form
11730 -251142 -411393 -155353 -397559 -812033 -961029 -634824 -170642 -116876 -30277 238849
11720 238849 450892 511981 480037 85109 -269043 -304593 325688 1426877 2492066 3186457
11710 3186457 1921216 710286 43119 -1055159 -1320967 -1209720 -1026237 -884701 -673607
11701 -673607 -787825 -1112140 -1412878 -1439525 -1503325 -1538892 -1667006 -1675597 -1694877 -1415140 -1478789
11690 -1478789 -1390715 -922704 -247426 140964 258337 -109672 -37175 83612 70109 -1313
11680 -1313 -432576 -496401 -62774 299913 206640 89658 -179044 -195709 -331872 -547093
11670 -547093 -880357 -890867 -699945 -407248 -167622 229436 452582 498876 617548 822404
11660 822404 489925 -81382 -375406 -692654 -337903 348364 671180 848837 679003 310609
$$ packed form
11730b51142j60251K56040k42206m14474j48996L26205M64182N3766Q6599K69126
11720B38849K12043O1089l1944l94928l54152l5550O30281J101189J065189O94391
11710C186457j265241j210930o67167j098278k65808J11247J83483J41536K11094
11701f73607j14218l24315l00738k6647o3800l5567j28114q591j9280K79737o3649
11690a478789Q8074M68011O75278L88390J17373l68009P2497J20787j3503p1422
11680a313m31263o3825M33627L62687r3273j16982k68702j6665j36163k15221
11670e47093l33264j0510J90922K92697K39626L97058K23146M6294J18672K04856
11660H22404l32479n71307k94024l17248L54751O86267L22816J77657j69834l68394
$$ plain form
11650 310609 281429 497403 539811 640091 783305 548499 -81449 -307802 29434 252305
11640 252305 234707 -14355 -152593 -698111 -642090 83508 219505 28222 -164686 -467769
11630 -467769 -741612 -1236644 -983526 -160623 366015 509796 35550 -490716 -145200 323434
11620 323434 -42244 -299836 11687 80136 -30065 94623 68016 32012 -118254 -307276
11610 -307276 -204517 190716 382403 499275 319106 -79145 -419485 -722941 -456897 -80426
11600 -80426 124017 192649 426664 825589 975782 965895 692793 295142 165600 162419 242590
11589 242590 41529 -195412 -203705 -101618 5309 175050 348237 244584 102071 88571
11579 88571 -30211 -119439 -372977 -621430 -585018 -366167 91105 340949 503038 728141
$$ packed form
11650C10609k9180K15974M2408J00280J43214k34806o29948k26353L37236K22871
11640B52305j7598k49062j38238n45518N6021P25598J35997j91283j92908l03083
11630d67769k73843m95032K53118Q22903N26638J43781m74246n26266L45516M68634
11620C23434l65678k57592L11523O8449j10201J24688k6607l6004j50266j89022
11610c07276J02759L95233J91687J16872j80169l98251l40340l03456K66044L76471
11600h0426K04443O8632K34015L98925J50193r887k73102l97651j29542l181Q0171
11589B42590k01061k36941q293J02087J06927J69741J73187j03653j42513j3500
11579H8571j18782q9228k53538k48453L6412K18851M57272K49844J62089K25103
$$ plain form
11569 728141 884617 949739 1225175 1393787 1300113 1223651 919025 732405 722066 524045
11559 524045 269593 78824 -143031 -187906 -263255 -528602 -580540 -329161 40601 470687
11549 470687 563810 233936 -205273 51555 851472 1273646 1187749 1031993 788370 177366
11539 177366 -469230 -634133 -10199 472043 606835 766367 522305 317849 499056 587367
11529 587367 611107 755532 1233657 1757436 2154395 2083755 1747733 1915199 2471385 3448590
11519 3448590 4394043 5438906 6519499 8451192 11159737 15117063 20488284 27533160
11511 27533160 36935200 52314373 76575068 107579674 119009659 96729667 69185535
11504 69185535 49886793 37245079 28992439 22997190 18480596 15364175 13090590 11263449
$$ packed form
11569G28141J56476O5122K75436J68612r3674p6462l04626j86620j0339j98021
11559E24045k54452j90769k21855m4875p5349k65347n1938K51379L69762M30086
11549D70687R3123l29874m39209K56828P99917M22174q5897j55756k43623o11004
11539A77366o46596j64903O23934M82242J34792J59532k44062k04456J81207Q8311
11529E87367K3740J44425M78125N23779L96959p0640l36022J67466N56186R77205
11519C448590R45453J044863J080593J931693K708545L957326N371221P044876
11511B7533160R402040J5379173K4260695L1004606J1429985k2279992k7544132
11504F9185535j9298742j2641714q252640n995249m516594l116421k273585j827141
$$ plain form
11496 11263449 9557565 8144486 6972953 6220642 6004816 5441349 4509585 4064198 3933225
11487 3933225 3614374 3384215 3317784 3027199 2630300 2314542 2447898 2350041 1845280 1294222
11477 1294222 1265965 1550012 1423434 1236234 1429492 1533189 1411286 1052679 534351 283126
11467 283126 550887 1112674 1530096 1357640 720566 203850 278125 550397 399348 -336641
11457 -336641 -1103144 -1259920 -857896 -532666 -407442 -255113 -115007 -77860 206646 457395
11447 457395 405778 72303 -111475 266907 691062 1044478 1187101 1053810 771492 329294
11437 329294 -183462 -194221 190762 537911 405733 37099 455692 1082548 985880 638130
11427 638130 778617 729638 881816 1040540 1263848 1218723 785909 79899 -400747 7448
$$ packed form
11496A1263449j705884j413079j171533p52311k15826n63467r31764m45387j30973
11487C933225l18851k30159o6431k90585l96899l15758J33356r7857n04761n51058
11477A294222k8257K84047j26578j87200J93258J03697j21903l58607n18328k51225
11467B83126K67761N61787M17422j72456o37074n16716P4275K72272j51049p35989
11457c36641p66503j56776M02024L25230J25224J52329J40106L7147K84506K50749
11447D57395n1617l33475j83778L78382M24155L53416J42623j33291k82318m42198
11437C29294n12756j0759L84983L47149j32178l68634M18593O26856r6668l47750
11427F38130J40487m8979J52178J58724K23308m5125m32814p06010m80646M08195
$$ plain form
11417 7448 552649 736705 622788 81733 114650 309098 211183 370676 405300 275226
11407 275226 246370 345429 -17296 -222231 130876 322796 249736 -12301 -227752 112147
11397 112147 719659 1227478 819318 -347770 -1463143 -1684157 -1869402 -1863960 -1483290 -1112365
11387 -1112365 -829511 -194619 411424 746427 998758 1323518 1145185 838288 677825
11378 677825 589032 95648 -507975 -907470 -960949 -1206210 -1448615 -859867 -348978 48902
11368 48902 252565 470118 692663 594172 586055 558184 557633 688292 475244 414123 420225
11357 420225 443351 513999 379509 98802 -187881 2951 516855 840940 725321 621925
11347 621925 217251 352043 929100 1086919 674967 340662 13445 -40450 -35273 60193
$$ packed form
11417G448N45201J84056j13917n41055L2917J94448r7915J59493L4624j30074
11407B75226k8856R9059l62725k04935L53107J91920p3060k62037k15451L39899
11397A12147O07512N07819m08160j167088j115373k21014j85245N442L80670L70925
11387a112365K82854O34892O06043L35003K52331L24760j78333l06897j60463
11378F77825q8793m93384o03623l99495n3479k45261k42405N88748N10889L97880
11368D8902K03663K17553K22545r8491q117k7871n51J30659k13048o1121O102
11357D20225K3126P0648j34490k80707k86683J90832N13904L24085j15619j03396
11347F21925m04674J34792N77057J57819m11952l34305l27217n3895N177R5466
$$ plain form
11337 60193 134887 -93726 -347591 -447703 -464046 -242503 -77325 -168289 136709 595916
11327 595916 729907 235241 -347982 -251053 -68254 47322 542371 937678 1169190 1371967
11317 1371967 1720711 1949285 1764823 1390358 1034603 869961 644167 508883 503886 264037
11307 264037 33786 -20310 -78477 99788 193102 81574 372064 811315 685435 129180
11297 129180 -188626 -303722 -166663 78739 241749 384276 540505 227610 -89294 -150047
11287 -150047 108189 291645 476929 339204 439952 820482 609367 343240 731080 1306931
11277 1306931 1191646 684830 132532 -103401 -64911 235496 618781 725409 548173 179366
11267 179366 387773 352008 -551110 -1058050 -955098 -607669 -288783 -58878 519026 1270110
$$ packed form
11337F0193P4694k28613k53865j00112j6343K21543J65178r0964L04998M59207
11327E95916J33991m94666n83223R6929J82799J15576M95049L95307K31512K02777
11317A371967L48744K28574j84462l74465l55755j64642k25794j35284m997k39849
11307B64037k30251n4096n8167J78265R3314j11528K90490M39251j25880n56255
11297A29180l17806j15096J37059K45402J63010J42527J56229l12895l16904o0753
11287a50047K58236J83456J85284j37725J00748L80530k11115k66127L87840N75851
11277A306931j15285n06816n52298k35933L8490L00407L83285J06628j77236l68807
11267A79366K08407l5765r03118n06940J02952L47429L18886K29905N77904P51084
$$ plain form
11257 1270110 1401645 1120210 781891 361922 265477 180074 -73297 -336565 -375674 -176790
11247 -176790 -184293 -164257 -34846 16009 118549 211980 703747 1293983 1244915 1081491 813805
11236 813805 548316 730849 423251 229519 362338 602582 804321 1134703 1639132 1848573
11226 1848573 1898961 1842971 1862725 1600663 1213850 742395 762336 784344 693058 519166
11216 519166 343149 270805 -18289 -475806 -122563 695539 898241 709509 548913 680766
11206 680766 847619 711519 516925 341146 66755 -58445 -39960 -59743 88459 -14921
11196 -14921 -363205 -731672 -891157 -787507 -456588 307987 906764 705955 490830 328294
11186 328294 215541 71777 39892 -401498 -740904 -523794 -264930 -223509 -274091 -469895
$$ packed form
11257A270110J31535k81435l38319m19969r6445q5403k53371k63268l9109J98884
11247a76790p503K0036J29411N0855J02540R3431M91767N90236m9068j63424k67686
11236H13805k65489J82533l07598j93732J32819K40244K01739L30382N04429K09441
11226A848573N0388n5990J9754k62062l86813m71455J9941K2008r1286j73892
11216E19166j76017p2344k89094m57517L53243Q18102K02702j88732j60596J31853
11206F80766J66853j36100j94594j75779k74391j25200J8485j9783J48202j03380
11196a4921l48284l68467j59485J03650L30919P64575N98777k00809k15125j62536
11186C28294j12753j43764l1885m41390l39406K17110K58864M1421n0582j95804
$$ plain form
11176 -469895 -480519 -231913 -298599 -68233 231839 138070 -151846 -755109 -678518 -39918
11166 -39918 429220 249778 -393006 -637653 -313557 -89205 -402950 -163032 107533 -88553
11156 -88553 -114418 -408619 -425399 -147802 -52839 -514548 -353308 -211413 -328534 -115525
11146 -115525 -2466 -175646 -774180 -956694 -719878 -596985 -500865 -85733 328062 568003
11136 568003 674747 813582 986315 904793 701425 634701 655141 773546 444188 181656
11126 181656 57559 2061 -32294 95637 397228 597967 436567 282462 817329 1238377
11116 1238377 1185193 1133512 928057 359567 67131 87174 -179723 -240548 -728799 -1014477
11106 -1014477 -292562 147893 -208080 -351366 -335909 -428127 -314351 8096 591988 885976
$$ packed form
11176d69895j0624K48606o6686K30366L00072r3769k89916o03263P6591O38600
11166c9918M69138j79442o42784k44647L24096K24352l13745K39918K70565j96086
11156h8553k5865k94201j6780K77597R4963m61709J61240J41895j17121K13009
11146a15525J13059j73180n98534j82514K36816J22893R6120M15132M13795K39941
11136E68003J06744J38835J72733q1522k03368o6724K0440J18405l29358k62532
11126A81656j24097n5498l4355J27931L01591K00739j61400j54105N34867M21048
11116A238377n3184n1681k05455n68490k92436K0043k66897o0825m88251k85678
11106a014477P21915M40455l55973j43286J5457r2218J13776L22447N83892K93988
$$ plain form
11096 885976 539079 223168 70634 77319 111029 44570 -258297 -268297 363572 992223
11086 992223 888652 876057 790652 351776 -5217 -219944 -613167 -1245559 -1401960 -1023427
11076 -1023427 -589874 62433 -62899 -447074 -319376 -136769 109358 495928 964613
11067 964613 861484 382461 276887 461075 446386 286856 100717 46781 92075 479087
11057 479087 666112 523826 75930 -573012 -925747 -736985 -690067 -641965 -586135 -608815
11047 -608815 -493252 -453767 -374928 62729 641832 425554 -139140 -388903 -561953 -399610
11037 -399610 53376 374552 643429 924569 1166258 866749 182256 -285787 -352174 -313437
11027 -313437 -166584 33798 13429 -179405 -195189 -257557 -340981 -288682 -331281 -579825 -682104
$$ packed form
11096H85976l46897l15911j52534O685L3710o6459l02867j0000O31869O28651
11086I92223j03571j2595q5405m38876l56993k14727l93223o32392j56401L78533
11076a023427M33553O52307j25332l84175J27698J82607K46127L86570M68685
11067I64613j03129m79023j05574J84188j4689j59530j86139n3936M5294L87012
11057D79087J87025j42286m47896o48942l52735J88762M6918M8102N5830k2680
11047f08815J15563L9485P8839M37657N79103k16278n64694k49763j73050J62343
11037c99610M52986L21176K68877K81140K41689k99509o84493m68043o6387L8737
11027c13437J46853K00382k0369j92834j5784o2368q3424N2299m2599k48544j02279
$$ plain form
11016 -682104 -792437 -692749 -631696 -394352 -335485 14673 222254 475474 634344 617804
11006 617804 646300 201133 -130559 -380027 -138347 358454 509297 489601 607053 874309
10996 874309 828443 659338 385522 304600 708051 974943 1043588 957617 534854 -41589
10986 -41589 -448527 -424277 68326 362109 351431 475681 616202 322387 112377 -134092
10976 -134092 -552702 -614362 -657022 -730192 -710874 -975522 -618086 -174191 -469901 -660686
10966 -660686 -344146 274735 629277 680044 511223 293379 183269 193989 118748 253398
10956 253398 336171 416343 391347 157147 332909 88812 -241616 -140477 15457 -68305
10946 -68305 -329525 -189268 -162858 -331305 -320519 -369009 -263078 -176613 -167147 -112396 -266815
$$ packed form
11016f82104j10333R9688O1053K37344N8867L50158K07581K53220J58870j6540
11006F17804K8496m45167l31692k49468K41680M96801J50843j9696J17452K67256
10996H74309m5866j69105k73816q0922M03451K66892O8645q5971m22763n76443
10986d1589m06938K4250M92603K93783j0678J24250J40521k93815k10010k46469
10976a34092m18610o1660m2660p3170J9318k64648L57436M43895k95710j90785
10966f60686L16540O18881L54542N0767j68821k17844j10110J0720p5241J34650
10956B53398Q2773Q0172k4996k34200J75762k44097l30428J01139J55934q3762
10946f8305k61220J40257K6410j68447J0786m8490J05931Q6465R466N4751j54419
$$ plain form
10935 -266815 -413688 -404239 -25639 293359 -138888 -559194 -459574 -360250 -320697 -103704
10925 -103704 196803 372867 233941 200597 313556 377748 263831 -53499 -669453 -1134775
10915 -1134775 -1299921 -825031 -314019 89059 -98503 -751673 -1040362 -1153429 -931080
10906 -931080 -754128 -773543 -859312 -831415 -923109 -924459 -746930 -543219 -349120 115197 494680
10895 494680 713926 688723 415162 -31697 -564281 -629602 -468407 -420343 -287660 -69457
10885 -69457 -14719 17699 48406 -276420 -522659 -669695 -431162 149651 384667 471450
10875 471450 462918 672208 629363 316171 151065 152675 54814 -252530 -733922 -784629 -566154
10864 -566154 -438428 -386802 -271700 -457068 -816999 -698684 -637707 -114241 544198 828072
$$ packed form
10935b66815j46873R449L78600L18998m32247m20306R9620R9324L9553K16993
10925a03704L00507J76064j38926l3344J12959O4192j13917l17330o15954m65322
10915a134775j65146M74890N11012M03078j87562o53170k88689j13067K22349
10906i31080J76952j9415q5769K7897r1694j350J77529K03711J94099M64317L79483
10895D94680K19246k5203k73561m46859n32584o5321J61195M8064J32683K18203
10885f9457N4738L2418L0707l24826k46239j47036K38533N80813K35016Q6783
10875D71450q532K09290m2845l13192j65106J610r7861l07344m81392n0707K18475
10864e66154J27726N1626J15102j85368l59931J18315O0977N23466O58439K83874
$$ plain form
10854 828072 815793 865929 501592 76103 97009 -555352 -1106729 -1220085 -1351981 -1302985
10844 -1302985 -897691 -557361 -481826 -206432 56884 -30819 -466757 -707904 -786559 -679492
10834 -679492 -16614 391107 548459 599608 834969 1057113 597788 452893 746232 551253
10824 551253 138180 54054 114429 159676 -223514 -653553 -604989 -263146 -88545 162381
10814 162381 421753 824844 817314 279504 -384186 -916874 -1052940 -678511 -8104 289831
10804 289831 106451 -261293 -481885 -317447 -35172 -144612 -198285 -249493 -350414 -454527
10794 -454527 -407714 -414122 -251208 80390 392709 6601 -256040 -440388 -879345 -917288
10784 -917288 -652017 -484886 -81628 417930 779565 404363 173988 -10287 -89621 -56652
$$ packed form
10854H28072j2279N0136l64337m25489K0906o52361n51377j13356j31896M8996
10844a302985M05294L40330P5535K75394K63316q7703m35938k41147p8655J07067
10834f79492O62878M07721J57352N1149K35361K22144m59325j44895K93339j94979
10824E51253m13073q4126O0375M5247l83190m30039M8564L41843J74601K50926
10814A62381K59372M03091p530n37810o63690n32688j36066L74429O70407K97935
10804B89831j83380l67744k20592J64438K82275j09440n3673n1208j00921j04113
10794d54527M6813o408J62914L31598L12319l86108k62641j84348m38957l7943
10784i17288K65271J67131M03258M99558L61635l75202k30375j84275p9334L2969
$$ plain form
10774 -56652 -163935 -559491 -824666 -485610 -241344 -157099 -104112 -35825 31970 -358019
10764 -358019 -942906 -746319 -127901 409970 614168 656022 882907 1187380 797535 137719
10754 137719 -148011 -731970 -1304191 -1127263 -777408 -383297 180768 564750 550994 367780
10744 367780 548967 771233 776958 523881 326546 522076 486212 328846 211323 -69990
10734 -69990 -136100 -26097 187056 323589 462573 623049 398703 228344 407824 523159
10724 523159 385754 594981 725335 607450 418494 -47153 -617599 -494656 145325 127865
10714 127865 -156680 -154449 -309091 -329546 -198961 -167389 -342722 -259875 -440455 -723620
10704 -723620 -542643 -164401 70467 424495 536553 208238 -238816 -850369 -1257212 -1373912
$$ packed form
10774e6652j07283l95556k65175L39056K44266Q4245N2987O8287O7795l89989
10764c58019n84887J96587O18418N37871K04198M1854K26885L04473l89845o59816
10754A37719k85730n83959n72221J76928L49855L94111N64065L83982j3756j83214
10744C67780J81187K22266N725k53077j97335J95530l5864j57366j17523k81313
10734f9990o6110J10003K13153J36533J38984J60476k24346j70359J79480J15335
10724E23159j37405K09227J30354j17885j88956m65647n70446J22943O39981j7460
10714A27865k84545K231j54642k0455J30585L1572j75333Q2847j80580k83165
10704g23620J80977L78242K34868L54028J12058l28315m47054o11553m06843j16700
$$ plain form
10694 -1373912 -1107343 -863867 -878023 -712407 -491892 -98352 545506 621458 317670 -30993
10684 -30993 -338908 -671310 -1046745 -909908 -773155 -747944 -454224 48127 390002 388394
10674 388394 73572 -518962 -598032 -177856 -39127 -218610 -46031 -235658 -940627 -1007942
10664 -1007942 -703403 -414811 -230166 -376622 -433322 -392903 -515497 -500376 -402208 -356150
10654 -356150 -56537 230227 -149381 -507658 -326821 -147287 -23851 -64128 -152735 -291987
10644 -291987 -389564 -745101 -952410 -545717 14142 62500 -385478 -316818 180770 343195
10634 343195 124568 8659 140929 -7548 -247245 -418501 -712549 -985825 -829642 -704823
10624 -704823 -907996 -1401759 -1934017 -1698511 -1280805 -953578 -773512 -632603 -547455 -889433
$$ packed form
10694a373912K66569K43476j4156J65616K20515L93540O43858P5952l03788l48663
10684c0993l07915l32402l75435J36837J36753K5211K93720N02351L41875j608
10674C88394l14822n92534p9070M20176J38729j79483J72579j89627p04969o7315
10664a007942L04539K88592J84645j46456n6700M0419j22594J5121R8168M6058
10654c56150K99613K86764l79608l58277J80837J79534J23436m0277q8607j39252
10644b91987r7577l55537k07309M06693N59859M8358m47978O8660M97588J62425
10634C43195k18627j15909J32270j48477k39697j71256k94048k73276J56183J24819
10624g04823k03173m93763n32258K35506M17706L27227J80066J40909Q5148l41978
$$ plain form
10614 -889433 -993201 -1045543 -1253719 -1219061 -990243 -831420 -685385 -785887 -1023271 -986715
10604 -986715 -1028010 -1017264 -792957 -373636 -380889 -406556 -440966 -569504 -489076 -409545 -84070
10593 -84070 500127 667371 333953 22160 -134779 -67630 395693 951369 1047885 493980
10583 493980 -113038 -308940 -719236 -1266168 -1332595 -1023555 -689546 -875975 -1294698 -1176533
10573 -1176533 -898112 -1080594 -1130106 -911758 -1124460 -1217631 -785897 -518010 -168458 -107022
10563 -107022 -220740 -309927 -804857 -1084876 -901093 -505634 -74514 275338 476611 197327
10553 197327 -93708 143350 613611 643696 97436 -473868 -667500 -487523 -407585 -654111
10543 -654111 -372969 -9500 -564516 -1219493 -1292565 -908651 -731325 -511387 -235483 -185671
$$ packed form
10614h89433j03768n2342k08176L4658K28818J58823J46035j00502k37384L6556
10604i86715m1295J0746K24307M19321p253k5667l4410j28538Q0428P9531L25475
10593h4070N84197J67244l33418l11793j56939O7149M63323N55676R6516n53905
10583D93980o07018j95902m10296n46932o6427L09040L34009j86429m18723J18165
10573a176533K78421j82482m9512K18348k12702r3171M31734K67887L49552O1436
10563a07022j13718q9187m94930k80019J83783L95459M31120L49852K01273k79284
10553A97327k91035K37058M70261L0085n46260n71304j93632J79977P9938k46526
10543f54111K81142L63469n55016o54977p3072L83914J77326K19938K75904M9812
$$ plain form
10533 -185671 -247976 -288007 -314032 -688256 -817473 -454506 22390 -45180 140285 491230
10523 491230 532233 477080 368663 249770 -67798 -123962 82783 474579 528117 -113443
10513 -113443 -573746 -652728 -455119 -125769 -67311 -315797 -60245 436980 549731 395746
10503 395746 126224 108000 48665 -154746 146923 199660 168228 285608 29220 -91969
10493 -91969 -78675 7333 98354 386977 287372 -260408 -555375 -468100 -22337 313161 148763
10482 148763 -119183 -408178 -761571 -812747 -1049401 -1320380 -1340916 -1297434 -880917 -149922
10472 -149922 265584 144438 21032 580673 1048136 606738 -380305 -1261136 -1036246 -562916
10462 -562916 -357012 46010 612463 673837 288023 -467722 -607836 -732440 -839073 -873866
$$ packed form
10533a85671o2305m0031k6025l74224j29217L62967M76896o7570J85465L50945
10523D91230M1003n5153j08417j18893l17568n6164K06745L91796N3538o41560
10513a13443m60303p8982J97609L29350N8458k48486K55552M97225J12751j53985
10503C95746k69522j8224n9335k03411L01669N2737l1432J17380k56388j21189
10493i1969J3294Q6008R1021K88623r9605n47780k94967Q7275M45763L35498j64398
10482A48763k67946k88995l53393n1176k36654k70979k0536M3482M16517P30995
10472a49922M15506j21146j23406N59641M67463m41398r87043q80831K24890M73330
10462e62916K05904M03022N66453O1374l85814p55745j40114j24604j06633l4793
$$ plain form
10452 -873866 -1017226 -1222895 -1148268 -938059 -781087 -610163 -905190 -897764 -577157 -213130
10442 -213130 -181280 -394481 -298382 185621 612655 748972 228067 -278556 -616326 -1009707
10432 -1009707 -694643 -170402 -412264 -812961 -990059 -1303088 -1729841 -1727724 -834935 299829
10422 299829 1041037 1508714 1470582 1292716 1068798 463753 78258 -96625 -125047 -376615
10412 -376615 -410797 -660591 -1128441 -1084531 -540654 -34906 207337 218018 110698 117921
10402 117921 194019 216806 618732 935523 751521 517570 188265 -251811 -859612 -1133757
10392 -1133757 -1134540 -1552773 -2122706 -1399052 -457025 -292876 -421217 -592040 -698280 -921137
10382 -921137 -1229151 -1591877 -1572607 -1475489 -1055599 -172279 432542 425696 -106673 -386661
$$ packed form
10452h73866j43360k05669P4627K10209J56972J70924k95027P426L20607L64027
10442b13130L1850k13201R6099M84003M27034J36317n20905n06623l37770l93381
10432a009707L15064N24241k41862m00697j77098l13029m26753K117Q92789J134764
10422B99829P41208M67677l8132j77866k23918o05045l85495j74883k8422k51568
10412c76615l4182k49794m67850M3910N43877N05748K42243J0681j07320P223
10402A17921P6098K2787M01926L16791j84002k33951l29305m40076o07801k74145
10392a133757p83m18233n69933P23654R42027J64149j28341j70823j06240k22857
10382i21137l08014l62726J9270R7118M19890Q83320O04821o846n32369k79988
$$ plain form
10372 -386661 -486069 -186487 -317102 -619151 -222479 149224 -10843 -483889 -405948 -366355
10362 -366355 -877827 -1021196 -1025337 -1096772 -1048054 -994926 -716687 -542147 -574314 -786562 -703662
10351 -703662 -479296 -690689 -971835 -1219263 -934060 -386927 -267143 -423224 -252006 57999
10341 57999 27124 -187563 -253084 -165246 60085 409830 545005 -14614 -774939 -981178
10331 -981178 -843793 -745786 -275955 435559 767469 797923 408752 36135 63059 -176120
10321 -176120 -649500 -825792 -726672 -469524 -157413 35010 -3588 -260563 -455105 -386607
10311 -386607 -310562 -734426 -438976 -180088 -619247 -458044 -26324 -12117 -192352 -174631
10301 -174631 -40599 -365595 -594835 -78514 387601 448157 611480 721714 514634 236651
$$ packed form
10372c86661r9408K99582j30615l02049L96672L71703j60067m73046P7941L9593
10362c66355n11472j43369m141p1435M8718N3128K78239J74540l2167k12248Q2900
10351g03662K24366k11393k81146k47428K85203N47133J19784j56081J71218L10005
10341E7999l0875k14687o5521Q7838K25331L49745J35175n59619p60325k06239
10331i81178J37385R8007M69831P11514L31910L0454l89171l72617K6924k39179
10321a76120m73380j76292R9120K57148L12111J92423l8598k56975j94542O8498
10311c86607P6045m23864K95450K58888m39159J61203M31720J4207j80235J7721
10301a74631J34032l24996k29240N16321M66115O0556J63323J10234k07080k77983
$$ plain form
10291 236651 592224 781291 336376 -194231 -440168 -377159 -415020 -158633 100476 -23869
10281 -23869 -34850 -207278 -371360 -14077 92348 -73101 -336119 -654042 -721970 -577308
10271 -577308 -439425 -27618 57853 -67350 259020 235445 -292498 -435853 -557921 -935416
10261 -935416 -1295113 -1316782 -762009 -4495 -65736 -66666 157285 125121 -210954 -746736 -1053157
10250 -1053157 -593059 -31685 124901 621376 642581 206789 108511 -104904 -389613 -429190
10240 -429190 -622714 -554470 -509168 -627207 -880096 -1020128 -813144 -507966 -309551 -53516
10230 -53516 26268 22191 -186101 -284306 -159031 125182 192929 262156 408611 125123 23888
10219 23888 -180697 -503077 -395100 -52471 121954 -116692 -339192 57262 445105 386843
$$ packed form
10291B36651L55573J89067m44915n30607k45937O3009l7861K56387K59109j24345
10281b3869j0981j72428j64082L57283J06425j65449k63018l17923o7928J44662
10271e77308J37883M11807Q5471j25203L26370k3575n27943j43355j22068l77495
10261i35416l59697k1669N54773P57514o1241r30K23951l2164l36075n35782l06421
10250a053157M60098N61374J56586M96475K1205m35792r8278k13415k84709l9577
10240d29190j93524O8244M5302j18039k52889j40032K06984L05178J98415K56035
10230e3516P9784m077k08292r8205J25275K84213O7747O9227J46455k83488j01235
10219B3888k04585l22380J07977L42629J74425k38646k22500L96454L87843n8262
$$ plain form
10209 386843 -42478 -384820 -198820 -20652 104908 232530 382216 441328 456532 214299
10199 214299 -197167 -269189 -271410 -120476 -47368 -33237 102040 -29509 -241462 -427482
10189 -427482 -780350 -852683 -612830 -61355 333019 601858 539318 423590 362064 94203
10179 94203 -136971 -305546 -222942 -300697 -430357 -490376 -123885 387942 668649 683868
10169 683868 545021 415472 575874 415850 -187232 -692766 -870469 -575851 -437292 -357624
10159 -357624 -359725 -621388 -915128 -991846 -794160 -692833 -778232 -678510 -366219 -309523 -612319
10148 -612319 -796732 -886173 -910621 -1123013 -1069252 -711397 -490076 -390229 -160925 -125182
10138 -125182 -282807 -399831 -325470 -200977 72226 97482 207486 693337 835284 808023
$$ packed form
10209C86843m29321l42342J86000J78168J25560J27622J49686N9112J5204k42233
10199B14299m11466p2022k221J50934P3108J4131J35277j31549k11953j86020
10189d27482l52868p2333K39853N51475L94374K68839o2540j15728o1526k67861
10179I4203k31174j68575Q2604p7755j29660o0019L66491N11827K80707J5219
10169F83868j38847j29549J60402j60024o03082n05534j77703K94618J38559P9668
10159c57624k101k61663k93740p6718J97686J01327q5399R9722L12291N6696l02796
10148f12319j84413q9441k4448k12392N3761L57855K21321R9847K29304L5743
10138a25182j57625j17024P4361J24493K73203K5256J10004M85851J41947k7261
$$ plain form
10128 808023 687354 427895 212395 34606 -143474 -555252 -739333 -647996 -90379 368397
10118 368397 494267 236231 -170295 -324273 -319304 -552031 -628287 -787164 -723678 -744539
10108 -744539 -794216 -559878 -146627 363107 760994 1567524 2396197 2771023 3042165 3599532
10098 3599532 4225716 5109018 6351890 7707176 9295125 11124294 13600662 17303350
10090 17303350 22147188 28102604 35647993 45369929 56930071 68543643 75750986 74191942
10082 74191942 65243458 53746268 42933003 34247351 27897637 22839048 18602998 15356745
10074 15356745 13357859 12072711 10942380 9643458 8642050 8153109 7404559 6890397
10066 6890397 6414899 5932161 5377485 4640754 4022637 3471190 3009217 3139758 2951852
$$ packed form
10128H08023j20669k59459k15500j77789j78080m11778j84081R1337N57617M58776
10118C68397J25870k58036m06526j53978M969k32727p6256j58877O3486k0861
10108g44539m9677K34338M13251N09734L97887Q06530Q28673L74826K71142N57367
10098C599532O26184Q83302J242872J355286J587949J829169K476368L702688
10090A7303350M843838N955416P545389R721936J1560142J1613572P207343j559044
10082G4191942q948484j1497190j0813265q685652o349714n058589m236050l246253
10074A5356745j998886j285148j130331j298922j001408m88941p48550n14162
10066F890397m75498m82738n54676p36731o18117n51447m61973J30541j87906
$$ plain form
10057 2951852 2463771 2439961 2365637 1971379 1571882 1351038 1314942 1248217 1402671 1889094
$$ packed form
10057B951852m88081k3810p4324l94258l99497k20844l6096o6725J54454M86423
$$ [...]
##END NTUPLES=NMR SPECTRUM
##END=
