##TITLE=C13_LR-689-A-CK1
 CDCl3, 22300 sc

 24.10.2019
##JCAMPDX= 6.0         $$ Bruker NMR JCAMP-DX V2.0
##DATA TYPE= NMR SPECTRUM
##DATA CLASS= NTUPLES
##ORIGIN= UXNMR, Bruker Analytische Messtechnik GmbH
##OWNER= root
$$ XWIN-NMR		Version 3.5
$$ Fri Oct 25 13:48:27 2019 Russian Standard Time (UT+4h)  she@DPX200
##.OBSERVE FREQUENCY= 50.327896
##.OBSERVE NUCLEUS= ^13C
##.ACQUISITION MODE= SIMULTANEOUS
##.ACQUISITION SCHEME= undefined
##.AVERAGES= 19405
##.DIGITISER RES= 17
##SPECTROMETER/DATA SYSTEM= spect
##.PULSE SEQUENCE= zgpg30
##.SOLVENT NAME= DMSO
##.SHIFT REFERENCE= (INTERNAL, DMSO, 0, 222.624)
##AUDIT TRAIL= $$ (NUMBER, WHEN, WHO, WHERE, WHAT)
$$ ##TITLE= Audit trail, XWIN-NMR		Version 3.5
$$ ##JCAMPDX= 5.01
$$ ##ORIGIN= Bruker BioSpin GmbH
$$ ##OWNER= she
$$ F:/spectra/data/she/nmr/c13/1/pdata/1/auditp.txt
$$ ##AUDIT TRAIL=  $$ (NUMBER, WHEN, WHO, WHERE, WHAT)
(   1,<2019-10-25 11:04:56.87 +0400>,<she>,<DPX200>,
      <created by zg, POWCHK disabled, PULCHK disabled
       terminated by command 'halt'
       configuration hash MD5:
       00 E9 B6 7A A2 85 ED C7 34 08 36 98 17 FE 4E 26
       data hash MD5: 32K
       6E F2 A0 A4 48 6A F3 9F 4E 0A 71 1E 0D 4E 1B 33>)
(   2,<2019-10-25 13:47:20.53 +0400>,<she>,<DPX200>,
      <Start of raw data processing
       efp BC_mod = 2 LB = 1 FT_mod = 6 PKNL = 1 PHC0 = -376.9655 PHC1 = 25.20636 SI = 32K 
       data hash MD5: 32K
       CD 3D 08 38 45 4A 31 D6 5A D9 EB 99 7F 6E B4 FF>)
(   3,<2019-10-25 13:47:23.39 +0400>,<she>,<DPX200>,
      <abs ABSG = 5 
       data hash MD5: 32K
       E9 70 6C 7D F2 0B 70 3A F4 43 9A 8E 99 7D 04 80>)
(   4,<2019-10-25 13:47:39.39 +0400>,<she>,<DPX200>,
      <pk PHC0 = -4.597768 PHC1 = 9.599999 
       data hash MD5: 32K
       E5 65 57 55 89 26 F3 6B 48 36 ED AB 3E 9B BE AF>)
(   5,<2019-10-25 13:47:42.53 +0400>,<she>,<DPX200>,
      <abs ABSG = 5 
       data hash MD5: 32K
       87 B1 B7 B5 9F D3 C2 45 9A B5 3E 06 65 17 A2 0B>)
$$ ##END=
$$ 
$$ hash MD5
$$ 40 3E 58 B4 6A 92 1F 02 45 1C B3 1C 1F 72 D9 FA
##$RELAX= 
##$RELAX= 
##$RELAX= 
##$RELAX= 
##$RELAX= 
##$RELAX= 
##$RELAX= 
##$RELAX= 
$$ Bruker specific parameters
$$ --------------------------
##$DU= <F:/spectra>
##$EXPNO= 1
##$NAME= <c13>
##$PROCNO= 1
##$TYPE= <nmr>
##$USER= <she>
##$AMP= (0..31)
100 100 100 100 100 100 100 100 100 100 100 100 100 100 100 100 100 100 
100 100 100 100 100 100 100 100 100 100 100 100 100 100 
##$AQSEQ= 0
##$AQ_mod= 1
##$AUNM= <au_zg>
##$AUTOPOS= <>
##$BF1= 50.322709
##$BF2= 200.13
##$BF3= 50.322709
##$BF4= 500.13
##$BF5= 500.13
##$BF6= 500.13
##$BF7= 500.13
##$BF8= 500.13
##$BYTORDA= 1
##$CFDGTYP= 0
##$CFRGTYP= 5
##$CHEMSTR= <none>
##$CNST= (0..31)
1 1 145 1 1 1 1 1 1 1 1 1 1 1 1 1 1 1 1 1 1 1 1 1 1 1 1 1 1 1 1 1 
##$CPDPRG= <waltz16>
##$CPDPRG1= <>
##$CPDPRG2= <waltz16>
##$CPDPRG3= <>
##$CPDPRG4= <mlev>
##$CPDPRG5= <mlev>
##$CPDPRG6= <mlev>
##$CPDPRG7= <mlev>
##$CPDPRG8= <mlev>
##$CPDPRGB= <>
##$CPDPRGT= <>
##$D= (0..31)
$$ [...]
##$SUBNAM4= <"">
##$SUBNAM5= <"">
##$SUBNAM6= <"">
##$SUBNAM7= <"">
##$SUBNAM8= <"">
##$SUBNAM9= <"">
##$SW= 239.972175391363
##$SWIBOX= (0..15)
0 1 3 0 0 0 0 0 0 0 0 0 0 0 0 0 
##$SW_h= 12077.2946859903
##$TD= 32768
##$TD0= 1
##$TE= 0
##$TE2= 300
##$TE3= 300
##$TEG= 300
##$TL= (0..7)
120 120 120 120 120 120 120 120 
##$TP= (0..7)
150 150 150 150 150 150 150 150 
##$TP07= 0
##$TPNAME0= <>
##$TPNAME1= <>
##$TPNAME2= <>
##$TPNAME3= <>
##$TPNAME4= <>
##$TPNAME5= <>
##$TPNAME6= <>
##$TPNAME7= <>
##$TPOAL= (0..7)
0.5 0.5 0.5 0.5 0.5 0.5 0.5 0.5 
##$TPOFFS= (0..7)
0 0 0 0 0 0 0 0 
##$TUNHIN= 0
##$TUNHOUT= 0
##$TUNXOUT= 0
##$USERA1= <user>
##$USERA2= <user>
##$USERA3= <user>
##$USERA4= <user>
##$USERA5= <user>
##$V9= 5
##$VALIST= <valist>
##$VCLIST= <CCCCCCCCCCCCCCC>
##$VD= 0
##$VDLIST= <DDDDDDDDDDDDDDD>
##$VPLIST= <PPPPPPPPPPPPPPP>
##$VTLIST= <TTTTTTTTTTTTTTT>
##$WBST= 1024
##$WBSW= 4
##$XGAIN= (0..3)
0 0 0 0 
##$XL= 0
##$YL= 0
##$YMAX_a= 126080747
##$YMIN_a= -30333448
##$ZGOPTNS= <>
##$ZL1= 120
##$ZL2= 120
##$ZL3= 120
##$ZL4= 120
##$ABSF1= 222.624
##$ABSF2= -17.3728
##$ABSG= 5
##$ABSL= 3
##$ALPHA= 0
##$AQORDER= 0
##$ASSFAC= 0
##$ASSFACI= 0
##$ASSFACX= 0
##$ASSWID= 0
##$AUNMP= <proc_1d>
##$AZFE= 0.1
##$AZFW= 0.5
##$BCFW= 0
##$BC_mod= 2
##$BYTORDP= 0
##$COROFFS= 0
##$CY= -3
##$DATMOD= 1
##$DC= 0
##$DFILT= <>
##$DTYPP= 0
##$F1P= 0
##$F2P= 0
##$FCOR= 0.5
##$FTSIZE= 32768
##$FT_mod= 6
##$GAMMA= 0
##$GB= 0
##$INTBC= 1
##$INTSCL= 4.134877e-10
##$ISEN= 128
##$LB= 1
##$LEV0= 0
##$LPBIN= 0
##$MAXI= 10000
##$MC2= 0
##$MEAN= 0
##$ME_mod= 0
##$MI= 0.1934396
##$NCOEF= 0
##$NC_proc= 2
##$NLEV= 6
##$NOISF1= 120.0001
##$NOISF2= 80.00006
##$NSP= 0
##$NTH_PI= 0
##$NZP= 0
##$OFFSET= 222.624
##$PC= 1.4
##$PHC0= -381.5633
##$PHC1= 34.80636
##$PH_mod= 1
##$PKNL= yes
##$PPARMOD= 0
##$PSCAL= 0
##$PSIGN= 0
##$REVERSE= no
##$SF= 50.3227315989248
##$SI= 32768
##$SIGF1= 140
##$SIGF2= 120
##$SINO= 11.81781
##$SIOLD= 32768
##$SREGLST= <13C.CDCl3>
##$SSB= 0
##$STSI= 32768
##$STSR= 0
##$SW_p= 12077.2946859903
##$SYMM= 0
##$S_DEV= 0
##$TDeff= 32768
##$TDoff= 0
##$TI= <>
##$TILT= no
##$TM1= 0
##$TM2= 0
##$TOPLEV= 0
##$USERP1= <user>
##$USERP2= <user>
##$USERP3= <user>
##$USERP4= <user>
##$USERP5= <user>
##$WDW= 1
##$XDIM= 32768
##$YMAX_p= 432778588
##$YMIN_p= -2111516
$$ End of Bruker specific parameters
$$ ---------------------------------
##NTUPLES= NMR SPECTRUM
##VAR_NAME=  FREQUENCY,     SPECTRUM/REAL,   SPECTRUM/IMAG
##SYMBOL=    X,             R,               I
##VAR_TYPE=  INDEPENDENT,   DEPENDENT,       DEPENDENT
##VAR_FORM=  AFFN,          ASDF,            ASDF
##VAR_DIM=   32768,         32768,           32768
##UNITS=     HZ,            ARBITRARY UNITS, ARBITRARY UNITS
##FACTOR=    0.368581032318806, 1,           1
##FIRST=     11203.0474431902, 0,            0
##LAST=      -874.247242800138, 0,           0
##MIN=       -874.247242800138, -2111516,    0
##MAX=       11203.0474431902, 432778588,    0
$$ Real data points
##PAGE= N=1
##DATA TABLE= (X++(R..R)), XYDATA
$$ [...]
18280 1395525 1173282 908582 412757 -9956 -166650 16379 19736 -115070 -297752 -229621
18270 -229621 160699 349908 229360 -96389 -246614 75443 369995 436895 358482 17125
18260 17125 -1461 139825 145287 52303 -32907 -109793 -392827 -533078 -302174 -349869 -436812
18249 -436812 -49169 139011 46922 41780 -101915 -407054 -612118 -485693 -182390 -318950
18239 -318950 -493584 -520692 -408994 -304698 -377576 -432073 -581078 -514617 -46658 253973
18229 253973 163836 18340 -249871 -229034 -32561 50063 2195 173278 13265 -333476
18219 -333476 -860263 -1243486 -1071058 -560315 -45532 170514 393134 451914 179617 83065
18209 83065 -35636 8465 230178 -98716 -518488 -302930 213289 154967 -147902 -508286
18199 -508286 -465926 -135394 499710 359121 -68613 184880 34592 -233956 -434464 -868045
18189 -868045 -932860 -812850 -931643 -1040893 -803343 -149258 216347 122917 333795 663689
18179 663689 791770 682950 703727 584550 296472 -41743 -167312 22940 56674 185347
18169 185347 508184 571762 459384 273693 -20207 -377661 -573661 -422105 -34754 531348
18159 531348 717714 473692 283233 -33647 -167150 13995 206856 332306 469056 517224
18149 517224 459122 337840 316205 345590 704983 949066 673622 351929 162180 269264
18139 269264 232981 64101 32348 278480 208127 -26603 -219059 -204717 -264642 -276890 -159668
18128 -159668 -237878 -284266 -31574 103564 30244 -216911 -397963 -116305 817748 1282170
18118 1282170 850219 568217 528542 348330 376872 424915 709398 1093140 916095 667236
18108 667236 621687 856855 1041320 915179 817081 904054 620101 325905 247647 155555
18098 155555 -256870 -434403 -689903 -665010 -270672 158076 411075 204765 -274168 -922651
18088 -922651 -1127638 -1113282 -1013801 -792987 -298189 -59658 180755 483033 641628 268911
18078 268911 -9711 121492 229704 156370 -518727 -797363 -623130 -570450 -577868 -413669
18068 -413669 -314318 -257913 -115085 165813 243436 -332394 -571500 -380352 -371002 -412862 -13999
18057 -13999 460115 816775 1163101 1069857 869069 421947 -53395 -243328 -125265 17563
18047 17563 230644 296796 62923 18015 -95330 -299937 -488034 -447969 -285718 -234436
18037 -234436 -148887 106597 226663 112036 126512 220059 50628 -98992 13055 61052
18027 61052 -24869 21445 -156585 -501953 -247152 112571 292298 514293 451371 352005
18017 352005 100088 -449546 -758267 -824940 -424961 364500 751332 874507 1222515 1352347
18007 1352347 789654 434719 86258 50241 264010 296837 120944 -248314 -468346 -421786
17997 -421786 -168365 310915 420393 208796 -361770 -687602 -1094528 -1140345 -1009875 -832511
17987 -832511 -726107 -985522 -1274984 -1378808 -903330 -500217 -588568 -1011498 -1370306 -1386868
17977 -1386868 -1214709 -1187664 -1238704 -1210462 -1162567 -961462 -506473 -20028 179658 144550
17967 144550 146891 -273922 -563188 -537134 -342674 -204867 -463106 -679118 -883616 -741431
17957 -741431 -615263 -835971 -648855 -329334 -210073 11194 240159 145570 -15453 -72219
17947 -72219 -171870 -107719 264049 649228 682557 295950 -189598 -227936 -296048 -164318 289387
17936 289387 690386 1016421 1136234 572025 -260403 -539616 -259226 424876 580225 105410
17926 105410 -557337 -405799 377699 855075 1289341 1261816 661983 50955 -95671 -109221
17916 -109221 -157994 -423496 -1065812 -1300766 -1219758 -858527 -714145 -432466 -74232 -71857
17906 -71857 -556975 -948413 -933913 -568693 -458187 -354579 106091 410360 286426 132046
17896 132046 -142348 -429196 -518198 -849735 -778110 -378589 -136496 82113 71713 77831
17886 77831 -118052 -240547 -320478 -410613 -527478 -544892 -493576 -98268 342513 297365 82192
17875 82192 25786 -1800 -286672 -111605 482831 679787 274756 -176380 -35989 155086
17865 155086 -86964 -330734 -556770 -652822 -574583 -347488 124325 368182 27059 -428285
17855 -428285 -455559 -360582 -116393 -10873 185033 195636 -188134 -290617 -533119 -726698
17845 -726698 -1071434 -1159917 -1067531 -1199341 -1171436 -803471 -509060 -267224 -137620 139571
17835 139571 397987 307769 -108034 -468246 -300711 -33969 -168357 -106534 -18991 -30764
17825 -30764 -338225 -594241 -349197 -72927 34232 -115938 -319180 -324591 11524 527167
17815 527167 920333 912187 497633 73638 -141559 -86220 42334 304025 561846 528517
17805 528517 98287 -523735 -799222 -803916 -907829 -817537 -534647 -718724 -734183 -243068
17795 -243068 -11251 110896 564570 624797 286525 12998 -100060 -248954 -101326 198299
17785 198299 381122 424097 536242 490283 128401 -99277 -265170 -469837 -534629 -248838
17775 -248838 -1805 61689 -105021 -854378 -1224540 -853168 -336196 -113404 -69007 160198
17765 160198 569607 484837 121754 -33342 60837 274849 422985 237160 -42324 -272963
17755 -272963 -400539 -617951 -895814 -806735 -44016 657901 811081 633865 471079 604153
17745 604153 477888 -28101 -148832 -292212 -632422 -663774 -271638 179126 479056 760484
17735 760484 878757 807182 1074300 1305961 815284 402478 279289 81079 -334660 -366682
17725 -366682 393297 464958 289387 212872 229035 -105878 -683306 -938801 -951166 -431066
17715 -431066 80278 104242 -53237 -83457 -156140 -342891 -444174 -501295 -683970 -1057216
17705 -1057216 -1082391 -514001 -279876 -292789 140040 705421 593751 216598 221030 416976
17695 416976 72908 -660622 -934569 -750112 -294438 -131174 -236426 -280626 -518183 -242597
17685 -242597 459458 635507 439857 585032 1021813 1197150 665486 536810 532925 366155
17675 366155 343066 480232 386370 143190 -202487 -68142 -10148 61668 241778 246458 -12202
17664 -12202 -321952 -92008 433438 672009 612036 533773 406316 116531 55393 520557
17654 520557 1295162 1714574 1826861 2070777 2281387 2203219 2112393 2149407 2105015 2225180
17644 2225180 2473548 2646646 2880212 3286767 4044412 4987199 6271456 7901106 9483236
17635 9483236 11207965 13614616 16969171 21311483 26327824 31684319 36639718 39754315
17627 39754315 39101304 35194655 29903741 24478498 19966486 16330014 13912811 12092354
17619 12092354 10246275 8459407 6888926 5773383 5060935 4607805 4492988 4034087 3296145
17610 3296145 2710814 2584139 2671439 2328850 1995998 1660976 1507547 1731325 1752676 1352145
17600 1352145 1187465 1227573 1323968 1386444 1545333 1604801 1621708 1372801 1133416 1100817
17590 1100817 1085226 863490 418023 332463 74664 -38045 339081 813033 999200 1268239
17580 1268239 1621745 1331179 978550 771038 591618 526342 102992 232967 469563 518380
17570 518380 767406 945898 1016991 1006337 755553 338434 25001 37552 241735 166817
17560 166817 -41761 -291557 -731852 -949525 -744223 -186950 94642 -28381 -448614 -540133
17550 -540133 -306951 -105497 -233919 -725202 -713942 -483834 -408798 -31491 227155 455598
17540 455598 784753 809915 355145 -100061 -142229 -210919 -280830 -117069 79164 -88168
17530 -88168 -235057 -354546 -578521 -659393 -379794 -441743 -433359 -347117 -232972 -80395 -105320
17519 -105320 -321523 -572312 -496318 -409502 -286218 -454526 -198788 398297 412101 -98903
17509 -98903 -526015 -697384 -603087 -580027 -374025 -390008 -120769 362784 382094 539205
17499 539205 667460 659355 594284 479693 656195 961708 863232 204277 -554986 -985294
17489 -985294 -770531 -322414 -287425 -105952 144212 392006 302806 439327 562956 447162
17479 447162 264603 368537 367536 -22151 -477782 -130991 256081 167212 234995 456459
17469 456459 635283 628386 467838 248255 -92506 -506869 -570914 -135033 31681 247440
17459 247440 928377 1248808 1140287 1214129 1234060 870564 535433 153450 -116657 232816
17449 232816 259747 205240 336674 170972 -156347 -257469 -99470 -46812 -282525 -612242
17439 -612242 -833540 -806181 -558905 -505749 -248600 -281715 -228245 2878 -258845 -723545
17429 -723545 -624259 -159564 129832 161625 315536 336940 -72766 -314832 -553474 -543884
17419 -543884 33775 381402 310458 -92741 -551120 -791895 -974450 -957879 -847906 -861149
17409 -861149 -579495 -244949 189682 426035 766093 941691 1000422 1086948 572751 -68366
17399 -68366 -491252 -731257 -240244 357925 482467 10955 -436159 -524671 -339848 -118359
17389 -118359 -94000 -143222 -59963 -348593 -705673 -808284 -517779 -91167 -24133 -87062
17379 -87062 -356700 -541461 -364114 187169 349879 48384 -21421 -27819 -339056 -83906
17369 -83906 121065 207304 207512 32476 -362350 -644217 -732677 -857975 -665590 -290856 12975
17358 12975 251902 357139 391464 358250 409259 595249 783077 1189636 1084178 1029541
17348 1029541 1145896 968867 685105 422018 124578 -159333 -301008 59923 657595
17339 657595 615637 343345 254426 124386 492779 514429 317489 487723 495777 562735 576756
17328 576756 221639 -209541 -404325 -443489 -596697 -530144 -456640 -462420 -660696 -779856
17318 -779856 -521348 -158532 129765 137168 171854 170414 230287 205264 137995 72926 -46777
17307 -46777 4447 238562 380288 650820 784388 430119 -274032 -893343 -1015974 -788500
17297 -788500 -425778 -591225 -851309 -667065 -153192 214606 223051 211616 423074 297593
17287 297593 -130146 -107282 34482 -63373 -17148 -65085 -336347 -238806 -52451 -36949 -291368
17276 -291368 -389622 -257276 131796 501417 693587 433003 213460 497151 817624 1263930
17266 1263930 1380409 771169 -99881 -422890 -356562 -365791 -492321 -667152 -1049714 -841258
17256 -841258 -250758 325559 585300 1002089 1088045 594646 287792 267817 36626 -619196
17246 -619196 -814244 -523077 -38029 407691 842735 988353 946813 518177 486401 384548
17236 384548 -179129 -700109 -745870 -454048 -462127 -470013 -159155 -9931 -408702 -609546
17226 -609546 -474845 -389387 -63577 516428 923283 1037433 793896 306507 -103334 -418318
17216 -418318 -42087 460038 172214 -8834 213685 253127 155605 69376 10027 -138071
17206 -138071 -90824 -136491 -291273 65598 496287 427852 226413 199303 -91718 -493696
17196 -493696 -293460 71807 19757 -215685 -377369 -497881 44661 593524 709883 682120
17186 682120 613063 515214 600088 507825 97443 -449024 -456886 -475497 -514061 -50764 326591
17175 326591 398231 362300 486997 352358 431167 522910 271263 266067 375093 158076 -193127
17164 -193127 -125343 417361 926318 1032374 946782 811694 390828 220147 577678 1043446
17154 1043446 1234556 1195202 992785 755649 442834 679178 846851 523796 349394 126655
17144 126655 -222805 -273080 -27596 -128478 -84378 -18905 -295519 -546453 -478069 -275342
17134 -275342 92182 354695 268493 343774 743260 729277 331081 191167 86475 -31971
17124 -31971 -82277 -70201 215525 456811 319287 220786 569082 371166 5156 191079
17114 191079 295946 450762 668050 626575 182664 -159210 -334798 -452576 -622476 -530660
17104 -530660 -169657 62701 102835 -7052 178395 57278 -293259 -571999 -892886 -702258
17094 -702258 -812532 -872081 -135312 367900 113694 -332345 -417598 -491833 -488241 -430299 -241851
17083 -241851 -49349 -58020 -118580 66975 414154 599349 464867 285393 140081 -78148
17073 -78148 -142938 -228659 -328793 -286201 -185445 147709 601504 994318 832565 380948
17063 380948 -99819 -340609 -276787 -206749 -97075 -157852 -179705 -36720 73952 116728
17053 116728 95940 81420 21266 -441003 -789722 -1024396 -741083 -566977 -656160 -476137
17043 -476137 -76919 160285 344669 54859 -253691 -105426 -658399 -902170 -443078 98252
17033 98252 520918 363383 -361170 -970081 -865135 -438794 -65495 -1352 -234243 -291449
17023 -291449 -290592 -107237 218088 411483 8862 -113216 214829 80201 71486 81179 -42110
17012 -42110 -370769 -513217 -31978 -38833 -166645 -198595 -321040 -26885 486117 704082
17002 704082 146991 -304774 -250244 -356276 -574808 -330225 75664 314520 -47419 -865658
16992 -865658 -1015987 -764355 -742020 -603032 -648302 -792167 -879836 -828809 -888772 -810185 -949777
16981 -949777 -1280751 -1060148 -497117 -251818 -232236 -274738 -324550 -316139 -716829 -1123558
16971 -1123558 -937832 -464626 -80035 340690 328449 -131915 -341974 -7194 301447 275502
16961 275502 494321 804822 656564 362679 363045 385200 469884 277749 296802 667741 958720
16950 958720 997967 833486 590903 259925 191960 25333 -116132 136712 202258 198299
16940 198299 149865 40988 -255248 -465095 -143211 -171175 -44839 449169 93017 -294169
16930 -294169 152209 494603 469186 415697 391869 277356 -9462 -490483 -766884 -573017
16920 -573017 -309973 173970 317069 113188 94958 477559 453328 145981 240193 648425
16910 648425 920652 985783 856053 734531 715505 311177 -215215 -346471 -351662 -255990
16900 -255990 -98734 -289072 -774756 -872574 -893460 -650414 99809 423659 482858 365481
16890 365481 377801 461930 129617 -53822 478716 754061 526239 125145 -3609 388260
16880 388260 443539 287043 141658 42357 462960 1118621 1596692 1660843 1806962 2315354
16870 2315354 1766588 1314136 1587733 1988615 2130873 2171531 2726764 3522168 4122578 4621859
16860 4621859 5358842 6056718 7032662 8484143 10544150 12360385 13217584 12927274 11441608
16851 11441608 9883417 8679276 6995564 5389987 4178423 3361629 3148602 3094621 2806807
16842 2806807 2535043 2329318 1662254 903221 530763 561307 966172 1135026 915516 605820
16832 605820 895543 1499793 1442161 1080295 1406538 1660383 1653400 1267975 963241 1124789
16822 1124789 1374237 1024450 329540 -103088 -170551 -252386 -192417 189742 456371 680395
16812 680395 738221 826060 857734 803170 436718 9102 -131253 176424 470370 251822
16802 251822 347829 512204 505347 665413 729029 1059616 1663335 1698866 1686284 1617342 1279038
16791 1279038 837558 288946 -255448 -290336 -369909 -687677 -576604 -192147 157592 490994
16781 490994 504870 309605 -53685 68502 173313 154373 199790 485407 872367 707910
16771 707910 369782 249855 418191 352976 89045 -287928 -279201 9857 360342 679805
16761 679805 777234 382275 -44951 30773 89282 -272969 -266783 -65760 -118007 -206219 -242225
16750 -242225 -117549 -210854 -88816 88557 95432 247498 414221 543668 730028 799766
16740 799766 610190 287289 200570 -304141 -702752 -900249 -1184371 -1260182 -1266893 -846153
16730 -846153 -686144 -626772 -194333 -52643 202842 722214 1104682 1053299 558854 319680
16720 319680 346838 319299 290117 495638 591880 472422 397891 367496 19236 -292167 -274131
16709 -274131 -173569 -144954 -175077 -177507 -351515 -749751 -1088478 -808574 37067 386184
16699 386184 309037 297565 448328 470204 74650 -179564 -15612 85138 -8170 -154681
16689 -154681 144289 434293 78636 -682589 -1010648 -650459 -231180 -37579 -281939 -170120
16679 -170120 36764 38364 153854 53386 -172323 -335163 -264144 -504158 -705231 -747016
16669 -747016 -757370 -699421 -460227 -224848 -256922 -555175 -1069463 -1214743 -1269781 -835576
16659 -835576 42531 610081 538628 149689 3416 -314446 -257196 -368679 -807065 -1158007
16649 -1158007 -941512 -329427 -76208 -101179 -451523 -446266 -362904 -367060 -429040 -666962 -862487
16638 -862487 -666996 -115189 347163 175948 -49753 -167044 -337051 -140725 -5236 -269499
16628 -269499 -231506 -208935 -236764 -171978 -48983 496077 496725 265798 348783 153584 191795
16617 191795 93853 307390 703912 381068 124264 51776 -186466 -96022 544373 731438
16607 731438 531258 598445 772092 606551 92509 -573863 -652397 -583245 -538522 -581662
16597 -581662 -677283 -456603 98863 441203 583492 732316 779083 599819 295571 172043
16587 172043 11280 -4830 -16006 -244381 -511819 -512042 -298375 -113963 138915 148939 172510
16576 172510 166249 77776 -152589 -215816 -17352 216832 237933 113333 32166 2822 204142
16565 204142 527491 777913 994404 996368 597598 366471 438822 345370 107527 -287575
16555 -287575 -419908 -189875 101026 -93022 -443699 59945 558736 615509 6148 -431140
16545 -431140 -484091 -533762 -511863 -440212 -477318 -592783 -904658 -1030115 -964590 -941310 -727336
16534 -727336 -476636 -102623 155814 229202 -161114 -652963 -696434 -371000 -203578 -498068
16524 -498068 -472824 -335880 -51946 -17705 -359020 -421054 80367 458204 576424 869059
16514 869059 711198 592652 581651 89942 -457641 -619993 -319657 1439 80276 49431
16504 49431 126188 153544 30917 148641 1464 -363031 -779363 -713161 -366804 -432389
16494 -432389 -657920 -646055 -482519 -583998 -508186 -130867 -58011 76418 445526 785295
16484 785295 835556 644275 297533 132952 220575 434805 688697 715378 592534 407984
16474 407984 322838 -229626 -672327 -926520 -1006982 -812383 -774244 -588895 -539955 -485122
16464 -485122 93719 361956 327773 319987 246484 -50290 -422534 -432187 -95539 229844 66479
16453 66479 -337745 -666495 -556763 -318039 -118368 -210808 -303454 -333871 -267841 -234564 -333951
16442 -333951 28228 337639 275794 107636 394222 659382 468598 335403 96660 -500968
16432 -500968 -542518 -551609 -510191 -285321 -68613 238569 211342 13752 175541 425242
16422 425242 182795 -101679 -285302 128879 1181124 1557221 1410799 762909 -81048
16413 -81048 -516785 -819031 -1154843 -1622105 -1533921 -1152520 -891898 -1015772 -1078506 -737556
16403 -737556 -597480 -692861 -775562 -1079074 -1421955 -1301271 -1109209 -859281 -563779 -348585
16393 -348585 -235886 -403029 -437774 -394023 -244858 80114 384117 -102497 -837066 -525936
16383 -525936 -98156 -477046 -748505 -624010 -488844 99973 449070 681859 1155981 1048108
16373 1048108 990280 961085 1025207 1005504 902366 703636 545308 507713 418109 -107579
16363 -107579 -218272 101826 195921 -106738 -663652 -836366 -1029719 -980182 -675006 -505420
16353 -505420 -365785 -28580 26450 -72499 -63296 -256992 -541944 -769067 -538125 -607633
16343 -607633 -1124981 -1312177 -846368 -204528 356952 1003030 1061271 857059 798840 726293
16333 726293 330700 -410837 -698502 -907396 -670954 -569917 -667331 -403546 -452304 -619155
16323 -619155 -461145 -457737 -757920 -977717 -737866 -70426 333625 277561 -59449 -400840
16313 -400840 -640545 -1041850 -1280222 -1040208 -642421 -338628 -128476 -203236 -463157 -595714
16303 -595714 -665556 -769132 -894882 -836685 -675958 -691813 -737870 -531932 -326080 -188822
16293 -188822 -189129 -103495 168502 250573 301453 372617 379171 153045 -158186 -65589 138138
16282 138138 123853 -129772 -216984 -381218 -457129 -293355 -234632 -492137 -804076 -1017772
16272 -1017772 -927269 -928805 -1094677 -1223826 -1157091 -1350813 -1653073 -1601672 -1285265 -1120610
16262 -1120610 -1056680 -1239222 -1461876 -1267649 -1025214 -1091063 -940639 -802196 -685735 -415099
16252 -415099 -590470 -795523 -871355 -1037249 -1070344 -1339204 -1424789 -1182764 -1212792 -1112245
16242 -1112245 -861488 -691066 -956605 -1159434 -1199504 -1136513 -796979 -219768 191492 156556
16232 156556 20510 -161298 -330254 -658839 -1045499 -981918 -738631 -683391 -751850 -761328
16222 -761328 -274584 215679 79246 -226134 -57844 32008 -242140 -264374 -14520 -37735
16212 -37735 -315870 -495658 -397826 -162516 -382713 -740028 -1021489 -899025 -237131 -69396
16202 -69396 -48658 74860 119972 -269787 -559316 -1043033 -1470337 -1400243 -1039205 -564445
16192 -564445 -79181 -38973 -187093 -106579 41656 -135120 -340925 -329734 -547229 -245640
16182 -245640 269212 189969 337314 649942 808882 512394 130217 102308 49752 -48916
16172 -48916 94985 -9311 -204158 248599 530898 140188 -395825 -589666 -453917 -332131
16162 -332131 -569779 -501128 -239367 267813 690018 491985 97767 -179215 -469113 -747472
16152 -747472 -694870 -643889 -717820 -678258 -686593 -534855 -731220 -1031070 -818550 -589993 -429880
16141 -429880 -17676 325345 341084 317478 408859 426715 610910 582688 358510 588030
16131 588030 964470 1089932 982137 675170 486606 906436 1135826 948709 610348 411797
16121 411797 145401 169348 466509 354498 -210703 -704870 -598055 -258521 -563162 -957784
16111 -957784 -785669 -533736 -121327 -37575 -384348 -680571 -762867 -799170 -864119 -1165396
16101 -1165396 -1216559 -937081 -905030 -890431 -749117 -806874 -965618 -731473 -315817 61287
16091 61287 -194139 -839586 -1463714 -1642258 -1393720 -1216585 -983103 -942530 -899813 -893098
16081 -893098 -733957 -801859 -1060209 -890938 -1008518 -1010780 -954418 -1177762 -1166226 -674688
16071 -674688 -296785 -687869 -1286057 -1183668 -993756 -1086970 -891709 -603282 -74847 450495
16061 450495 602895 125497 -394082 -455115 -412990 -514426 -659812 -631869 -319376 -455513
16051 -455513 -565918 -869991 -1043167 -936062 -607698 -325618 -89437 131915 173031 289840
16041 289840 177837 80848 -251243 -488431 -352386 -190624 -31248 149672 493131 700168
16031 700168 610929 508601 428225 219934 -121462 -232063 -620509 -926131 -632034 -414488
16021 -414488 -479421 -488368 -414236 -101803 222171 393286 216128 -182597 -45353 -210916
16011 -210916 -405116 116249 794146 863330 725152 442235 -61808 -277332 -561420 -1070663
16001 -1070663 -1280891 -752005 -200052 -87764 100001 674596 738572 242171 46068 314809
15991 314809 566704 693477 588789 15804 -480424 -958956 -942471 -821897 -675934 -605673
15981 -605673 -520834 -289517 88249 287792 462330 499948 159088 -114017 -36185 -102344
15971 -102344 -367299 -211412 205682 279144 -110717 -400664 -347053 -542814 -558296 -295390
15961 -295390 -405278 -353538 -366664 -467902 -409221 -114841 36267 -78062 -313956 -594229
15951 -594229 -481672 -128056 206223 156024 -275734 -562553 -698746 -1019518 -1121209 -686882
15941 -686882 98126 408019 674617 636778 422876 591564 672963 254682 -268600 -196593
15931 -196593 172698 456963 699328 804209 419459 -227655 -575334 -927112 -952677 -219826
15921 -219826 267389 326500 418850 364240 303189 414276 428877 358247 184711 -122205 -656094
15910 -656094 -605423 -212608 -199746 -721896 -881606 -704520 -656257 -429156 -202390 -195728
15900 -195728 -215500 260008 292768 -5195 -69500 -325071 -492200 -174124 -106842 -340032
15890 -340032 -387882 -313974 -541197 -793841 -762999 -922878 -352141 341550 383853 21585
15880 21585 119458 -173992 -791928 -907892 -719821 -169896 339463 385199 412232 395296
15870 395296 232556 249139 353841 588045 733122 800006 953184 819175 653336 508777
15860 508777 185752 -8724 -100068 -86573 107569 84426 -313027 -756593 -779881 -527093
15850 -527093 -165644 105687 113282 148199 213300 218717 21349 -124713 38057 388548 373658
15839 373658 117365 -359634 -760300 -943219 -1032720 -706883 -385321 -428317 -438000 -399333
15829 -399333 -330963 -258816 -202644 -115021 -188529 43602 256987 -199611 -543756 -689781
15819 -689781 -680025 -395837 -359332 -324931 -82491 221505 -13382 -202495 19213 211336
15809 211336 274870 -76092 -375843 -585438 -737321 -858279 -639887 -625011 -1013842 -903234
15799 -903234 -362712 124720 -109444 -494388 -617536 -628126 -324807 -29528 576498 837065
15789 837065 585323 378892 334751 215020 4943 -460292 -754394 -626866 -356399 -139930
15779 -139930 -17841 -59579 -317342 -178736 -21097 224449 369734 251483 10039 -23527
15769 -23527 -40577 -295870 -260411 33061 -7527 -60619 74378 351850 328111 94085 -244268
15758 -244268 -165814 410407 620933 122054 -201997 -349417 -453423 -778007 -1035010 -722283
15748 -722283 -156676 319901 278645 349584 566959 459754 -186828 -578753 -544515 -513704
15738 -513704 -125652 145289 208952 129685 -72023 -567861 -866012 -644522 -432147 -522147
15728 -522147 -653083 -554012 -425570 -499828 -432950 -33099 120027 -93440 -393963 -531648
15718 -531648 -414968 -40254 -136722 -238269 52711 156895 23251 -289642 -420819 -310129
15708 -310129 -318770 -629435 -805073 -697485 -461276 -237374 125311 7838 -587388 -828621
15698 -828621 -639361 -419721 -505693 -791784 -838283 -649512 -328757 86089 145153 283488
15688 283488 268445 -3847 -196638 -289307 -409410 -388189 -586855 -806138 -895310 -886951 -1092998
15677 -1092998 -1448178 -1629687 -1341174 -844587 -959132 -1123841 -1012962 -705290 -468284
15668 -468284 -150244 187435 87972 -433241 -707847 -566799 -537779 -755602 -669766 -639886
15658 -639886 -463191 -43999 280191 639984 813383 181588 -134683 53404 57771 -55943
15648 -55943 -357302 -708719 -880905 -331858 191792 316822 289854 410096 596146 -25745
15638 -25745 -704801 -745532 -532170 -453331 -182337 281155 846527 963726 488568 94962
15628 94962 125358 275290 97602 20091 246391 657831 1070075 1430240 1243067 508746
15618 508746 -50498 -406153 -386457 -195189 -21202 142956 158329 -93112 -64438 288467
15608 288467 272196 -50648 -239611 131342 606947 1186957 1468987 1249769 790760 140391
15598 140391 -231692 -902701 -1171767 -1055960 -982946 -991466 -778342 -534068 -395647 -694138
15588 -694138 -889001 -725693 -368084 56513 -301197 -358106 -65034 139018 54918 250496
15578 250496 -24789 -866246 -1419523 -1269659 -662999 103601 422186 195310 66051 -207602
15568 -207602 -346319 -171180 400860 913534 728560 523018 495748 634469 821989 884517
15558 884517 896029 908241 978520 788659 807005 529703 352722 51746 -272738 -114014
15548 -114014 -185794 -214205 -153796 -243456 -333933 -99050 392485 711966 728611 587369 197948
15537 197948 -30009 -209155 -396998 -800515 -928195 -553748 -58642 284218 172298 -90751
15527 -90751 -90046 -90199 -154201 -235000 -121322 -50259 -311022 -509204 -295697 -247399 -107096
15516 -107096 113661 294965 56967 -196570 17287 207464 149220 -277797 -692143 -695207
15506 -695207 -997267 -1507821 -1817128 -1456542 -574104 468385 649497 223418 -31579
15497 -31579 125360 232224 300563 264275 239823 -11319 -159640 649477 1130140 921279
15487 921279 832503 694558 371818 -286625 -617826 -592473 -661866 -273703 5023 -140838
15477 -140838 -381751 -510326 -604094 -551048 -493863 -707105 -495194 -133073 17617 203059
15467 203059 364790 183607 -269625 -487967 -602016 -757219 -880778 -969888 -917463 -640301
15457 -640301 -616433 -344072 207212 82768 -204269 -101721 -120004 -418739 -406601 -382203
15447 -382203 -278845 35802 589824 848431 462387 -90304 -209146 -287125 -483763 -464388
15437 -464388 -374213 -123903 89070 56430 -94996 -219385 235930 748583 773568 658875
15427 658875 519468 252015 -430363 -934050 -735490 -491590 -553848 -570130 -303792 -139148
15417 -139148 -256576 -405162 -170505 333251 171738 -50395 29614 350942 242197 16308
15407 16308 -238756 -612534 -779707 -694682 -345922 -132175 -209358 -197516 -399602 -302556
15397 -302556 -72146 9889 147959 239725 192806 386893 493738 213424 -239853 -463049
15387 -463049 -427489 -431398 -297759 -217356 -361260 -769290 -973084 -790345 -135862 800698
15377 800698 1286750 1444056 1301047 899053 327783 -125586 -220940 -501802 -577037 -285088
15367 -285088 19643 126507 110817 -127038 -41187 171936 -223207 -664347 -622262 -463659
15357 -463659 -188620 26088 -314557 -516153 -595481 -462685 -450341 -561363 -261617 17494
15347 17494 69752 -135278 -249940 -318628 -360595 -408186 -732842 -730047 -394697 -85526 -10394
15336 -10394 54981 -18102 -382179 -542413 -143017 -71671 -285090 -155707 -145556 -351206
15326 -351206 -503249 -389891 -612481 -760108 -723212 -844899 -528094 -308387 -88159 148623
15316 148623 340165 137311 -352987 -545168 -449218 -342794 -321870 -74586 306525 433478
15306 433478 567680 370051 -8297 -203030 -93057 58365 -57316 477142 546609 293962
15296 293962 394563 455415 512783 44914 -520447 -686220 -626477 -215517 91919 289205
15286 289205 446179 506537 363361 176543 -213461 -416893 -19500 246146 330276 211851
15276 211851 -157990 -338612 -429826 -438669 -411047 -952909 -1396442 -1375398 -1384467 -1188772 -898448
15265 -898448 -613096 -215375 -76352 -227370 -433572 -576033 -552315 -577483 -1005354 -1305988
15255 -1305988 -1803837 -1820184 -1579939 -1549573 -1039405 -427965 -455520 -259558 -286820 -376128
15245 -376128 -63178 123775 265443 377286 94087 -85138 3438 -97528 -135694 -251441
15235 -251441 -531002 -512848 -137033 128326 281446 557551 431767 116476 -153021 -696408
15225 -696408 -1021446 -956825 -455677 76528 130700 188081 -42915 -206557 -94259 -237843
15215 -237843 -650810 -1039232 -1130313 -1165690 -1056665 -1445217 -1825702 -1331559 -1107250 -1110968
15205 -1110968 -1154056 -944261 -650044 -250108 460346 1176254 1143275 609025 -15137 -281470
15195 -281470 -288257 -289809 -290888 -203076 -330889 -630923 -911090 -901503 -460859 -128937 391323
15184 391323 546628 141605 118272 444561 308823 440002 554608 371524 409534 28327
15174 28327 -347683 -161536 179532 410864 251400 68495 14563 -342146 -876482 -1304852
15164 -1304852 -1051422 -643139 -678423 -629587 -541359 -544001 -809847 -691294 -310954 -153117
15154 -153117 -48201 114551 -26715 42760 104317 -90833 -372040 -752829 -956351 -581347
15144 -581347 -239832 -131738 -178940 -339177 -356953 -419342 -582553 -962532 -1073698 -1013486
15134 -1013486 -903592 -794075 -914523 -1030726 -1108681 -959773 -913155 -1083398 -1338609 -1369997
15124 -1369997 -971629 -465891 -217301 -153219 -361853 -786837 -1006827 -838267 -605685 -182453
15114 -182453 -24163 -169619 -180368 -326617 -514818 -924309 -1004461 -668219 -225903 -52912
15104 -52912 -82756 296059 288924 380279 399016 18880 -77505 -112562 -189525 -168027 -252982
15093 -252982 -284214 -269422 -458757 -205687 -1039 138343 94760 -462941 -710434 -597056
15083 -597056 -158594 141119 32727 54913 280145 36584 -391391 -667438 -477923 -316756
15073 -316756 96436 335678 170622 -91387 162157 301686 -23771 -282412 -169068 27243
15063 27243 494572 505145 -102662 -347281 -264454 -51759 39244 96736 -25449 -334225
15053 -334225 -418497 -110273 447017 973162 765979 287203 201470 -155384 -579358 -622655
15043 -622655 -595671 -532739 -380348 -915452 -1012551 -836243 -567915 -199299 -387152 -586183
15033 -586183 -281284 120867 572541 669671 435659 389141 420013 226158 171507 -513
15023 -513 -126680 -276241 -293495 70117 427664 891741 752795 749848 967979 1283389 1287877
15012 1287877 1323921 1142333 962173 763792 545296 367578 -158140 -818983 -1096053 -1007455
15002 -1007455 -485996 141814 579495 208663 -207896 14049 713370 932085 592413
14993 592413 148559 85352 -131192 -437900 -674091 -402998 90849 131244 443844 896369
14983 896369 921127 691738 646378 528023 98085 110943 580443 554767 71130 -278001
14973 -278001 -668380 -972079 -1070885 -985357 -661176 -430219 -243679 -324558 -642805 -663666
14963 -663666 -402444 114025 446310 490684 247640 -75093 -224875 -358372 -465385 -364428
14953 -364428 108876 377554 533927 575010 676517 750008 953540 1277551 1234640 895850
14943 895850 749375 537555 -24583 -258839 -24870 23439 -200991 -32611 243447 279065
14933 279065 170023 11716 -15083 -20846 225287 305130 -243650 -759092 -955963 -867889
14923 -867889 -633880 -474648 -534926 -561449 -647556 -771848 -780668 -617396 -580093 -710455 -621973
14912 -621973 -582778 -634670 -938640 -1087320 -1125453 -935355 -842802 -821013 -640614 -389585
14902 -389585 -119449 163113 91977 -415767 -508514 -187099 -61910 141988 662910 1276777
14892 1276777 1298743 614506 5261 -202825 -82298 -85491 -435725 -597960 -513192 -393491
14882 -393491 -484850 -791283 -800836 -547956 -524156 -695411 -686766 -427077 -379587 -322483 -247715
14871 -247715 -184506 -190465 -182033 -301066 -651331 -892657 -906261 -810349 -870538 -1155577 -1385529
14860 -1385529 -1335941 -1427157 -1175249 -426587 -127369 105457 47134 -264572 -471262 -691632
14850 -691632 -798396 -747601 -484158 -82276 342610 462461 595850 886168 944012 876226
14840 876226 773410 750041 581364 525247 611521 658739 525404 189492 -38012 102555
14830 102555 212581 -32477 4819 6135 280287 539361 311038 -186102 -492888 -665614
14820 -665614 -718987 -408544 -103763 -64994 -109122 214682 600811 535949 273981 276323 268309
14809 268309 135180 275913 119690 -51117 25778 -80683 -100304 -235459 -162856 361325
14799 361325 616049 453433 113511 -53017 32384 -221801 -520260 -511464 -646569 -819503
14789 -819503 -787601 -690348 -503344 -516512 -654530 -819915 -879413 -371214 81553 -4833
14779 -4833 -593410 -897727 -548499 -201255 -304615 -305903 -163220 172907 -45950 -226907
14769 -226907 -137053 215557 444732 332581 -61118 -373580 -172877 -189736 3240 136600
14759 136600 25880 -59797 18103 174378 141139 -115475 -113638 179107 315893 223548 -137678
14748 -137678 -811311 -1160790 -1253738 -1559015 -1268902 -595888 -347397 -329249 -118681 88770
14738 88770 -61816 -371213 -282728 -258759 -791995 -1210505 -1229858 -1231117 -1399444 -1560936 -1220978
14727 -1220978 -659049 -420453 -409633 -758530 -864024 -854905 -1240903 -1422065 -1312375 -618487
14717 -618487 -121157 157892 160775 110705 169325 6507 -83925 -1359 -87341 144238 390154
14706 390154 272457 237608 64947 -427053 -706121 -322045 13702 -223501 -215906 22838
14696 22838 154926 276340 198742 -56949 -245621 -429234 -294481 -130735 123753 370424
14686 370424 104974 -177714 -314213 -361730 -345449 2842 235380 146632 60780 195432
14676 195432 158533 32069 41805 327859 350499 -4684 -65610 -152901 -307133 -203432 39435
14665 39435 16349 184551 305537 235956 244969 176380 138620 -131507 -211846 232202 91856
14654 91856 -555039 -1050540 -1119265 -1023504 -906004 -897642 -823743 -800227 -750198 -349469 361951
14643 361951 634279 345153 -118201 -377191 -411312 -151290 8199 226676 775716 531073
14633 531073 101172 -237039 -547346 -496977 -452942 -602935 -722504 -713693 -408903 -241912
14623 -241912 -203523 156497 528703 497536 320540 325703 422855 180417 301586 407424
14613 407424 359776 15347 -314048 -324163 46584 297161 -123483 -297592 -144210 -66557
14603 -66557 -302474 -715511 -772019 -770047 -556580 -228144 -365290 -584666 -239768 -80874
14593 -80874 161246 760852 1310368 1351040 1010285 848113 871705 566507 321834 217276
14583 217276 -275201 -928367 -1001750 -556381 145436 445751 248627 30418 -53588 -266665
14573 -266665 -695608 -879316 -565509 -155018 -108350 -133875 291883 253019 -192005 -114631
14563 -114631 61045 -83204 -498307 -322371 393212 473978 184601 257542 470853 401646
14553 401646 -19114 -532245 -630399 -202753 170981 166746 123946 205250 380616 538589
14543 538589 427479 173391 -76816 -367809 -287562 -378566 -552105 -597399 -571171 -690449
14533 -690449 -1250116 -1245708 -1072772 -1288552 -1418988 -1209682 -924705 -560741 -401923 -467180
14523 -467180 -623058 -654703 -316962 -48860 145517 234924 -156154 -841421 -1071385 -831174
14513 -831174 -938486 -1005595 -716965 -694612 -655219 -936157 -1066830 -807936 -605142 -657259
14503 -657259 -788093 -630265 -131173 504831 506274 -73771 -693573 -1021481 -928478 -618149
14493 -618149 -111068 151712 172924 17364 -91941 -374281 -780050 -716960 -699749 -970529
14483 -970529 -1088304 -640938 -353109 -292427 -470055 -988402 -1370600 -1285698 -933004 -622403
14473 -622403 -222345 230876 582308 552193 162011 -286590 -521478 -371778 -157906 -127585
14463 -127585 -23609 158 -114458 -326040 -474107 -490170 -325247 -376624 -405250 -359867
14453 -359867 -294757 -66571 -49135 48218 149762 -220188 -565996 -475727 -479125 -628946 -789361
14442 -789361 -722451 -619357 -378104 -222800 126646 139063 -121536 157057 622017 374768
14432 374768 -74866 -354830 -347072 -179299 -30002 121660 288055 328670 402955 221081
14422 221081 208 434852 1046212 1078862 866007 465779 -80313 -110329 32699 57236
14412 57236 -124218 -103554 83493 208021 -106322 -316363 -40725 4403 -341680 -632412
14402 -632412 -565742 -644559 -574129 -468181 -358562 -170309 305401 183174 -18502 -28600
14392 -28600 -188250 -356007 -245162 108507 115494 -23315 -148047 -270612 -353421 -213041
14382 -213041 -309203 -586672 -703937 -661175 -585984 -545262 -800746 -743454 -697051 -805256 -643667
14371 -643667 -391659 -675862 -1176642 -1131300 -642454 -196334 -173007 241572 332277 -317504
14361 -317504 -598923 -376296 29916 211126 509719 695237 779581 865628 786818 601675
14351 601675 533235 481614 291478 285166 376757 306371 171012 -11119 -300703 -75218 166931
14340 166931 50459 180108 235838 15333 305482 1010520 1089063 562721 481981 481767 184134
14329 184134 70426 -43159 -356014 -355677 -295421 -496104 -523690 -513877 -512913 -593543 -811472
14318 -811472 -934354 -816492 -702410 -745707 -758150 -450168 -368074 -530646 -439687 -126468
14308 -126468 254850 87785 -85041 242178 857391 1194510 987290 736328 605062 351994
14298 351994 127806 -106259 -97240 7641 205680 239400 48314 -120298 -365245 -592901
14288 -592901 -457412 -93816 -116183 -246688 -287080 -106836 31144 -93698 -312416 -569415
14278 -569415 -963974 -1361660 -1497378 -1704769 -1429532 -817621 -1026530 -1349042 -1577599 -1470325
14268 -1470325 -732123 -269141 -155517 99197 -88192 -181346 169926 228456 86999 255878
14258 255878 341181 88574 392411 824358 929167 547650 316460 315865 81144 151436
14248 151436 133209 -67018 -89073 -68871 64510 400044 579747 602662 510347 441753 89945
14237 89945 -223989 -327004 -481425 -729619 -769246 -711993 -854311 -931621 -742174 -167274
14227 -167274 108706 -168793 -96138 -274068 -143791 193016 -19384 -363993 -547832 -366910
14217 -366910 16944 292655 312362 -122255 -628308 -586357 -472160 -514034 -476848 -387954
14207 -387954 -451840 -382458 -20209 533415 806575 347214 30033 189209 369603 460262
14197 460262 271781 496491 780637 436325 -113077 -564144 -700422 -646437 -729332 -739818
14187 -739818 -280195 -199912 122220 327485 -142867 -677480 -966004 -680848 -57600 200536
14177 200536 175134 -168729 -553066 -648703 -793349 -861540 -355948 568851 855020 796633
14167 796633 910727 842028 236654 -123661 -39276 -285392 -273505 60863 269797 30428
14157 30428 -289590 -270856 -303725 -372586 -186341 214816 185443 334384 606423 222042
14147 222042 -683148 -796874 -248702 186156 31335 -13096 207445 -153449 -428982 -228255
14137 -228255 78088 33534 -383269 -531406 -560319 -309176 82590 228930 114522 -243562
14127 -243562 -746116 -799140 -609288 -295108 -313509 -560529 -628832 -677018 -782397 -638205
14117 -638205 -287755 -44987 98283 142462 270847 389751 325038 658973 674003 -20202
14107 -20202 -231924 -134065 -106929 -150163 -231228 -351458 -309365 -101016 219866 199302 272008
14096 272008 324886 281369 178952 -149646 -342025 -246247 -534310 -589604 -267301 -232174
14086 -232174 -563415 -903418 -870224 -1076631 -1041399 -825640 -684324 -721845 -209924 613919
14076 613919 988081 766612 210601 -298599 -611158 -769550 -747672 -936628 -995559 -928661
14066 -928661 -1100327 -1275501 -881336 -350260 -211983 -12604 444978 559721 252492 120785
14056 120785 -131365 -182682 -45956 -7204 125627 1220 -17712 -125859 -336037 -194060
14046 -194060 -152417 -115649 25312 184132 40201 -148064 -251811 -459443 -790160 -864388
14036 -864388 -365846 137206 319872 413487 550667 331879 168856 286570 304214 125592
14026 125592 -354074 -560443 -398390 -132988 -20079 -199232 -373875 -184843 -244260 -732410
14016 -732410 -858511 -528308 -214744 -17064 -33981 -159819 -67264 -186823 -325546 -341387
14006 -341387 -639573 -833509 -566784 -524353 -695061 -665353 -818633 -1057652 -946134 -618254
13996 -618254 -244735 223484 240840 -204791 -538781 -647721 -658447 -914939 -903564 -516724
13986 -516724 -176293 -115623 -496355 -540381 -501556 -425289 -174130 -120188 40870 100638 289558
13975 289558 576859 352044 -39740 -271390 -295127 -248220 -504390 -520007 -204039 -82385
13965 -82385 -4704 13297 102075 -5554 -249499 -98749 352870 168215 -223698 -255595
13955 -255595 -420374 -302562 -234352 -476389 -465774 -574706 -349930 -283971 -357108 -344777
13945 -344777 -8923 233987 532035 588385 346121 207321 -195048 -713797 -924881 -900201
13935 -900201 -780168 -940388 -1170069 -867983 -401759 -346817 -240774 -89128 -83839 -128376
13925 -128376 -422532 -483533 -318860 -170393 -325592 -639322 -433981 -1960 447790 471847
13915 471847 43973 -311782 -626554 -822275 -912679 -625257 -324139 -125420 -265189 -483379
13905 -483379 -398676 -335459 -178110 -212111 30738 327781 302161 61364 -122876 -293149
13895 -293149 -486855 -505705 -708215 -527016 -230366 -455092 -286845 -253416 -262234 -60958
13885 -60958 -80921 60337 263974 113057 -330709 -630229 -668202 -825278 -1160425 -1280408
13875 -1280408 -1117439 -775766 -654898 -395443 129463 54272 258449 318564 93690 60808
13865 60808 -96972 -304425 -396182 -312808 -351841 -254527 56322 243892 427881 296198
13855 296198 125691 230676 390080 840820 1113556 891537 512434 91009 -336962 -479082
13845 -479082 -558501 -330646 3510 105732 -3010 40148 -113585 -21931 -24831 -297200
13835 -297200 -185658 32968 6334 -27896 -29956 -61209 -74451 -92660 -358348 -373633 -468597
13824 -468597 -656945 -639715 -392188 -298667 -603459 -631784 -463167 -684771 -1063009 -832706
13814 -832706 -218339 -25716 -129810 -249476 -244157 -39110 23778 -168031 -227737 -36918
13804 -36918 -298784 -641614 -489108 -525773 -769453 -964556 -1076478 -1081501 -941755 -953805
13794 -953805 -604560 -83485 273369 465092 300675 202842 -85801 -230556 -278810 -649773
13784 -649773 -917069 -1239950 -1606201 -1389520 -745367 -377124 -83004 184895 163993 8741
13774 8741 -120250 -148120 -117815 -296078 -567821 -873178 -1116624 -1334006 -1688386 -1669210
13764 -1669210 -1286674 -981566 -668303 -410514 -550789 -803538 -864360 -1014282 -891599 -123829
13754 -123829 227101 361709 128252 -40042 -53367 -271932 -381916 -598106 -637272 -437329
13744 -437329 5127 273422 296468 335957 202085 -25072 -42721 -309751 -365786 -36868
13734 -36868 -110359 -544295 -742216 -476656 -290958 -281937 82765 583891 455170 -112319
13724 -112319 -308049 -282437 -395836 -504320 -856447 -1251326 -1247240 -1015739 -824381 -330581
13714 -330581 -185857 -504020 -731115 -644030 -648492 -425253 -387920 -274148 119188 153670
13704 153670 202628 237017 -156067 -559085 -556766 -378563 626 -107851 -537537 -524118
13694 -524118 -357847 -494832 -730221 -841613 -747305 -677225 -761572 -337440 -235961 -115116
13684 -115116 7649 -221236 -73053 24541 30152 75918 -101205 -250428 -91928 -60481
13674 -60481 -42535 -67388 -262969 -708027 -652699 -364789 -200198 -130943 -42270 32302 73373
13663 73373 326241 473604 485320 500970 548701 792462 698239 608280 630071 425507 466394
13652 466394 431939 86085 -26837 -19749 -179677 -195883 -169161 -45277 -43051 -247130 -69493
13641 -69493 106451 -4272 -155597 -260878 -359822 -464452 -1107913 -1617542 -1504774 -775126
13631 -775126 -387959 -290333 -124648 -209025 -7955 358266 281481 72967 130320 195628
13621 195628 273400 1016120 1711879 1494566 510939 -37584 254851 520884 223257 105208
13611 105208 122574 -158920 -267524 -162220 -298205 -395806 -336570 -187709 -176298 -445174
13601 -445174 -618156 -529756 -623532 -573921 -305924 -280804 -73710 258132 210160 -63303
13591 -63303 56054 375080 398118 309069 130555 267845 533844 699240 1076241 791349
13581 791349 519180 756846 907451 642520 474260 287812 -103748 -140496 -255229 -263546
13571 -263546 -75993 -257720 -349397 -174445 -135033 -9674 49844 -237203 -482041 -250421
13561 -250421 323729 626750 744882 1046871 1720511 2101448 1666690 1273683 840186 635274
13551 635274 895365 964630 402868 -203570 -698144 -741091 -488739 -499581 -537075 -520168
13541 -520168 -385060 -416207 -579099 -707593 -576348 -304281 351016 781075 754952 417354
13531 417354 561664 697240 338765 44744 -43473 115034 286026 281637 110660 -51523
13521 -51523 -749949 -1123818 -970209 -592890 -42219 260912 124948 -99641 -282668 8550
13511 8550 229452 20268 -16350 342362 515218 263441 -70591 -469322 -647553 -942905
13501 -942905 -1393107 -1146431 -94117 343311 265420 -93242 -346905 -262989 -158444 -392893
13491 -392893 -606756 -483582 -280689 -198765 -30694 45301 258593 554983 889571 900219
13481 900219 685244 696894 810565 579965 352576 114371 -302373 -324539 -118882 -362713
13471 -362713 -380515 30131 544012 686612 489562 3462 -309484 -693919 -603529 -500463
13461 -500463 -344852 -113887 -231129 -244945 20956 92703 -42914 -281380 -680550 -833108
13451 -833108 -918647 -1343984 -1351855 -964465 -646880 -490980 -655880 -1108367 -1089478 -727109
13441 -727109 -210465 -203934 -458041 -526359 -666642 -578977 -356215 -488157 -334130 23408
13431 23408 216912 610860 595272 239066 -219839 -350313 -42902 135297 202882 84423
13421 84423 -186475 -295300 -267341 -151950 -29088 94897 245302 638158 756093 882471
13411 882471 903680 674237 468261 520798 646192 575402 530478 434961 557154 517291 290441
13400 290441 275279 272559 500329 775583 699646 681937 484823 81690 -245900 -278817 271613
13389 271613 615914 705324 657862 797016 827549 633578 458288 538697 791330 968043
13379 968043 1037911 1067113 778350 416130 73994 -291124 -205540 314685 233623 641718
13369 641718 1097636 1618726 2034889 2121577 1879533 1103172 689445 595789 277013 -278789
13359 -278789 -498032 -883540 -700306 -68340 240171 699847 846791 771258 932812 665754
13349 665754 42759 -590611 -700018 -161494 358084 116683 92171 263677 173017 414116
13339 414116 984563 1287746 1037044 802795 1056877 936769 567863 540584 656474 339340
13329 339340 -261259 -539038 -651378 -605529 -280423 -172540 -462360 -571671 -489993 -263496
13319 -263496 -437263 -703354 -634007 -367527 -20106 306097 557241 690779 569718 519912
13309 519912 327206 224192 211845 542565 452681 185641 509027 899799 624672 264957
13299 264957 143039 101613 217490 269564 56143 28046 309042 509591 549538 346192
13289 346192 313560 689186 919419 795827 602075 955750 1273624 947376 400554 81413
13279 81413 307869 576693 326739 -232461 -456942 -429253 -54650 80758 226744 512899
13269 512899 372579 -86006 -619161 -642283 -501872 -251731 -117601 153940 465165 631935
13259 631935 457894 44778 144298 90486 51299 306677 -84517 -584662 -369895 82516
13249 82516 876896 1549632 1618434 1595438 1257897 876850 497475 36646 -47347 58744
13239 58744 253244 405460 242892 287812 536283 345615 323784 787378 937271 801743
13229 801743 679747 608129 362734 70525 -9693 381618 276844 -28260 -320586 -405506
13219 -405506 -249438 -426800 -291582 -40095 17278 -59510 -243273 -153561 335042 249133
13209 249133 47104 295497 709585 615623 256182 52369 122248 294999 571139 1046617
13199 1046617 903042 499720 68548 22159 260679 158000 278943 674890 987520 922340
13189 922340 956621 889319 897824 737376 269588 78089 327033 261754 -178222 -109514 81364
13178 81364 258206 461879 239003 -146519 -471051 -945802 -1077518 -616752 -90862 178289
13168 178289 346365 329547 59924 221533 294642 390870 733816 670245 647694 725448 465586
13157 465586 166098 380841 977007 1222719 1387928 1081800 775658 531089 389574 478297
13147 478297 117648 13359 131671 233882 -28288 -178653 -14043 227686 320256 750056
13137 750056 1359345 1273504 669696 329617 596815 1022028 1135480 1277728 1208417 1044387
13127 1044387 1245369 1531860 1758051 1747582 1647990 1688034 1443107 1035389 921235 929072
13117 929072 950455 798792 697579 851128 1117273 864862 780956 1054814 1328689 1012820
13107 1012820 182124 -119779 287793 1003891 1390765 1360498 1157904 1220663 1703498 1606949
13097 1606949 1534645 1536264 1476866 1451182 943934 594519 680493 757505 708451 974163 1173031
13086 1173031 1306799 1604482 1736815 1360431 871401 803374 638432 704229 1216321 1124936
13076 1124936 1081869 1173857 1254080 1374598 1126484 1301216 1561750 1444744 1276533 1194253
13066 1194253 1350929 1294591 1402529 1530553 1887247 2700174 3266003 2583419 1688794 1510360
13056 1510360 1373701 1211922 1607333 1939488 1543986 1332368 1715041 2202775 2092839
13047 2092839 1890773 1738233 1499465 1657418 1976284 2498092 2757433 2901580 3300959
13038 3300959 3391923 2867388 2169636 1534521 1543522 1953571 2110751 2204745 2273395 2254137
13028 2254137 2058677 1965500 2162387 2420191 2640608 2662903 2661685 2448678 2305074 2594524
13018 2594524 2951864 3155179 3609017 4037341 4389801 4846915 5364624 5566064 5302156
13009 5302156 5358775 5684094 5674263 5693961 5894498 6079937 6527652 7242391 8048448 8469766
12999 8469766 8613057 8475736 8532356 9127127 9821006 10474951 11027442 11841425 12928019
12990 12928019 13965074 15260266 17058471 18450410 19450919 21111632 23407867 26477166
12982 26477166 30475760 35294005 41293003 49152741 59547420 73042854 90927847 115454271
12974 115454271 148134110 191934927 249986977 321032586 389929836 423954760 400626627
12967 400626627 338044446 268991997 210833928 166124420 132793608 108376842 89930250
12960 89930250 75936878 65167116 56366214 49076311 43209075 38837629 35354999 31961851
12952 31961851 28974709 26140840 23467410 21313245 19320320 17797612 16637610 15823370
12944 15823370 15219880 14520936 13772052 13222072 12848996 12193389 11242296 10453454 9977623
12935 9977623 9984514 9715206 9109832 9307396 9787091 9672283 9323220 9148596 8901382 8907770
12925 8907770 8882930 8937926 9260971 9642175 9827911 9528324 9431581 10258480 11138765 11675732
12915 11675732 12622905 14499483 16897792 19636980 22570579 24195611 24126441 22451448
12907 22451448 20558802 19173944 18582405 18433347 18621933 18591739 18704396 19791919 21877833
12898 21877833 24208810 26437816 29253064 33341327 38407955 44846829 53266728 64341146
12890 64341146 78527989 97565423 124035106 160072703 208413221 271412926 346092781
12883 346092781 412245941 432778588 393456554 322940403 253452752 197746617 156319168
12876 156319168 125927234 103336756 86325679 73069057 62779137 54590948 47740135
12869 47740135 42062492 37498374 33989247 30771513 27413024 24241231 21930764 20320364
12861 20320364 18724633 17136130 15882734 14804844 14025671 13460131 12635102 11775714 11136113
12852 11136113 10723410 10460196 10306812 9849804 9458697 9660290 9672296 9360491 8643747
12843 8643747 7815125 7418589 7501394 7614799 7759551 7823660 8186944 8561834 8252570 7908326
12833 7908326 7823081 7943715 8326856 8542474 8572361 8853653 9220796 9414861 9419614 9935496
12823 9935496 10550657 10994782 11746412 12690159 13504959 14054496 14206070 14881934 15856646
12814 15856646 16831026 18237626 20383197 23173041 26410170 30010068 34371410 39536055
12806 39536055 46255548 55407863 67233600 82883688 103861401 131973213 170379213
12799 170379213 222007776 287500496 359905512 414735136 418948834 370513225 300777877
12792 300777877 236246807 185297248 147375595 119366703 98514248 82573618 70065498
12785 70065498 60251289 52213984 45561738 40104517 35472586 31567884 28530491 25599677
12777 25599677 22985666 20579519 18697662 17425297 16309449 15609564 14907658 13824749
12769 13824749 12238467 10857859 9779749 9159228 8435069 8037322 7734797 7310429 7213125
12760 7213125 6874338 6919800 7427495 7157774 6586608 6026901 5213864 4865724 4717474 4742117
12750 4742117 4629959 4241870 4027231 4095771 4302776 4281621 4434573 4492433 4025783 3799229
12740 3799229 4051142 4254555 4227100 3837877 3302410 2890347 2823871 2626295 2535428 2278407
12730 2278407 2055056 1993639 1781666 1876840 2291863 2296027 2067163 2100835 2275832 2126516
12720 2126516 1674337 1108204 1093390 1185018 1280491 1368810 1389168 1442211 1310302 1152571
12710 1152571 1476965 1875688 1508656 1123192 1465543 2193682 2309210 2201294 2093180
12701 2093180 1693574 1126390 1167252 1798059 1882204 1401307 1453881 1719999 1452202 1160739
12691 1160739 1141576 1153421 1084901 1267217 1123912 827132 793748 1295318 1503379 1309884
12681 1309884 1148717 1077326 997067 955523 625346 284875 375013 616757 919863 673114
12671 673114 167866 -6312 -58610 34033 293579 190063 -2729 20084 54255 46752 95562
12660 95562 -286900 -595369 -577307 -680361 -653501 -523743 -287318 62881 492486 475930
12650 475930 186265 449262 487473 489762 572300 764069 657444 42765 -302093 -266155
12640 -266155 -387240 -403251 34513 357335 566653 858465 220947 -334681 -97474 -9701
12630 -9701 28764 124857 27451 -22477 184485 292559 202963 316515 499852 768909 718111
12619 718111 586936 935896 906226 646421 811048 1164210 1302436 1255234 1539389 1821839
12609 1821839 1840168 1703799 1667033 2027902 2146856 1593435 804575 19029 -134396 360461
12599 360461 898257 964472 797262 644972 748584 742672 636484 806561 732554 407158
12589 407158 -45522 -45561 312830 717189 706156 474899 345221 242285 288112 374835 192943
12578 192943 383695 835392 1367073 1540441 1469946 1566555 1850591 1901217 1528189 927331
12568 927331 793519 1610819 1912191 1754517 1541690 1592561 1865831 1888484 1634155 1193980
12558 1193980 458836 101562 42559 -5916 -135244 -201236 -119104 -139812 23975 243743
12548 243743 321751 258642 170988 237104 68465 -276204 -9068 357171 257116 103407
12538 103407 106973 454178 1163178 1787149 1662792 1024343 695923 373811 257275 327612
12528 327612 315511 192003 -20624 -103320 -314663 -448477 -227550 161131 416275 437710
12518 437710 117493 143946 117464 -231111 -54359 240674 210026 -14482 -20980 183358
12508 183358 429613 732218 686719 519679 338000 388835 384712 602828 765144 508627
12498 508627 276158 363409 783786 1010137 1062352 1054968 603435 177335 118633 260604
12488 260604 209683 59796 -82999 -112323 -85522 64997 52642 229687 854287 836267
12478 836267 401079 128390 4358 149058 279649 477967 871194 836571 629030 297661
12468 297661 -303041 -569086 -205060 258781 211903 -378595 -721180 -865292 -763774 -458994
12458 -458994 -210794 -36901 -209608 -133360 9937 -108649 -425320 -403072 -432866 -144461
12448 -144461 539649 896433 751308 363549 238664 257728 289273 265323 104988 -40593
12438 -40593 -196798 -20553 151713 33490 -137420 -277697 -105855 215324 204276 215052
12428 215052 60574 238162 555078 549658 531478 228748 48071 337951 564575 475624
12418 475624 564512 689374 456548 215061 -223013 -422155 -235673 -162029 -148574 -244389
12408 -244389 -522458 -279926 51722 -167949 -345298 -162933 261363 415594 -130785 -357845
12398 -357845 7302 74341 45191 233051 64682 -148169 -70379 190538 621943 529930
12388 529930 438325 744366 921437 963383 614675 77881 -129663 -113074 -113854 -171917 116331
12377 116331 404975 531700 409785 344218 325338 788274 934326 526788 158460 222889
12367 222889 342349 436334 785254 999832 636412 102977 -389756 -699438 -303491 -29382
12357 -29382 -158147 -408881 -577470 -259366 71490 295112 307329 346006 433439 260384
12347 260384 31735 231553 351596 17490 -265962 -103222 -84138 -64942 17856 207879
12337 207879 171554 33664 20898 -161195 -172267 -15319 -144241 70821 338024 779768
12327 779768 1196363 1136327 735300 482578 424821 659423 816788 537198 308253 -38851
12317 -38851 -190359 -104416 768 -33769 51190 461953 859760 972018 892061 643589
12307 643589 253413 203118 317748 191234 195943 349190 179980 -33228 -147633 -294784
12297 -294784 -463882 -539577 -679005 -576831 -204309 -106886 -59145 67586 65196 -134473
12287 -134473 -275234 -577225 -916111 -673643 -277140 134069 507272 361945 103110 -261764
12277 -261764 -227975 -109178 -222396 -171234 -204014 -555217 -495512 303079 949889 1092956
12267 1092956 1018685 738992 898536 970487 515657 197980 235814 596163 687048 344114
12257 344114 36487 -233146 -201281 -148851 -123469 -230561 -660605 -764260 -312486 -96052
12247 -96052 -58691 108831 139381 243158 -5098 -404524 -476588 -587510 -573837 -316075
12237 -316075 -54631 126960 234866 119166 -235895 -330890 -95498 357481 684387 688140
12227 688140 452534 344179 336373 440466 750764 672851 837839 1007737 1018951 1032833
12217 1032833 910960 721306 636454 550438 330171 134476 -211548 37558 634511 1002960
12207 1002960 1243669 1430976 1378149 1554323 1807537 1874578 1252479 578974 267724 331321
12197 331321 396397 357747 687937 987197 859276 592144 327319 -99134 -167956 208389
12187 208389 299077 155108 233553 593416 587735 344677 203260 228535 117279 185050 675689
12176 675689 598118 555319 844266 493005 -69489 -360855 77513 414783 -78841 -536292
12166 -536292 -388480 -27161 93335 -138097 -491118 -650158 -720120 -587410 -363501 88653
12156 88653 581160 933586 973604 1095469 1026652 890429 716695 591922 695365 793181
12146 793181 1059419 971797 739242 617066 324566 84996 225864 521742 760784 661332
12136 661332 652627 639297 435723 159635 -98550 -393301 -578066 -582207 -507530 -526557 -869886
12125 -869886 -981637 -775698 -119729 343954 550929 566538 658340 1045230 1100800 868362
12115 868362 292933 -416667 -291359 109380 196116 282349 232224 -189843 -225159 161513
12105 161513 625048 419890 -1689 -355185 -691889 -568317 -396044 -317901 -83463 -191981
12095 -191981 -672624 -955881 -822391 -342760 161496 411093 216714 -224282 -563413 -507894
12085 -507894 -206091 -60392 14454 -17618 -146892 -591343 -732223 -534142 -600667 -839848
12075 -839848 -754931 -299807 196185 410226 282299 363365 425383 538804 370788 701536
12065 701536 1270355 1776006 1762639 1281393 1123910 790540 288631 -258339 -453301 -242761
12055 -242761 -187876 -532740 -456449 -161100 62114 -195767 -230992 -318657 -458431 -490149
12045 -490149 -507564 -387051 -530567 -806676 -912663 -794304 -394724 -235668 -561337 -546043
12035 -546043 -173839 231980 378557 134407 -105680 -1147 348346 633253 456686 -5337
12025 -5337 -111294 227322 834796 962712 616491 411426 603297 1116602 874726 354087
12015 354087 -90154 -265537 -388151 -620371 -450726 -170600 169980 356280 195485 -202753
12005 -202753 -361083 -308686 -145217 -53245 82092 268341 268266 -240455 -599298 -361468 11613
11994 11613 64158 -135144 295939 926958 1039229 679867 477837 616633 567872 564246
11984 564246 582386 471215 327891 245593 -72110 41911 655769 859771 763649 200516
11974 200516 -403369 -390604 -197805 -43698 -8994 -268717 -165368 504818 678599 186438
11964 186438 194388 981159 1421410 1135801 793871 544668 511661 641537 623552 248078
11954 248078 -248350 -405961 -140845 85669 121439 260193 339688 745461 661899 308184
11944 308184 161099 46097 244752 483876 540050 464015 429244 -272154 -736683 -289104
11934 -289104 -120966 24688 771791 1295728 1269464 799976 412774 430945 316062 124244
11924 124244 64555 -122322 -177333 183707 935308 1327363 1248283 822602 783249 837389
11914 837389 317245 -52874 -3512 242638 310106 82442 -219943 -189083 -232915 -581676
11904 -581676 -432812 -206766 9693 -125247 -337845 -406799 -425839 -569671 -781802 -596619
11894 -596619 -359738 -76635 153419 196163 262290 359476 93011 -66912 85535 320695
11884 320695 368691 -69523 -466516 -484042 -476508 -387992 99379 246822 -31121 -257585
11874 -257585 -52890 620167 847132 737822 866314 974701 1070475 987092 796279 609005
11864 609005 578466 391487 79205 -23795 148178 742625 1125438 953967 829998 623125
11854 623125 415014 658953 825532 1033164 1518047 1864380 1766259 1415013 1461393 1225354
11844 1225354 754699 1072199 1838361 2157432 2394378 2981719 3883978 4801635 5590979
11835 5590979 6619119 7726045 8924181 10014121 11020510 11913012 12993579 14715785
11827 14715785 17112239 20256481 23030050 24359948 23204879 20176219 16704149 13505185
11819 13505185 10982534 8891390 7416552 6573574 5765172 4861662 4335903 3904371 3496793
11810 3496793 3187950 2789917 2332623 2083844 1935552 1920701 2251868 2479619 2510229 2332668
11800 2332668 2276272 2322077 1973145 1682400 1226405 728912 674017 763028 771643 1135966
11790 1135966 1119194 951145 1050152 753282 467409 429392 506070 812772 1292943 1688041
11780 1688041 1901090 1956808 2087875 2248881 2157120 2403854 3016329 3118583 2659024 1995427
11770 1995427 1465025 1252383 1489274 1720452 2022653 2365376 2185224 2265631 2382114 2145831
11760 2145831 1602901 1041927 884035 1283333 1585278 2197365 2775835 3119612 3484078
11751 3484078 3910487 4111054 3726815 3034185 2481362 2385230 2797204 3035422 2957122 2368783
11741 2368783 2079762 2237105 2350130 2473517 2548033 2330554 1878057 1928814 2510134 2386077
11731 2386077 2033222 2239951 2517340 2561098 2577980 3213911 3759252 3953935 4552920 5432657
11721 5432657 6019943 6855515 7594426 7844019 8387010 9312192 10457473 12375477 14664020
11712 14664020 17542959 21179523 25264634 29330768 33599249 38943948 46311567 55095996
11704 55095996 62594689 65712029 62704930 55345773 47267238 41279290 38992524 39878515
11696 39878515 40361558 35701287 28055159 21765940 17722462 14992201 12985956 11263431
11688 11263431 10097057 9283739 8044860 7387940 7053738 6470922 6008915 5405281 4810456
11679 4810456 4342193 3820539 3368450 3274963 3307834 3387231 3152476 2788830 2530004 2707184
11669 2707184 2402596 1989343 1624902 1194307 1068593 975844 1214489 1737283 2108510 1740354
11659 1740354 1413883 1604010 1756974 1159819 817410 1305622 1507060 1242169 1331444 1712516
11649 1712516 2029209 1762798 1124073 738650 849048 1141227 1182149 1006447 830019 961860
11639 961860 1449642 1599675 1416226 1119233 726037 865327 1385923 2125892 2477716 2436245
11629 2436245 2240645 1995466 1602677 1564095 1297519 1011995 1146682 1211488 883485 536302
11619 536302 533337 581830 784281 773838 472996 -207900 -404454 -105813 -67112 -426497
11609 -426497 -407517 -44641 58416 -108717 -224081 126574 725115 889589 466931 99350
11599 99350 -435917 -590249 -319611 -218178 -166683 -144446 -165125 -216276 -47348 101998
11589 101998 205119 277517 441692 753625 558976 -100304 -387126 -559013 -647953 -229215
11579 -229215 631828 911133 597599 526858 513748 405166 377628 149423 -342392 -816770
11569 -816770 -1249552 -1240590 -741996 -656121 -661790 -257186 -475085 -628625 -247216 264340
11559 264340 672864 640083 410506 172478 -178073 -209927 87487 335727 621926 608554
11549 608554 116038 -167753 -346549 -716141 -1053392 -986889 -618012 -888464 -1259027 -1090191
11539 -1090191 -710212 -371645 -230562 -372314 -340300 -431968 -562542 -389208 -293532 -348833
11529 -348833 -507535 -751140 -569698 -221298 -50697 -108989 -142813 -105355 70205 244608
11519 244608 61238 -150827 -82843 167057 214623 -137908 -333600 -457012 2465 682143
11509 682143 708888 441808 264786 119064 194044 657890 961685 983881 496419 -125637
11499 -125637 -151647 -303271 -876493 -826947 -297622 100942 386166 894939 1356145 1283327
11489 1283327 1355357 1154614 778425 534483 372723 552505 879054 1662420 2344050 2213514
11479 2213514 1596335 869670 415549 166330 95009 256412 309371 354218 262166 210281
11469 210281 515485 451769 230792 120589 139351 229953 596987 885527 571922 369697
11459 369697 452164 561942 384646 483260 736409 792063 501064 6885 -256314 -423434
11449 -423434 -623907 -662572 -628962 -739966 -585670 -516380 -626893 -434274 -231646 -348268
11439 -348268 -463428 -705562 -866431 -611279 -265136 -411848 -1026274 -965678 -503304 -79027
11429 -79027 122682 76502 -134604 -297421 -328043 -392717 -447259 -498708 -369984 -364851 -425308
11418 -425308 -523573 -435555 -37511 475844 682241 627194 658246 646507 236844 -185345
11408 -185345 -403996 -548093 -889612 -1196831 -1144323 -1114374 -1093067 -1200621 -1086865 -874124
11398 -874124 -925781 -694206 -776845 -795511 -772693 -701300 -709550 -717816 -407740 -141669 187560
11387 187560 304549 390248 775377 721840 411950 329778 243560 -300564 -620932 -583141
11377 -583141 -613325 -389281 -114560 -77112 95031 388331 332554 104730 -72383 -283029
11367 -283029 -250960 -85080 205262 213483 -216386 -140570 482730 761924 645615 796514
11357 796514 741736 557951 440189 268069 247784 395356 238100 -174235 -372566 -521508
11347 -521508 -487717 -300736 -322199 -391872 -827298 -989342 -474593 -234057 -270279 -92149
11337 -92149 114284 728421 1062287 641363 399294 479859 348161 222875 142501 -253869
11327 -253869 -664485 -658385 -460385 -114555 29481 -236366 -382881 -572478 -858634 -725594
11317 -725594 -96258 612195 356194 -282173 -399890 -259563 -139338 -114057 5846 329997
11307 329997 608931 813616 857586 739384 457278 283763 232323 240171 381051 739128
11297 739128 968450 980602 661392 37515 -325381 -522856 -869753 -713808 -502576 -174792
11287 -174792 18582 86635 43131 -107821 12523 104745 -48896 -70805 1142 208298
11277 208298 449636 281651 12566 -390070 -544932 -735536 -579777 -210448 125707 591048
11267 591048 801307 809244 561729 184855 52290 -270197 -907885 -970245 -540969 -196395
11257 -196395 -254068 -714099 -934852 -712455 -449048 -143028 -132658 -521804 -746745 -803454
11247 -803454 -951830 -855979 -634663 -358069 -215644 -80491 142293 412659 506362 557556
11237 557556 771683 448315 23240 157531 586864 816308 702206 659706 530803 382307
11227 382307 210811 -216676 -732877 -697469 -367013 -265585 -525376 -224491 192363 43612
11217 43612 -199366 -212187 -122106 -225673 -100713 -215501 -226453 -188915 -81594 47255
11207 47255 -40726 179016 730376 1027487 1143139 1025940 625254 176279 -79710 -157708
11197 -157708 -222106 -142935 106603 236401 345789 483000 107061 -818008 -1133182 -1298297
11187 -1298297 -1630862 -1389333 -982293 -710206 -153028 16140 -13238 101757 375030 439798
11177 439798 351438 614500 1111628 1676409 2172091 2409188 2201836 2027306 1586661 1018962
11167 1018962 598605 624970 350206 8919 127055 444831 490160 -34574 -255128 90554
11157 90554 265334 222025 526832 361366 -191173 -392941 -41330 457810 630435 688227
11147 688227 721847 436260 300901 500698 618035 712746 826989 629307 140418 -197057
11137 -197057 -410074 -364742 195614 443336 175550 43815 -90392 25570 70224 -418311
11127 -418311 -785352 -548290 -40455 194848 203378 80935 56524 -91033 -245890 -369933
11117 -369933 -475943 -487374 -518557 -612276 -689306 -812337 -770612 -631539 -481785 -161181
11107 -161181 68967 164740 55947 -465295 -851050 -815035 -541142 -457717 -261442 -72051
11097 -72051 -294726 -431029 -377006 -98123 107849 -55835 13761 300728 823611 1061705
11087 1061705 583901 -107161 -674262 -756973 -341686 280429 724359 868582 609452 530437
11077 530437 826846 835460 737142 657633 498175 440050 209119 45370 340122 522701
11067 522701 -68940 -419184 -554152 -176767 401431 392796 -2831 -471433 -767353 -623822
11057 -623822 -449675 -188324 301842 347550 -62892 -151744 428537 824216 641848 621530
11047 621530 447745 85941 -201109 -471616 -546369 -293315 179304 494978 556035 292295
11037 292295 70839 232313 322512 -182839 -394770 -266960 -361568 -396487 -239677 68464
11027 68464 374426 442268 529483 295482 -323611 -610405 -374927 247197 466202 650782
11017 650782 1048251 1221986 1207951 844084 441381 191202 -103361 -182046 177393 -20796
11007 -20796 -436002 -327800 79673 502576 384783 -319086 -684232 -380845 10403 329561
10997 329561 188945 -100687 -32973 98682 26704 194927 624231 742722 500883 35532
10987 35532 -246186 -231021 87610 315376 408722 496611 426038 639251 788945 804746 603694
10976 603694 281328 313644 593733 508626 362840 632055 640551 660004 572409 833224 1081836
10965 1081836 993972 766188 587747 462455 184294 -134463 -352297 -379835 -107411 172049
10955 172049 377698 354244 -176905 -514140 -438098 -218607 107335 577357 863291 1008411
10945 1008411 1155958 1158424 1316137 1517521 1758077 1586632 922911 891507 1123922 1296875
10935 1296875 1740914 1866089 1423111 1310527 1373838 1607963 2022762 2802111 4076686
10926 4076686 4989190 5950718 7062418 9132976 12743057 17524224 23557719 31651850
10918 31651850 41403896 51633124 59377283 62229916 59635396 52753255 45008267 38531415
10910 38531415 33963535 31541949 30922192 31502108 32117938 31956796 31082194 29000121 26126748
10901 26126748 22653862 18943421 15749116 13380678 11255645 9591615 7850153 6310420
10893 6310420 5371832 4873250 4697964 4446488 4347048 4071828 3835016 3670031 3593143 3364547
10883 3364547 3182378 2956727 2392418 1661354 1415828 1532022 1558660 1453817 1258316 1413904
10873 1413904 1557943 1352761 1124418 949064 828464 728126 337970 413979 1178361 1451107
10863 1451107 1250792 1015237 1252067 1339176 1491357 1917343 1534884 1045459 1259994 1339708
10853 1339708 1159542 1046603 912340 654612 298026 70634 165323 374115 233865 -90136
10843 -90136 -25382 8534 -144935 -328906 -122375 559985 753819 428062 450753 822998
10833 822998 825578 1112232 1238595 999058 424414 -145389 -186066 12275 43877 1174
10823 1174 26743 -421713 -528584 466364 1161153 1022769 585000 426462 244990 186168
10813 186168 236133 269893 629724 688957 401332 291887 384242 -68173 -885904 -1504189
10803 -1504189 -1430443 -685460 -160494 -187891 -518917 -1172136 -1495876 -1360900 -1292370 -1415055
10793 -1415055 -1106517 -409421 158426 126721 -42874 365945 495194 107243 -343875 -131489
10783 -131489 410269 584565 493469 81101 -466680 -716881 -746079 -488014 -113820 82391
10773 82391 281478 113693 -72197 -115742 -188769 -2737 96426 477345 702947 601238
10763 601238 668946 994839 911451 520173 347314 374204 124579 351037 886385 941945
10753 941945 766089 496595 279582 121408 278677 443668 272260 -241847 -895322 -1115344
10743 -1115344 -1031962 -1206440 -774506 -310847 -328569 -564230 -481349 -480588 -538650 -626336 -872378
10732 -872378 -591737 -294533 -577363 -917289 -886722 -606931 -665785 -747351 -768123 -919473
10722 -919473 -965036 -810008 -769346 -719293 -632685 -319484 82474 128930 -136696 -472751
10712 -472751 -445006 -396387 -605901 -769370 -378984 -334170 -729006 -1151515 -900270 -414613
10702 -414613 380452 638937 475956 500755 424329 28581 44756 328915 532042 571439
10692 571439 598017 487319 150593 139050 555614 1073869 1045909 518473 -51628 -588316
10682 -588316 -633215 -579842 -308834 49279 165055 123664 28780 231804 812226 784344
10672 784344 53841 -287040 -47162 37614 -188368 -394016 -835400 -783557 -155149 -22213
10662 -22213 14576 105331 -159566 -681808 -825628 -670870 -654439 -204572 -12444 -143746
10652 -143746 -259987 -270904 -282742 -212258 -231860 -173289 -398752 -564298 -405221 -122012
10642 -122012 55580 114969 105157 172648 -106459 -363254 -405293 -46849 418122 319477 130838
10631 130838 83748 96223 -52361 -145032 -7243 312003 419076 -21823 -819090 -1453423
10621 -1453423 -1884394 -1907995 -1445593 -835213 -481619 -161518 -96034 -54404 200965 438514
10611 438514 515908 47726 -420646 -517920 -664914 -1070654 -869797 -398358 -61552 469721
10601 469721 1162568 1444033 1269908 982579 917628 1138244 1232131 537651 -349837 -781280
10591 -781280 -330167 224743 199618 533129 1108265 809091 123302 -143099 19897 155051
10581 155051 237346 -47713 -368875 -328782 -175472 -101647 -160163 94742 261148 -82553
10571 -82553 -231418 49924 51158 -172322 -257470 -91040 150048 116034 -59109 21839 74334
10560 74334 379764 682900 973595 922040 635593 519111 643706 1014374 1092919 558358
10550 558358 91601 257791 662590 560489 123514 -548631 -862984 -324061 152530 -51772
10540 -51772 -83359 116918 -190500 -700187 -757187 -564686 -135840 -422298 -1363345 -1871436
10530 -1871436 -1634843 -664377 -173490 -262724 -414874 -424524 -108640 -50917 256233 -90880
10520 -90880 -822641 -736663 -529998 -161139 197800 599731 708992 201351 -28706 -172634
10510 -172634 -395888 -558601 -1049160 -1346367 -673773 -256797 -834269 -1407567 -1391228 -931043
10500 -931043 -343581 -211475 -66947 -40264 -629974 -924544 -669032 -158183 47232 -352896
10490 -352896 -730861 -523223 -342691 -220987 -439181 -748643 -886984 -858962 -498354 -289845
10480 -289845 -549705 -468402 -51943 464830 341789 -287133 -733253 -562011 -372116 3101
10470 3101 -13841 -511240 -1061136 -1447330 -1455195 -1131869 -1051589 -992561 -514743 -21465 380239
10459 380239 899760 443171 -272782 -416411 -472804 -585126 -615700 -518375 -178084 -84366
10449 -84366 -313498 -183547 128184 553306 751976 629903 553817 879675 854952 24268
10439 24268 -626107 -802448 -476077 -149027 -21010 301424 269042 2093 294539 405333
10429 405333 84627 -114367 -316770 -82786 -28304 -167283 -318571 -677760 -660286 -437566
10419 -437566 -496945 -300386 -100183 -17945 -127312 -392063 -706122 -667967 -602755 -616861
10409 -616861 -444178 -247540 -38817 -4175 205995 540733 451125 -50266 -682778 -1029933
10399 -1029933 -1017852 -1048661 -1323395 -1520805 -1563770 -1266971 -405898 318422 385470 110704
10389 110704 -86956 -245802 -230045 -79644 128411 227919 370504 735254 699665 387017
10379 387017 -23538 -87694 -394069 -746884 -1037504 -1486640 -1881723 -1579978 -1165593 -1003230
10369 -1003230 -820127 -701714 -948079 -1301876 -1105163 -745018 -476862 -382191 -432860 -543519
10359 -543519 -901982 -907384 -246063 196608 227106 86298 -329520 -681215 -663672 -233589
10349 -233589 -186802 -604709 -622046 -754834 -825616 -713743 -824703 -1309342 -1865872 -1962544
10339 -1962544 -1555979 -831235 -305815 -374871 -449605 -365164 -662297 -831804 -840631 -916418
10329 -916418 -1015289 -1066736 -965608 -680341 -217721 43896 143268 286789 423744 471676
10319 471676 398187 -57587 -421696 -446656 -326716 -49355 386502 646209 958043 906575
10309 906575 245655 -666166 -798083 5654 731691 883565 1274839 1596516 1648198 2003648
10299 2003648 1902417 1524880 1338283 1216911 1063699 729749 423656 342408 215970 -251940
10289 -251940 -558421 -704263 -860562 -888762 -526840 -398556 -581362 -204619 -32092 -143714
10279 -143714 171620 380496 161740 257253 190639 -9286 -540230 -1109954 -1217975 -950148
10269 -950148 -920054 -1210662 -1133682 -909144 -637362 -720522 -1173391 -1046624 -926965 -969566
10259 -969566 -818394 -694684 -461641 -458265 -432428 -168394 37273 322898 473610 912820
10249 912820 1387726 1451415 1449991 1057710 591443 203469 173599 1975 16044 148048
10239 148048 -224103 -484495 -618757 -949531 -1088604 -1000113 -871864 -829853 -990229 -1145955
10229 -1145955 -1140449 -1065848 -847791 -793573 -1052983 -1049790 -1025226 -960154 -941530 -763475 -319878
10218 -319878 -242066 -754035 -1043020 -704411 -367870 -258160 -182993 62698 140832 339636
10208 339636 455921 340076 219681 51839 -507269 -1164695 -1200846 -1121025 -1379947 -1338677
10198 -1338677 -774154 -244537 -126568 -381780 -444210 -360985 -246074 -63401 12218 -157983
10188 -157983 -575206 -457784 -202916 -433324 -913159 -1282242 -1587375 -1522864 -1068618 -768844
10178 -768844 -684916 -452557 63369 139221 -76772 -10641 353408 483065 256159 475682
10168 475682 476967 95950 184090 -43578 -488062 -638860 -457816 -261031 -143018 -96146
10158 -96146 131010 -126175 -503895 -719673 -577809 -445653 -154945 401903 381015 -73498
10148 -73498 -10215 395613 506665 186867 73231 -171627 28057 289517 305056 212966
10138 212966 12920 -151819 -244219 -262211 -277772 -509372 -1096919 -1030358 -374287 170126
10128 170126 708996 1114167 944344 381780 -321766 -799653 -809653 -677020 -655196 -244587
10118 -244587 -611770 -1470172 -1558883 -1219627 -718711 -426157 -607227 -768786 -753060 -485618
10108 -485618 -484170 -981076 -878667 -394182 -301108 -453216 -606835 -367815 -187666 -295974
10098 -295974 -451492 -368974 -302285 -170612 119702 -53135 -479679 -884925 -789663 -664241
10088 -664241 -486823 -234495 -24567 -5085 -337866 -612077 -880511 -639861 -494457 -345461
10078 -345461 -123482 -137120 -92345 -252307 -209025 -93477 -113777 -488392 -637028 -658451
10068 -658451 -499666 14981 372513 256635 -25172 -83322 -258014 -517002 -616563 -539440
10058 -539440 -483755 -443639 -641416 -973806 -973047 -928241 -827098 -713509 -649039 -651507 -635061
10047 -635061 -675541 -666796 -254507 289453 550624 830878 833464 510133 408086 175848
10037 175848 390187 688444 690422 104063 -484806 -288707 -87177 -229342 -196976 28756
10027 28756 -78996 -443149 -210947 241486 178891 -38970 132908 288168 596811 1015313
10017 1015313 1176365 963312 1015031 680563 73616 -294235 -405243 -625879 -771362 -417377
10007 -417377 -361688 -317430 -199588 40993 230295 58411 -112964 19035 -307650 -863777
9997 -863777 -1224543 -1144498 -826388 -566073 -501795 -425493 -25167 428191 527142 514051 477217
9986 477217 154524 -77935 -29187 158745 -2037 -346168 -513624 -579500 -491593 -361640
9976 -361640 -333353 -6818 141496 -132984 -510185 -795690 -1166767 -1246730 -888676 -226577
9966 -226577 -148494 -249654 -169355 -92435 -46548 323745 770304 594959 214321 177834 26505
9955 26505 -123239 -295320 -205222 148345 478745 456549 280021 150141 161795 277099
9945 277099 441748 591799 447625 55305 -337011 -365258 -149017 -5949 147541 64127
9935 64127 -340585 -362497 -29700 219238 569900 494251 45197 -478010 -881582 -1125863
9925 -1125863 -1000468 -861347 -636262 17566 145757 74011 155959 -120576 -579181 -701462
9915 -701462 -699815 -472232 43124 175013 -177560 -399284 140540 799509 616978 368770
9905 368770 208277 -255159 -822684 -1114413 -1078523 -829283 -616473 -544552 -791000 -888246
9895 -888246 -658011 -578404 -264241 268747 557895 674552 559089 670626 822973 523672
9885 523672 228838 -51452 -377889 -254258 156972 615690 942604 714087 44842 -383375
9875 -383375 -516355 -570933 -484682 -400244 -323500 -47112 -145302 -389355 -638223 -606366 -578023
9864 -578023 -721953 -793516 -699402 -511535 -231578 -241102 -620985 -903889 -1007553 -1044854 -1442526
9853 -1442526 -1466212 -942249 -592160 -326847 161695 593158 558759 76080 -325098 -409826
9843 -409826 -262633 -380724 -710642 -650789 -257011 112165 345921 153168 -10000 11585
9833 11585 -344043 -861586 -1341295 -1402240 -1062912 -435400 465245 892840 791036 284751
9823 284751 -57237 442090 889359 681491 280619 252566 281506 558416 869008 1036423
9813 1036423 726827 108193 -143552 -79100 -332782 -627613 -392303 -249485 -289259 -550244
9803 -550244 -476475 -435163 -596236 -303463 -46125 402387 636906 154929 -432296 -822521
9793 -822521 -892892 -760458 -692113 -571830 -458812 -242646 14129 -9323 -163070 -189457
9783 -189457 -40640 -327932 -483804 -640500 -781599 -592900 -950854 -1387000 -1501488 -1561876
9773 -1561876 -1299904 -803403 -275504 12800 19977 126141 433351 129406 -466255 -370031
9763 -370031 -190107 -37097 396318 595452 591211 246540 -367302 -291617 124724 429148
9753 429148 191647 -6719 -117851 -497900 -959978 -730346 -479441 -458377 -125164 307238
9743 307238 244536 66894 -35456 62488 159840 201739 461571 510122 345909 223535 -18547
9732 -18547 -381183 -839089 -1132548 -1018189 -969548 -879596 -760540 -1155321 -1522128 -1352107
9722 -1352107 -974007 -619155 -342633 -161280 90568 336617 170324 -122190 288138 561944
9712 561944 324458 880 -26505 -98006 -455210 -576599 -649168 -561961 -249871 43593
9702 43593 234009 9539 -229441 -242101 -626621 -871747 -921336 -1092571 -856795 -584560
9692 -584560 -1031516 -1509705 -1340872 -903612 -785586 -655009 -548002 -364958 -408578 -638658
9682 -638658 -863513 -822346 -342683 153548 133103 56953 229263 487459 822615 1038568
9672 1038568 1076573 837302 476873 217697 -153554 -343397 -262368 -379380 -549159 -680727
9662 -680727 -804292 -499647 -97708 -2243 -59768 -167290 20157 78993 -191617 -63631
9652 -63631 345697 122204 -173315 -113462 -115339 -382635 -343370 -211733 -106405 -148881 -212721
9641 -212721 -194096 -305522 -140757 67600 3334 -238731 -455779 -763950 -712660 -286181
9631 -286181 -72276 -502031 -616727 -243688 -281989 -532111 -527907 -793916 -786822 -736025 -800056
9620 -800056 -689237 -458164 -234970 -215439 18754 560321 833078 543390 37315 -222323
9610 -222323 -476155 -523320 -304511 -185707 -184073 -245199 -41277 285059 255087 183178 145134
9599 145134 -119658 -334616 -649799 -504369 -154500 -62201 200834 506286 257367 -63676
9589 -63676 58270 135292 -47606 -73463 157696 -75549 -307759 -433502 -86993 500732
9579 500732 835980 1025847 715189 288044 -129660 -536050 -552676 -281111 -559463 -655665
9569 -655665 -550487 -190802 290270 274333 44701 79817 219013 207924 216898 473529 557784
9558 557784 342303 371277 589703 574354 148282 -217539 -288181 -152127 -2071 17674
9548 17674 90038 100949 -185103 -791306 -884692 -406249 14336 415196 609734 575863 304726
9537 304726 -101072 -321208 -443381 -696439 -763137 -293595 -145630 -399777 -631742 -1134453
9527 -1134453 -1522872 -1369408 -963495 -386018 156547 328523 54071 -402761 -145637 352336
9517 352336 254910 46375 172124 404031 602324 605858 444885 473717 325912 -37673
9507 -37673 18646 171788 111860 -85955 -192087 -224550 132132 738948 1076173 1067743 1101487
9496 1101487 1264798 1492711 1223359 469526 52245 177483 259064 112349 -154546 -237230
9486 -237230 -166081 -161496 -5780 481826 494036 695483 661719 366988 96229 -114064 9245
9475 9245 110120 156774 -13125 -379407 -471716 -130894 -164733 -176540 -274583 -138895 128537
9464 128537 201545 109050 -35118 18966 343257 206966 -254383 -514349 -447067 -315863
9454 -315863 -95268 298879 286757 81925 53821 252818 497096 535749 208022 -229022
9444 -229022 -313197 -139737 203335 357322 149372 303921 120443 -204856 -167014 -238912
9434 -238912 -154725 93920 -237824 -318623 166139 665433 920527 802772 703259 882103
9424 882103 928014 398668 -110068 -99939 -48986 -68035 217633 320702 360590 151766 -307199
9413 -307199 -476245 -182228 80958 -137250 -422131 -394050 -407822 -221404 -31035 -22608
9403 -22608 -303637 -651097 -292409 -200994 -626091 -974796 -939548 -703397 -445680 -384166
9393 -384166 -790150 -712577 -248743 -106906 -146734 -365532 -508960 -153280 262023 205547
9383 205547 247697 277349 402309 259166 -166616 -566958 -845031 -652266 -362744 -300208
9373 -300208 -457822 -480331 -616609 -415833 348384 810572 610039 328665 -126321 -749680
9363 -749680 -1008382 -986353 -618567 -252436 -46446 387356 323793 -226957 -529915 -675358
9353 -675358 -743778 -594138 -539091 -1001730 -1501080 -1485013 -1230231 -1186003 -1042656 -987257 -1252662
9342 -1252662 -1178304 -841659 -603457 -196590 -25319 -351665 -541143 -570542 -749172 -586734
9332 -586734 -230192 -10951 496234 921063 1055016 963429 803879 638507 621673 749943
9322 749943 314683 -43316 -295199 -827929 -1053989 -1053089 -1052369 -872643 -511033 -329997 -422203
9311 -422203 -176011 -317280 -606664 -317632 -290941 -272206 -336290 -382386 -47969 254076
9301 254076 451379 608377 557927 578112 616317 322875 -768 -483291 -632847 247688
9291 247688 1372436 1859890 1443913 1073342 989642 722068 311255 240705 534349 713942
9281 713942 381954 -370348 -356765 -32264 -321619 -715386 -734266 -870928 -1010649 -1109740
9271 -1109740 -1008803 -304084 522847 755644 394001 -28555 109558 576012 672040 349189
9261 349189 69716 -354170 -576381 -411537 -497236 -570910 -644167 -472633 -148982 350070
9251 350070 490198 178694 131766 115189 90730 -259145 -490463 -301628 -315260 -309604 -419621
9240 -419621 -492702 -446490 -158389 772127 1568370 1260075 435955 286221 582609 710884
9230 710884 673390 491670 328245 332439 207602 313591 797203 1358059 2142621 2383426
9220 2383426 2203561 2109603 2350370 2538067 2655231 2966332 3818049 5117521 6346684
9211 6346684 7067246 7458570 7680476 7760497 7709071 7404240 6500222 5474790 4507362 3514566
9201 3514566 2854644 2578952 2140569 1303495 1224942 1679978 2117005 2134358 1978402 1901452
9191 1901452 1508668 932915 365862 40235 36756 -122761 -35671 165343 106878 207011
9181 207011 237169 -93283 -482324 -356008 -258476 -202216 -10100 286100 786408 1352112
9171 1352112 1535018 1449650 1359050 1313110 905449 504402 598326 447606 100750 431572
9161 431572 830429 858230 994329 532736 -126675 -231077 114649 361939 535051 581941
9151 581941 239682 76474 353772 517986 474799 317087 433926 840934 715090 84527
9141 84527 -85219 43930 -169207 -401409 -281805 292122 589540 409966 94966 26974
9131 26974 74410 -202947 11138 521808 452533 383053 510281 605089 765146 677338 471984
9120 471984 530755 871325 1441569 1560732 1257958 1167907 1470726 1681007 1489633 1740682
9110 1740682 2049655 2187116 2372451 2540451 2897223 3201742 3826845 4387659 5050482 6128268
9100 6128268 7202342 8545702 10393562 12794478 15472058 17945827 20036054 21909297
9092 21909297 23298418 22754021 20418120 17709797 15151819 12349674 10101923 8627000
9084 8627000 6982009 5612048 4525699 4222112 4640197 4493433 3906756 3551544 3343895
9075 3343895 3457198 3721504 3542690 3032354 2657793 2691833 2678453 2479273 2403401 2566702
9065 2566702 2403392 1631400 871189 468589 805668 1189817 1426259 1460059 1135946 1059179
9055 1059179 1060097 1329834 1363039 1187609 901438 376702 133295 21904 179240 622742
9045 622742 753059 430844 369293 323260 356832 542600 719671 668292 527432 401933
9035 401933 227247 50760 -46211 -298066 -599296 -523727 -160595 190559 309620 86606
9025 86606 -161862 -255189 -13629 613020 838985 603020 228787 -39925 -156955 -247235
9015 -247235 -387383 -300280 77747 300040 361452 379399 328294 194243 217169 234392 159417
9004 159417 214255 445150 573528 462499 298186 383888 383041 255938 281822 543295 669886
8993 669886 291385 9614 -306564 -679288 -887258 -898259 -816025 -534993 -210035 116697
8983 116697 896375 1323049 1327611 1005025 401454 -107776 -378259 -131646 -78296 7618
8973 7618 -142723 -426939 -577432 -648504 -649191 -843084 -965074 -594911 76110 544294 759397
8962 759397 524579 474634 942693 1203139 990912 432217 167717 102597 -57369 -204201
8952 -204201 -180181 -114226 36506 395913 837754 1297109 1337313 1131462 859676 641587
8942 641587 484601 647126 1089322 1444208 1589158 2113736 2691480 2714928 2417313 2358051
8932 2358051 2580453 2755381 2782199 2835291 3231151 3922101 4580779 5644887 6838465 7812284
8922 7812284 8600330 8879362 8581025 7679604 6448536 5337317 4365444 3734810 3344702
8913 3344702 2907729 2490405 2262397 1935230 1720841 1521214 1373098 1186396 949276 682550
8903 682550 150252 -192117 176191 523374 384568 230425 251702 202843 245935 171399
8893 171399 111093 425556 803187 862608 677195 437477 406691 688365 1038157 1010033
8883 1010033 1012931 709433 194419 294425 908348 1457865 1460039 962307 735091 737056 549164
8872 549164 584061 599249 322075 -166466 -400924 -447933 -535670 -389673 -411471 -359306 184157
8861 184157 559630 346748 167538 403016 400401 465160 702825 818091 1024126 974410
8851 974410 772511 783811 573950 637989 753038 786991 590899 343129 218096 400464
8841 400464 645556 299634 -258383 -678238 -767999 -499044 203398 814881 1465563 1986486
8831 1986486 1740745 1235420 947279 1114672 1176369 1263292 1381277 1296171 1118377 1223232
8821 1223232 1494520 1957860 2592042 3537984 4350313 4480698 4906431 6021020 7146642
8812 7146642 8211839 9497250 10764444 12324264 14557365 17170309 19682783 22180861
8804 22180861 23857544 23389969 21256606 18405889 15589012 13081882 11108078 9747795
8796 9747795 8370043 6891459 5633122 4949923 4523037 4114102 3675547 2951998 2379581
8787 2379581 2117822 1974954 1808566 1558841 1428212 1549320 1553850 1300635 1015814 1183775
8777 1183775 1732700 2054883 2110582 1894794 1511618 1080298 410688 -136596 47566 57667
8767 57667 222258 683428 547703 37310 -282703 -188995 -79794 692976 1156088 1038916
8757 1038916 688159 370065 89404 245732 85023 -485771 -633883 -417098 -14654 276123
8747 276123 459274 18060 -252745 -487342 -851217 -907330 -518172 -266658 -189195 -25113
8737 -25113 -181629 -111668 142716 827355 1337294 1275554 982428 1016140 1322207 1392369 1214836
8726 1214836 556493 209539 436439 503082 315922 180536 178203 -37181 -8983 34776
8716 34776 -108968 -82390 -27762 4264 296477 369061 444430 712965 855728 484055 2359
8705 2359 19970 149720 88384 -33076 -334227 -564628 -405181 -155843 157921 199574 276224
8694 276224 468462 504367 371656 283712 605481 772136 545374 211203 -225438 -249577
8684 -249577 -33532 187896 461631 467051 335969 341407 72376 64519 -22413 -30969 191593
8673 191593 -84148 -292890 -220992 -27983 295491 197101 94480 -125211 -295930 -124576
8663 -124576 -41356 -57265 230415 460142 369376 97063 -155546 138913 313828 -13976
8653 -13976 -250080 -268907 -128834 -28173 -95851 -79396 21502 -353835 -886481 -753868
8643 -753868 -383159 -353060 -792128 -1029706 -1013836 -984404 -771889 -676745 -360379 36797
8633 36797 167058 76774 -191973 -258432 -166116 168191 373833 5802 -128620 -21919
8623 -21919 -95413 -239699 -467929 -1107264 -1521704 -1359764 -1367358 -1373381 -1097641 -1069641 -912783
8612 -912783 -638223 -596094 -255664 -62353 -306 -230104 -377253 -392439 -426286 -589701
8602 -589701 -385250 -186842 -221261 -275362 -626170 -672234 -228897 -57895 -253229 -347070
8592 -347070 -282313 -235944 -178223 -392735 -821032 -910870 -870212 -565976 5544 399484 782217
8581 782217 1023587 717129 380663 107069 -331455 -574940 -590928 -449545 -361240 -605577
8571 -605577 -724885 -847261 -703773 -474773 -317317 -357484 -594001 -706727 -767208 -133000
8561 -133000 447304 454377 -70616 -416955 -362636 -160836 108708 148922 25321 -192901
8551 -192901 -18000 241940 227233 249706 19182 -531317 -961182 -971455 -664350 -320946
8541 -320946 -88646 -589122 -821957 -501925 -99181 -255760 -899664 -1447373 -1339587 -858526
8531 -858526 -426250 -434130 -852320 -1057167 -1269405 -1002286 -289038 64662 359059 802620
8521 802620 853633 658621 141025 -151539 121465 112365 -51469 -247194 -282615 -272842 -158874
8510 -158874 -142505 -510102 -505107 -197362 -504 28584 28414 61530 60560 27072 13625 -169581
8498 -169581 -8084 64306 195072 233159 144183 -5519 -91690 -326498 -686199 -501130
8488 -501130 -287964 -359928 -749260 -980876 -1233886 -1575786 -1676000 -1188023 -638467 -327207
8478 -327207 -47059 -65524 -292053 -421807 -482015 -287935 159404 373540 425018 125161
8468 125161 -45360 59 -313321 -540468 -723390 -659561 -386398 -561253 -899799 -1031894
8458 -1031894 -1182259 -1196072 -1064268 -802187 -433190 -51353 -137037 -377768 63858 747658
8448 747658 597380 759802 1040973 859585 469039 34355 -136008 -114384 40393 55379
8438 55379 90281 19617 -558813 -1280333 -1741158 -1774143 -1561783 -1220656 -607954 -95056
8428 -95056 -202491 -609478 -1050462 -1272355 -992936 -443277 -33616 220743 656031 876374
8418 876374 638246 516664 885791 1056684 907292 808273 495635 204597 16957 -236646
8408 -236646 -393911 -190497 -91633 -289672 -611965 -880856 -855224 -672760 -491062 -339878
8398 -339878 -296468 -793386 -1236658 -804170 -92146 218735 -315353 -936133 -1231016 -1386330
8388 -1386330 -1257457 -929880 -1033775 -1399892 -1514863 -1119413 -654667 -575032 -627141 -619284
8378 -619284 -563258 -940484 -1373054 -1226967 -920279 -669917 -374463 -11885 149743 -148923
8368 -148923 -252645 -178361 -2477 -40440 -128405 57301 -169448 -744764 -1011665 -1067831
8358 -1067831 -1332751 -1471944 -1284208 -856834 -441842 -223016 -231041 -95133 348886 497107
8348 497107 429440 686533 885012 892629 833585 483192 -21920 -292045 -376057 -475975 -465240
8337 -465240 -600037 -662977 -690594 -879254 -1129651 -962096 -666380 -676319 -658428 -710347 -638391
8326 -638391 -323496 52193 58843 39928 324565 726114 1092451 1169601 902244 757462
8316 757462 762225 887407 900352 557632 350111 323030 373994 361450 -19201 -219868 113870
8305 113870 560603 684436 370668 293571 142180 -113093 -82489 395064 565777 293132
8295 293132 9452 -26965 -101190 -51508 -122509 -111415 214554 192960 291375 315550 -195518
8284 -195518 -476317 -321113 126647 140454 189030 405240 552471 59322 -355765 -508179
8274 -508179 -732369 -637890 -58038 258594 45583 316194 644538 636268 681198 942111
8264 942111 959090 669367 362510 164778 76772 128236 392843 735645 1027812 1151415
8254 1151415 653559 -65912 -315471 -331347 -222625 -77838 -113230 -345285 -111916 128664
8244 128664 168120 262972 279583 -54531 -436645 -346935 -174690 -195958 -246580 -248538 -256095
8233 -256095 -46318 19088 -158144 -434299 -370739 -58887 218560 565990 690938 694372
8223 694372 850805 646784 331208 198000 -99199 -349612 -13090 17828 -30465 82134
8213 82134 53629 -515122 -986637 -1087164 -1325336 -1669946 -1463340 -1191618 -1169931 -1228025
8203 -1228025 -1074172 -538219 -48496 347269 225039 -162834 -476554 -425272 -600147 -585951
8193 -585951 -484207 -189167 -589 -266040 -386343 -382619 -559350 -750109 -745037 -550857
8183 -550857 -70647 306645 347197 356938 272726 384570 434209 504278 634318 470793 123264
8172 123264 154648 271531 -25800 -364388 -475070 -367066 -833516 -1155585 -911522 -849767
8162 -849767 -669374 -832288 -1063878 -1086417 -747197 -144017 345704 707034 1062002 1034237
8152 1034237 275324 -300818 -513350 -474157 -327988 153 575261 593935 109160 -159842
8142 -159842 114177 227314 -306785 -613198 -699254 -904951 -1009074 -712213 -490208 -419063
8132 -419063 -724743 -943962 -946871 -866342 -595030 -486020 -562985 -516879 -621021 -604344 -545689
8121 -545689 -728252 -669046 -527324 -529879 -580424 -886736 -1056998 -944170 -943214 -898215 -803177
8110 -803177 -414798 -343952 -877466 -1043411 -960520 -727809 -324136 66322 198596 35602
8100 35602 -288326 -243334 -44905 -20073 -95062 -387047 -675709 -1031519 -835028 -461448
8090 -461448 -176962 273235 254639 -276971 -1022217 -1394752 -1344387 -1326923 -1204266 -1055474
8080 -1055474 -1031034 -775771 -579919 -343459 -98368 110263 292800 88781 -193314 -167763
8070 -167763 51462 559361 1038817 1045413 974435 817621 473461 -178065 -436335 -360030
8060 -360030 -536688 -830409 -759907 -499968 -437719 -561533 -873598 -926888 -521304 -309884
8050 -309884 -352786 -422625 -655253 -424034 -1595 99265 364991 372454 283633 -92750 -482969
8039 -482969 -366347 -434202 -557652 -418411 -623708 -1319860 -1740374 -1681341 -1440859 -1547870
8029 -1547870 -1950555 -1944067 -1781051 -1726947 -1881315 -1955265 -1520103 -1135335 -967987 -526764
8019 -526764 40120 451259 586669 713247 613312 580684 378362 -189605 -424915 -275451
8009 -275451 178399 600863 700050 161550 -582258 -950704 -1065585 -735009 -304381 88614
7999 88614 581350 701050 587300 46884 -94874 -25673 -153981 -28335 284370 459724
7989 459724 691017 914374 609469 -52402 -394443 -443078 -536834 -735888 -726544 -357266
7979 -357266 13144 -81798 -188746 -808769 -1684637 -1811637 -1475151 -1362762 -1527162 -1520261
7969 -1520261 -1164773 -707085 -570083 -550906 -640932 -737910 -556855 -78148 59482 -449194
7959 -449194 -637207 -349269 -258268 -446061 -602704 -1045972 -1231446 -1174177 -988148 -521827
7949 -521827 -127198 -202962 -288516 -210226 -196192 47782 325661 644606 719542 365443 41222
7938 41222 -243711 -655548 -836527 -451368 -149176 -195212 -78149 -34914 -82905 -316246
7928 -316246 -643016 -566418 190445 456532 113684 -272843 -541973 -364190 -102594 -41771
7918 -41771 -325195 -429449 -372117 -271951 225799 672517 615257 363466 252379 431966
7908 431966 222534 -358144 -984059 -1246642 -1247281 -1201251 -956703 -686120 -1003142 -1039424 -692398
7897 -692398 -454999 -456081 -510508 -310660 -20864 353303 247547 174485 -106621 -319463
7887 -319463 59662 257063 242294 221303 -94024 -167749 -287112 -277290 -107143 34916 278706
7876 278706 497342 87994 -97239 66977 260908 407780 467557 686748 684034 973578
7866 973578 1105398 735937 439774 109600 -389192 -615837 -393656 -236722 -431635 -709563
7856 -709563 -795373 -317502 186006 414348 170414 -69624 -102391 30527 -29962 4329
7846 4329 233035 299444 -162238 -567257 -672400 -425388 -120019 243031 530564 437909
7836 437909 119648 -483445 -1303321 -1586496 -1521092 -985604 -606685 -688237 -606590 -707411
7826 -707411 -1019775 -1022377 -707399 -367758 -32233 352055 649638 819649 846691 339864
7816 339864 13188 -269309 -382298 -250033 26168 167882 28641 -357049 -619665 -430969
7806 -430969 -189062 -392790 -475958 -596421 -418498 61061 335609 222627 354012 681240
7796 681240 1071087 1047164 470320 825 -18728 23253 334263 694415 740046 989344
7786 989344 1256860 1232254 1133461 752061 662470 699625 836181 1023549 1403992 1693875
7776 1693875 1430382 721702 377827 499606 651952 907366 1006976 644675 395619 466672
7766 466672 222540 -22175 -241176 -650915 -582422 -371544 -565578 -348194 206304 81086
7756 81086 -6622 -105562 -108097 -219621 -503447 -424271 -385716 -549845 -554171 -576420 -864652
7745 -864652 -555890 -468107 -861759 -1340036 -1531261 -1520226 -1434000 -1323982 -1326626 -1195905 -1086932
7734 -1086932 -960543 -1083494 -823654 -680971 -944547 -1020279 -904737 -698849 -557087 -736856
7724 -736856 -911980 -1204928 -1359064 -1148323 -842314 -723323 -888973 -1082755 -1099412 -1070831
7714 -1070831 -1040572 -924136 -1198513 -1193089 -580131 -227178 -408772 -779128 -1074965 -1113079
$$ [...]
##END NTUPLES=NMR SPECTRUM
##END=
