##TITLE=C13_LR-688B-C4-EtOAc2
 CDCl3, 22400 sc

 17.10.2019
##JCAMPDX= 6.0         $$ Bruker NMR JCAMP-DX V2.0
##DATA TYPE= NMR SPECTRUM
##DATA CLASS= NTUPLES
##ORIGIN= UXNMR, Bruker Analytische Messtechnik GmbH
##OWNER= root
$$ XWIN-NMR		Version 3.5
$$ Fri Oct 18 13:41:14 2019 Russian Standard Time (UT+4h)  she@DPX200
##.OBSERVE FREQUENCY= 50.327896
##.OBSERVE NUCLEUS= ^13C
##.ACQUISITION MODE= SIMULTANEOUS
##.ACQUISITION SCHEME= undefined
##.AVERAGES= 22400
##.DIGITISER RES= 17
##SPECTROMETER/DATA SYSTEM= spect
##.PULSE SEQUENCE= zgpg30
##.SOLVENT NAME= CDCl3
##.SHIFT REFERENCE= (INTERNAL, CDCl3, 0, 222.624)
##AUDIT TRAIL= $$ (NUMBER, WHEN, WHO, WHERE, WHAT)
$$ ##TITLE= Audit trail, XWIN-NMR		Version 3.5
$$ ##JCAMPDX= 5.01
$$ ##ORIGIN= Bruker BioSpin GmbH
$$ ##OWNER= she
$$ F:/spectra/data/she/nmr/c13/1/pdata/1/auditp.txt
$$ ##AUDIT TRAIL=  $$ (NUMBER, WHEN, WHO, WHERE, WHAT)
(   1,<2019-10-18 13:39:32.87 +0400>,<she>,<DPX200>,
      <created by zg, POWCHK disabled, PULCHK disabled
       terminated by command 'halt'
       configuration hash MD5:
       00 E9 B6 7A A2 85 ED C7 34 08 36 98 17 FE 4E 26
       data hash MD5: 32K
       B5 0B 16 1F 50 D5 46 39 B9 6B 19 B1 2F 70 0F 37>)
(   2,<2019-10-18 13:39:37.78 +0400>,<she>,<DPX200>,
      <Start of raw data processing
       efp BC_mod = 2 LB = 1 FT_mod = 6 PKNL = 1 PHC0 = -387.0912 PHC1 = 26.20636 SI = 32K 
       data hash MD5: 32K
       C0 0F 7F 5D A8 E1 82 99 7E 2D 7C BC D5 06 B6 A5>)
(   3,<2019-10-18 13:39:40.82 +0400>,<she>,<DPX200>,
      <abs ABSG = 5 
       data hash MD5: 32K
       33 DB 08 0E 53 6E 35 3E 3F CB A3 48 E5 36 34 DB>)
(   4,<2019-10-18 13:40:06.32 +0400>,<she>,<DPX200>,
      <pk PHC0 = 4.87527 PHC1 = 7.600002 
       data hash MD5: 32K
       1F 18 92 0F BA 32 8F 4D 6E E2 71 34 70 CC 10 B2>)
(   5,<2019-10-18 13:40:09.62 +0400>,<she>,<DPX200>,
      <abs ABSG = 5 
       data hash MD5: 32K
       D1 C3 38 0C 10 ED ED 5A 9D AC 5B 87 F6 4C 0B E1>)
$$ ##END=
$$ 
$$ hash MD5
$$ 6A FB 68 37 0A 79 D8 AF B4 6F 37 DB FD 05 52 1D
##$RELAX= 
##$RELAX= 
##$RELAX= 
##$RELAX= 
##$RELAX= 
##$RELAX= 
##$RELAX= 
##$RELAX= 
$$ Bruker specific parameters
$$ --------------------------
##$DU= <F:/spectra>
##$EXPNO= 1
##$NAME= <c13>
##$PROCNO= 1
##$TYPE= <nmr>
##$USER= <she>
##$AMP= (0..31)
100 100 100 100 100 100 100 100 100 100 100 100 100 100 100 100 100 100 
100 100 100 100 100 100 100 100 100 100 100 100 100 100 
##$AQSEQ= 0
##$AQ_mod= 1
##$AUNM= <au_zg>
##$AUTOPOS= <>
##$BF1= 50.322709
##$BF2= 200.13
##$BF3= 50.322709
##$BF4= 500.13
##$BF5= 500.13
##$BF6= 500.13
##$BF7= 500.13
##$BF8= 500.13
##$BYTORDA= 1
##$CFDGTYP= 0
##$CFRGTYP= 5
##$CHEMSTR= <none>
##$CNST= (0..31)
1 1 145 1 1 1 1 1 1 1 1 1 1 1 1 1 1 1 1 1 1 1 1 1 1 1 1 1 1 1 1 1 
##$CPDPRG= <waltz16>
##$CPDPRG1= <>
##$CPDPRG2= <waltz16>
##$CPDPRG3= <>
##$CPDPRG4= <mlev>
##$CPDPRG5= <mlev>
##$CPDPRG6= <mlev>
##$CPDPRG7= <mlev>
##$CPDPRG8= <mlev>
##$CPDPRGB= <>
##$CPDPRGT= <>
##$D= (0..31)
$$ [...]
##$SUBNAM4= <"">
##$SUBNAM5= <"">
##$SUBNAM6= <"">
##$SUBNAM7= <"">
##$SUBNAM8= <"">
##$SUBNAM9= <"">
##$SW= 239.972175391363
##$SWIBOX= (0..15)
0 1 3 0 0 0 0 0 0 0 0 0 0 0 0 0 
##$SW_h= 12077.2946859903
##$TD= 32768
##$TD0= 1
##$TE= 0
##$TE2= 300
##$TE3= 300
##$TEG= 300
##$TL= (0..7)
120 120 120 120 120 120 120 120 
##$TP= (0..7)
150 150 150 150 150 150 150 150 
##$TP07= 0
##$TPNAME0= <>
##$TPNAME1= <>
##$TPNAME2= <>
##$TPNAME3= <>
##$TPNAME4= <>
##$TPNAME5= <>
##$TPNAME6= <>
##$TPNAME7= <>
##$TPOAL= (0..7)
0.5 0.5 0.5 0.5 0.5 0.5 0.5 0.5 
##$TPOFFS= (0..7)
0 0 0 0 0 0 0 0 
##$TUNHIN= 0
##$TUNHOUT= 0
##$TUNXOUT= 0
##$USERA1= <user>
##$USERA2= <user>
##$USERA3= <user>
##$USERA4= <user>
##$USERA5= <user>
##$V9= 5
##$VALIST= <valist>
##$VCLIST= <CCCCCCCCCCCCCCC>
##$VD= 0
##$VDLIST= <DDDDDDDDDDDDDDD>
##$VPLIST= <PPPPPPPPPPPPPPP>
##$VTLIST= <TTTTTTTTTTTTTTT>
##$WBST= 1024
##$WBSW= 4
##$XGAIN= (0..3)
0 0 0 0 
##$XL= 0
##$YL= 0
##$YMAX_a= 148926098
##$YMIN_a= -68060450
##$ZGOPTNS= <>
##$ZL1= 120
##$ZL2= 120
##$ZL3= 120
##$ZL4= 120
##$ABSF1= 222.624
##$ABSF2= -17.3728
##$ABSG= 5
##$ABSL= 3
##$ALPHA= 0
##$AQORDER= 0
##$ASSFAC= 0
##$ASSFACI= 0
##$ASSFACX= 0
##$ASSWID= 0
##$AUNMP= <proc_1d>
##$AZFE= 0.1
##$AZFW= 0.5
##$BCFW= 0
##$BC_mod= 2
##$BYTORDP= 0
##$COROFFS= 0
##$CY= -3
##$DATMOD= 1
##$DC= 0
##$DFILT= <>
##$DTYPP= 0
##$F1P= 0
##$F2P= 0
##$FCOR= 0.5
##$FTSIZE= 32768
##$FT_mod= 6
##$GAMMA= 0
##$GB= 0
##$INTBC= 1
##$INTSCL= 4.134877e-10
##$ISEN= 128
##$LB= 1
##$LEV0= 0
##$LPBIN= 0
##$MAXI= 10000
##$MC2= 0
##$MEAN= 0
##$ME_mod= 0
##$MI= 0.1934396
##$NCOEF= 0
##$NC_proc= 3
##$NLEV= 6
##$NOISF1= 120.0001
##$NOISF2= 80.00006
##$NSP= 0
##$NTH_PI= 0
##$NZP= 0
##$OFFSET= 222.624
##$PC= 1.4
##$PHC0= -382.2159
##$PHC1= 33.80636
##$PH_mod= 1
##$PKNL= yes
##$PPARMOD= 0
##$PSCAL= 0
##$PSIGN= 0
##$REVERSE= no
##$SF= 50.3227315989248
##$SI= 32768
##$SIGF1= 140
##$SIGF2= 120
##$SINO= 11.81781
##$SIOLD= 32768
##$SREGLST= <13C.CDCl3>
##$SSB= 0
##$STSI= 32768
##$STSR= 0
##$SW_p= 12077.2946859903
##$SYMM= 0
##$S_DEV= 0
##$TDeff= 32768
##$TDoff= 0
##$TI= <>
##$TILT= no
##$TM1= 0
##$TM2= 0
##$TOPLEV= 0
##$USERP1= <user>
##$USERP2= <user>
##$USERP3= <user>
##$USERP4= <user>
##$USERP5= <user>
##$WDW= 1
##$XDIM= 32768
##$YMAX_p= 285043537
##$YMIN_p= -1303271
$$ End of Bruker specific parameters
$$ ---------------------------------
##NTUPLES= NMR SPECTRUM
##VAR_NAME=  FREQUENCY,     SPECTRUM/REAL,   SPECTRUM/IMAG
##SYMBOL=    X,             R,               I
##VAR_TYPE=  INDEPENDENT,   DEPENDENT,       DEPENDENT
##VAR_FORM=  AFFN,          ASDF,            ASDF
##VAR_DIM=   32768,         32768,           32768
##UNITS=     HZ,            ARBITRARY UNITS, ARBITRARY UNITS
##FACTOR=    0.368581032318806, 1,           1
##FIRST=     11203.0474431902, 0,            0
##LAST=      -874.247242800138, 0,           0
##MIN=       -874.247242800138, -1303271,    0
##MAX=       11203.0474431902, 285043537,    0
$$ Real data points
##PAGE= N=1
##DATA TABLE= (X++(R..R)), XYDATA
$$ [...]
18438 1096636 1069822 1251822 1493252 1545229 1368951 1241620 1146241 1158417 1135935 1124146
18428 1124146 1142703 1224150 1303138 1320271 1190901 1081904 1312134 1418614 1443664 1712295
18418 1712295 2087523 2098106 2122519 2354561 2756204 3068459 3024278 2971193 3034008 3126614
18408 3126614 3225217 3240807 3448560 3606519 3692553 3925497 4102775 4510663 4835577 5308598
18398 5308598 5818918 6024862 5890092 5733688 5827060 6030952 5907353 5778323 5714644 5776952
18388 5776952 6098629 6208209 6240416 6230653 6198294 6200746 6135751 6047514 6037557 5907057 5854425
18377 5854425 5811865 5678477 5550631 5528866 5493372 5457563 5362861 5071180 4772063 4673008
18367 4673008 4698058 4382124 4027986 3810660 3472631 3331368 3345439 3340219 3079792 2733126
18357 2733126 2687186 2621124 2279067 2085642 1867712 1717128 1904237 1955027 1771315 1612528
18347 1612528 1651872 1658743 1576102 1387249 1173757 1099880 1109338 1206679 1267708 1049559 783960
18336 783960 588669 617898 805206 1081974 1301967 1256596 1214114 1238927 1221795 1079161
18326 1079161 1095340 1279487 1338511 1313329 1174827 1151350 1149232 1287511 1135002 777006
18316 777006 547566 472337 422144 346006 430767 806018 1107386 1092282 1134600 1027156 805792
18305 805792 736176 823924 873925 949840 1083138 861557 599907 391846 321745 393277 391163
18294 391163 239966 208790 391775 459077 429042 306127 312353 576793 634010 596989 591320
18283 591320 557288 493756 497072 616002 624084 525649 499539 532742 333056 156812 31587
18272 31587 96957 120357 100558 127389 166271 224376 418885 822541 992746 880194 704272
18261 704272 376885 210039 53333 -30101 37372 -20698 18953 280987 209403 -77274
18251 -77274 -189076 -294704 -285153 -183361 -376349 -599011 -421443 -332835 -382804 -159779
18241 -159779 29197 -191193 -323111 -104843 102414 32009 -38926 -224054 -289569 -49989
18231 -49989 186155 458130 645353 591476 415974 301383 285762 311429 -1250 -395762
18221 -395762 -552121 -446124 -80848 178110 221349 248595 119847 -73119 -64459 55845
18211 55845 73070 -160158 -549970 -740496 -891167 -1030373 -1007346 -696348 -402214 -378682
18201 -378682 -429431 -335517 -281062 -437872 -475556 -278824 124303 337765 459648 515818
18191 515818 461166 282019 154758 299331 332752 235450 129909 180713 162458 -92104
18181 -92104 -299851 -331116 -387922 -461789 -410840 -466749 -438375 -164242 -77370 -93402 -143085
18170 -143085 -19805 43780 176070 129363 138872 25511 -309459 -511412 -386249 -88199
18160 -88199 -17205 -338879 -710493 -731412 -599221 -392205 -137488 15167 -20929 -64067
18150 -64067 -84396 -185591 -440721 -409325 -188160 11493 -45670 -115661 -59480 -100969 -69074
18139 -69074 150197 401257 489503 214555 -252890 -380251 -419831 -397527 -222191 -97448
18129 -97448 -20215 121405 109391 159621 336551 265247 266439 355374 391236 325037 310422
18118 310422 68372 -198379 -81055 131613 96693 170500 225021 109526 -96104 -42614
18108 -42614 196209 143418 55669 -2157 105045 -55646 -239845 -225717 -181938 -238209 -344504
18097 -344504 -315813 -165644 -22117 -53579 -75562 -83605 -185131 -249483 -344736 -425152 -150996
18086 -150996 -33147 -82217 -168248 -188981 -224110 -256273 -139007 -165150 -103703 -65826 -93177
18075 -93177 -110707 45650 36204 -36605 108330 158957 11308 -167205 -177166 -111090 -164246
18064 -164246 -268518 -193105 -155686 -231313 -394659 -461637 -391943 -599286 -602767 -299887 -198566
18053 -198566 -166983 -207855 -311649 -487411 -496847 -270092 90578 218915 145256 66295 -13307
18042 -13307 -71364 -165596 -267117 -487489 -721210 -706203 -622381 -609136 -554923 -508437 -278897
18031 -278897 -75573 13027 -157069 -363863 -307941 -392984 -399008 -255344 -114220 21515
18021 21515 -11224 -267628 -479445 -357421 -48700 -164376 -331000 -83720 262411 275167
18011 275167 45875 -33421 129872 602454 800399 573178 381217 384816 280770 128368
18001 128368 100322 150204 256194 392600 490520 515619 527650 398091 224277 56394
17991 56394 -74076 -32790 141566 221304 92680 -153192 -238689 -334796 -386377 -430302 -430382
17980 -430382 -348108 -206596 -24470 50595 100941 134746 -28608 -207111 -180148 -221034 -197769
17969 -197769 -291601 -346534 -201627 -81159 -202999 -328029 -262456 -54779 138893 183942
17959 183942 273892 354026 280300 183527 115625 -14292 -142166 -254307 -415632 -530475
17949 -530475 -431703 -294058 -118899 12126 108521 -35457 -172620 -104490 -77419 -177016
17939 -177016 -418721 -275892 145368 267501 382849 471712 323743 117784 189096 367914
17929 367914 571452 438450 212165 142254 299583 269722 197001 170991 296091 329836
17919 329836 246615 259434 216137 245879 353574 250733 4352 -139121 -264407 -223329
17909 -223329 -23453 68993 56269 80391 -75637 -362279 -533476 -518515 -424655 -182982
17899 -182982 75358 180229 60766 119290 213426 330669 311796 269109 24242 -290331
17889 -290331 -452218 -669919 -716284 -516287 -392372 -468189 -429424 -316136 -65944 121015
17879 121015 260771 398282 303781 125718 167364 254619 256748 143992 105823 100721 -27655
17868 -27655 30937 69537 129467 187768 221148 193638 55024 -103347 -88321 78606 361963
17857 361963 417868 76490 -299798 -359986 -263684 -146116 -21415 82179 197525 366076
17847 366076 302032 144189 141028 177987 204264 203540 72185 86345 -1468 -89218 -81932 -71885
17835 -71885 -161942 -198631 -96627 -42073 -101574 -158886 -99780 -4980 86249 71355 101728
17824 101728 116048 208880 320333 266998 185654 3256 -48235 -74796 -173250 -430690 -591676
17813 -591676 -472387 -284185 -255648 -355386 -147756 -16511 -112767 -44037 77308 -86911
17803 -86911 -197133 -154979 -6881 186519 343255 297105 84313 -26254 5269 -179806
17793 -179806 -227047 -84119 142587 40003 -186400 -177231 -156905 -237542 -166966 -161337 -51226
17782 -51226 194390 233239 226765 309023 433206 427481 166953 152284 252083 227497 60410
17771 60410 -131493 -127891 -78309 -105177 -189107 -86395 -113409 -176297 -137674 -43934 359114
17760 359114 667629 636351 492043 559745 495123 153441 -104366 -186195 -251250 -244415 -128068
17749 -128068 35270 183920 274156 661410 899164 817709 596386 498707 423172 204069
17739 204069 62598 95847 112340 177016 313081 318161 327726 385122 480467 539244 317031
17728 317031 1235 -206007 -260304 -141077 4738 9446 -34008 -67728 113759 368822
17718 368822 385362 231773 351453 365154 77779 -65833 148733 276204 147953 54936
17708 54936 152160 184141 205213 280665 378159 437343 451407 521213 515989 676772 634546 415947
17696 415947 494623 575677 656092 728196 592449 430088 487648 688558 863213 791253 563450
17685 563450 194585 -25534 -66961 -149992 -88169 49918 221134 317651 513869 667233
17675 667233 686415 619313 491578 500760 576923 550138 585722 832395 1019934 942374 828569
17664 828569 727774 680903 640309 460129 576159 929825 1019625 1062269 1071710 999819 1031798
17653 1031798 1070567 1075216 1220214 1486394 1742723 1877897 1999531 2079906 2171560 2481873
17643 2481873 2645427 2545961 2528041 2620029 2675956 2830604 2827219 2869559 2988110 3153081 3502874
17632 3502874 3786235 3782896 3531180 3408526 3734336 4225969 4563320 4947291 5262189 5621645
17622 5621645 5797903 5687512 5793983 6013766 6269110 6515078 6529634 6470321 6111019 5820502
17612 5820502 5972449 6163573 6151141 6009765 5966290 5942792 6024797 6003063 5973442 6026012 5901485
17601 5901485 5512138 5106295 4891789 4897070 4884941 4667164 4402286 4173203 3990180 3749297
17591 3749297 3703806 3595060 3335374 3195478 3250138 3079289 2839487 2736158 2804919 2826289
17581 2826289 2911131 2716863 2332116 2217619 2057864 2039782 2061076 1893224 1841053 1673344
17571 1673344 1355071 1120469 1059365 1244039 1421629 1662373 1837703 1690174 1392589 1171469
17561 1171469 871201 789209 717480 575521 521882 560027 621272 575401 639418 569807 561289
17550 561289 794980 895073 921851 739094 576241 649634 610045 715804 754147 711355
17540 711355 513653 296166 165385 176701 259760 429216 673438 782466 746164 659295
17530 659295 656930 599308 535692 379336 152723 51227 120326 101797 23245 14615 -190777
17519 -190777 -378318 -358832 -219233 -66358 -4403 136158 197947 435913 656295 661462
17509 661462 408303 158064 170303 206262 140771 -24212 -181136 -72543 149785 293052
17499 293052 462466 716429 884547 850097 693317 462591 418596 348325 314641 366834
17489 366834 302176 284888 309069 247374 139776 301917 626116 756894 684222 749848 716617
17478 716617 618491 514037 307601 36423 -21408 150923 279235 220356 235360 261843
17468 261843 311995 411235 509760 497454 359258 278674 176983 191823 366141 400239 346221
17457 346221 400808 269258 128732 310155 524187 418491 279110 245825 162106 44654
17447 44654 -14666 74121 319636 348593 191894 289551 453126 348627 79649 -59554
17437 -59554 -207630 -340068 -494981 -475701 -220543 -129619 -35959 -6665 -10111 -42104 -69108
17426 -69108 -1009 -51226 71558 265408 143290 27934 -12016 -35557 -112851 -323365 -513581
17415 -513581 -533009 -315507 -141817 14807 63771 -15446 -257799 -489782 -451642 -295643
17405 -295643 -136759 -51584 51532 136343 223668 292562 178052 57283 44246 -5788 -156540
17394 -156540 -300285 -159634 -37585 -62521 96936 314141 323129 129106 -200686 -281168
17384 -281168 -145467 48563 306003 556901 696451 723111 505516 304317 391693 540493
17374 540493 656080 699161 404078 95500 36165 25438 -24758 -133577 -191630 -279500 -253183
17363 -253183 -345823 -243158 161214 321008 196822 115961 -67916 -208680 -79896 -112808
17353 -112808 -407672 -544804 -576773 -558790 -479288 -390484 -139862 46029 5007 -35767 124164
17342 124164 45831 -35154 132649 333941 390303 425083 393574 250799 11905 -203173
17332 -203173 -291993 -217247 -5880 178502 136856 10351 -38174 -200905 -333038 -272616
17322 -272616 -101085 59598 141815 251245 333710 195607 -105683 -379280 -362838 -212327
17312 -212327 -192308 -199188 -47493 132865 257763 340436 369103 388956 339779 507687 576438
17301 576438 330051 26002 -281931 -397006 -295588 -195350 -385318 -788944 -925917 -769768
17291 -769768 -561444 -296938 -55715 236162 268392 -2228 -5902 112196 135071 87131
17281 87131 253332 358897 438554 431421 271935 151929 77190 89405 143099 270685 389242
17270 389242 141408 -282070 -326128 -264665 -460716 -484327 -529119 -577688 -630062 -482662 -278995
17259 -278995 -139236 57528 153205 261292 244917 100573 144609 256925 234019 290050
17249 290050 151330 -127222 -321609 -382210 -213044 -71160 141068 415227 471158 314946
17239 314946 59522 -118111 -226515 -137940 -238233 -502527 -675649 -706761 -845176 -1065917
17229 -1065917 -884485 -484598 -359504 -316171 -435861 -439745 -147196 3586 83868 170594
17219 170594 72109 11419 82609 128853 188464 111378 172986 225930 145488 67638 -76203
17208 -76203 -127645 -283340 -392605 -348591 -254252 -74722 -126131 -155519 -67892 -70677 -9650
17197 -9650 148260 245090 127384 51011 230613 215466 148592 261196 317051 119194 -42459
17186 -42459 72823 296099 454162 394577 356404 342598 158699 -32241 -172963 -208684
17176 -208684 -177514 -145577 -176932 -173903 -283769 -490103 -431122 -149632 129202 352174 387188
17165 387188 247630 267571 321622 235504 204139 254892 209892 252056 194256 -137010 -442046
17154 -442046 -430169 -210330 -49903 -51818 -211371 -369300 -244145 -132632 -85035 -26720
17144 -26720 -212768 -446179 -372168 -180438 -138627 -65663 157059 272155 189363 662
17134 662 -234700 -579022 -775713 -790145 -897590 -783617 -517429 -410572 -647006 -832839
17124 -832839 -686731 -364435 31403 251580 329745 122808 158002 41106 -280717 -345726
17114 -345726 -106994 219781 419683 461666 420310 272558 188081 147530 92348 169144 374257
17103 374257 501395 444652 230638 -4320 -147661 -307006 -277696 17256 123370 9656
17093 9656 -323634 -380485 -277094 -375506 -537584 -780019 -931713 -935183 -897093 -727152 -517069
17082 -517069 -372820 -250989 -344700 -598050 -689203 -608734 -538473 -281631 -133917 -169669
17072 -169669 -42786 255719 309256 96318 -73136 -2661 173802 -7073 -318460 -376633
17062 -376633 -125887 24800 50585 50992 -174226 -348476 -261715 1696 264016 233605 128556
17051 128556 36170 26687 27668 -6468 -180642 -379744 -462731 -251514 75595 209934 133300
17040 133300 253492 400425 304504 51172 -128704 -147176 -262048 -283309 -186000 -45475
17030 -45475 92497 159594 238934 321360 279006 245118 125369 10913 35122 66636 -94715
17019 -94715 -171687 -126147 -62174 -114644 -54403 -91998 -233016 -458517 -649011 -762525 -506835
17008 -506835 -139678 -58248 -2680 -75662 -316503 -418986 -448554 -605279 -689999 -594558 -448017
16997 -448017 -420595 -511563 -488538 -376818 -345300 -384764 -319648 -188020 140894 454044 391434
16986 391434 292448 355861 263398 269466 239161 20453 91961 289192 328417 287372 379556
16975 379556 514909 509683 271258 -17755 -62232 -146161 -164123 -70016 55157 173883 211420
16964 211420 325822 361413 326484 155014 -67634 -138324 -95970 -38873 -42354 -88261 79821
16953 79821 312430 402110 301394 18336 -86367 -86605 -140492 -44503 15609 97353 243607
16942 243607 255460 277572 419744 425346 365852 475098 545857 520876 307074 161993 70030
16931 70030 -50854 -151136 -109557 -138590 18325 284174 314193 299214 311129 396360 432969
16920 432969 185887 101340 220780 409733 567273 472016 289519 254363 127096 -94107
16910 -94107 -124214 -16336 220794 412603 439591 333672 248403 443188 514546 400793
16900 400793 358890 554076 923103 1052225 947028 831514 666626 390513 301926 397389
16890 397389 393475 461454 537664 598885 518209 323467 268192 117490 -77364 -89613 29246
16879 29246 233138 276635 261175 405346 592625 629651 499969 544347 815164 796746 763199
16868 763199 900633 929057 919300 978919 1184908 1373899 1490643 1555453 1387194 1344425 1297798
16857 1297798 1063947 887968 987612 1223477 1343038 1279210 1057054 1232742 1757953 2184424
16847 2184424 2374514 2391611 2040704 1777995 1958120 2163649 2237956 2451541 2817578 2885284
16837 2885284 2693621 2520089 2339870 2212796 1995640 1844422 1582602 1371219 1389591 1477942
16827 1477942 1593105 1884176 2011235 1730048 1329259 1238621 1378874 1396274 1232409 893207
16817 893207 699381 662311 767409 879116 942961 817896 770623 749918 717971 808937 743617
16806 743617 581895 513095 420573 377443 361909 409706 612722 784899 963404 943449 769561
16795 769561 645100 738013 735190 644112 529317 388311 347161 332233 96251 -59587 62902
16784 62902 237714 504516 754392 663388 452824 372578 461885 429164 183079 7726
16774 7726 28758 149068 297253 468606 492329 409797 240262 -193758 -394665 -452479 -603615
16763 -603615 -522606 -190801 81183 80893 92265 108497 53270 200366 341252 355022 448095
16752 448095 365568 169368 267958 335933 404033 268165 264362 426654 299510 114919 197315
16741 197315 284260 237198 22925 -123674 88042 366344 425494 249504 59705 94791
16731 94791 59963 35405 28282 -97601 -199043 -216158 -257691 -320872 -310453 -247196 -297747
16720 -297747 -151281 24518 118319 24547 44493 193441 33736 -89640 -206199 -264616
16710 -264616 -314150 -424085 -569575 -445025 -325380 -338406 -152455 -247661 -255392 33744
16700 33744 62136 -52973 -134296 -90212 -131456 -117719 -61807 66423 68533 64244 38822 150419
16688 150419 277278 158918 25463 146191 330964 453109 480623 421574 98095 -162692
16678 -162692 -239475 -324262 -456909 -503210 -368740 -350239 -237536 26361 210434 369688
16668 369688 438671 322052 318818 316171 236184 4542 -114376 -123641 -76287 -12472 -10104 108956
16656 108956 197448 156398 -91590 -294727 -418779 -755326 -856099 -673994 -433833 -289556
16646 -289556 -231392 -167106 -195546 -220051 -142247 -148890 -198807 -131917 84291 40101 -207391
16635 -207391 -326919 -133488 20288 31158 -64031 -381225 -611515 -695784 -729156 -647737
16625 -647737 -405502 -202568 61622 102894 177776 171089 127334 2350 19238 -5632 -267489
16614 -267489 -455561 -470056 -366362 -213524 -49510 -78040 -293222 -485522 -398006 -203607
16604 -203607 -218420 -237989 -258228 -124931 133493 270280 352497 272828 290068 523526 426452
16593 426452 132332 116898 409172 565019 411391 186514 -75125 -244154 -194892 -306776
16583 -306776 -500221 -410883 -222515 -239202 -400452 -395352 -267717 -56446 -52878 -221709 -337617
16572 -337617 -339162 -331585 -357788 -402071 -393402 -441419 -606365 -786770 -801230 -766753 -613389
16561 -613389 -401192 -237603 150215 261241 72632 93180 23388 -171893 -193954 -179724
16551 -179724 -266876 -242493 79951 105396 -140368 -366964 -481461 -463009 -434955 -272633
16541 -272633 -151250 -126886 99305 295315 253725 41326 -140419 -158069 73401 189716
16531 189716 405489 675859 751452 737286 526781 247404 -57686 -246574 -491447 -660147
16521 -660147 -631558 -332184 -167338 -72333 -210250 -432756 -438572 -372708 -388499 -342872 -21586
16510 -21586 171696 -23215 -331689 -256517 -268773 -394589 -453585 -342707 -129912 81347
16500 81347 170317 218430 190840 -99854 -220865 72415 134240 -172144 -301857 -177898
16490 -177898 -83514 -159361 -333409 -524282 -593439 -375353 -64278 -44475 -181947 -273359
16480 -273359 -408068 -476186 -330227 -145646 -148333 -229777 -308856 -485326 -508366 -286421 92047
16469 92047 323136 206389 36669 46788 28350 -59800 -148162 -93833 268823 599161 622101
16458 622101 450205 468894 592579 611042 403360 122125 -228875 -589043 -743905 -622811
16448 -622811 -425348 -203705 -103578 -371067 -637523 -487995 -313936 -212610 -256147 -379590
16438 -379590 -430204 -318319 -187937 -107404 -93311 93429 463423 573099 297033 -86829
16428 -86829 -294712 -287444 -10204 176346 270020 372699 317299 168103 -57333 -324811
16418 -324811 -185728 343281 760623 658925 147571 -150008 -254778 -303766 -245097 -387435
16408 -387435 -515346 -418340 -151086 -11872 39038 124454 41123 -127152 -49941 68173
16398 68173 -14969 -150291 -77381 127473 162620 -280519 -574468 -629801 -504165 -154598
16388 -154598 326709 580883 476994 553941 706515 696009 630589 565643 346303 95448
16378 95448 -158657 -288230 -179899 -60106 192205 249053 237781 199729 40385 -122008
16368 -122008 -234069 -188515 -159819 -257352 -406692 -393082 -345022 -314601 -155662 -50702 -122964
16357 -122964 -242764 -245703 -99955 -96615 -249324 -467031 -477458 -141442 -170308 -476999 -538771
16346 -538771 -494652 -636152 -907748 -847617 -469228 -252364 -96384 143314 210626 100986
16336 100986 87724 156988 242837 199967 56772 -90093 19471 393386 662789 479070
16326 479070 133039 -115057 -112876 -86347 -65068 -69880 -151225 -394455 -541612 -411966 -328017
16315 -328017 -270938 -198463 -91974 -184319 -166556 164766 341550 216903 129256 -55125
16305 -55125 -190489 -138090 62493 203676 48460 -143186 -133297 -189412 -246642 -224604 41157
16294 41157 176130 -9338 -154861 -427569 -394784 -70263 77106 127070 251038 431307
16284 431307 504291 292433 181057 257146 259468 215269 283231 271280 198621 51578 -88369
16273 -88369 -35208 158257 380351 556383 553606 452374 104957 -317040 -248738 -55826
16263 -55826 -19663 38129 -12936 -85279 -132804 -181093 -300211 -497716 -424566 -230578 -95449
16252 -95449 33122 181128 76406 -113189 -239593 -282774 -377677 -622852 -640605 -385856
16242 -385856 -240578 -251642 -118726 96703 18521 -208876 -206793 -55023 -313627 -625753
16232 -625753 -605458 -302635 -33227 79610 -15462 -192320 -129543 50271 95245 -132134
16222 -132134 -404046 -457355 -335619 -217039 -115335 -1443 -35155 -246055 -508058 -362149
16212 -362149 24794 319888 325983 402653 603459 526580 376938 339900 185856 -44617
16202 -44617 -21937 22056 108353 102647 138619 186145 254093 324348 365451 383910 363987 65900
16190 65900 -237563 -238105 -162463 -194394 -364138 -338493 -226976 -259834 -413178 -419647 -128390
16179 -128390 111963 181733 194271 163967 147195 180787 305532 237439 133406 62203 -10471
16168 -10471 -20360 -37111 27213 257652 368774 264217 286301 383118 212235 56308 2975
16157 2975 26492 277990 379703 269194 118993 -106381 -208513 -58885 64416 61384
16147 61384 91936 148310 243449 201776 147853 100733 344061 602367 619126 469733 349496
16136 349496 298560 249575 495896 646257 533940 228513 -172122 -275573 -84204 -8502
16126 -8502 -15770 122589 265772 160085 -65681 -265127 -452813 -586320 -579850 -328259 -62440
16115 -62440 17429 17111 95922 102420 230945 428079 302404 240360 382550 462194 287887
16104 287887 68734 53343 -13558 -86192 -124819 -247392 -477240 -570614 -522374 -516095 -324369
16093 -324369 -19376 222893 358407 481088 558657 490692 382544 318244 286484 -17956
16083 -17956 -278789 -288149 -311852 -391725 -539384 -723178 -694952 -463711 -409722 -417219 -347835
16072 -347835 -8886 365295 499633 408638 356572 270409 37709 -192086 -113272 4481
16062 4481 89617 158292 244310 252216 111148 39401 55114 -18750 21676 73950 68417 63415
16050 63415 16556 5229 -116339 -300189 -664271 -808967 -705725 -621086 -537864 -309950
16040 -309950 -204592 -67627 -1384 9044 87561 15471 22475 140367 31059 -25047 137237
16029 137237 223608 120949 -106347 -232771 -645253 -988994 -994717 -881226 -577345 -367628
16019 -367628 -219472 -27505 90751 -10084 26154 187472 142707 -36945 -175692 -111858
16009 -111858 171124 256575 66636 98068 177462 64890 -294209 -494496 -422101 -258650
15999 -258650 -129676 -70169 -174288 -362228 -569820 -773474 -749798 -612582 -290397 19225
15989 19225 -7332 -189121 -245885 -70500 111226 220184 317260 267054 254749 252142 199855
15978 199855 239949 337232 286051 203871 198955 58516 -34508 27520 95369 -62915 -205915
15967 -205915 -155818 2482 174413 518686 679807 414012 -5791 -227679 -276318 -251243
15957 -251243 -281920 -348145 -275865 -146990 -138941 -88312 -145609 -411703 -540482 -450518 -345533
15946 -345533 -305436 -294321 -168254 154005 364031 391340 270381 236945 372337 533656
15936 533656 418006 255286 180665 304404 339151 139032 -22960 -224803 -304771 -192626
15926 -192626 -210811 -211168 -95683 -60333 -84444 -152496 -181716 -330543 -441669 -446550 -470609
15915 -470609 -349499 -162454 -189367 -215121 -286470 -233997 -6223 -13468 -138885 -187045 -101993
15904 -101993 21461 1490 -41248 68669 -14898 -250679 -355636 -259897 -18481 215236
15894 215236 270200 180956 200372 355491 392443 462 -543743 -727949 -440616 -154978
15884 -154978 -45804 24211 -97102 -200014 -214234 -401139 -470233 -504961 -347091 -104277
15874 -104277 -125436 -49943 66174 22634 -100018 -42406 69580 13222 -13853 221880 461840
15863 461840 488276 395167 503204 555050 327440 156955 58899 -14201 -306271 -732111
15853 -732111 -758248 -459267 -181826 -116483 -253423 -242864 -132469 60093 252865 445226
15843 445226 531073 310965 265255 240866 -11762 -235853 -188457 46244 101525 -107573
15833 -107573 -294824 -257414 26345 141324 298345 610515 659749 590506 291158 47953
15823 47953 45727 40580 152136 293060 392272 434451 257776 45200 -11094 74018 316077
15812 316077 551412 522560 456775 325020 206301 170269 147104 218079 363332 590007
15802 590007 493866 325517 234719 191844 48693 -225492 -336140 -201046 -114781 -217031
15792 -217031 -369930 -351440 -261160 -263642 -387033 -397895 -192887 -26104 100806 121931 61203
15781 61203 -103076 -270073 -214331 -118843 -58900 -187986 -296638 -375102 -365683 -182193 -47095
15770 -47095 -271469 -491485 -259461 -52779 76444 158705 182884 291912 223309 30634
15760 30634 -41647 -195701 -334333 -335286 -415504 -582564 -578837 -333464 -23888 46613 -22264
15749 -22264 16916 -49997 51360 161101 82503 -129665 -301206 -186271 -3559 -13544 19127
15738 19127 126019 267780 253675 -16847 -68945 56683 -55929 -422574 -518979 -426973
15728 -426973 -293278 -110733 47145 -63461 -298565 -394720 -316552 -284164 -275260 -117502
15718 -117502 -40020 -136943 -3226 127540 68743 319295 264023 -72336 -63619 94211 221617
15707 221617 36033 -200088 -71718 73588 75903 -34958 -215121 -233940 -236514 -165601 16976
15696 16976 147964 253026 331746 314557 197210 -96149 -438668 -497888 -439310 -262327
15686 -262327 6091 -61147 -217530 -321086 -347221 -419484 -629374 -729721 -698856 -599812
15676 -599812 -487183 -358784 -87011 -33030 -195511 -295706 -338130 -436240 -438903 -357955 -283028
15665 -283028 -174478 -205531 -310665 -342742 -387438 -133069 256905 336836 358903 520630
15655 520630 657769 615249 523085 620165 547221 160031 -98640 -199241 -281380 -185940 -78713
15644 -78713 -116967 -227365 -447043 -513610 -490815 -384826 -260125 -105107 25010 -140013
15634 -140013 -227714 -108338 -46895 -11519 184815 402348 397033 167838 -294112 -565507
15624 -565507 -631413 -537191 -431495 -347297 -264643 -192934 5393 292060 385683 281128 214491
15613 214491 97761 35690 207788 478899 520833 402231 377080 468174 414679 248220
15603 248220 -59765 -121555 -59833 -62639 47272 -98501 -411263 -612787 -589496 -314007
15593 -314007 -176036 -61877 86689 271619 343936 444578 533810 513327 331709 79386
15583 79386 -248070 -563444 -593405 -301928 -38807 104774 16321 -140796 -53971 -216489
15573 -216489 -372501 -535128 -581207 -489228 -400507 -353289 -212594 -89141 -145821 -185926 -187152
15562 -187152 -31844 66601 -58049 -165513 -83516 51285 34077 -149402 -329510 -483912
15552 -483912 -500850 -603827 -601122 -554690 -348149 42854 285937 322421 120759 58882 -26800
15541 -26800 -141980 -239521 -143697 -132763 -250293 -296945 -225727 14101 222397 278527 28988
15530 28988 -227392 -292659 -251146 -369756 -370478 -241799 -286666 -302809 -198652 -211278 -269226
15519 -269226 -239311 -206427 -258076 -292013 -420019 -455910 -171588 -119050 -100750 -159039 -440810
15508 -440810 -680900 -651961 -700837 -721551 -529970 -341338 -405401 -474047 -618876 -657354 -274691
15497 -274691 -13157 -227 -166624 -276213 -551704 -674576 -416632 -25315 205753 170230
15487 170230 69580 -114857 -239214 -233879 -93631 76321 311344 500088 654684 500574
15477 500574 297747 324404 250530 8220 -352736 -577099 -752764 -809075 -781755 -586634
15467 -586634 -451725 -581041 -707661 -788758 -921699 -789458 -627340 -649665 -423626 -223395
15457 -223395 -64936 152705 305387 428973 431156 174545 24774 -70395 -148094 -287214
15447 -287214 -354367 -440548 -429864 -332419 -460367 -628332 -575122 -400571 -184047 -67897
15437 -67897 5885 161737 174359 55677 137736 134665 -25968 -41976 -16648 20603 32623
15426 32623 39844 162012 140955 -10241 -7516 -39811 -55725 162308 150041 -207487 -504275
15415 -504275 -546793 -516102 -361331 -121395 165171 264827 65365 -166948 -121401 -80446
15405 -80446 -92563 -136736 -42129 85734 188276 358735 380544 256028 199687 74304 -22037
15394 -22037 41411 119003 184715 234450 251729 157762 85581 68462 -63015 -35669 85928
15383 85928 160798 351989 343241 32390 -235902 -367155 -526000 -283519 6727 -49421
15373 -49421 -357080 -554692 -606201 -506549 -348059 -224620 -239138 -304041 -297511 -195442 -75874
15362 -75874 -165308 -165696 -50209 -101192 -366984 -308776 -238180 -233936 -229366 -25762 378048 497689
15350 497689 462884 213799 93846 83575 32005 -106982 -237908 -189904 -150160 37944
15340 37944 154090 50541 32642 57271 -29973 -114382 -227061 -337544 -230853 -78510
15330 -78510 164937 374390 522352 722516 850440 587982 136198 -2071 -2705 84310
15320 84310 -21 -224321 -253544 -201260 -119969 10980 164117 119553 -25578 -134067 -123928
15309 -123928 -151943 -139681 -97340 -202587 -342861 -218041 -112836 -77801 -66965 -73401 -123241
15298 -123241 -175735 -150261 -180283 -389904 -456130 -379351 -189936 -28656 -11887 -74702 -186841
15287 -186841 -97452 -14289 84622 121039 64615 -6813 -208108 -453150 -370132 -68267 97063
15276 97063 298376 204330 -21812 -4378 -67228 -145089 -24455 116600 216867 221613 201166
15265 201166 249888 189545 11312 87839 114515 -95851 -71283 -199050 -505382 -511099 -335943
15254 -335943 -326794 -369704 -259377 -220402 -253052 -367853 -449632 -302986 -172635 -241763 -127799
15243 -127799 229541 400516 286932 100695 -196075 -407931 -468324 -530802 -504064 -350280
15233 -350280 -254828 -361365 -472875 -393715 -255853 -155832 -1357 107213 68045 165727
15223 165727 221365 181016 168617 334002 400691 326108 305334 226930 123370 -25795 -195497
15212 -195497 -24709 165677 281478 81982 -139001 -279798 -464322 -645187 -535823 -236392
15202 -236392 19547 194482 169644 32996 -20696 -61203 -108372 -94903 45793 3905 -184176
15191 -184176 -192553 -391085 -616671 -567240 -472243 -464280 -514485 -578162 -640388 -649129 -484277
15180 -484277 -169754 81540 -39102 -195228 -302120 -632056 -790972 -502913 -300487 -184050
15170 -184050 -152531 -118999 78936 44125 -70969 -146956 -366687 -416440 -474995 -263655 84049
15159 84049 444218 586568 513921 442503 376086 377887 608299 788599 470197 49805 -271672
15148 -271672 -222957 -2109 39013 21739 107339 125857 -61820 -108305 17460 -80162 -266938
15137 -266938 -126753 56502 88907 -48419 -199633 -385720 -505367 -439162 -165589 55491
15127 55491 132735 329671 356268 152998 21113 57939 89715 87870 -91478 -241370 -224210
15116 -224210 -223720 -127580 -54446 -125826 -180828 88802 279438 33582 -292741 -506343 -547019
15105 -547019 -482715 -405040 -314547 -142875 29195 -92402 -440540 -726160 -845891 -801030
15095 -801030 -580005 -384514 -364235 -334352 -217963 -25001 203731 324452 428509 567087
15085 567087 600868 422929 331400 117549 -137610 -407361 -699345 -856295 -533405 -208990
15075 -208990 -143905 -147289 -258910 -446629 -508599 -448277 -483348 -447260 -155637 -75237 -213907
15064 -213907 -162383 34753 190168 366894 579895 642469 656648 523140 388641 199628
15054 199628 -143744 -273536 -327378 -337907 -357186 -253413 -63344 75741 -1003 -173341
15044 -173341 -342613 -394387 -233258 -42414 43333 181679 269785 469203 679290 696864
15034 696864 604681 389398 210428 61747 174576 397484 530051 364105 193188 267380
15024 267380 249615 182908 199747 130261 138523 202079 200731 234169 200470 77562 -93355
15013 -93355 -110576 -155723 -213591 -381306 -402169 -264513 -202679 -172257 -77168 121581 221613
15002 221613 288245 234940 -57042 -269663 -360555 -328393 -195941 -247892 -267537 -289437 -180868
14991 -180868 12394 75491 -18395 -16574 82510 159876 -38528 -272146 -17134 133284 68871
14980 68871 18798 91729 267928 185733 64247 -72900 -224704 -244898 -209700 -135622 -105476
14969 -105476 -144674 -194535 -242129 -362986 -370502 -209393 51999 269781 367089 208190 -15865
14958 -15865 -227883 -444053 -560128 -524804 -359771 -310310 -307181 -248847 47474 355311 402758
14947 402758 294635 75676 -173255 -203016 -29273 31877 -65768 -48948 90242 217906
14937 217906 312851 258248 173957 195518 173403 -69305 -379629 -388823 -50097 210474 197897
14926 197897 53410 -63361 -73030 20654 -5955 -213276 -341738 -379986 -295947 -272940 -390751
14915 -390751 -435202 -389042 -468684 -484936 -474030 -472228 -504963 -488990 -293706 -48016 92079
14904 92079 45721 -149184 -285424 -270608 -187867 -249668 -176562 -64212 203064 296814 -63711
14893 -63711 -347740 -222959 -209153 -349774 -256322 -108670 -34661 126659 -120801 -529808
14883 -529808 -586217 -559723 -592025 -660566 -687759 -552732 -516221 -545127 -610025 -610290 -587132 -583472
14871 -583472 -663909 -675015 -428192 -364521 -358545 -265541 -64757 123892 -3275 -273221 -336566
14860 -336566 -342018 -272544 -298726 -311938 -193956 -31851 164994 165293 -35586 2330 19228
14849 19228 -136276 -299958 -236901 -120048 -303511 -477812 -475799 -460194 -373085 -274932 -245212
14838 -245212 -317958 -411209 -459851 -254463 -88981 -146720 -166553 -3487 -58289 -229083 -311973
14827 -311973 -174277 50400 136056 51623 -210959 -307701 -306179 -238056 -223200 -284612 -67901
14816 -67901 136427 3280 -75233 91417 60403 -112353 -258523 -309674 -199269 -236925
14806 -236925 -98692 93276 109723 145 -1033 8142 -40605 -60533 -28270 9439 -101875
14795 -101875 -144394 -44439 -138066 -345747 -538754 -430469 -207127 -66866 -78841 -16167
14785 -16167 63882 45353 19902 82939 121551 -15864 -51206 -125511 -372621 -366452 -286779
14774 -286779 -326732 -324008 -252031 -200207 -31783 155390 275887 335874 380847 309674 145167
14763 145167 57109 14605 18264 -90170 -301656 -323367 -357054 -547426 -493870 -271425 -66959
14752 -66959 127017 156167 -1191 -20227 114368 79250 161795 228199 153110 274680 332934
14741 332934 269337 95058 -4989 -242220 -469085 -571268 -181669 185452 160141 -28630
14731 -28630 -194748 -100780 116506 273290 380365 261344 66270 -41335 -63081 93866
14721 93866 421283 390867 143613 -27109 -112687 -124885 -293299 -558592 -803580 -894396
14711 -894396 -654164 -445478 -551239 -612711 -587668 -484881 -377936 -293462 -247118 -338753
14701 -338753 -283984 -52337 -15214 -173277 -285872 -280615 -189510 -109622 -167405 -64125 228676
14690 228676 424488 433792 140406 -149926 -36418 111957 18130 -79023 -91540 -40884 15162
14679 15162 -22013 -59635 -14661 201818 303959 161743 -48447 -176111 -131452 100372
14669 100372 189173 24692 -185654 -279930 -257446 -206179 -390930 -467721 -410049 -361131 -249338
14658 -249338 -166845 -281680 -364448 -291739 -257937 -394090 -348077 -274555 -453616 -618733 -479534
14647 -479534 -422286 -499819 -408611 -174237 -157095 -64354 -56852 -242059 -304063 -406325 -357687
14636 -357687 -280639 -337210 -319346 -280394 -204424 -227425 -332891 -251592 -206467 -165334 -161420
14625 -161420 -308039 -470169 -471476 -321127 -285734 -392830 -275251 -95483 -111429 -338881
14615 -338881 -290823 -174600 -270505 -453310 -513141 -262026 -136257 -8392 57541 55469 58519
14604 58519 -105557 -138447 -8193 110940 269364 294625 44012 -111939 -295134 -482428
14594 -482428 -497968 -387285 -196078 -158111 -259797 -275530 -290385 -223218 -292168 -385419 -248060
14583 -248060 -37648 144357 32836 -208340 -224855 -98078 28630 43041 132174 310235
14573 310235 504779 335760 57907 -75964 5006 -26672 -233109 -4025 237339 278018
14563 278018 244018 156534 17234 -134150 74955 455196 454766 108985 -63551 4099 91653
14552 91653 237528 437834 358726 1013 -236928 -157757 -109457 -96655 -258193 -341497 -312635
14541 -312635 -81981 28876 -68815 -63467 26678 189095 280193 122021 -90481 -69622 113980
14530 113980 213883 372821 181581 -96610 -118792 -104414 16800 207104 216012 132576 106765
14519 106765 -21307 -119916 -85903 -211595 -408342 -374495 -335755 -586431 -734890 -711137
14509 -711137 -687280 -591588 -304168 -74903 -44215 -172399 -190356 -120719 -192923 -324791 -467675
14498 -467675 -430852 -375857 -383774 -267521 -186432 -75594 36880 -146976 -374109 -569214
14488 -569214 -577535 -370930 -256347 -337114 -405413 -409736 -191264 1502 -16709 -51812 -30532
14477 -30532 47808 248303 336419 221585 -28949 -32563 61959 -4971 -371856 -787045 -942802
14466 -942802 -613462 -218801 -158842 -6598 145546 118666 175471 337184 477207 348944
14456 348944 229351 387089 308116 -108832 -298983 -345709 -329226 -343624 -457415 -623253
14446 -623253 -815347 -917731 -817063 -752065 -749992 -502269 -292041 -367740 -362451 -153206 11404
14435 11404 -12319 -76779 -7786 -98975 -221662 -521822 -552662 -327093 -246575 -92261 124801
14424 124801 269570 40960 -133190 -112399 -148524 -238740 -155828 -96373 -286019 -352769 -57084
14413 -57084 146935 187743 63711 -142273 -274708 -187867 -168711 -81044 -97657 -222155 -107693
14402 -107693 96113 264946 404992 302138 225714 355186 310682 275204 400993 487189
14392 487189 531251 327623 80839 -56433 -145705 -189685 -83563 -40399 -243164 -291722
14382 -291722 -297487 -259736 -144653 -115627 -71891 -61514 -333817 -406643 -386685 -438956 -438748 -470487
14370 -470487 -586971 -617504 -529469 -238295 -195771 -256245 -210070 -24672 135751 110859 15800
14359 15800 32757 -47396 -417779 -877318 -1158892 -922825 -621916 -539237 -504076 -502328 -506799
14348 -506799 -469796 -427793 -414090 -504607 -611297 -557810 -577932 -505716 -303743 -232328 -268829
14337 -268829 -152049 -30436 0 -74746 -215647 -175655 -138740 -83618 -225509 -320933 -172053
14326 -172053 68841 195484 28865 -468119 -829348 -743838 -471492 -197699 -201724 -175928
14316 -175928 -24163 48115 33192 157521 518731 801155 790738 375282 30215 -83861
14306 -83861 -159304 -176872 -198935 -166507 46378 188313 143719 9068 -136756 -137393 -105700
14295 -105700 -39394 148074 20286 -122887 -188607 -159031 -203540 -222366 -219515 -133134 -49853
14284 -49853 117506 222508 109765 116403 241320 297190 235634 258846 161323 -38397 -51436
14273 -51436 131652 192143 141460 85298 100660 63206 -143690 -444677 -566811 -494069 -540485
14262 -540485 -567133 -428042 -457674 -524934 -601880 -455586 -336605 -347121 -437320 -668935 -729381
14251 -729381 -695762 -626566 -441734 -230872 -41543 56026 13263 -44766 -297696 -318112 -354333
14240 -354333 -352875 -243196 -302803 -408230 -345752 -422518 -518751 -444577 -245549 -185731 -283311
14229 -283311 -381249 -515055 -558027 -475109 -391852 -390925 -361506 -276266 -244780 -207842 -340552
14218 -340552 -533400 -593548 -586670 -347019 30765 283952 355519 517010 468016 415481 482991
14207 482991 292681 -66463 -215595 -64887 181678 370821 347340 107171 -12217 -94223
14197 -94223 -93419 60711 232322 134297 49279 -9411 -24928 -186930 -229996 -146030 -142423 -93429
14185 -93429 -152625 -437836 -651553 -396896 162088 309964 103980 149058 140223 88659 282705
14174 282705 245535 -87820 -387713 -307490 -212518 -154422 -57918 20512 -261355 -432162 -256502
14163 -256502 -137069 25601 22395 -214936 -232449 -224139 -256293 -242163 -160206 -119907 -256202
14152 -256202 -300042 -233354 -68110 55327 81683 180360 261369 167600 36930 83456 156197
14141 156197 322889 597863 746395 599556 275017 111052 5179 91878 211542 486769
14131 486769 691744 736641 599582 432875 330511 237773 16404 -95036 -13025 27718
14121 27718 24610 2686 -24549 -74841 -64079 8714 -65922 -206953 -342254 -510730 -650101
14110 -650101 -586043 -468897 -454242 -290906 -52968 -28663 -34532 -74086 -113579 -34320 -94441
14099 -94441 -346801 -569396 -533728 -450296 -320198 -141318 -87794 -52055 46581 220359 215568
14088 215568 89694 -20076 33088 303 -134646 31181 6328 -172208 -169719 -15944
14078 -15944 53891 128672 88210 19021 2275 -191815 -311877 -279119 -110931 -76684 -88844
14067 -88844 -78151 -236146 -248746 -172051 -108252 -173166 -79317 303389 417426 260825 -37100
14056 -37100 -222790 -401105 -651918 -790576 -755206 -569376 -470576 -600306 -446667 -199924
14046 -199924 -215568 -261027 -116577 121394 343480 291631 -17525 -185680 -3042 -65591
14036 -65591 -198603 -196630 -15492 264661 384898 372418 148256 4529 3549 -59765 -31275
14025 -31275 89992 -35348 -183948 -89454 219747 63122 -386404 -712003 -705278 -359383
14015 -359383 -67812 -93107 -114747 -108263 -243247 -314013 -298175 -252520 -277715 -313382 -212265
14004 -212265 -37862 173511 228698 203721 81305 100547 476662 716698 635137 464241
13994 464241 251556 186234 222946 301734 157275 -254142 -538441 -563020 -532416 -417002
13984 -417002 -179643 41704 133533 21570 -142692 -35527 31962 132472 22495 -213755
13974 -213755 -285794 -267973 -182656 -180086 -4448 226668 185385 12088 -88741 -116609 -164084
13963 -164084 -189243 -110886 -70539 -209403 -588365 -655938 -472750 -383581 -229995 -93601
13953 -93601 -42298 -39888 -115504 -139482 -327436 -232900 33345 110032 110453 27548 -192573 -265093
13941 -265093 -345090 -354649 -352439 -301231 -194818 -188693 -91117 18301 152230 137659 103686
13930 103686 315439 389752 159796 -84815 -73094 -23468 53662 23648 28155 76937 -76684
13919 -76684 -249448 -440085 -340015 -179408 -207370 -208768 -212872 -361330 -506730 -395790 -216404
13908 -216404 -154046 -166924 -339943 -659946 -672741 -322586 -210790 -111175 197415 391415
13898 391415 526709 470562 299856 124493 -67606 -146604 -236549 -439764 -445042 -226532
13888 -226532 -194463 -444811 -552162 -435764 -245128 -138314 -43712 13783 8228 -44784 -295005
13877 -295005 -313878 74208 350511 406531 299967 178006 18542 -148695 -124214 26161
13867 26161 -98581 -197308 -175061 -68954 40931 -28828 -167780 -331327 -228695 38078
13857 38078 393545 336750 63961 -224732 -588749 -638313 -581034 -545856 -240628 -40270
13847 -40270 -123585 -392173 -442614 -326248 -319945 -469068 -540282 -468912 -185437 -64386 15243
13836 15243 214616 257071 99092 -77539 -338877 -620797 -619958 -370321 -176611 14233
13826 14233 344109 492185 220707 126858 241917 373745 417890 388128 298462 299725 304072
13815 304072 135425 62961 -6555 -209390 -370420 -265082 -118502 -98645 -205007 -318651
13805 -318651 -485999 -619372 -680761 -548853 -189817 110756 215442 74838 27696 59194
13795 59194 -93020 -149076 -163547 -281141 -232315 83007 458375 359890 88677 -115916
13785 -115916 -171864 23657 177852 158873 108803 90567 180819 270445 273899 91861 -28590
13774 -28590 3990 -73765 49221 403513 562484 398495 387517 312123 163129 27780
13764 27780 -39780 -173628 -284337 -133578 -66757 -80621 -77394 1137 -103685 -241610 -148547
13753 -148547 -18824 117699 390018 456312 221675 107535 165979 174215 27669 66765
13743 66765 118182 191161 238595 201143 132347 39319 -276909 -476033 -294503 -244802 -186276
13732 -186276 26482 93140 -50295 -217567 -336607 -412202 -284768 -135803 -182746 -277592
13722 -277592 -333464 -470688 -517088 -380366 -74644 -44010 -63947 -107776 -220655 -363839
13712 -363839 -381826 -134206 159703 217977 44687 -27155 23794 -35265 -18840 81720 214784
13701 214784 207739 200948 114132 180369 191335 23831 -69242 51015 8359 33252 118444
13690 118444 111344 4956 -120418 -91263 -13406 28813 121933 156276 47361 88343 156438
13679 156438 144851 -149995 -238145 -97062 93325 290273 286521 116326 -7378 -2325 126699
13668 126699 255845 30112 -381892 -296711 156468 519554 623571 635063 608289 423033
13658 423033 422978 579978 666034 818095 731952 629423 347994 37098 97178 387935 454261
13647 454261 353133 270931 373018 536683 731643 524184 321606 339125 302107 248411
13637 248411 71732 -45104 67439 105815 84300 186832 316433 323256 167144 142673
13627 142673 232317 135279 -4169 -208265 -460824 -611498 -749545 -862486 -845707 -658584
13617 -658584 -366697 -128194 -45133 128719 180740 19036 64883 277044 342759 322711
13607 322711 215128 175744 162708 107082 -1489 35327 156235 261014 211893 101562
13597 101562 58541 -57146 -238737 -205493 -50380 -65518 -160042 -87896 -6873 112837 190598
13586 190598 120711 96192 227885 421093 543527 385226 287609 423954 493829 528074
13576 528074 516302 507591 519954 329502 203141 196526 154787 92942 92780 193250 256822 286411
13564 286411 143541 114223 193933 229784 65480 -210852 -314185 -311548 -237625 -271006 -194041
13553 -194041 -11896 88205 43074 122626 143985 33040 45120 -35710 -90075 86961 152472
13542 152472 40462 76435 301776 341626 46430 -207975 -5947 281409 296518 290949
13532 290949 454574 558616 533008 351286 106585 23725 165783 292174 158778 227427
13522 227427 598179 740527 421571 59849 -96120 -281603 -608689 -491845 -168844 31723
13512 31723 61242 191265 301845 311835 364886 433607 400220 374345 557260 437764 34022
13501 34022 -10380 90963 126802 114102 123034 166377 -7791 -234203 -94226 200443 263936
13490 263936 124777 67281 37652 119996 294312 417430 514950 472486 507204 621477 730398
13479 730398 848496 745809 458331 259476 288326 185861 145836 242729 401037 533897
13469 533897 500968 500839 673777 708117 552154 261305 115627 175014 263610 188761 135626
13458 135626 157309 311756 382352 305744 294878 292742 235025 183634 237049 139341 18911
13447 18911 189727 472719 708449 765352 448535 173860 216939 297688 215108 75671
13437 75671 37699 169162 133805 99696 6346 -161552 -2605 308749 527830 646918
13427 646918 568529 483749 554433 447443 282943 466172 747152 682936 581380 629783
13417 629783 689353 622190 528500 493596 358928 75549 -81901 -192574 -283403 -108559
13407 -108559 79793 332980 495566 507758 442090 303404 172708 30171 -31558 -12467
13397 -12467 90933 194948 264062 241207 234835 257004 183547 -29249 25281 222446 312114
13386 312114 320735 319524 353918 184632 165522 138367 71403 215773 436904 407532 261370
13375 261370 91388 502 -17933 162210 339336 422190 461038 511206 421694 451854 674830
13364 674830 770465 578137 365795 157796 88488 455211 675053 577604 357374 236494
13354 236494 99297 175526 364499 377047 287171 232866 376090 499992 351362 207392
13344 207392 252354 572466 801784 971661 1101328 879386 495359 315679 171863 123852
13334 123852 140291 312396 391730 297331 -4045 -251617 -6891 95527 65647 123200
13324 123200 400086 689573 798954 626965 320954 102053 41297 184262 424665 658047
13314 658047 789761 832959 776554 693311 639100 570467 683215 716780 666164 432506 158683
13303 158683 168076 427773 469251 374642 436773 510719 530027 651439 453588 124441 173262
13292 173262 341960 534631 753063 784770 816202 705436 652711 691488 470573 339415
13282 339415 408636 342327 244125 211972 178829 205798 235489 322834 376908 500786 478472
13271 478472 367538 342395 208772 148104 222459 180449 81515 128830 309883 414873 591920
13260 591920 689108 671944 589203 517530 529943 532143 438341 184934 280801 592001 669306
13249 669306 581002 527281 608590 653305 561331 443582 266705 120974 -35478 -159025
13239 -159025 -80731 96426 191342 328851 368365 410433 528654 644094 794775 864263
13229 864263 956055 978230 661997 468110 453353 670525 874900 689428 497080 595562
13219 595562 609686 467176 414515 584648 850878 1014894 1181000 1097705 942868 947222
13209 947222 931988 959923 990409 879058 729621 471521 345048 511986 846999 881075
13199 881075 753951 501153 88389 -63904 68223 138887 220386 539396 686073 581604
13189 581604 511094 613788 816475 783239 673520 701987 762046 538490 385362 331003
13179 331003 254648 385307 715458 820996 791837 820006 824467 628437 353972 122072
13169 122072 187648 527360 762856 738965 794567 825789 794696 729904 716338 826152 783429
13158 783429 583409 290877 200716 425359 611859 663570 838813 1056734 1173992 1138517
13148 1138517 1134964 1047140 891013 830429 724801 641403 689578 597764 530559 628336 865146
13137 865146 998279 899706 777760 668567 761880 931926 894651 889389 885544 939524 1117760
13126 1117760 1239708 1067932 812503 823927 986345 989748 985266 745471 613974 659051
13116 659051 730038 824459 897275 860905 935779 1232827 1379370 1285612 1173188 966823 939783
13105 939783 987012 826638 844970 745673 722222 889077 964206 890445 659367 413574 458839
13094 458839 682077 1038121 1368732 1571229 1612462 1576756 1672894 1792361 1753222 1469135
13084 1469135 1250790 1091516 960394 756913 634014 676860 805693 952490 1062329 1017296
13074 1017296 982644 992937 1042885 1193973 1221434 1284375 1458434 1301706 1260429 1357475 1424866
13063 1424866 1393580 1328887 1350801 1316170 1323118 1384483 1373630 1288935 1376741 1278945 1234550
13052 1234550 1396524 1595432 1972974 2366094 2292958 2191833 2236145 2154349 2088181 2086460
13042 2086460 2123552 2179483 2310581 2451541 2393162 2222669 2244363 2200257 1974137 2005313
13032 2005313 2096652 2074697 2075852 2139453 2068862 1973572 2190169 2548746 2717632 2761745 2762036
13021 2762036 2657831 2632310 2721018 2769933 3131760 3449447 3510481 3491443 3342145 3376380
13011 3376380 3753262 3895571 3782102 3787911 3859317 4049508 4372996 4494941 4530438 4625641
13001 4625641 4860517 5111419 5354045 5345769 5593719 5946795 6219902 6581658 7112504 7595653
12991 7595653 8049137 8355842 8646678 9150595 9701772 10426328 11281958 12331667 13591780
12982 13591780 15229527 17140181 19244925 21795060 24989365 29108381 34500007 41290934
12974 41290934 49965274 61554864 77234585 98218000 126370591 163507211 208863213
12967 208863213 253673354 278719419 268553912 230236196 184318011 144155718 113123080
12960 113123080 90193109 72963294 59866404 50031815 42491872 36675716 32103098
12953 32103098 28148908 24845036 22204780 19870754 17857621 16406086 14877677 13431574
12945 13431574 12281799 11242279 10432781 9828401 9422964 9069652 8670308 8370829 8118068
12936 8118068 7825236 7527326 7192261 6872790 6651228 6457974 6245073 6258513 6108188 5950931
12926 5950931 5951644 5915318 5689076 5211457 5012644 5056897 5218726 5495467 5801423 6087204
12916 6087204 6343815 6688738 7126545 7490481 7998630 8709128 9693287 10925713 12148264
12907 12148264 13037371 13396685 12870973 12151482 11700931 11507955 11634711 12064452 12699915
12898 12699915 13359122 14257747 15441564 16592692 18230022 20335392 23002258 26688603
12890 26688603 31234750 36994763 44365263 53746043 66000346 82556046 105204987 136046156
12882 136046156 176808532 225107935 268566624 285043537 263924249 219696455 173158716
12875 173158716 134645174 105494606 84135406 68329308 56404469 47252624 40367142
12868 40367142 34797950 30373556 26679120 23482436 21094400 19101865 17275457 15733610
12860 15733610 14323224 13321921 12502955 11551604 10782785 10085579 9403110 8701058 8072727
12851 8072727 7538899 7237503 7082065 6771250 6480565 6297512 6158489 5697549 5321026
12842 5321026 5272598 5493996 5626965 5660005 5706118 5560528 5309626 5173094 4981927 5005637
12832 5005637 5142121 5336884 5410402 5306353 5401427 5501099 5700588 5759200 5836772 5970614
12822 5970614 6109853 6167775 6562513 7191304 7632338 8063605 8804179 9506417 10114696 11070821
12812 11070821 12002147 12693376 13686373 15008132 16464734 18405133 20764645 23762089
12804 23762089 27691002 32732713 38954501 46893331 57137267 70501848 88652843 113401830
12796 113401830 146437792 188537529 235284539 271409224 276904852 248452601 203577301
12789 203577301 160062615 125060755 98469700 78675980 64043052 53049484 44531092
12782 44531092 37672765 32140378 27905063 24461877 21683772 19329032 17182213 15237968
12774 15237968 13586206 12366088 11356129 10470994 9687390 8921892 8417852 7841284 7310554
12765 7310554 6963952 6557361 6137422 5832134 5372275 4975713 4760396 4523624 4446361 4087970
12755 4087970 3501532 3056993 2848684 2732167 2767983 2986225 3150287 3108413 3025934 2961409
12745 2961409 3046782 2975038 2916197 2787266 2404696 2018096 1801875 1768051 1749986 1595702
12735 1595702 1603745 1432335 1144876 996928 1065186 1268830 1252582 1388576 1382194 1209736
12725 1209736 886616 686187 764677 881600 845524 1061846 1401463 1554194 1591400 1427725
12715 1427725 1196544 1008828 990899 1179439 1228716 1308682 1272792 1186003 1027718 761525
12705 761525 646028 818403 952332 781424 674248 866093 1143549 1189608 1114039 1028502
12695 1028502 982426 905099 793517 601312 467509 397370 463800 646871 641019 649098 682886
12684 682886 654605 632085 440595 239560 293906 559272 711341 761783 918288 969836
12674 969836 892082 816300 805269 727011 701866 895332 1078101 999822 670173 589023 559646
12663 559646 549848 412314 266108 248874 180472 347017 340986 326175 460577 470027 480960
12652 480960 717002 838954 747564 779055 829376 584033 419265 671249 844750 932358
12642 932358 949907 870187 875774 887265 783276 727385 598497 559394 683391 779236 797526
12631 797526 586165 226886 -56184 -77676 225980 378119 523304 737998 815171 709770
12621 709770 608742 674340 618247 599554 581606 601427 479601 370245 450530 489561 361914
12610 361914 98549 -32308 -40237 139287 -5025 -149437 155792 440157 276200 100930
12600 100930 319395 579059 557314 601549 552651 447733 258294 191494 325397 364957
12590 364957 298105 285899 293389 273248 344768 279564 379499 564572 621252 575293 704043
12579 704043 722307 628883 459829 196694 90690 137273 156287 157632 206578 319394 263602
12568 263602 410082 489851 429249 416238 393985 304856 429856 412913 360060 388787 331927
12557 331927 316930 510821 626481 610928 597668 734899 934621 843672 532898 401363
12547 401363 415567 456847 439490 266540 94737 -2854 -139380 -211444 -134914 -104221 30727
12536 30727 88066 165272 208919 92461 134770 131594 106009 54356 80475 208149 336730
12525 336730 262895 7303 -27119 -5944 79915 166185 84354 -134820 -244923 -162889 50635
12514 50635 252555 343410 277621 393905 404559 191775 -71485 -227188 -313510 -53171
12504 -53171 63847 128180 107466 2635 -48344 4636 235442 528184 779423 1117754
12494 1117754 1317119 1341387 1516895 1691811 1819846 2316124 3191126 4571039 6339553
12485 6339553 8337986 9602761 8989937 7034253 5084106 3689951 2629661 1759399
12477 1759399 1255392 1060393 850766 769059 651743 597307 511094 544537 614763 622909 562829
12466 562829 598062 617226 465846 169711 -42653 -166949 -207108 -290947 -347689 -276035 -13492
12455 -13492 67801 -28808 -21432 -130919 -309994 -349304 -345561 -303953 -119536 -94840 -250600
12444 -250600 -403217 -84334 422332 562087 432912 378568 647931 906739 898130 873352
12434 873352 910216 1019337 948435 1038363 1247923 1412014 1332843 1024191 902049 946149
12424 946149 899878 910916 1076266 986448 656919 376672 424318 640282 603320 551786 599723
12413 599723 716842 772727 595095 305448 267187 288782 273541 371626 364018 303811 340473
12402 340473 434913 567923 595326 594173 643360 948997 1236196 1236471 828780 236736 -73282
12391 -73282 -117337 -52516 75764 378151 636228 687779 711139 817875 674401 538214
12381 538214 410510 341557 352475 402983 577670 532569 323005 243808 316056 537405 736326
12370 736326 718976 413460 90784 -302977 -531805 -588963 -578184 -645453 -538343 -85185
12360 -85185 276799 533864 635569 583378 282832 -10251 -49789 -104824 -211307 -128524
12350 -128524 -137187 -154452 -291133 -538313 -458912 -229835 -77656 -72486 -311018 -650112 -655378
12339 -655378 -484774 -326445 -416090 -353211 -180531 -117146 -129101 -292130 -326007 -156338
12329 -156338 -114846 -208783 -143361 165654 484562 504081 592343 668422 656991 538504 429780
12318 429780 389710 282353 197980 89386 -65698 -54187 -66818 -54963 -53682 12895 393659
12307 393659 525280 258185 4480 -124379 -268256 -345436 -1536 335356 220513 76867
12297 76867 68985 178585 162670 99609 297047 552269 481392 271766 402968 813051 1012388
12286 1012388 852731 617506 491584 496402 450748 494925 426015 327130 250115 266903 295018
12275 295018 313040 81677 -238470 -277440 -182996 55350 249910 87537 -4609 122440
12265 122440 155831 128177 9708 -164054 -306054 -154982 77551 217178 237699 154008
12255 154008 -29975 -224244 -432280 -488300 -481543 -399726 -70741 89942 125686 212761 212488
12244 212488 -76044 -253468 -131108 59025 82588 -6194 -10840 27758 107814 210144 281714
12233 281714 346383 674236 798748 487914 91306 -12230 139132 69860 -132010 -45090
12223 -45090 109530 236167 361987 264746 82724 141905 248873 144479 34617 61433
12213 61433 113483 308548 519896 440992 189428 149275 212771 187616 -92002 -137355 11086
12202 11086 217689 337377 236944 151728 137272 134316 -94493 -95903 85982 197945 73031
12191 73031 -169879 -266441 -266062 -223049 -265832 -228241 -169451 -263608 -445574 -577838 -733440
12180 -733440 -918898 -1040203 -1032660 -873726 -617500 -402021 -207838 -201970 -171165 113783
12170 113783 409770 589188 534495 121515 -454359 -570334 -316906 -162359 -73138 -46809
12160 -46809 8539 45927 74670 259841 422554 439190 327428 306657 222835 -40933 -44252
12149 -44252 84261 53683 24696 -25144 -85862 -150186 -89165 70005 197083 370699 354669
12138 354669 189489 -107819 -345506 -489584 -528291 -378568 -111381 24798 -24855 -152545
12128 -152545 -143583 -173531 -164614 -51704 98472 117099 163210 119589 -69682 -110388 -74473
12117 -74473 -151667 -334084 -513302 -392312 -232220 -230502 -114798 -158118 -120191 150811 208265
12106 208265 -8140 4089 -70112 -285951 -417006 -375955 -408301 -357001 -51970 -48361 -129921
12095 -129921 -119763 -272981 -289838 29333 344340 502913 380791 -53865 -192245 -17254
12085 -17254 227751 329169 277894 138086 88640 214855 402281 585642 633424 508323
12075 508323 372549 47663 -241131 -283724 -281793 -190414 -69091 -92753 -167493 -204397 -143835
12064 -143835 44584 45262 -117708 -79961 145816 258909 36776 -344950 -399831 -306350 -260595
12053 -260595 -151800 -85829 -34320 -162339 -287039 -259550 -31275 -58142 -73573 52596
12043 52596 1673 -48724 -92410 -237880 -267465 -379843 -468671 -350903 -95838 169349 287301
12032 287301 409528 346469 239818 103473 15893 -95135 -210971 -291742 -247826 -310843
12022 -310843 -301142 -186683 -25672 -25328 36483 101546 174810 137261 11747 -153411 -246717
12011 -246717 -155439 -46479 15201 94542 215453 380378 456767 283448 236260 240847 227426
12000 227426 225586 439346 692544 712927 524096 297651 131547 90057 259834 244247
11990 244247 42470 -43897 -4225 19401 2906 141607 156503 7967 -120172 -222487
11980 -222487 -214266 -621 214259 404967 519572 675984 583179 226567 -38742 -210545
11970 -210545 -202297 -96121 -12403 -86406 -235089 -256506 38579 369770 306563 46523 -146027
11959 -146027 -295244 -300890 -173474 -32881 95691 185192 385740 255247 89121 24144
11949 24144 65849 -63112 -325604 -477729 -395063 -204324 -3626 110729 37400 -120956
11939 -120956 -347409 -414774 -352036 -222941 -201502 -312777 -437248 -741700 -911829 -764613
11929 -764613 -612137 -293433 -35123 71753 200079 319543 206246 81291 61032 6152
11919 6152 -23640 -170224 -59577 155156 341302 542816 621806 302483 -18309 18036
11909 18036 -5692 152363 385352 546339 511867 396794 322324 48327 -237602 -48651
11899 -48651 302360 361704 231413 189919 159492 31672 135748 313281 299608 290007 323751
11888 323751 60565 -209956 -200867 -31401 -61792 -382742 -456943 -360177 -507179 -403072
11878 -403072 -78558 164902 249143 204718 250075 469467 763706 886435 968128 1067866
11868 1067866 1087578 1186994 1352964 1520403 1529779 1780684 2214368 2788058 3703706 4888779
11858 4888779 6545589 8305570 9759610 10491695 10207108 8820074 7108231 5662818
11850 5662818 4500823 3759166 3384975 3077453 2617009 2167178 1794010 1482891 1197345
11841 1197345 1035479 1093056 1147679 1250930 1091814 739109 693942 877077 1038701 1152584
11831 1152584 1179885 1153182 1070337 986763 949469 685913 189130 6095 161482 363191
11821 363191 349137 376813 578044 776804 824518 592597 415665 354350 317453 19682
11811 19682 -207582 -116658 -3573 -107964 -153209 135119 440822 528606 419307 379496
11801 379496 275359 45440 122991 312229 359766 496926 840526 1131745 1331920 1503666
11791 1503666 1430162 1489266 1732269 1760944 1673655 1661588 1788564 1800169 1472521 1238598
11781 1238598 1210711 1413891 1489515 1605632 1868632 1996844 2088004 2114698 2085393 2131449
11771 2131449 2555810 3557985 4921584 6572517 8319297 10492555 13205805 15886701
11763 15886701 17870628 18690023 18143684 16347289 13962822 11202017 8698737 6783135
11755 6783135 5494981 4646722 3883381 3242324 2867995 2693088 2470000 2229890 1945128
11746 1945128 1633078 1438830 1258130 1087045 1032378 965887 850659 649908 370110 289691
11736 289691 271859 210374 184405 120371 -56281 -13327 26358 99806 6439 -138566 -188903
11725 -188903 -265999 -211142 -222739 -297907 -51496 57425 -34724 -2648 237494 519665 437756
11714 437756 219355 -123397 -384796 -385538 -107467 287243 633955 566093 254966 197442
11704 197442 335323 443372 436035 392553 377698 267305 233397 236131 264020 324336 326163
11693 326163 251977 254165 261601 171055 55969 42648 45350 -3013 101290 171461 123091 -83884
11681 -83884 -370298 -402323 -337643 -211035 24522 230578 534938 767122 1042398 960765
11671 960765 745950 801725 808189 854070 793551 760720 793367 692884 595714 681767 658487
11660 658487 507432 152108 -77250 -16822 70663 -18636 -123859 -134490 -189775 -192147 -197477
11649 -197477 -183168 -28130 181384 -1042 -192669 -129188 -228355 -277055 -179126 58109
11639 58109 310578 471967 544570 614052 516592 304050 183415 233256 165895 111952 120314
11628 120314 135772 166205 76008 -54476 -55635 -199650 -129598 36364 -76393 18822 355623
11617 355623 430769 224800 70480 141014 229553 257352 229150 149974 125247 157307 138303
11606 138303 -90067 -480448 -553214 -512972 -454087 -400986 -328983 -56004 172544 269321 167194
11595 167194 19064 51065 254304 484080 401959 323540 382579 214676 167046 75515 -197879
11584 -197879 -379067 -293147 -228999 -121561 10712 45703 -33490 -312017 -385568 -431175 -380314
11573 -380314 -292318 -427643 -695166 -787657 -769266 -581719 -400431 -244793 74036 193672
11563 193672 -78883 -224444 -203164 -352718 -279198 -140253 -188946 -241279 -160897 -226531 -406590
11552 -406590 -560882 -487036 -349278 -254802 -283994 -114509 -73177 -110842 -55056 -82210 -2248
11541 -2248 -43466 -221071 -283960 -239429 -189411 -101299 115166 142813 -17072 -126554 -76015
11530 -76015 -164117 -417716 -364711 -40127 286532 441665 268459 -2900 -108112 180425
11520 180425 205633 159040 140239 88109 38339 163863 265147 102151 -43234 106067
11510 106067 322646 379072 399765 323201 260222 226780 158104 117880 -1988 -42649 -2152
11499 -2152 146889 342589 394919 490158 574546 510471 331612 372030 519252 536363 364328
11488 364328 115372 -33024 -239133 -320660 40790 408616 426176 178249 63634 144257
11478 144257 -43 -247541 -281515 -185533 -103103 15732 -66237 -159083 -59867 88663 281093
11467 281093 334788 145297 -164952 -392264 -389752 -379155 -554772 -510239 -457308 -386132 -227842
11456 -227842 -264582 -374375 -318470 -289567 -400696 -393643 -351288 -98907 113263 55654 -31565
11445 -31565 -253841 -598271 -791720 -696038 -511988 -567390 -595144 -478248 -363206 -432319
11435 -432319 -695899 -791354 -550172 -129932 50073 38558 -83768 -189979 -182618 -158117
11425 -158117 -106564 169157 274404 113679 74430 23586 -98046 -209148 -88869 199135
11415 199135 350617 242243 82669 248959 412978 413885 363282 378647 449912 436225 404505
11404 404505 314048 367865 465848 395968 331238 201954 -58232 -371650 -479822 -223849
11394 -223849 50629 39519 -141876 -291455 -177445 -118603 -194144 -136951 31070 111274
11384 111274 -82764 -225798 -109616 -24997 78666 170024 237725 153739 88636 130815 673
11373 673 -82304 67840 224376 388734 398858 251424 173876 78207 -6019 46932 238688
11362 238688 193863 -28545 32626 170001 167820 191288 113363 -102123 -235034 -141261 -72519
11351 -72519 -230240 -378882 -386170 -384900 -403639 -362928 -299850 -275773 -158364 48803 295851
11340 295851 452098 231413 -96397 -226953 -343963 -407720 -160054 -99085 -282204 -164837
11330 -164837 -110554 -66164 -26161 -51160 -75080 -73478 -102641 -103410 -411237 -616587 -404929
11319 -404929 -157227 43202 268344 470302 593480 670261 470771 191790 122445 185124
11309 185124 295784 467315 786997 659871 344788 250694 244841 382035 445240 303949
11299 303949 100797 -9306 -228390 -341993 -273810 -216000 -170918 -262798 -333291 -166229
11289 -166229 31605 76193 77698 -194718 -458555 -475111 -587679 -578475 -472512 -386780 -360547
11278 -360547 -444652 -381237 -39478 240666 437679 309257 213435 249972 393898 444876
11268 444876 330235 137456 20061 -34588 -95715 53462 130801 193047 374268 361500
11258 361500 250814 135933 -71345 -338347 -447257 -536068 -524087 -483376 -529098 -407512
11248 -407512 -277510 -317249 -315792 -328187 -121904 139265 117459 -11994 -208589 -212150 85346
11237 85346 324736 425405 314196 114453 25082 56397 95220 232193 469155 582551
11227 582551 521003 391327 115561 -13839 19207 -30086 -86775 -131392 40214 192215
11217 192215 211378 286894 168179 63409 202779 113014 -120892 -359830 -426070 -192653
11207 -192653 -117154 -239964 -360991 -449159 -430639 -451798 -420920 -341148 -158958 238936 459951
11196 459951 241875 76366 197786 411019 594562 597335 248217 -119249 -58980 36273
11186 36273 -5075 -36482 26507 140190 130412 -135621 -526699 -507256 -181451 45117 55915
11175 55915 -52895 -183437 -294160 -280395 -170992 -33082 -203911 -391471 -352664 -321823
11165 -321823 -200450 10706 200484 173522 97587 82757 -27911 -258660 -386993 -408153
11155 -408153 -206651 56548 122822 -111111 -174226 -52421 -100611 -153545 -325147 -452765
11145 -452765 -345489 -338620 -404546 -390949 -337700 -274079 -224245 -300653 -259696 -399519 -465283
11134 -465283 -288419 -238026 -255693 -171010 -91 82792 215695 287476 250845 107813 -60864
11123 -60864 -135109 -100982 125066 210833 137681 -11024 -21589 71570 52542 -178048 -399907
11112 -399907 -433626 -262828 -10107 125599 13171 -3998 321059 436078 137104 -223786
11102 -223786 -64146 63449 -56599 -36369 93143 39493 -76402 -122846 -97014 39890
11092 39890 107460 222832 425578 690417 684533 455120 213738 127426 235420 336524
11082 336524 236088 69905 -17807 -181490 -239021 -192290 -94399 -38540 -173133 -129894 -298540
11071 -298540 -450877 -387266 -453813 -304507 -137291 -37602 92609 182281 119969 -35744
11061 -35744 -163324 -90167 48258 155099 192410 221745 140041 -99229 -212720 -280519 -207735
11050 -207735 -161716 -141352 -83307 -136270 -301836 -192141 -109255 -366740 -329260 34654 154259
11039 154259 9831 39434 230727 455114 563560 632980 803354 899781 860078 741732
11029 741732 343149 -21362 -172719 -73844 125764 251372 76375 -184165 -373252 -407268
11019 -407268 -418730 -619314 -695143 -376079 -246743 -290713 -388705 -588792 -852945 -876304
11009 -876304 -591722 -520380 -502922 -330481 -27682 155147 181625 22704 -372736 -635504
10999 -635504 -555484 -461565 -545105 -594861 -564065 -569503 -385731 -69468 -41432 -180139 -291063
10988 -291063 -290865 -65030 16406 -145643 -230038 -80662 150257 259735 412996 750383
10978 750383 992279 874881 665038 427173 387707 408544 453654 526043 475913 495381 560177
10967 560177 632968 520758 324486 259281 339413 464431 438801 206789 93625 103223 85749
10956 85749 63091 -15653 106983 144352 -146584 -419262 -651983 -795148 -670072 -451835
10946 -451835 -267482 -230353 -189701 -182654 -55717 102990 156189 -9439 -218243 -156605 -153586
10935 -153586 -150096 -158990 -108991 -4815 -48125 -150652 -76453 108230 110882 -79536 -187428
10924 -187428 -18922 257595 323288 164927 -137717 -197225 -128968 -75587 123038 161164
10914 161164 55750 176351 215913 167317 324197 447893 498563 438820 327575 399400
10904 399400 265323 34802 -123882 -121303 37715 174265 247999 189556 -89012 -265663
10894 -265663 -345680 -171205 207475 285078 32872 -140095 -19430 202463 421070 515810
10884 515810 296697 184097 237627 54246 28456 250124 407455 488940 476473 392142
10874 392142 279297 78468 61220 169184 219233 235317 74771 -9982 89179 139281 63985
10863 63985 62635 55547 -85737 -315939 -423214 -233117 -38893 35913 112318 316214 580633
10852 580633 560405 387164 330296 296299 300762 396718 373089 322911 374304 433586 409673
10841 409673 239631 49546 -111109 -341980 -461580 -581972 -554370 -548779 -471071 -184169
10831 -184169 51178 114196 127047 138507 -91490 -189821 -181090 -140764 -34410 -102861 -294179
10820 -294179 -360158 -289743 -376699 -440942 -260939 -147004 -48012 -53118 -120825 45580 294635
10809 294635 274095 336386 365120 292797 123629 100455 106770 -8719 -202338 -337235 -269869
10798 -269869 -261076 -310215 -315939 -392587 -295229 -193635 -370086 -557601 -526238 -284194 -110229
10787 -110229 -163921 -185503 -51099 28628 39425 -60266 -316766 -336881 -305296 -254982 11334
10776 11334 223910 257450 99789 136560 272882 133776 -127434 -346950 -436622 -185749
10766 -185749 51894 78859 -72234 -104927 -106428 -110795 -14272 -140891 -236660 -154487 -3568
10755 -3568 18123 -92460 -196184 -167710 -194810 -246409 -156593 -138909 -201098 -197423 24690
10744 24690 288269 435711 372254 270598 254406 135900 16828 -11703 -34443 133334
10734 133334 236906 278386 358231 280388 112611 -46314 -205182 -246101 -169303 -116142 -96791
10723 -96791 -66234 -76779 61820 296379 306674 73231 11032 -66412 -118950 -194331 -350239
10712 -350239 -330410 -304134 -446784 -475871 -320804 -225907 -134178 46461 49244 2699 197484
10701 197484 266377 307309 292373 116484 -98666 -90871 89917 29974 -300848 -422958 -502832
10690 -502832 -521951 -417140 -298190 -154654 67437 -63178 -245198 -170799 -45599 -29117
10680 -29117 91850 84156 32854 194325 446269 289509 -345209 -767201 -649686 -297427
10670 -297427 42231 170172 -22956 -236646 -217944 9568 111947 191373 15150 -19194
10660 -19194 12921 -38576 80491 332712 567717 746491 602914 503084 319465 -37752
10650 -37752 -273870 -394343 -367766 -189934 14523 121470 52587 -24477 -155155 -144039
10640 -144039 -62842 199493 401968 412326 379865 282420 220597 136364 141126 74502 -186236
10629 -186236 -396000 -453489 -396893 -163119 89622 137589 32406 -138052 -303343 -200586
10619 -200586 -55649 -145555 -84669 -18744 -54617 77503 26809 -188842 -208561 -119689 -149462
10608 -149462 -180360 -95820 -3966 130353 174093 190959 278570 226560 13395 -425180 -563256
10597 -563256 -394948 -167919 30454 300724 371228 417771 409892 308615 107674 -248489
10587 -248489 -205667 20268 85133 73997 -140915 -411565 -480004 -381628 -279239 -102962
10577 -102962 -180721 -276651 -66751 89732 -45013 -192824 -299692 -330070 -249330 -168056
10567 -168056 -275908 -418614 -655814 -946105 -826884 -415968 -177971 65797 330028 390443
10557 390443 379066 104269 -425301 -687027 -694059 -632232 -449719 -437763 -526909 -457394 -361835
10546 -361835 -196605 -87477 -235296 -378529 -384577 -148798 -11242 -228540 -410578 -625563
10536 -625563 -886156 -718981 -607769 -378825 -28472 50731 86436 111743 148471 198808
10526 198808 245030 215328 209003 267154 -51658 -410668 -473693 -410044 -267875 -243396 -269540
10515 -269540 -269065 -287403 -284348 -181830 32337 179950 133011 41029 -47589 -144209 -253471
10504 -253471 -428435 -408233 -325231 -278939 -144235 5324 52419 51330 157413 375761 433290
10493 433290 269349 199372 277467 277096 235363 4337 -209202 -328146 -291246 -185904 -244076
10482 -244076 -220756 21925 201764 76126 -122514 -388965 -627214 -633507 -463126 -359801
10472 -359801 -516943 -641900 -540334 -417410 -520973 -635842 -474996 -233337 -55330 233772
10462 233772 337250 272982 185445 -2205 4106 5481 -117051 -39233 182722 438330 485228
10451 485228 180713 -92126 36001 179671 24681 -3841 -82028 -120078 93278 41291
10441 41291 -80376 -152230 -348546 -316693 7700 253972 296995 229899 100756 47341 -84810
10430 -84810 -225313 -163080 76527 134742 46719 -86767 -210261 -333839 -409003 -509439
10420 -509439 -582735 -571002 -430748 -291587 -164813 -156393 -152703 -248045 -213897 -20219 106639
10409 106639 107354 -20360 -146429 -136827 -135145 -210434 -196454 20530 191358 151554 49415
10398 49415 -10157 -7247 90731 217327 389028 298317 -143183 -446760 -640066 -599501 -498655
10387 -498655 -402898 -408831 -453281 -307427 -136883 -111444 30081 196298 277191 239515 205349
10376 205349 266738 384111 416286 321864 168805 90812 -155366 -293167 -27384 206297
10366 206297 243722 243680 340575 396322 414736 363037 67074 -92828 43343 190691 174660
10355 174660 -70604 -253321 -459466 -595919 -447386 -272235 -225520 -270796 -351622 -431983
10345 -431983 -288880 -198287 -165338 36842 251391 219224 101304 40687 43518 27767 95921
10334 95921 237675 246349 177769 134479 172807 381100 438155 244829 215353 223310 223837 49646
10322 49646 35949 27160 -205350 -308588 -132257 75037 250582 16903 -433728 -625711
10312 -625711 -695600 -694923 -616042 -425400 -387065 -416177 -242320 -63763 -161677 -86244 -175406
10301 -175406 -504277 -583950 -386399 -150318 -38339 -81019 -97767 -128748 -294777 -177185
10291 -177185 25312 -64709 -343426 -224108 -53049 -4608 197238 69775 -83891 -108162
10281 -108162 -156144 -52284 82714 -115108 -196311 -114947 14026 197679 186746 368904
10271 368904 481231 359298 231112 145071 -56496 -46548 208760 414091 467403 369640
10261 369640 185214 340 -159042 -228503 -162868 -291497 -515808 -589301 -582063 -623917 -430231
10250 -430231 -6310 419848 643222 577606 169469 -45544 26323 87213 191249 6935
10240 6935 -16939 170360 218083 240310 183844 -349 126518 359143 376031 385602 297125
10229 297125 -22165 -312190 -222477 -9131 257778 542400 395583 -151456 -649231 -782232
10219 -782232 -777151 -721430 -417882 -204837 -292878 -545373 -634802 -693636 -635832 -670992 -719363
10208 -719363 -677704 -349914 167344 379077 302153 283622 369018 445042 468949 284032 49610
10197 49610 81563 69782 213459 440499 398193 252648 180339 114094 23375 21799 71589
10186 71589 195904 321431 222076 156838 188534 48293 -114077 -162694 -99669 223551 575078
10175 575078 640860 921767 1123602 879123 570297 431056 585418 702576 647152 615773
10165 615773 668701 693637 537590 434632 372930 300822 260931 308752 398784 285106 69738
10154 69738 70524 234971 208722 41719 -17212 -127718 -74831 301710 347355 255257 329180
10143 329180 482503 394225 312091 367423 346368 260142 268256 219847 78765 242629 521613
10132 521613 618756 436928 240823 417354 693788 832347 954188 949121 931398 855212
10122 855212 946328 991627 937866 823925 932722 1036105 942629 961941 977625 893431 951856
10111 951856 1036514 991777 861220 813072 734007 503810 481598 630693 618780 509806 325563
10100 325563 182936 -6351 -90683 -15494 -55755 -196185 -103924 113314 220044 281141
10090 281141 310175 242518 313054 486074 629954 625508 671565 767852 775302 870179 886343
10079 886343 914448 917168 688067 590444 607182 537065 297926 22957 -57331 14413 148515
10068 148515 187233 156088 217398 489884 670607 500286 374908 322537 346502 394992 444900
10057 444900 439252 415725 579836 917968 849382 285255 -12882 33339 87901 -93874 -171634
10046 -171634 -281199 -253739 -89669 18196 135290 203445 76213 -74546 171550 655201
10036 655201 770943 671102 687762 684572 655920 526009 281826 67232 80734 229315 184190
10025 184190 57119 193099 234488 239909 135118 49408 162748 219928 261574 229330 197134
10014 197134 408385 652512 685806 621905 654696 632729 505396 376735 188395 -2118
10004 -2118 -265922 -360102 -285336 -197101 -99254 89328 345757 689572 830784 1027974 1277093
9993 1277093 1352623 1243878 1300051 1569378 1664781 1652406 1670316 1667154 1755939 1797531 1722174
9982 1722174 1759559 2047960 2176864 2078667 2035868 2108755 2210071 2133864 1876112 1722234
9972 1722234 1772630 1912475 1969011 1990828 1780758 1474535 1251188 1060690 1057249 907420
9962 907420 668665 665164 830548 984219 975407 1027120 1091922 993266 767522 769325 833401
9951 833401 634204 249003 55577 195556 355723 368352 470337 520527 680832 825413
9941 825413 669453 648035 656360 440202 -21438 -265692 -142738 15946 55563 147444 -4536
9930 -4536 -96577 -208712 -420288 -441117 -617109 -911513 -941897 -881983 -606727 -616054 -791741
9919 -791741 -575998 -163222 12395 44093 118441 36705 67347 15214 -132112 -141129 19531
9908 19531 314250 454019 547956 525072 207873 -119271 -356330 -467057 -342543 -80646
9898 -80646 270547 519924 609814 459765 211099 -107111 -301229 -225594 -257619 -385263
9888 -385263 -323010 -307431 -129317 138589 300470 143185 13684 126181 303842 339526
9878 339526 256641 184028 192530 286734 221810 -151279 -377985 -170448 82627 113847 -64390
9867 -64390 -41162 85817 -37148 -61910 27615 279532 402453 313023 282175 226391 223829
9856 223829 243714 332135 454281 516857 634040 920437 996665 817680 777363 790387 887428
9845 887428 997386 1098674 1132414 1160657 1084419 898978 741942 640891 644404 716682 760270
9834 760270 898122 1180825 1227648 1084210 1110323 1213459 1093731 992937 1003440 1106603
9824 1106603 1067128 1094978 1075809 890199 724929 666129 717323 723727 718757 747762 748007 553611
9812 553611 272798 251931 272766 261830 187911 179483 95771 -26645 -138192 3954 347416
9801 347416 721601 976143 1015751 984318 961445 953133 913231 721415 554263 477614 300972
9790 300972 143883 58707 -53548 -95594 -92609 -138319 -186570 -36605 -65077 -203513 -217873
9779 -217873 48159 209407 122239 76952 150056 372687 428729 428075 348455 304284 388308
9768 388308 305240 239824 330840 540841 504490 234682 268889 242887 162496 75189 -23346
9757 -23346 19931 242499 503437 490573 379490 454401 492777 701121 865250 657647 445297
9746 445297 357635 447693 445149 265808 228646 309232 312929 201616 202500 317108 507221 627776
9734 627776 667920 513926 400693 390603 669113 978545 1179209 1184613 991803 843784
9724 843784 723760 706025 516254 483394 673476 765999 611835 541964 663401 732349 762432
9713 762432 927048 1171615 1198203 1088813 1278647 1192709 1120482 1366409 1618264 1766091
9703 1766091 1995301 2263409 2380067 2304211 2299411 2297229 2236791 2219216 2188100 2191196 2333329
9692 2333329 2468424 2507248 2441510 2325494 2149286 1911149 1642293 1436028 1517626 1653879
9682 1653879 1607336 1422202 1159216 958913 953854 1109367 1192704 1065356 958518 1033192
9672 1033192 1105914 900032 702450 518603 383079 471347 511363 290855 -27828 -2827
9662 -2827 173200 264966 360374 451611 335620 190826 121721 320988 482144 530130 327238
9651 327238 10041 -142140 -212054 -269711 -415681 -470049 -242258 27970 98903 18324 -17416
9640 -17416 16683 35938 43247 12150 119453 259336 286473 192480 97654 1847 227086
9629 227086 433231 531271 497027 178645 28966 141128 295945 526142 646782 576193
9619 576193 527067 647815 794959 744805 549853 231318 40021 1051 28222 258623
9609 258623 510834 638704 739351 798289 700759 576542 570967 489497 428352 516789 558226
9598 558226 630608 577407 401432 97696 -32306 -7337 -23225 39393 98182 76428 7375
9587 7375 -104518 -231066 -387741 -310688 -57903 181662 411337 385618 352401 328375 431894
9576 431894 548664 531990 430817 421088 444481 181023 -108329 -231789 -321654 -330664 -264173
9565 -264173 -278173 -471536 -539194 -588981 -622649 -613829 -606346 -499482 -376050 -302249 14215
9554 14215 453456 359146 6219 -215954 -192104 -156510 -150859 -234777 -209247 -214015 -68114
9543 -68114 89066 157739 179062 167240 161888 140426 64825 -111313 -165264 -120716 -100682 -57532
9531 -57532 -109345 -166481 -108098 -45409 59693 220268 181140 90291 45332 95270 316003
9520 316003 421926 285439 109131 193401 361302 342813 390674 496923 598038 728896
9510 728896 686101 403457 203509 289193 239649 -32393 -70431 -53206 -176892 -241598 -209815
9499 -209815 -212913 -225110 -210208 -184415 -249524 -192551 125405 291991 329179 267325 175903
9488 175903 85772 -85831 -304636 -326074 -352187 -497777 -466093 -419522 -392304 -87014 100464
9477 100464 -49580 1190 107074 194508 357245 501360 646759 529833 226919 96989
9467 96989 77426 70180 115929 298251 330930 -32527 -375478 -540484 -435511 -250799 -72804
9456 -72804 230429 416575 234411 -121932 -166659 -21668 172723 280955 337075 515562
9446 515562 802848 724759 231470 -180489 -259161 -313200 -352257 -163293 102791 306918
9436 306918 314718 221807 177087 150286 97581 68861 20747 8575 -72457 -257394 -362288
9425 -362288 -428933 -186577 -162534 -315016 -204640 -35140 94613 173076 20782 -243430
9415 -243430 -245381 114385 475942 492225 212418 222586 364047 346196 177509 237401 254804
9404 254804 -66777 -578791 -793622 -814905 -747170 -470493 -371193 -617848 -671750 -489212
9394 -489212 -345013 -355002 -388813 -260466 -117922 -80063 -285651 -448876 -495242 -466888 -558423
9383 -558423 -598001 -406451 -199456 -198570 -418887 -680379 -634223 -466681 -327754 -115968 40042
9372 40042 -119049 -355308 -412011 -334093 -256760 -63300 79384 60268 35197 -47084 -276878
9361 -276878 -408108 -328238 -233649 -14959 40832 -77534 76325 124125 -117757 -450514
9351 -450514 -427718 -269964 -164679 -174309 -58922 163503 320970 375082 262146 114482
9341 114482 10618 -86971 -151092 14463 194588 13182 -302618 -485903 -632478 -529339
9331 -529339 -352766 -412963 -283017 -189017 -261535 -324773 -259506 -237391 -308073 -462602 -497679
9320 -497679 -326768 -258610 -176695 -157860 -245617 138229 580155 496643 78841 -188432 -176351
9309 -176351 -91075 -118791 -128838 -41013 62264 71648 55026 165683 171585 147292 162815 150081
9297 150081 231127 197203 92393 32583 -121360 -154004 7640 301360 327265 24995 -4838
9286 -4838 -2167 -45331 76998 169012 281734 339870 215074 -98584 -237939 -467305 -611009
9275 -611009 -369693 95280 387153 380237 504603 642292 585698 388410 79105 -44579
9265 -44579 164374 378421 646882 875871 721784 429140 268470 84678 -120827 -263810
9255 -263810 -166544 -111886 13804 202818 338883 383012 331620 300988 426833 713462 846889
9244 846889 587760 266917 142307 50081 -141377 -132225 -53695 227573 494741 485278 352905
9233 352905 205895 107149 2910 -93300 -116111 194 226636 467188 561706 544872 425403
9222 425403 227680 228574 445083 426345 278270 262702 542385 701453 433825 181334 17663
9211 17663 -147826 -263053 -404013 -325938 -129066 -200926 -363608 -293118 -221099 -409489 -577998
9200 -577998 -528034 -419968 -338964 -227505 -198940 -175904 -80814 110625 301817 308541 294585
9189 294585 304566 182453 51057 -46444 -221796 -379208 -344058 -341975 -268568 -198120 -242934
9178 -242934 -292594 -257901 -171499 -84002 27687 75024 -17517 -199803 -199548 -223310 -251379 -362888
9166 -362888 -445484 -505755 -504533 -281435 -22552 -89823 -397608 -642682 -587708 -263060 -220782
9155 -220782 -187482 31528 -56893 -238258 -366579 -359661 -271958 -326677 -472532 -623246 -643285
9144 -643285 -527935 -224076 109766 238688 192152 -112130 -274963 -124259 -69901 -85546
9134 -85546 -221629 -548286 -883503 -716636 -433356 -445690 -306218 -125264 -194565 -155327
9124 -155327 -146629 -283954 -359028 -346675 -417808 -520360 -615240 -510076 -307905 -163958 -91849
9113 -91849 -92463 -133037 -81349 -65691 -72624 213 74786 -22871 -56086 -100169 -246857 -355584
9101 -355584 -308102 -261224 -330825 -462532 -602664 -428685 -400323 -396863 -358148 -342547 -384556
9090 -384556 -307902 -105943 236618 570458 532242 430851 472032 650363 502628 172813
9080 172813 161732 331012 391124 217256 83078 49577 -20312 -226073 -315958 -413808 -259513
9069 -259513 21728 42085 -223599 -395927 -469865 -481007 -352995 -351763 -330580 -236435 -163307
9058 -163307 -22816 168133 302458 321728 170870 -74857 -275566 -354541 -142360 -101065
9048 -101065 -405213 -401613 -324776 -382022 -336214 -295468 -178345 -189368 -342552 -412361 -371648
9037 -371648 -130846 -15404 -75316 -129479 -56334 117327 328193 460728 351174 152905
9027 152905 -73949 -109624 -19415 -10336 -61487 -42631 -154953 -352451 -493419 -457702 -307234
9016 -307234 -145908 -118624 23238 -16115 -143891 -271697 -516211 -700986 -675055 -495009
9006 -495009 -279153 -360977 -637277 -645328 -449795 -403081 -303669 -195857 -263782 -226767 -209225
8995 -209225 -146200 -9528 -82426 -226243 -459574 -624590 -660494 -463061 -75682 -21758
8985 -21758 -382307 -508089 -222468 -135124 -144101 -200419 -298338 -271150 -214664 -212594 -263300 -301179
8973 -301179 -243476 -144553 -119483 -186318 -517393 -786050 -774127 -582608 -481097 -376788 -347235
8962 -347235 -542302 -605259 -581102 -595852 -420686 -145260 -137333 -175500 -194538 -256925 -392932
8951 -392932 -481139 -414746 -302531 -175273 -166179 -222932 -206401 -409450 -441695 -304807 -173949
8940 -173949 -81396 -220882 -446362 -382924 -104056 5037 100921 310197 367666 284616 390559
8929 390559 550129 608404 403476 139787 -159957 -311009 -157861 14225 127253 241196
8919 241196 222413 -106193 -331090 -154244 -118621 -417576 -538433 -451963 -336654 -283874
8909 -283874 -131668 -7311 16530 -58437 -27259 139779 162398 114068 -46048 -309699 -494509
8898 -494509 -555789 -290083 -137257 -83059 121113 214944 55741 -247050 -549420 -804858
8888 -804858 -852214 -707258 -446721 -332430 -419778 -368211 -312497 -567203 -751818 -572661
8878 -572661 -359629 -293600 -128766 152485 282228 92049 -9314 34925 28208 -130 77403
8867 77403 -36937 -351990 -474272 -405682 -102642 145768 142245 55706 -112047 -239231 -69181
8856 -69181 -36154 -269411 -572360 -701628 -732518 -841569 -933939 -892099 -751816 -683992 -606838
8845 -606838 -526293 -392444 -96670 -51510 -298713 -670869 -984847 -976327 -602983 -215668
8835 -215668 -92602 138036 230563 135070 148355 389733 362187 476701 730239 614471
8825 614471 353682 250296 381381 302587 5896 -131494 -71745 128368 136045 16785
8815 16785 75337 127592 276727 492862 406753 -11221 -327575 -487250 -471751 -293245 -58674
8804 -58674 -165409 -486480 -530391 -602936 -672214 -561904 -460532 -426640 -432386 -389147 -269306
8793 -269306 81028 444316 727490 627021 375507 212663 80414 2771 200087 243101
8783 243101 35899 82571 365014 440009 464649 460597 342661 39936 -282348 -478966 -627129
8772 -627129 -699919 -652111 -573751 -365122 -357558 -454182 -327709 -79093 82592 164805 239425
8761 239425 15164 -216770 -266191 -279910 -206188 -232478 -207731 -137185 -135928 -364232 -486584
8750 -486584 -534400 -533165 -327346 -225608 -195954 66266 183811 148986 -16451 -190986 -189891
8739 -189891 -315748 -463512 -291992 -214189 -410566 -627263 -575670 -378713 -171070 -2433
8729 -2433 -28119 -93419 -184194 -140521 -44876 2142 -165567 -231772 -4849 95558 -127548
8718 -127548 -312903 -224540 -218434 -239712 -255065 -121165 151780 123978 -82171 -33522 -79046
8707 -79046 -226430 -227449 -212677 -171815 -201374 -271094 -623813 -946880 -1015323 -927701 -606889
8696 -606889 -338539 -238260 -340219 -698903 -751878 -508702 -277982 -154317 -129101 -327379
8686 -327379 -441332 -329732 -207852 -162310 -182843 -197068 34857 145571 124342 223121 242089
8675 242089 265275 334284 303529 213675 203053 187836 -27966 -167207 -236235 -35139 184112
8664 184112 264761 323951 348044 271276 168018 63186 193496 175861 -136147 -233996 -145595
8653 -145595 -148141 -128332 -114353 -387796 -572996 -512186 -280744 -119117 -122213 -156255 -132688
8642 -132688 -147353 -186521 -318847 -614178 -826623 -804003 -698650 -419203 -140662 -193466
8632 -193466 -422655 -643832 -655576 -459863 -267237 9267 146471 -40674 -273254 -258090
8622 -258090 -233334 -163494 143482 327303 296967 61614 -264769 -454883 -453907 -187936 -128519
8611 -128519 -352068 -411792 -244370 -10097 -151183 -114421 82580 -93892 -292600 -348398
8601 -348398 -394560 -389152 -453973 -604624 -578518 -491474 -320456 -414868 -544987 -680728 -910409
8590 -910409 -938441 -769704 -437262 -142347 -89919 -323379 -443454 -520166 -643439 -529404
8580 -529404 -275858 -183219 -144874 -167190 -232305 -231371 -116244 -272955 -500938 -415666 -349534
8569 -349534 -470035 -606100 -641557 -531570 -221332 -96957 -220756 -279089 -219892 -100463
8559 -100463 -118549 -131913 -191121 -223727 -102237 184958 207173 51260 -96806 -272086 -266706
8548 -266706 -240432 -177573 -21133 -92338 -114424 -150753 -275800 -219869 -273791 -451578 -548942
8537 -548942 -481385 -429183 -334129 -98178 64566 120706 117396 -162730 -663040 -865631 -793945
8526 -793945 -515199 -323104 -325720 -360387 -336964 -299741 -225318 -159530 -169658 -334962 -489645
8515 -489645 -512694 -439338 -318299 -377502 -601080 -771116 -451578 -58458 193132 395748
8505 395748 507316 334482 253839 188336 140135 225641 258685 243765 373349 426261 193878
8494 193878 -26747 -105531 12938 176747 90154 16359 -60695 -294890 -273562 -276158 -414640
8483 -414640 -410721 -329668 -311894 -342131 -313342 -214498 -229056 -106463 50199 119235 59999
8472 59999 145617 261783 227895 -4116 -186343 -111052 37562 108264 115424 139186 69163
8461 69163 -31341 -48548 -21803 -98147 -269402 -223439 -139190 -130087 -114313 78010 238058
8450 238058 130759 -90207 -330930 -416266 -244209 -167620 -110490 115288 103161 -120756
8440 -120756 -351897 -561518 -637348 -554031 -446220 -338809 -156647 120498 336889 185109
8430 185109 -215217 -319812 -105477 -129911 -226548 -165455 -158310 -278822 -347951 -442920 -514074
8419 -514074 -373271 -203021 61353 113536 94350 118363 222194 95776 -287501 -308117
8409 -308117 -157381 11408 240899 360041 210998 9676 -76669 -367480 -522463 -343208
8399 -343208 -160940 -218910 -389684 -472771 -485133 -445984 -341056 -518357 -638688 -572447 -476511
8388 -476511 -425338 -466284 -469179 -465178 -450059 -419553 -434268 -566510 -543566 -359280 -288667 -318045
8376 -318045 -210819 -217550 -220401 -13901 -11038 27089 -18857 -238210 -451008 -489762 -442771
8365 -442771 -512902 -458098 -367233 -268999 -193177 -214530 -78189 77322 79130 244702 537004
8354 537004 343018 26037 -113374 -34487 253052 438262 426819 410680 375153 191239
8344 191239 10668 -49589 -5512 -53574 10725 156337 236069 159655 159203 153743 134711 -90987
8332 -90987 -355789 -424594 -466812 -505228 -549442 -383082 -314570 -446228 -359222 -237801 -187604
8321 -187604 -18021 94417 291302 377396 409907 314202 97143 -27267 210499 406484
8311 406484 302108 208959 127643 -50692 -111460 -2791 -65138 -145491 -93810 -67233 -161308
8300 -161308 -157743 -229348 -271999 -116779 5378 -88439 -171254 -246393 -407953 -390547 -553111
8289 -553111 -786350 -851560 -825094 -707666 -597524 -526909 -455136 -521675 -633959 -808426 -649127
8278 -649127 -387081 -325246 -482962 -726203 -675779 -657555 -778741 -786591 -697336 -572405 -403418
8267 -403418 -452251 -366681 -186446 -295272 -350383 -322399 -262842 -294824 -348462 -315346 -257348
8256 -257348 -223840 -218863 -247486 -359621 -369855 -100451 387801 440889 306586 117567 -42132
8245 -42132 9316 103815 291999 473710 462238 287514 175393 291280 382077 326512 230793
8234 230793 73749 -26080 7595 -14477 -163498 -184979 -174941 -192861 -210351 -240426 -282212
8223 -282212 -257051 -171234 -84102 -87738 -225223 -117439 130939 103757 -4207 9158 -182717
8212 -182717 -409923 -485699 -453064 -257937 -159379 -168163 -225177 -501882 -558485 -414224 -447201
8201 -447201 -499010 -740959 -945330 -862845 -694115 -451980 -214731 -65385 17673 70193
8191 70193 227858 190217 11454 -260193 -629916 -818410 -650471 -356317 -254546 -381762
8181 -381762 -448624 -402460 -346386 -80660 -140748 -433591 -458278 -286768 -228577 -259942 -103180
8170 -103180 -44605 -307640 -563033 -515647 -340788 -247602 -174172 -181517 -265919 -146499 92669
8159 92669 175837 58921 76258 167689 209619 216010 84835 -74949 -40022 -121599 -226807
8148 -226807 -195383 -167176 -79896 36173 160384 305855 318134 201271 52627 -182777
8138 -182777 -446807 -548632 -506435 -402191 -317874 -279229 -276603 -333511 -365526 -306130 -362050
8127 -362050 -480937 -472705 -287413 -17085 27696 -86226 -35105 -193954 -493421 -564609 -433330
8116 -433330 -82605 65624 -49104 -137681 -230849 -111508 63678 227528 286039 189478
8106 189478 -58116 -200533 -125540 -51580 101756 211400 233046 128530 74439 71541 -127819
8095 -127819 -356094 -399101 -428876 -350220 -180866 -14519 -69785 -170722 -312793 -525661
8085 -525661 -554964 -335737 -329942 -573132 -641707 -610089 -411790 -99757 -166450 -406529 -663716
8074 -663716 -637905 -651552 -822022 -599991 -174343 38043 -38023 -32580 -75933 -213693 -365360
8063 -365360 -391057 -392978 -367689 -301790 -125386 -17682 -41526 -32323 162565 288068 -17710
8052 -17710 -236587 -137420 68648 94619 -107314 -296087 -285717 -245741 -151312 -104163 147724
8041 147724 287419 264094 205786 146747 339288 691951 707893 348017 92317 -38386
8031 -38386 -122781 -245327 -350632 -285835 -276981 -93150 272623 356426 403769 357186 302410
8020 302410 304830 276660 203435 -14787 -70292 -150912 -275783 -278932 -275455 -440968 -466987 -500808
8008 -500808 -468527 -370375 -242540 -309536 -360398 -211683 -199669 -182781 -172659 -124552 179662
7997 179662 342062 341232 346828 343089 384838 421578 450909 359434 264002 284958 271634 310745
7985 310745 387030 282154 27078 -270388 -407664 -500634 -472377 -286225 -92417 -13715
7975 -13715 226392 361155 176698 -71863 -143784 -111776 -98616 -49572 -201929 -357414 -355098
7964 -355098 -120786 182017 310199 298851 225045 71002 79430 294286 385868 357434 312880
7953 312880 202917 -40294 -269682 -259882 -150553 -162735 -203784 -58945 119324 152169 219916
7942 219916 172247 -53442 -151229 46116 135444 -100533 -296499 -341048 -427581 -355280 -124198
7931 -124198 -60241 -74957 -197134 -207300 -31033 -14152 -191607 20802 409129 618823
7921 618823 613689 442634 386202 536412 556258 511784 406019 244950 240448 259962 186423
7910 186423 -27964 -23486 302935 467964 185188 74479 55624 69825 66079 252604 404657
7899 404657 321334 279954 200670 -82902 -338733 -552148 -717051 -659955 -555764 -497949 -527435
7888 -527435 -458376 -149077 204814 124725 -59126 -118632 -340460 -512627 -311693 37772
7878 37772 303419 302821 -26427 -339125 -396280 -478406 -610458 -399526 -138005 -313732 -489850
7867 -489850 -457214 -354037 -227885 -126042 -192876 -405346 -308213 -227767 -71144 85690
7857 85690 193088 370144 370604 296026 30598 -270056 -413909 -591280 -548745 -473970 -437389
7846 -437389 -346566 -272510 -166189 71057 7887 -259575 -292945 -281501 -239554 -201304 -123340
7835 -123340 -250419 -630358 -813270 -538934 -281903 -95989 -6251 75918 175942 171799
7825 171799 58809 -95339 -72980 79293 128367 95269 242761 369222 369320 268151 12776
7814 12776 -152544 -145003 -195597 -363977 -587963 -610706 -631584 -422586 -404703 -524299 -447317
7803 -447317 -302894 -140097 160892 287918 284840 279428 305355 18745 -368285 -421241 -72370
7792 -72370 150671 134924 73640 -158162 -141595 127738 222076 129981 32252 -119448 -385357
7781 -385357 -408498 -167907 -38255 146305 295182 314835 279045 98432 63708 -6653 -143440
7770 -143440 -83093 -245113 -481760 -681840 -617487 -151886 169607 1667 -42639 7121
7760 7121 -39795 146762 407132 525657 366798 154049 189533 174896 114448 131858 -7075
7749 -7075 -294412 -472041 -240108 33179 97865 -4020 -151681 -114855 43137 123759 59810
7738 59810 71416 191594 389939 501895 476011 312368 59059 -23839 83525 43489 -47727
7727 -47727 -178757 -258307 -349916 -301322 9982 222806 209399 78256 -93658 -46926 180732
7716 180732 451765 528122 505252 355733 11432 -182520 -282131 -511553 -466039 -25153
7706 -25153 302305 364844 122590 -920 39268 137686 257956 144519 -151490 -423829
7696 -423829 -513912 -420387 -365109 -277666 -235722 -191566 -144772 -138450 -189570 -259150 146572 477130
7684 477130 353080 117158 248035 550517 605118 263764 -178057 -365557 -228775 -155668
7674 -155668 -165390 -164846 -71997 -2023 -40449 32273 284800 377551 379859 256705 105161 -6660
7662 -6660 -172217 -198961 -161659 429 278569 475473 461537 90937 -141868 -231299 -301405
7651 -301405 -73246 104180 346745 465306 325355 121603 -51153 -243005 -292095 -280353
7641 -280353 -386358 -414281 -168696 108730 285645 309619 341340 357892 323286 393158 433735
7630 433735 379001 346134 202948 46516 85903 165000 29985 40205 191944 314047 275200
7619 275200 117278 -81032 -51658 -41350 -42453 21566 38278 3529 -9604 -112303 -195066
7608 -195066 -167341 -10193 133441 195456 163353 107725 8519 -53847 -286488 -525461 -534853
7597 -534853 -525974 -423564 -370887 -175204 184498 306513 33785 -289330 -388612 -252831
7587 -252831 -136092 -151446 -267424 -265635 -63598 127272 141370 61012 -141032 -218824 -200397
7576 -200397 -76170 -15877 -166774 -189502 -25475 -42339 -86262 -148855 -310440 -467875 -611618
7565 -611618 -707895 -736106 -724465 -568708 -174056 -93219 -135951 -76432 -184542 -164742 -154769
7554 -154769 -46906 -17368 -67432 -268142 -298049 -87113 50496 193259 232644 275849 331823
7543 331823 313287 168756 17757 -27268 -232498 -152390 217728 191393 -30752 -162918
7533 -162918 -251758 -222091 -236284 -314996 -245462 8828 291004 175544 -118238 -128378 78490
7522 78490 329975 351904 23331 -378647 -591364 -590447 -635790 -705396 -555380 -67092 301587
7511 301587 274443 -63033 -385941 -441430 -195605 -125064 -127393 -261943 -509445 -497581 -434295
7500 -434295 -471607 -473161 -336860 -144385 138187 157439 18879 130089 240199 225521 153271
$$ [...]
##END NTUPLES=NMR SPECTRUM
##END=
