##TITLE=C13_LR-688A-C2KCF
 DMSO-d6, 23000 sc

 3.6.2020
##JCAMPDX= 6.0         $$ Bruker NMR JCAMP-DX V2.0
##DATA TYPE= NMR SPECTRUM
##DATA CLASS= NTUPLES
##ORIGIN= UXNMR, Bruker Analytische Messtechnik GmbH
##OWNER= root
$$ XWIN-NMR		Version 3.5
$$ Thu Jun  4 11:26:38 2020 Russian Standard Time (UT+4h)  she@DPX200
##.OBSERVE FREQUENCY= 50.327896
##.OBSERVE NUCLEUS= ^13C
##.ACQUISITION MODE= SIMULTANEOUS
##.ACQUISITION SCHEME= undefined
##.AVERAGES= 25033
##.DIGITISER RES= 17
##SPECTROMETER/DATA SYSTEM= spect
##.PULSE SEQUENCE= zgpg30
##.SOLVENT NAME= CDCl3
##.SHIFT REFERENCE= (INTERNAL, CDCl3, 0, 222.624)
##AUDIT TRAIL= $$ (NUMBER, WHEN, WHO, WHERE, WHAT)
$$ ##TITLE= Audit trail, XWIN-NMR		Version 3.5
$$ ##JCAMPDX= 5.01
$$ ##ORIGIN= Bruker BioSpin GmbH
$$ ##OWNER= she
$$ F:/spectra/data/she/nmr/c13/1/pdata/1/auditp.txt
$$ ##AUDIT TRAIL=  $$ (NUMBER, WHEN, WHO, WHERE, WHAT)
(   1,<2020-06-04 10:42:21.65 +0400>,<she>,<DPX200>,
      <created by zg, POWCHK disabled, PULCHK disabled
       terminated by command 'halt'
       configuration hash MD5:
       00 E9 B6 7A A2 85 ED C7 34 08 36 98 17 FE 4E 26
       data hash MD5: 32K
       F3 52 61 6A EE 42 77 B5 9A ED D3 D3 11 E0 49 F0>)
(   2,<2020-06-04 11:24:47.46 +0400>,<she>,<DPX200>,
      <Start of raw data processing
       efp BC_mod = 2 LB = 1 FT_mod = 6 PKNL = 1 PHC0 = -231.3637 PHC1 = 39.80638 SI = 32K 
       data hash MD5: 32K
       E6 90 E4 D6 D0 67 75 26 57 C3 3C F4 B1 70 AE AA>)
(   3,<2020-06-04 11:24:51.51 +0400>,<she>,<DPX200>,
      <abs ABSG = 5 
       data hash MD5: 32K
       FD A4 5B D9 92 22 2B AB 2A 9E D2 3F 93 C4 70 B9>)
(   4,<2020-06-04 11:25:22.20 +0400>,<she>,<DPX200>,
      <pk PHC0 = 1.387552 PHC1 = -5.799997 
       data hash MD5: 32K
       8A D3 DD 05 9F 7C 15 05 E8 BD 89 38 C2 D4 C0 26>)
(   5,<2020-06-04 11:25:26.20 +0400>,<she>,<DPX200>,
      <abs ABSG = 5 
       data hash MD5: 32K
       AC 5D 25 66 81 79 2F A1 DF A9 28 91 7F DE 2E 3C>)
$$ ##END=
$$ 
$$ hash MD5
$$ 45 3D A0 AA BF 01 12 27 C4 16 4A 3C 8A 6A 92 93
##$RELAX= 
##$RELAX= 
##$RELAX= 
##$RELAX= 
##$RELAX= 
##$RELAX= 
##$RELAX= 
##$RELAX= 
$$ Bruker specific parameters
$$ --------------------------
##$DU= <F:/spectra>
##$EXPNO= 1
##$NAME= <c13>
##$PROCNO= 1
##$TYPE= <nmr>
##$USER= <she>
##$AMP= (0..31)
100 100 100 100 100 100 100 100 100 100 100 100 100 100 100 100 100 100 
100 100 100 100 100 100 100 100 100 100 100 100 100 100 
##$AQSEQ= 0
##$AQ_mod= 1
##$AUNM= <au_zg>
##$AUTOPOS= <>
##$BF1= 50.322709
##$BF2= 200.13
##$BF3= 50.322709
##$BF4= 500.13
##$BF5= 500.13
##$BF6= 500.13
##$BF7= 500.13
##$BF8= 500.13
##$BYTORDA= 1
##$CFDGTYP= 0
##$CFRGTYP= 5
##$CHEMSTR= <none>
##$CNST= (0..31)
1 1 145 1 1 1 1 1 1 1 1 1 1 1 1 1 1 1 1 1 1 1 1 1 1 1 1 1 1 1 1 1 
##$CPDPRG= <waltz16>
##$CPDPRG1= <>
##$CPDPRG2= <waltz16>
##$CPDPRG3= <>
##$CPDPRG4= <mlev>
##$CPDPRG5= <mlev>
##$CPDPRG6= <mlev>
##$CPDPRG7= <mlev>
##$CPDPRG8= <mlev>
##$CPDPRGB= <>
##$CPDPRGT= <>
##$D= (0..31)
$$ [...]
##$SUBNAM4= <"">
##$SUBNAM5= <"">
##$SUBNAM6= <"">
##$SUBNAM7= <"">
##$SUBNAM8= <"">
##$SUBNAM9= <"">
##$SW= 239.972175391363
##$SWIBOX= (0..15)
0 1 3 0 0 0 0 0 0 0 0 0 0 0 0 0 
##$SW_h= 12077.2946859903
##$TD= 32768
##$TD0= 1
##$TE= 0
##$TE2= 300
##$TE3= 300
##$TEG= 300
##$TL= (0..7)
120 120 120 120 120 120 120 120 
##$TP= (0..7)
150 150 150 150 150 150 150 150 
##$TP07= 0
##$TPNAME0= <>
##$TPNAME1= <>
##$TPNAME2= <>
##$TPNAME3= <>
##$TPNAME4= <>
##$TPNAME5= <>
##$TPNAME6= <>
##$TPNAME7= <>
##$TPOAL= (0..7)
0.5 0.5 0.5 0.5 0.5 0.5 0.5 0.5 
##$TPOFFS= (0..7)
0 0 0 0 0 0 0 0 
##$TUNHIN= 0
##$TUNHOUT= 0
##$TUNXOUT= 0
##$USERA1= <user>
##$USERA2= <user>
##$USERA3= <user>
##$USERA4= <user>
##$USERA5= <user>
##$V9= 5
##$VALIST= <valist>
##$VCLIST= <CCCCCCCCCCCCCCC>
##$VD= 0
##$VDLIST= <DDDDDDDDDDDDDDD>
##$VPLIST= <PPPPPPPPPPPPPPP>
##$VTLIST= <TTTTTTTTTTTTTTT>
##$WBST= 1024
##$WBSW= 4
##$XGAIN= (0..3)
0 0 0 0 
##$XL= 0
##$YL= 0
##$YMAX_a= 151772342
##$YMIN_a= -49250870
##$ZGOPTNS= <>
##$ZL1= 120
##$ZL2= 120
##$ZL3= 120
##$ZL4= 120
##$ABSF1= 222.624
##$ABSF2= -17.3728
##$ABSG= 5
##$ABSL= 3
##$ALPHA= 0
##$AQORDER= 0
##$ASSFAC= 0
##$ASSFACI= 0
##$ASSFACX= 0
##$ASSWID= 0
##$AUNMP= <proc_1d>
##$AZFE= 0.1
##$AZFW= 0.5
##$BCFW= 0
##$BC_mod= 2
##$BYTORDP= 0
##$COROFFS= 0
##$CY= -3
##$DATMOD= 1
##$DC= 0
##$DFILT= <>
##$DTYPP= 0
##$F1P= 0
##$F2P= 0
##$FCOR= 0.5
##$FTSIZE= 32768
##$FT_mod= 6
##$GAMMA= 0
##$GB= 0
##$INTBC= 1
##$INTSCL= 4.134877e-10
##$ISEN= 128
##$LB= 1
##$LEV0= 0
##$LPBIN= 0
##$MAXI= 10000
##$MC2= 0
##$MEAN= 0
##$ME_mod= 0
##$MI= 0.1934396
##$NCOEF= 0
##$NC_proc= 3
##$NLEV= 6
##$NOISF1= 120.0001
##$NOISF2= 80.00006
##$NSP= 0
##$NTH_PI= 0
##$NZP= 0
##$OFFSET= 222.624
##$PC= 1.4
##$PHC0= -229.9761
##$PHC1= 34.00639
##$PH_mod= 1
##$PKNL= yes
##$PPARMOD= 0
##$PSCAL= 0
##$PSIGN= 0
##$REVERSE= no
##$SF= 50.3227315989248
##$SI= 32768
##$SIGF1= 140
##$SIGF2= 120
##$SINO= 11.81781
##$SIOLD= 32768
##$SREGLST= <13C.CDCl3>
##$SSB= 0
##$STSI= 32768
##$STSR= 0
##$SW_p= 12077.2946859903
##$SYMM= 0
##$S_DEV= 0
##$TDeff= 32768
##$TDoff= 0
##$TI= <>
##$TILT= no
##$TM1= 0
##$TM2= 0
##$TOPLEV= 0
##$USERP1= <user>
##$USERP2= <user>
##$USERP3= <user>
##$USERP4= <user>
##$USERP5= <user>
##$WDW= 1
##$XDIM= 32768
##$YMAX_p= 382993013
##$YMIN_p= -1352330
$$ End of Bruker specific parameters
$$ ---------------------------------
##NTUPLES= NMR SPECTRUM
##VAR_NAME=  FREQUENCY,     SPECTRUM/REAL,   SPECTRUM/IMAG
##SYMBOL=    X,             R,               I
##VAR_TYPE=  INDEPENDENT,   DEPENDENT,       DEPENDENT
##VAR_FORM=  AFFN,          ASDF,            ASDF
##VAR_DIM=   32768,         32768,           32768
##UNITS=     HZ,            ARBITRARY UNITS, ARBITRARY UNITS
##FACTOR=    0.368581032318806, 1,           1
##FIRST=     11203.0474431902, 0,            0
##LAST=      -874.247242800138, 0,           0
##MIN=       -874.247242800138, -1352330,    0
##MAX=       11203.0474431902, 382993013,    0
$$ Real data points
##PAGE= N=1
##DATA TABLE= (X++(R..R)), XYDATA
$$ [...]
10945c70656r282M9802J0293p916j83830o9324L11767M62265J54861k6794l0514
$$ -370656 -379938 -330136 -319843 -327759 -511589 -580913 -269146 193119 347980 321186 290672
10934B90672q4330N2763k74004k38701j53223j52038J67293L88292K73326J40071
$$ 290672 206342 259105 -14899 -253600 -406823 -558861 -391568 -3276 270050 410121
10924D10121J1711p1541j58777j50563J17362K13114J31604N7449k18045k42590
$$ 410121 421832 350291 191514 40951 158313 371427 503031 560480 342435 99845
10914I9845n6314p9994j32161l514J02058J14742o6293j99661N3658J90170j7103
$$ 99845 43531 -36463 -168624 -172138 -70080 44662 -21631 -221292 -167634 22536 5433
10903E433k98998j71084J13279J84517K3554j73736o7475j63515o9789J57033
$$ 5433 -293565 -464649 -351370 -166853 -143299 -317035 -384510 -548025 -617814 -460781
10893d60781M19726M69862j01133l96638j96704r299N2171N7878J01862J24311
$$ -460781 -41055 428807 327674 -68964 -265668 -274967 -222796 -164918 -63056 61255
10883F1255O7282J94840J64103m6222j41875k15739j77484j58025O082J09443
$$ 61255 128537 323377 487480 441258 299383 83644 -93840 -251865 -245783 -136340
10873a36340l0696k4442Q5446R6551K69611J39278k33965l3052j3408L5882M9706
$$ -136340 -167036 -191478 -106032 -9481 260130 399408 165443 132391 118983 154865 204571
10862B04571m4906J64506J20450o8940n0970O1759J34971M8976O575K2376N5178
$$ 204571 159665 324171 444621 375681 324711 386470 521441 570417 576992 599368 654546
10851F54546L5213l2899J01053o187n9732m3447o4583j71313j53861k17705k13414
$$ 654546 689759 656860 757913 751726 691994 648547 583964 412651 258790 41085 -172329
10840a72329n1908J10388q9031k60280n899J49186J1764k5359p7914n5847K5416
$$ -172329 -224237 -113849 -202880 -463160 -469059 -319873 -308109 -333468 -411382 -467229 -441813
10829d41813M4953K87811K95668r758j51973j2733P2887M1057P7788m7081L0164
$$ -441813 -396860 -109049 186619 176861 24888 12155 85042 126099 203887 156806 186970
10818A86970J56814P9738j5865q6433j84442q585M6651M1279r4324k11189J35468
$$ 186970 343784 423522 407657 321224 136782 128197 174848 216127 121803 -89386 46082
10807D6082J66473K4180J1689J29500j0038j35854k51224j53407q2000j50046
$$ 46082 212555 236735 248424 377924 367886 232032 -19192 -172599 -254599 -404645
10797d04645k86939r9678K66395M04608K13653P3167l5983j65750k0838M7983
$$ -404645 -691584 -791262 -524867 -120259 93394 166561 130578 -35172 -56010 -8027
10787h027j32482j08497M3888J60986J75614k0515j79880j29036O8915m6527k97012
$$ -8027 -140509 -249006 -205118 -44132 131482 110967 -68913 -197949 -129034 -175561 -472573
10776d72573k22099R739J47815K64687K18555p9107j80020J13265J61592J39616
$$ -472573 -694672 -684933 -537118 -272431 -53876 -132983 -313003 -199738 -38146 101470
10766A01470R2185p5493P4280Q4712J46058R236j57359k09012q0061J25019J30085
$$ 101470 193655 118162 192442 277154 423212 432448 275089 66077 -13984 111035 241120
10755B41120o9086j47831M5643p991j55210j40137m6874j34147k33791n3683J29120
$$ 241120 172034 24203 69846 61855 -93355 -233492 -280366 -414513 -648304 -701987 -572867
10744e72867K72093J10149J55600L02154R5979J26638R0911k59245k87108n777
$$ -572867 -300774 -190625 -35025 267129 363108 489746 580657 321412 34304 28527
10734B8527K04614J11747Q1246j3091k7773N9168j36934l62730k82788q6126J3494
$$ 28527 233141 344888 426134 413043 385270 444438 307504 -55226 -338014 -424140 -410646
10723d10646p4455o6650Q3533K47581L63517n0377j52976Q0108O2176j23772j29231
$$ -410646 -485101 -551751 -468218 -220637 142880 92503 -60473 19635 81811 -41961 -171192
10712a71192L7594K7438J13915K3466m0215J00639k4210j66685j74749o4028o030
$$ -171192 -133598 -106160 7755 31221 -8994 91645 67435 -99250 -273999 -338027 -344057
10701c44057j86225o1585K98452L40847N8607o6631K2373N7035K10194L7604j42443
$$ -344057 -530282 -591867 -293415 47432 106039 39408 61781 118816 329010 366614 224171
10690B24171r4055r4075K49982L29915K6795J14338K00671o2278o9749J59062
$$ 224171 130116 36041 286023 615938 642733 757071 957742 895464 825715 984777
10680I84777O3156k08092l08448k70793K18702M26615N2956O5551K78708J20574
$$ 984777 1047933 839841 531393 260600 479302 905917 958873 1024424 1303132 1423706
10670A423706r0853j14435j96005k66514j39010L8086m794r9839N4424L20745
$$ 1423706 1332853 1218418 1022413 755899 616889 654975 650181 550342 604766 925511
10660I25511J35205l7752J29949M78688O84627M83421K49780K97535K20858L44455
$$ 925511 1060716 1022964 1152913 1631601 2316228 2799649 3049429 3346964 3567822 3912277
10650C912277M71471O97493J037657J208155J417007K222248L490764M863230
$$ 3912277 4383748 5081241 6118898 7327053 8744060 10966308 14457072 19320302
10642A9320302O256687P367419O888756K428190m414664p807178p345238n519329
$$ 19320302 25576989 32944408 39833164 42261354 37846690 30039512 22694274 17174945
10634A7174945l791983k904514j996335j358259j122153q50439o26485n52576
$$ 17174945 13382962 10478448 8482113 7123854 6001701 5151262 4524777 3972201
10626C972201o40406m87170j81337n23661n23525k15642k28115j05209K4933r3009
$$ 3972201 3331795 2844625 2663288 2139627 1616102 1400460 1172345 1067136 1092069 999060
10616I99060j04083m7445p305k8321j56684j15760K15023K11746k33440n11571
$$ 999060 894977 847532 840227 811906 655222 539462 754485 966231 732791 221220
10606B21220l74473j23752K2695M5857K37357J74143n7358j17311j4448j80045
$$ 221220 -153253 -277005 -254310 -208453 28904 203047 145689 28378 13930 -166115
10596a66115j41735K6991J110J1928m2439L41224N68730o7246k45437k77268l17977
$$ -166115 -307850 -280859 -279749 -267821 -310260 30964 599694 532448 287011 9743 -308234
10585c08234k9802K29779J70610m1244j26928l8923J58686K84111J73975j87778
$$ -308234 -338036 -108257 62353 21109 -105819 -144742 13944 298055 472030 284252
10575B84252k18452r5184p0473l17574j62205O9025J11049M1219J50375J48619
$$ 284252 65800 -29384 -99857 -417431 -579636 -510611 -399562 -358343 -207968 -59349
10565e9349j3794J46936J48381O3564q6813k27388l93322j96483N5967K08030
$$ -59349 -73143 73793 222174 285738 198925 -28463 -421785 -618268 -562301 -354271
10555c54271J91642q632m8792J8673J30789k1756N9627J46762n1730m9977K56887
$$ -354271 -162629 -171261 -220053 -201380 -70591 -92347 -32720 114042 62312 12335 269222
10544B69222K17244L8393l7113k57991m16910k88176J07288K65337N3374k93964
$$ 269222 486466 524859 487746 229755 -187155 -475331 -368043 -102706 -49332 -343296
10534c43296j94760J49086J94336l007j23474j23137r9915q3847J60181K95153
$$ -343296 -538056 -388970 -194634 -197641 -321115 -444252 -544167 -628014 -467833 -172680
10524a72680j4207N4745K3893R7582Q2802j52178j58617J6829J45064K914k77160
$$ -172680 -186887 -132142 -108249 -10667 72135 -80043 -238660 -221831 -76767 -73853 -351013
10513c51013q7575K36340N9851j61724J67714L14832Q4731P7372j41679k06588
$$ -351013 -438588 -202248 -142397 -304121 -136407 178425 263156 340528 198849 -7739
10503g739k9020Q2538p0569j48255j25075j9839J77519J31610J3656k10729j24692
$$ -7739 -36759 45779 -24790 -173045 -298120 -317959 -140440 -8830 4826 -205903 -330595
10492c30595L4370M6933J33545K86673J13882J61726m8974j90075j67441r0475
$$ -330595 -296225 -249292 -115747 170926 284808 446534 397560 207485 40044 -50431
10482e0431j6821l1041j72996j43305K06964J86804n3951j09346k63167k52236
$$ -50431 -67252 -98293 -271289 -414594 -207630 -20826 -74777 -184123 -447290 -699526
10472f99526N5352K56645J59671l8858j41033l9239R7130M8277N938N1468Q276
$$ -699526 -644174 -387529 -227858 -266716 -407749 -446988 -349858 -301581 -295643 -244175 -235899
10461b35899N8329K09846J96863J41441j29118k63100k07867p3190J01622K00519
$$ -235899 -177570 32276 229139 370580 241462 -21638 -229505 -302695 -201073 -554
10451e54L40537J37662j01803k37711l38021l2803M0084j36556j3122J57147J66273
$$ -554 339983 477645 375842 138131 -199890 -232693 -192609 -329165 -342287 -185140 -18867
10440a8867J86748k0529j94429j1307K24082J19787j76563j14162J02039M3467
$$ -18867 167881 147352 -47077 -58384 165698 285485 108922 -5240 96799 140266
10430A40266m3709L1026Q9262j11618L5746p2163k0532n3043k8648j04034q9548
$$ 140266 96557 127583 216845 105227 140973 68810 48278 -4765 -33413 -137447 -226995
10419b26995J9794J84504K58559p3461l54815l01712j6976j9924k1410J48860
$$ -226995 -207201 -22697 235862 162401 -192414 -494126 -511102 -531026 -552436 -403576
10409d03576K01864q2793k4526J33611J74053q7483k39321j91407n2687J75335
$$ -403576 -201712 -284505 -309031 -175420 -1367 -88850 -328171 -519578 -572265 -396930
10399c96930K28968J65852l5173j02205l0062J2869Q9015J16719L612j5024O9625
$$ -396930 -167962 -2110 -37283 -139488 -169550 -156681 -67666 49053 52665 37641 107266
10388A07266J17808O9486j15640k85575k18567j00958J20997K45327J15607P7597
$$ 107266 225074 294560 178920 -106655 -325222 -426180 -305183 -59856 55751 133348
10378A33348K6986j53762m7864m6215j39928q4681O8590J03318J76498J53942
$$ 133348 160334 6572 -41292 -87507 -227435 -312116 -243526 -140208 36290 190232
10368A90232o6759j08145m5838k465J78305J82449J41499j31742j34806L7584
$$ 190232 123473 15328 -30510 -32975 145330 327779 469278 337536 202730 240314
10358B40314j25132J13699K47846n2431k20261m0189p6994j75268m28J59033k0190
$$ 240314 115182 228881 476727 424296 204035 163846 86852 -88416 -88844 70189 49999
10347D9999m2381L7940k00993j71676L9434j391m5611J17787J30401p4268R092
$$ 49999 7618 45558 -155435 -327111 -287677 -289068 -334679 -216892 -86491 -160759 -151667
10336a51667J59470j6218r2180k5381j32552j40413L6548K44137Q9221J119J63027
$$ -151667 7803 -8415 -100595 -125976 -258528 -398941 -362393 -118256 -29035 -27916 135111
10325A35111K53969J42823j54205l50675k44331J402R6836q8232N4695K33104
$$ 135111 389080 531903 377698 27023 -217308 -215906 -119070 -207302 -152607 80497
10315H0497j73953j83262J76807L39450L51904J93392J2728q6699q6210N1707
$$ 80497 -93456 -276718 -99911 239539 591443 784835 797563 710864 624654 676361
10305F76361k0544J5148L6692j47038q7212j59743p7711K16098R2678l05096j94146
$$ 676361 655817 670965 707657 560619 473407 313664 235953 452051 544729 239633 45487
10294D5487J36679J02554J45204R1897J3469j13881k00708j75078R7871J42458
$$ 45487 182166 284720 429924 521821 535290 421409 220701 45623 143494 285952
10284B85952P8885K12294n9665l09598l61928k77047j65085M5262R1844K7986
$$ 285952 364837 577131 517466 207868 -154060 -431107 -596192 -550930 -459086 -431100
10274d31100N5809J52605K85534P437k2157k0002J19904K83464J34125r6116j38684
$$ -431100 -375291 -222686 62848 70285 48128 28126 148030 431494 565619 469503 330819
10263C30819P284J02952o5595k20947j48891J16879J06762N0721j07422j96038
$$ 330819 338103 441055 375460 154513 5622 122501 229263 279984 172562 -23476
10253b3476k9186N95q4955J39838J58662j07378J04784K1035j75679m3678j00992
$$ -23476 -52662 -52067 -137022 2816 161478 54100 158884 179919 4240 -39438 -140430
10242a40430m3477K32182K37972P8609J14951J28767j29073j31949o7440K8019
$$ -140430 -183907 48275 286247 364856 479807 608574 479501 347552 280112 308131
10232C08131K544j85183j71138k36719j63112J78846L59019J90625j27709j93657
$$ 308131 310675 125492 -45646 -282365 -445477 -266631 92388 283013 155304 -38353
10222c8353l3925M8137j36432j36309M0110K03983M3198j73164j97826k36406
$$ -38353 -72278 -24141 -160573 -296882 -256772 -52789 -9591 -182755 -380581 -616987
10212f16987q9602O010o4636N5621K48610K15978J5314K18490P3865l01584K274
$$ -616987 -706589 -700579 -765215 -709594 -460984 -245006 -229692 -11202 62663 -238921 -236647
10201b36647K14336J49867J72625j38917j98552k41975j18169Q4665m9213j39440
$$ -236647 -22311 127556 300181 161264 -37288 -279263 -397432 -312767 -361980 -501420
10191e01420m4934j5128K82158L90680M9574q3361N3300r0558M3111J42255n626
$$ -501420 -546354 -561482 -279324 111356 160930 77569 130869 40311 83422 225677 220051
10180B20051q2839J58399K60060M613j75868j33347p4764K9073J53729J75118
$$ 220051 137212 295611 555671 560284 384416 251069 176305 205378 359107 534225
10170E34225j2557l59559j54650o7460j56334j7088o9428j18258J83020J17994
$$ 534225 521668 162109 7459 -60001 -216335 -233423 -302851 -421109 -238089 -120095
10160a20095l1638j88596J32769K14704k2396J21152J38191k4692k02548l14482
$$ -120095 -151733 -340329 -207560 7144 -15252 105900 244091 219399 16851 -297631
10150b97631k67978j9492J07530J69820Q1672p9639r1449L41118L59249J3577
$$ -297631 -565609 -585101 -477571 -307751 -226079 -305718 -397167 -56049 303200 316777
10140C16777j42342r3566J48951J76651K2015M2163n8743O9157O3422R7395K60531
$$ 316777 174435 80869 229820 406471 428486 470649 411906 481063 544485 641880 902411
10129I02411k05832k81896R923r1617l5445K2303K03840J61085m7278j3076o2135
$$ 902411 696579 414683 424606 332989 297544 319847 523687 684772 637494 624418 562283
10118E62283N7950L4592j27280r3077M0944J41678J01056j225J86786L28978R8940
$$ 562283 620233 654825 527545 434468 475412 617090 718146 716921 903707 1232685 1331625
10107A331625l9q5066m9119L3159J29704J2979k6815L76912L89784M03103J97204
$$ 1331625 1331586 1246520 1197401 1230560 1360264 1373243 1346428 1723340 2113124 2516227 2713431
10096B713431J45649J74680K95130L98180M72668P59556Q86421Q87147R97935
$$ 2713431 2859080 3033760 3328890 3727070 4199738 4959294 5845715 6732862 7730797
10087G730797J175567J194478J178146Q78344K47015m19774q15636j094112j217940
$$ 7730797 8906364 10100842 11278988 12157332 12404347 11984573 11168937 10074825 8856885
10078H856885j247643j181017p78939n21198n66341n85997m51310m29112l84185
$$ 8856885 7609242 6428225 5649286 5128088 4561747 3975750 3524440 3095328 2711143
10069B711143m04222n60814l98616j51812l6253K84100J35658j21513l00940k51237
$$ 2711143 2306921 1746107 1347491 1195679 1159426 1443526 1579184 1457671 1156731 905494
10059I05494k0573J35942J28690j64463j19652R8021O762Q5333j05091m41937
$$ 905494 884921 1020863 1149553 985090 865438 963459 970221 1055554 950463 508526
10049E08526k17235j85363R9145K99680J12465O0724l1433j41094J6051J58402
$$ 508526 291291 105928 205073 504753 617218 677942 646509 505415 521466 679868
10039F79868m1433j73656j33447o9812K4825k5293J363l7401j7217J44867L5171
$$ 679868 638435 464779 331332 261520 286345 261052 262415 225014 207797 352664 387835
10028C87835M7804k6347j09349l7246P1290R9595m5841k07801J10464J56132j62085
$$ 387835 435639 409292 299943 262697 333987 433582 387741 179940 290404 446536 284451
10017B84451j97282p2438L5957M0978j39832Q773K74812K12052J16848j19915
$$ 284451 87169 14731 50688 91666 -48166 -39393 235419 447471 564319 444404
10007D44404m88064l07367k22955j07356J02790L5405l4893M5929L8875J918J68929
$$ 444404 -43660 -351027 -573982 -681338 -578548 -543143 -578036 -532107 -493232 -491314 -322385
9996c22385K12759J71174Q7697j64197j85709J4747J73261J21563J25062j446
$$ -322385 -109626 61548 149245 -14952 -200661 -185914 -12653 108910 233972 232526
9986B32526Q1241K59720J11343k22670k67796o6864K67854J14031j50697N1843
$$ 232526 313767 573487 684830 462160 194364 127500 395354 509385 358688 410531
9976D10531J89980m6476j58803n2682j17712k1558M7775J26860J49881p8367k58758
$$ 410531 600511 554035 395232 342550 224838 203280 251055 377915 527796 449429 190671
9965A90671L60O4162m4207j12431j31578J31806J87617r6728k05156j10862K6074
$$ 190671 191031 255193 210986 98555 -33023 98783 286400 189672 -15484 -126346 -100272
9954a00272J76378J44914o2043p81p9249j07274P6002J71498n9708l8664l0141
$$ -100272 76106 221020 158977 158196 78947 -28327 47675 219173 159465 120801 90660
9943I0660M8881n0644j15152j05576j13148j28312L2261J16778J51295Q4029k2661
$$ 90660 139541 88897 -26255 -131831 -244979 -373291 -341030 -224252 -72957 11072 -11589
9932a1589j353J11311J92728J33485k1331j00787o8775j57730j80967R4238J10300
$$ -11589 -12942 98369 291097 424582 403251 302464 233689 75959 -105008 -10770 99530
9921I9530R4373L5052n6109l5284J9316j83171j6829K52862J28576N9061k7973
$$ 99530 193903 228955 172846 137562 156878 -26293 -43122 209740 338316 397377 369404
9910C69404q2945j4981J88431J60843N8960k48262k04152j6076M7844L7376J16946
$$ 369404 286459 271478 459909 620752 679712 431450 227298 211222 259066 296442 413388
9899D13388K24721J26761p318n1211M9313j29156j65963K9317K3425O9986J09710
$$ 413388 638109 764870 757552 706341 755654 626498 460535 489852 513277 583263 692973
9888F92973p528j90430l74260j25981J52549m7060l0443Q3406K7525L8229J46563
$$ 692973 685445 495015 120755 -5226 147323 100263 69820 153226 180751 218980 365543
9877C65543M2772J1964o8686o5617K09665K82099J60204R0244k9263k91516k40713
$$ 365543 408315 420279 351593 285976 495641 777740 937944 1028188 998925 707409 466696
9866D66696j5258N5879J72953M9565k04988j39176J9223k1603q2828J29287K08756
$$ 466696 451438 507317 680270 729835 524847 385671 404894 383291 300463 429750 638506
9855F38506o748q7559k35435j04617K2734J8845j31233L2968J9579p7061O4249
$$ 638506 631758 544199 308764 204147 226881 245726 114493 147461 167040 89979 154228
9844A54228J4429N3010J23391j48681j79596j0783J3409R135O3518J95472L11468
$$ 154228 168657 221667 345058 196377 16781 5998 19407 28542 92060 287532 599000
9833E99000J68723J28740J47942j06069k00064k27695M8994J35309m0361m4376
$$ 599000 767723 896463 1044405 938336 738272 510577 559571 694880 654519 610143
9823F10143j02368J03901K77328J81338l755R3886J79353M5590l9283K64372N44218
$$ 610143 507775 611676 889004 1070342 1066587 1160473 1339826 1385416 1346133 1610505 2154723
9812B154723L84192J53782J96782N98234Q53378J085407R28039P80294J028513
$$ 2154723 2538915 2692697 2889479 3487713 4341091 5426498 6354537 7134831 8163344
9803H163344J040700J316310J284630R28445L01577m44307j130134j499690j403617
$$ 8163344 9204044 10520354 11804984 12733429 13035006 12590699 11460565 9960875 8557258
9794H557258j188569q67991q65899q83653o81695n81065n15074j45626o3222k30030
$$ 8557258 7368689 6500698 5634799 4751146 4069451 3488386 2973312 2827686 2764464 2534434
9784B534434k53368k74681o1967M0338k88366m18813m89794k92283k91345k20847
$$ 2534434 2281066 2006385 1944418 1984756 1696390 1277577 787783 495500 204155 -16692
9774a6692J96943L10277L50061P7204j92211k03882q4039l9627j86683j42481
$$ -16692 180251 490528 840589 917793 725582 521700 437661 398034 211351 68870
9764F8870J6952l0205j04994J74343J10089Q1490O1154k42506l80088m5691K44466
$$ 68870 85822 55617 -49377 124966 235055 316545 377699 135193 -244895 -290586 -46120
9753d6120K16186l4474j46289N8365K96783L80814K7696k36280O164N1964l07685
$$ -46120 170066 135592 -10697 47668 344451 725265 752961 516681 522845 574809 267124
9742B67124j97765J82966K4113j36051k8028k1730j18945n1241j32566J28062
$$ 267124 69359 252325 276438 140387 112359 90629 -28316 -79557 -212123 -84061
9732h4061J60223M2468m7440j9492k142k8280R3010R42j83258j46369j9616O1291
$$ -84061 76162 118630 71190 51698 49556 21276 114286 115228 -68030 -214399 -234015 -172724
9720a72724J7452l1798j92403j27734P7659J48348L45315K06493j58690n9361
$$ -172724 -155272 -187070 -379473 -507207 -429548 -281200 64115 270608 111918 52557
9710E2557N6728j37462m05416n8177J23013o056k66344j95628J4565Q7539J53448
$$ 52557 109285 -28177 -433593 -491770 -368757 -374813 -641157 -836785 -822220 -734681 -581233
9699e81233K06667j04825q12L07640K2871j01232k32960r4958j2594J04313K47662
$$ -581233 -374566 -479391 -480203 -172563 -149692 -250924 -483884 -578842 -591436 -487123 -239461
9688b39461K24089N7606p1802j32227j21079K6713J21273R7256r6656p5551P9043
$$ -239461 -15372 42234 -29568 -161795 -282874 -256161 -134888 -37632 -134288 -209839 -130796
9677a30796P8526J17915J85312J75338n0503j93009l29508j92475k8681Q5377
$$ -130796 -52270 65645 250957 426295 375792 182783 -146725 -339200 -367881 -282504
9667b82504J08973j17544k34380R0923O7950l7132q0157k0500O6367Q6744J60192
$$ -282504 -173531 -291075 -525455 -434532 -366582 -403714 -483871 -504371 -438004 -351260 -191068
9656a91068J38589J24005J6902o8418o14k79712k75284L7247L31336J26023m4129
$$ -191068 -52479 71526 88428 20010 19396 -260316 -535600 -498353 -167017 -40994 -85123
9645h5123j27625j06102L8256K09916J31569m2519m505R2313P6846N9947K091
$$ -85123 -212748 -318850 -280594 -70678 60891 18372 13867 106180 183026 242973 245064
9634B45064o0868m7077j21068k28634k15041N8540J53133r75k99931p7357K64578
$$ 245064 184196 137119 16051 -212583 -427624 -369084 -215951 -216926 -516857 -594214 -329636
9623c29636J56448J18090r9257l05425l1327J51849Q6095R4850q0808j585J49008
$$ -329636 -173188 -55098 -154355 -459780 -491107 -339258 -253163 -158313 -239121 -240706 -91698
9612i1698l4064k39241J41196J93976M3183R276J59319K54563q0791k25618k9427
$$ -91698 -125762 -365003 -223807 -29831 13352 22628 181947 436510 355719 130101 100674
9601A00674l8546m0288M1779Q9412J46204J08001k8792k22395k85584n7090J07062
$$ 100674 62128 21840 63619 153031 299235 407236 378444 156049 -129535 -186625 -79563
9590g9563o7754k49237j22276J82358L78127K00635J02279P8616J09255J36445
$$ -79563 -147317 -396554 -518830 -336472 41655 242290 344569 423185 532440 668885
9580F68885j89605j85443p6909l7249j34008o9921K1791o6583n2460J02405M9555
$$ 668885 479280 293837 216928 179679 45671 -24250 -2459 -69042 -121502 -19097 30458
9569C0458l1814j26440R368L0784k7304k82189J4253M03055K22898m4804m4180
$$ 30458 -1356 -127796 -118428 -87644 -114948 -397137 -382884 20171 243069 198265 154085
9558A54085r958n3068J9924J07776J14869Q7010k27596k46067R6015K42583K58201
$$ 154085 144127 91059 110983 218759 333628 420638 193042 -53025 42990 285573 543774
9547E43774L80972l4548l47282l39213k59382k64051j66752K22441J47842J02823
$$ 543774 924746 890198 542916 203703 -55679 -319730 -486482 -264041 -116199 -13376
9537a3376K84538J32743n9155m18398m64987l28301k9657K37771P1613M7709Q1504
$$ -13376 271162 403905 344750 -73648 -538635 -866936 -896593 -658822 -587209 -539500 -457996
9526d57996J50068J59162J30313J10127o8834o3176j20188l26389k68736K7088
$$ -457996 -307928 -148766 -18453 91674 22840 -40336 -160524 -486913 -755649 -728561
9516g28561J66914K31631L34321P9208r134P0191j86453k20883j47429k18116
$$ -728561 -561647 -330016 4305 83513 74379 144570 -41883 -262766 -410195 -628311
9506f28311N9349R1041O7809J60166n4585q2746r7975r5652P1873J92013J89449
$$ -628311 -568962 -477921 -410112 -249946 -304531 -387277 -485252 -580904 -509031 -317018 -127569
9495a27569P1103j84261l67080j50789O3462J83973J67943J39214j2418J6235
$$ -127569 -56466 -240727 -607807 -758596 -695134 -511161 -343218 -204004 -216422 -200187
9485b00187J11023J356p2219R8398J68441j5153l38617k65186L7291P4511J21892
$$ -200187 -89164 -87808 -160027 -61629 106812 91659 -246958 -512144 -474853 -400342 -278450
9474b78450R8136Q5473J61976O5973R159j72297r1965K19129J22046k29663l30570
$$ -278450 -180314 -94841 67135 133108 142267 -30030 -121995 97134 219180 -10483 -341053
9463c41053j0138J14479P4669M0219r0455q871L478j15495j90267m0510J18498
$$ -341053 -351191 -236712 -162043 -121824 -212279 -221150 -217672 -333167 -523434 -563944 -445446
9452d45446K17388p6422j87219j36175r5197q6809m9511n2447m8826J22030Q4293
$$ -445446 -228058 -304480 -491699 -627874 -723071 -809880 -859391 -911838 -960664 -838634 -754341
9441g54341p4338J00654K29892N0873O0296J9392o0709j57734r0735O1159O0132
$$ -754341 -828679 -728025 -498133 -447260 -386964 -367572 -428281 -586015 -676750 -615591 -555459
9430e55459K68213J21244j37110j24409J49291J31930J41356R2966L9720J74691
$$ -555459 -287246 -166002 -303112 -427521 -278230 -146300 -4944 88022 127742 302433
9420C02433p2476j31616J57395o688q0798O9563o9053k67235j56556L41726K70155
$$ 302433 229957 98341 255736 249048 168250 237813 168760 -98475 -255031 86695 356850
9409C56850M3604J33749j2009q6729J06967p8887j26823O6333P4893j48190p6290
$$ 356850 400454 534203 522194 435465 542432 463545 336722 403055 477948 329758 253468
9398B53468O049m4721P3314J15260m5573k34913M6800R9623k19127j84403o9482
$$ 253468 259517 214796 288110 403370 357797 122884 169684 269307 50180 -134223 -203705
9387b03705k42136k14012r5880K08219K52093j58514J48556k0599j13602O3856
$$ -203705 -445841 -659853 -755733 -547514 -295421 -453935 -305379 -325978 -439580 -375724
9377c75724N16K94M8744L7126p6667O2371J21762Q1585K27569J86209P5636n1973
$$ -375724 -375208 -374914 -326170 -289044 -365711 -303340 -181578 -99993 127576 313785 389421 337448
9365C37448J14512K08339p2145j86895K0773K1017r1889n8015M4284q16l6947
$$ 337448 451960 660299 588154 401259 422032 443049 351160 293145 337429 336613 299666
9354B99666k0347o4225r3607J9447J33127L4362j61151j83960j47672j48543K87161
$$ 299666 279319 215094 121487 140934 274061 308423 147272 -36688 -184360 -332903 -45742
9343d5742M27467j17762l82119j17148k9704J94787L20578J37785J51328J2937
$$ -45742 381725 263963 -118156 -235304 -265008 -70221 250357 388142 539470 552407
9333E52407j87983k63755k40768k71348j34342J28800K20366J66489J21723l3620
$$ 552407 364424 100669 -140099 -411447 -545789 -416989 -196623 -30134 91589 57969
9323E7969j57566m5309o714k22637k67788M2183J19701J4361j18321k4998K65021
$$ 57969 -99597 -144906 -151620 -374257 -642045 -599862 -480161 -465800 -584121 -609119 -344098
9312c44098L67198r695j41192j24852j80846n5326K31518L03328J51858n5409
$$ -344098 23100 13405 -127787 -252639 -433485 -488811 -257293 46035 197893 142484
9302A42484j30479j41120O3j4788r3608J81115K35989M1906q7255p5771J18310
$$ 142484 12005 -129115 -129052 -143840 -237448 -56333 179656 221562 134307 58536 176846
9291A76846K01078J58839J801o3822j21860k40889k17075k1536R3233j0467M1071
$$ 176846 377924 536763 538564 474742 352882 111993 -105082 -126618 -33385 -43852 -2781
9280b781J02361j54548j46585J02357J21503q6178j86081m3664j13322j40557
$$ -2781 99580 -54968 -201553 -99196 22307 -63871 -249952 -293616 -406938 -547495
9270e47495q6622P2213K361j61010K407J62777P8801L765Q978n2955M7409K45108
$$ -547495 -634117 -561904 -559543 -720553 -718146 -555369 -476568 -472803 -463825 -516780 -469371 -224263
9258b24263O0139J4755J03100K6445R698J36512R9711j29721j86927J3507L28031
$$ -224263 -164124 -149369 -46269 -19824 -10126 126386 226097 96376 -90551 -77044 250987
9247B50987J38339o2856j04423K3762l3196k13069j35716M568P8798P5016n3950
$$ 250987 389326 326470 222047 245809 212613 -456 -136172 -131604 -52806 22210 -31740
9236c1740l3510j14367n3516r5198j39102M7793P6786q6174l1735Q5604J3028
$$ -31740 -65250 -179617 -233133 -328331 -467433 -419640 -342854 -429028 -460763 -375159 -362131
9225c62131J22056K74616J26835j29023k21678l44140j94436n6873P8543j67385
$$ -362131 -240075 34541 161376 32353 -189325 -533465 -727901 -784774 -706231 -873616
9215h73616o6625J88560J02745J02648J47436P7500r055K67181L66665J35313
$$ -873616 -940241 -751681 -648936 -546288 -398852 -321352 -330407 -63226 303439 438752
9205D38752j33637l29916q6739L0947Q0083Q2689K3715k70506k52393p6589o940
$$ 438752 305115 -24801 -111540 -80593 -510 82179 105894 -164612 -417005 -493594 -500534
9194e00534m6385K1881K19532J33770n4612j85284r3186M5208J26878J1356l4439
$$ -500534 -546919 -525038 -305506 -171736 -226348 -411632 -504818 -459610 -332732 -321376 -355815
9183c55815m2328k4710l9397R1601K27263O6449o8425j38480J0817K33385K49215
$$ -355815 -398143 -422853 -462250 -370649 -143386 -76937 -145362 -283842 -273025 -39640 209575
9172B09575q6660k29688O7655P5725O2163R1572l8163j0717k75333n12097l26834
$$ 209575 122915 -106773 -39118 36607 98770 190342 152179 141462 -133871 -645968 -972802
9161i72802K4585J87811K3933j2675J27673J74005K15326J73051J43154Q711J96246
$$ -972802 -948217 -760406 -736473 -749148 -621475 -447470 -232144 -59093 84061 92772 289018
9150B89018L16271r64l32830j98890L6487K15301P607l06360l4944K7407j22103
$$ 289018 605289 604325 271495 72605 109092 324393 332000 25640 -9304 18103 -104000
9139a04000m2746j79236j36548m1762j14786J04686J67827P0027q7656J04309
$$ -104000 -146746 -325982 -462530 -504292 -619078 -514392 -346565 -276538 -364194 -259885
9129b59885J02386J5674q0661r2880q2428j18363J52102K24057J68436M2330M3991
$$ -259885 -157499 -141825 -222486 -315366 -397794 -516157 -364055 -139998 28438 70768 114759
9118A14759J57967J9266j28029n1976K5844j37199j10190q8654k38283j57443
$$ 114759 272726 291992 163963 111987 137831 632 -109558 -198212 -436495 -593938
9108e93938J64757K2690K9511k6040p094J19674R363J08757L15847J06111p4252
$$ -593938 -429181 -406491 -376980 -403020 -410114 -290440 -281077 -172320 143527 249638 175386
9097A75386j14505j06505j66256j29396M9933L08291K18477J1091m3196o2428
$$ 175386 60881 -45624 -211880 -341276 -291343 16948 235425 246516 203320 140892
9087A40892K5740j6755j56552j63217o4133l6692L9162J48016J09623n0744O273
$$ 140892 166632 149877 -6675 -169892 -234025 -270717 -231555 -83539 26084 -24660 -18387
9076a8387J30460Q9153j59517m5739j07978k48906n6815J61631j0327n4467R8166
$$ -18387 112073 201226 41709 -4030 -112008 -360914 -417729 -256098 -266425 -320892 -222726
9065b22726J05924r6925k38575j61473J9897q5928l9378K37300J02202q2274k2171
$$ -222726 -116802 -213727 -452302 -613775 -593878 -679806 -719184 -481884 -379682 -461956 -484127
9054d84127M4475M7845K09601J78321q0853k45484p252J40824O3076m4127O87
$$ -484127 -439652 -391807 -182206 -3885 -84738 -330222 -337474 -196650 -133574 -177701 -177014
9043a77014O6860J66063P843o5440j94746l87348j53519J34564J28507r653m4078
$$ -177014 -110154 55909 63752 -1688 -196434 -583782 -737301 -602737 -474230 -483883 -527961
9032e27961r6509n9481o6334K03738K52877J90989N8950J02045o655R9927R0334
$$ -527961 -624470 -683951 -750285 -546547 -293670 -102681 -43731 58314 51659 151586 241920
9021B41920j8448L4179k80468m79405k22597K06263N06546P4918l41788p7441
$$ 241920 223472 257651 -22817 -502222 -724819 -518556 -12010 62908 -278880 -356321
9011c56321K16532J56552R3848J02676k28884j71022j41916J67266J49509l5623
$$ -356321 -139789 16763 110611 213287 -15597 -186619 -328535 -161269 -11760 -47383
9001d7383j28272j92799O7477K62172K61629R0202j23615n6492k14926k29050
$$ -47383 -175655 -368454 -300977 -38805 222824 313026 189411 132919 -82007 -311057
8991c11057l6603Q8861K86401J67477L7599j99295N7014J30361j25399j89468
$$ -311057 -347660 -258799 27602 195079 232678 33383 90397 220758 95359 -94109
8981i4109R4009K13699L7349N8793m768j54480p7410o6330j69291k30758r3017
$$ -94109 -100 213599 250948 309741 304973 150493 73083 6753 -162538 -393296 -486313
8970d86313n4456k04617m5849J85134K50583K45083J10615P7565o1113j60657
$$ -486313 -540769 -745386 -791235 -606101 -355518 -110435 180 77745 16632 -144025
8960a44025L0848p5453o2280R7242N4335J7654L2379K04097O2576k0098k7403
$$ -144025 -113177 -188630 -250910 -153668 -99333 -81679 -49300 154797 217373 197275 169872
8949A69872j10631o5152J2067R6286J01065K5629j06690J27404K86168p41j45361
$$ 169872 59241 -5911 6156 102442 203507 229136 122446 249850 536018 535277 389916
8938C89916J03817J46772K0043k00577k89482j03448N9374J96487R8912r2130
$$ 389916 493733 640505 660548 459971 170489 67041 126415 322902 421814 329684
8928C29684j81445p9843K7372k1758l3421j19644J03224O6357K4589P4059j36251
$$ 329684 148239 68396 95768 74010 40589 -79055 24169 90526 115115 189174 52923
8917E2923o6028J98251J26778j57138j97578M3932J94791J03637q8427k11654
$$ 52923 -13105 185146 311924 154786 -42792 1140 195931 299568 211141 -513
8907e13q2959j05843o4469n1891j51461k91099j17512K72898P7797r3080r7283
$$ -513 -83472 -189315 -253784 -305675 -457136 -748235 -865747 -592849 -515052 -608132 -705415
8896g05415J25428J15962Q0378P5479K6478L74897M56268L17039J41086q1801
$$ -705415 -579987 -464025 -383647 -308168 -281690 93207 549475 866514 1007600 925799
8886I25799k00200l84843l46274q0818M32311J10714m9312N0237m2566m7440p8784
$$ 925799 725599 340756 -5518 -86336 345975 456689 407377 457614 415048 367608 288824
8875B88824k14431j28035J25357R9956k29963l48569k02600n3374l5296o7082
$$ 288824 74393 -53642 71715 171671 -58292 -406861 -609461 -662835 -698131 -765213
8865g65213J78171K25997M4696n3682J46197n3736j92575K15346L27098K10396
$$ -765213 -587042 -361045 -316349 -370031 -223834 -277570 -470145 -254799 72299 282695
8855B82695J39004K3051l11324l23064r989J95508J47749J69539j29288k68311
$$ 282695 421699 444750 133426 -189638 -199627 -4119 143630 313169 183881 -84430
8845h4430k19911k54626o9420P0288J790O98K58245K76243L6801q731k7004j60994
$$ -84430 -304341 -558967 -628387 -558099 -556309 -555611 -297366 -21123 15678 6947 -20057 -181051
8833a81051j30932j22012J7666k2208j85708j26970r8366K8366K34244K83717
$$ -181051 -311983 -433995 -416329 -438537 -624245 -751215 -849581 -821215 -586971 -303254
8823c03254K63507J85381R8568Q952O1341R2499P6082r793j30929R9190K3701
$$ -303254 -39747 145634 244202 253154 314495 406994 483076 473283 342354 441544 465245
8812D65245r2291j05294j22808j01592o7086R7670J11048J53044O6250k87232
$$ 465245 372954 267660 144852 43260 -23826 73844 184892 337936 404186 116954
8802A16954l01734k13661j14230R0668J94084J62604Q0442R845o7149L6880j9238
$$ 116954 -184780 -398441 -512671 -422003 -227919 -65315 15127 24972 -42177 -5297 -24535
8791b4535j96339J20120M46253K9130j35757j19064Q2809M5410q9108j76963j6004
$$ -24535 -220874 -100754 345499 374629 238872 119808 202617 248027 158919 -18044 -34048
8780c4048O1175j14599j73166L4560j20845k75406l4086K07524J35075J18000
$$ -34048 27127 -87472 -260638 -226078 -346923 -622329 -656415 -448891 -313816 -195816
8770a95816J60896q5189j92918L7276Q0392Q7439K4709p4091m5565j6197j24264
$$ -195816 -34920 -120109 -313027 -275751 -195359 -107920 -83211 -157302 -202867 -219064 -343328
8759c43328j25000k5025o191r8876r6031J44139J97095J10580j0089k27450k97232
$$ -343328 -468328 -493353 -499544 -598420 -694451 -550312 -353217 -242637 -252726 -480176 -777408
8748g77408Q5339K12793n1405R715Q4096J39051K18026J07135j49187j10147m2816
$$ -777408 -692069 -479276 -530681 -520966 -436870 -297819 -79793 27342 -121845 -231992 -274808
8737b74808J33457L36681Q2039j70742p4043P0305j23215k39002k58033o7340
$$ -274808 -141351 195330 277369 106627 32584 102889 -20326 -259328 -517361 -584701
8727e84701J07043J41006K74239N722M5513L6365m4675k2994l8181M3939J11611
$$ -584701 -477658 -336652 -62413 -56691 -11178 25187 -19488 -42482 -80663 -36724 74887
8716G4887O5764J82738J63699M1951l58041m34841j16339K34582K68887P3106
$$ 74887 140651 323389 487088 529039 170998 -263843 -380182 -145600 123287 196393
8706A96393J56333R7525p1012q3529R5487j14114l82951j21090n3264J33811L53635
$$ 196393 352726 450251 379239 295710 391197 277083 -105868 -226958 -280222 -146411 207224
8695B07224l6940j86178j68778j5823p2641j19732m4407j50500j08063k1051K63613
$$ 207224 170284 -15894 -184672 -200495 -273136 -392868 -437275 -587775 -695838 -716889 -453276
8684d53276O7039k67497o8366K69428M62316R8107j73934j59829M5359J75134
$$ -453276 -386237 -653734 -722100 -452672 9644 107751 -66183 -226012 -180653 -5519
8674e519K69432J6751k15691j68732k15593j35504O5400L42514K61251j07406
$$ -5519 263913 280664 64973 -103759 -319352 -454856 -389456 -46942 214309 106903
8664A06903k01830k58250k82200R7555J80396k8924R2486J33881K07451J17855
$$ 106903 -94927 -353177 -635377 -537822 -357426 -386350 -293864 -159983 47468 165323
8654A65323o6170k7076j4843k8768J19568j77069k40490p9370Q5807J97908J66030
$$ 165323 99153 72077 57234 28466 148034 -29035 -269525 -348895 -263088 -65180 100850
8643A00850O9336k6852j30188N0160k5267j40124k71953r3023J71988J20004K6981
$$ 100850 170186 143334 13146 63306 38039 -102085 -374038 -467061 -295073 -175069 -148088
8632a48088J48318J59761l0181n48j09314q3611j19203o4226M0033p6037j10850
$$ -148088 230 159991 129810 129262 19948 -63663 -182866 -247092 -207059 -283096 -393946
8621c93946o7543j75734j31463M9368K27664L03611J65849m6425J50442Q8803
$$ -393946 -461489 -637223 -768686 -719318 -491654 -188043 -22194 -68619 81823 170626
8611A70626j31800j58095j28644n3791J0206l2596n596j2711Q1200N8370k23529
$$ 170626 38826 -119269 -247913 -301704 -291498 -324094 -329690 -342401 -261201 -202831 -426360
8600d26360j74984q9279j24452q1162P4142J39458r1733O2828K38528K97784K93493
$$ -426360 -601344 -690623 -815075 -896237 -822095 -682637 -774370 -711542 -473014 -175230 118263
8589A18263m2345n6968J56132K30000R4749j18541k32455k6264j7014J15692K16166
$$ 118263 75918 18950 175082 405082 499831 381290 148835 122571 105557 221249 437415
8578D37415l6590k21413l33437l14257r8912J19025L27332K12027m0509L2057
$$ 437415 400825 179412 -154025 -468282 -567194 -448169 -120837 91190 50681 82738
8568H2738j05767l04103q1115J4019l5191N2356J51695N5357n3572j0363p5791
$$ 82738 -23029 -327132 -408247 -394228 -429419 -377063 -225368 -170011 -223583 -233946 -309737
8557c09737j54764l2222M2411O1025R0126m475p7378P1495J89767K14058O4044
$$ -309737 -464501 -496723 -454312 -393287 -303161 -307636 -385014 -313519 -123752 90306 154350
8546A54350j58334r3497N6596j4284k76175j18372K74416J16277l27859k56972
$$ 154350 -3984 -97481 -40885 -55169 -331344 -449716 -175300 -59023 -386882 -643854
8536f43854J97345L55094J10254j89307K8847J91372J66928M0836J15041J31064
$$ -643854 -446509 -91415 18839 -170468 -141621 49751 216679 257515 372556 503620
8526E03620P952k47214l75533k40168O1084L81362K06386L1902L6743m6513P8534
$$ 503620 511572 264358 -111175 -351343 -290259 91103 297489 329391 366134 319621 398155
8515C98155J04409j23048k15886j86308j42328r9612p1647J71906N3190J62625
$$ 398155 502564 379516 163630 -22678 -165006 -264618 -336265 -164359 -111169 51456
8505E1456M17724K64931q941j80925p5948r5271k31883l83581k42588j83529j80361
$$ 51456 469180 734111 725170 544245 468297 373026 141143 -242438 -485026 -668555 -848916
8494h48916O7844M17668N11107K77765m4974k38108k21641k87085j50222K19367
$$ -848916 -781072 -363404 147703 425468 380494 142386 -79255 -366340 -516562 -297195
8484b97195J00379o6108K2352K14208J59595R6262P7014m9454j09275J26985Q4690
$$ -297195 -196816 -262924 -240572 -26364 133231 229493 306507 257053 147778 274763 359453
8473C59453K7605j11574K4357J8495m6119k2427j53894j40447J45288K26999N0083
$$ 359453 387058 275484 299841 318336 272217 249790 95896 -44551 100737 327736 377819
8462C77819J6105j89928j29478J26287j29808q2601K02014L7779j90506l49112
$$ 377819 393924 203996 74518 200805 70997 -11604 190410 228189 37683 -311429
8452c11429j13966J40636j571P866L7482K4526j02473R4361L64321j5188m57093
$$ -311429 -425395 -284759 -286330 -278464 -240982 -216456 -318929 -224568 139753 124565 -332528
8441c32528k82737j23852r325J93831L61793L29880m7224j60587p4306L3999K05157
$$ -332528 -615265 -739117 -748442 -554611 -192818 137062 89838 -70749 -145055 -111056 94101
8430I4101P2212n9270J90918J87812m1591j01400K49461L96142J05276j66497
$$ 94101 166313 107043 297961 485773 444182 342782 592243 988385 1093661 927164
8420I27164k63009k76565j53987M2955Q9511p3709l6587J42376M619k30454k05350
$$ 927164 664155 387590 233603 276558 366069 292360 255773 398149 402768 172314 -33036
8409c3036k40254j05832J1910q0760j80536j59355J89135M21238L12085J14209
$$ -33036 -273290 -379122 -367212 -447972 -628508 -787863 -598728 -177490 134595 248804
8399B48804l7469O6020l0755J1804O2133j85631j59614J2457j70759k35510K26293
$$ 248804 211335 277355 246600 258404 320537 134906 -24708 -12251 -183010 -418520 -192227
8388a92227L64528J7423k37518o6652n5686l0275M1873K2052j42139j40247K2040
$$ -192227 172301 189724 -47794 -114446 -170132 -200407 -158534 -136482 -278621 -418868 -396828
8377c96828J00341p6004L32226N31202K46481J16961J39141Q7719M8604L4178
$$ -396828 -296487 -372491 -40265 490937 737418 854379 993520 1081239 1129843 1164021
8367A164021j40480q4722l709j27804q2175J10924j43594j33920k70602j60065
$$ 1164021 1023541 938819 935110 807306 725131 836055 692461 558541 287939 127874
8357A27874j20874J35526K68913J22244j9835j23793j14929n0467n9225k6144
$$ 127874 7000 142526 411439 533683 513848 390055 275126 224659 165434 139290
8347A39290R1923J63787L59351K75523m9497k98073k94945K3106R017q5509k7718
$$ 139290 231213 395000 754351 1029874 980377 682304 387359 410465 419482 333973 306255
8336C06255J30105J43867o0616n2211J81323m110j08888j6192k0681j251L5474
$$ 306255 436360 580227 519611 467400 648723 644613 535725 519533 498852 497601 533075
8325E33075K42536K34562l4705j88565n3088j01994q1372m8185k12072p5116j4674
$$ 533075 775611 1010173 975468 786903 733815 631821 550449 502264 290192 215076 200402
8314B00402K7184L59058K35970j39625N0062o1099l83750j36330L8771K5273P3610
$$ 200402 227586 586644 822614 682989 733051 671952 288202 151872 190643 215916 289526
8303B89526R9335K00220j51614k44965k4184R6699J07370P9328j2105L0137J09088
$$ 289526 388861 589081 437467 192502 168318 265017 372387 451715 439610 469747 578835
8292E78835K33667K08508K5993j49349K0706k3167j23472K5704l0099P1049l3890
$$ 578835 812502 1021010 1047003 897654 918360 895193 771721 797425 767326 838375 804485
8281H04485j60841k55185n3732l9601P0569K99117J46515n6409l7386N3443J90317
$$ 804485 643644 388459 334727 295126 365695 664812 811327 754918 717532 770975 961292
8270I61292K25201j59952j87564J46895K38226J81357j32320l23294k52254o282
$$ 961292 1186493 1026541 838977 985872 1224098 1405455 1273135 949841 697587 691305
8260F91305K17914L42088K08864J55553N4850q3763K2964m1492j71213j54903
$$ 691305 909219 1251307 1460171 1615724 1670574 1586811 1609775 1568283 1397070 1242167
8250A242167l49497j83389J20395K45809O1815J44195m4711j03244J83846l922
$$ 1242167 892670 709281 829676 1075485 1137300 1281495 1236784 1133540 1317386 1313464
8240A313464q7825Q1938Q0925j40148k46668k71003j54356K633N2862P292j03843
$$ 1313464 1225639 1307577 1388502 1248354 1001686 730683 576327 578960 631822 639114 535271
8229E35271j09854J68637L65107K96752n2014k86279r1666N5408K72250J78625
$$ 535271 425417 594054 959161 1255913 1203899 917620 825954 881362 1153612 1332237
8219A332237k07392o5212K86695J55348j49114k2985O4631o8907j7497R6156p0221
$$ 1332237 1124845 1059633 1346328 1501676 1352562 1329577 1394208 1325301 1307804 1403960 1333739
8208A333739k63781k37814k14465M7743J62326J43818J18831L8858k7956J50941
$$ 1333739 1069958 832144 617679 665422 827748 971566 1090397 1129255 1101299 1252240
8198A252240J99843j72233j74411O3605p2486n4067r5546j37155K1716K7313O2142
$$ 1252240 1452083 1279850 1105439 1169044 1096558 1042491 946945 809790 831506 858819 920961
8187I20961O367o9824O3598J45152K084r9592m1147L6488R6684L5798P8512k8213
$$ 920961 927328 857504 921102 1066254 1068338 968746 927599 964087 1060771 1096569 1175081 1146868
8175A146868j12597J30607K38489j7487J18020R2784k01422j92558k23051J74531
$$ 1146868 1034271 1164878 1403367 1385880 1503900 1596684 1395262 1202704 979653 1154184
8165A154184K91889J41959r2429k56724q2743R3771J54605l5411N5004J60980
$$ 1154184 1446073 1588032 1495603 1238879 1156136 1249907 1404512 1369101 1424105 1585085
8155A585085r4731l98457k80377K2228J05474P7080J14863q3600j95058P34J85846
$$ 1585085 1490354 1091897 811520 833748 939222 1016302 1131165 1047565 852507 853241 1039087
8144A039087J43294J05434j3765N7233K07752Q7100k50252l84394j28134m0174
$$ 1039087 1182381 1287815 1274050 1331283 1539035 1626135 1375883 991489 863355 823181
8134H23181q2483K20846L21394K91409J08983P3382K15275p6237j66792l3217
$$ 823181 740698 961544 1282938 1574347 1683330 1756712 1971987 1895750 1728958 1695741
8124A695741q8296l24251R503L37099J20915P9012R4159J1400r3239j03493m5111
$$ 1695741 1607445 1283194 1292697 1629796 1750711 1829723 1923882 1935282 1842043 1738550 1693439
8113A693439O7808M4585j26749j02507L7192K16679K4158j08032m1804R0479k432
$$ 1693439 1761247 1805832 1679083 1576576 1613768 1830447 1854605 1746573 1704769 1795248 1792816
8102A792816J9528N3614j04038M0533K42086K23377K5574j59549m27340l89528
$$ 1792816 1812344 1865958 1761920 1802453 2044539 2267916 2293490 2133941 1706601 1317073
8092A317073O9543J97392R7924J26251K38964K5282k46008k71111n9527J34515
$$ 1317073 1386616 1584008 1681932 1808183 2047147 2072429 1826421 1555310 1495783 1630298
8082A630298J72129R1731p9391l56159J19932M47604L01528J10407J12105M3399
$$ 1630298 1802427 1894158 1814767 1458608 1578540 2026144 2327672 2438079 2550184 2593583
8072B593583p3678j05502k5353j33630J9173L33965R5048J30929P9195j02993
$$ 2593583 2519905 2414403 2389050 2255420 2274593 2608558 2703606 2834535 2913730 2810737
8062B810737k73597j08093P6103J02486J28265j27287p175J10101L43196L25324
$$ 2810737 2537140 2429047 2505150 2607636 2735901 2608614 2601439 2711540 3054736 3380060
8052C380060j23368l27773j98935P7683K04174L32018L27226J30139j43724m97313
$$ 3380060 3256692 2928919 2729984 2807667 3011841 3343859 3671085 3801224 3657500 3160187
8042C160187m93586k03754J39495K62638J64395J41703J36961K74351K39793O5385
$$ 3160187 2666601 2462847 2602342 2864980 3029375 3171078 3308039 3582390 3822183 3887568
8032C887568p8340M8536K87674Q1914j38904J3591K6799j29301l772J91558L43053
$$ 3887568 3809228 3857764 4145438 4227352 4088448 4102039 4128838 3999537 3995765 4187323 4530376
8021D530376K70424M6934J73369L36913J97636J20244K05092J44933K98148L78333
$$ 4530376 4800800 4847734 5021103 5358016 5555652 5675896 5880988 6025921 6324069 6702402
8011F702402M03197O43852O47574P48975Q38533J053335J285568J322370J480223
$$ 6702402 7105599 7749451 8397025 9146000 9984533 11037868 12323436 13645806 15126029
8002A5126029J840338K453784K903752L786135M407481M835674N573013N737990
$$ 15126029 16966367 19420151 22323903 26110038 30517519 35353193 40926206 46664196
7994D6664196M926429L416351J549158j051484l029186m245765n041142n106705
$$ 46664196 51590625 55006976 56556134 55504650 52475464 48229699 43188557 38081852
7986C8081852m613132m034047l268851k642340k136246j709974j376772j013237
$$ 38081852 33468720 29434673 26165822 23523482 21387236 19677262 18300490 17287253
7978A7287253q71161o06881k81432l03743o0884M2619j95417l61694k68235k10538
$$ 17287253 16416092 15809211 15527779 15224036 15163152 15205771 15010354 14648660 14380425 14169887
7968A4169887l01446l30916l61125k47392j52460J02635K72545L58787K98530
$$ 14169887 13868441 13537525 13176400 12929008 12776548 12879183 13151728 13510515 13809045
7959A3809045N59320P12028P54962P13021Q38074J004708J108620J608920K029926
$$ 13809045 14368365 15080393 15835355 16548376 17386450 18391158 19499778 21108698 23138624
7950B3138624K367779K682591L152665M062963N082116N831057O762685Q746512
$$ 23138624 25506403 28188994 31341659 35404622 40486738 46317795 53080480 61826992
7942F1826992J1202409J3827183J6074905J7496977J7278265J4721185R973987
$$ 61826992 73029401 86856584 102931489 120428466 137706731 152427916 162401903
7935A62401903L716812l363299j0087096j4471468j6207365j6128801j4634393
$$ 162401903 166118715 162755416 152668320 138196852 121989487 105860686 91226293
7928I1226293j2406887j0129936q102212o567397n215098m324486l577985k717213
$$ 91226293 78819406 68689470 60587258 54019861 48804763 44480277 40902292 38185079
7920C8185079k170078j842464j562944j086553n35659k46918R807l98911q21379
$$ 38185079 36015001 34172537 32609593 31523040 30987381 30740463 30750270 30351359 29529980
7911B9529980q29619p48634q11609p07342n33088m54402k41581L7052M72847P77839
$$ 29529980 28700361 27951727 27140118 26432776 25899688 25445286 25203705 25240757 25713604 26491443
7901B6491443R15098J244794J427418J607907J942393K434340K894646L368894
$$ 26491443 27406541 28651335 30078753 31686660 33629053 36063393 38958039 42326933
7893D2326933L924432M891368O091120P542008R350518J1442634J4309082J8191030
$$ 42326933 46251365 51142733 57233853 64775861 74126379 85569013 99878095 118069125
7885A18069125K3028500K8181267L2417374L4930870L4669951K9852610J9896064
$$ 118069125 141097625 169278892 201696266 236627136 271297087 301149697 321045761
7878C21045761O286014q135444k0733915k9310512l3106590l2821121k9644050
$$ 321045761 327331775 319196331 298462416 269151904 236045314 203224193 173580143
7871A73580143k5299966k0739992j6810745j3615496j0858033q587408o945302
$$ 173580143 148280177 127540185 110729440 97113944 86255911 77668503 70723201
7864G0723201n721301m603341l761439k899890j997584j465289j558139j639649
$$ 70723201 65001900 60398559 56637120 53737230 51739646 50274357 48716218 47076569
7856D7076569j594579j706654j755253j786130j601343j449305j097313q27371
$$ 47076569 45481990 43775336 42020083 40233953 38632610 37183305 36085992 35258621
7848C5258621o71390r7403J95200M06286N96354J021988J420245J812314J869800
$$ 35258621 34587231 34489828 34685028 35091314 35687668 36709656 38129901 39942215 41812015
7839D1812015K538405L377456L987884M573443N608369P087115Q723064J0788275
$$ 41812015 44350420 47727876 51715760 56289203 61897572 68984687 77707751 88496026
7831H8496026J3475255J7218539K1610137K6837351L2472162L7735851M0944688
$$ 88496026 101971281 119189820 140799957 167637308 200109470 237845321 278790009
7824B78790009M0303435L4374080K2678729O846760j0419746k5181727l5151126
$$ 278790009 319093444 353467524 376146253 382993013 372573267 347391540 312240414
7817C12240414l9587327l8997415l5025173k9682385k4395350j9715808j6048710
$$ 312240414 272653087 233655672 198630499 168948114 144552764 124836956 108788246
7810A08788246j3009724j0449833q668908p229384n912702m604227l670620k948710
$$ 108788246 95778522 85328689 76659781 69430397 63517695 58913468 55242848 52294138
7802E2294138k368174k212047k135316k048795j825137j689252j695041j596898
$$ 52294138 49925964 47713917 45578601 43529806 41704669 40015417 38320376 36723478
7794C6723478j554918j234411r14434n45281m26902j46921K71385L97884P80020
$$ 36723478 35168560 33934149 33019715 32474434 32047532 31900611 32171996 32569880 33349900
7785C3349900J050874J346891J782931K025950K654406L346837L909907M613435
$$ 33349900 34400774 35747665 37530596 39556546 42210952 45557789 49467696 54081131
7777E4081131N641473P449785R454417J1826271J5002523J8563964K2755364K7440415
$$ 54081131 59722604 67172389 76626806 88453077 103455600 122019564 144774928 172215343
7769A72215343L2171429L4768054L3921156K8545466J8519827N289954r161522
$$ 172215343 204386772 239154826 273075982 301621448 320141275 325431229 316269707
7762C16269707k1828842l0439727l3922199l3220420k9841508k5337237k0945594
$$ 316269707 294440865 264001138 230078939 196858519 167017011 141679774 120734180
7755A20734180j7092796j3832876j1181568r205915p570852o192352n085131m304001
$$ 120734180 103641384 89808508 78626940 69421025 61850173 55657821 50572690 46268689
7747D6268689l702771l098580k653749k226604j814612j746341j776094j676413
$$ 46268689 42565918 39467338 36813589 34586985 32772373 31026032 29249938 27573525
7739B7573525j375148j160466j068447r01328q09836o55564m36573l21326j24503
$$ 27573525 26198377 25037911 23969464 23068136 22258300 21602736 21166163 20844837 20720334
7730B0720334R6430J48892L65363P23029J020817J147966J132853J278756J873576
$$ 20720334 20816764 20965656 21331019 22054048 23074865 24222831 25355684 26634440 28508016
7721B8508016K262096K706693L526954M609848N873632P459498R218430J1412803
$$ 28508016 30770112 33476805 37003759 41613607 47487239 54946737 64165167 75577970
7713G5577970J3892505J5816673J6899110J6732239J4052960Q904592K066139
$$ 75577970 89470475 105287148 122186258 138918497 152971457 161876049 163942188
7706A63942188n214414j1250266j5152470j6954700j6693943j5074486j2786544
$$ 163942188 158727774 147477508 132325038 115370338 98676395 83601909 70815365
7699G0815365j0493769q773952p115468n634386m518937l735557l283754k825800
$$ 70815365 60321596 51547644 44432176 38797790 34278853 30543296 27259542 24433742
7691B4433742k256539j948859j799101j367562j234856j150251p89079n65591
$$ 24433742 22177203 20228344 18429243 17061681 15826825 14676574 13887495 13321904
7683A3321904m94149m98317p11603q44520n53231k44452r8401j72961j72901p0783
$$ 13321904 12827755 12329438 11617835 10773315 10220084 9975632 9877231 9704270 9531369 9460586
7673I460586k03848j86227K33298M11221K44025K75435K51025J06508L39539Q94391
$$ 9460586 9256738 9070511 9303809 9715030 9959055 10234490 10485515 10592023 10931562 11825953
7663A1825953R74461J083791J661987K183520K465522K849852L620562M379220
$$ 11825953 12800414 13884205 15546192 17729712 20195234 23045086 26665648 31044868
7655C1044868M837504N127638N167588M523886K812042O51105j716336l795689
$$ 31044868 35882372 41010010 46177598 50701484 53513526 54164631 52448295 48652606
7647D8652606n035451n263295n225408m925610m346294l623300k906470k334975
$$ 48652606 43617155 38353860 33128452 28202842 23856548 20233248 17326778 14991803
7639A4991803j800435j473687j218230j135680r35981p25910o74361o67641m04530
$$ 14991803 13191368 11717681 10499451 9363771 8427790 7701880 7027519 6359878 5955348
7630E955348l95213o33120m85464m13010k07829l1149l09643m45362k23233j52331
$$ 5955348 5560135 4927015 4441551 4028541 3820712 3789563 3479920 3034558 2811325 2658994
7620B658994j44013J11530J50125J10094j12601j61980j56263k42340j77860j8500
$$ 2658994 2514981 2626511 2776636 2886730 2774129 2612149 2455886 2213546 2035686 2017186
7610B017186J18034K73207J93633j03113j85571j16154p8612p8439J24008K7068
$$ 2017186 2135220 2408427 2602060 2498947 2313376 2197222 2118610 2040171 2164179 2191247
7600B191247k45925j54869p3150n5086r9884L6396j5722p0305j1002q0010n6596
$$ 2191247 1945322 1790453 1717303 1662217 1562333 1598729 1583007 1512702 1501700 1421690 1365094
7589A365094j28850k22762k58051j00597K56039K77026k23270k71133J90358R0439
$$ 1365094 1236244 1013482 755431 654834 910873 1187899 964629 693496 883854 974293
7579I74293K7925J39913j32356l003N3417p2660l2311M8272J69397J88161l13067
$$ 974293 1002218 1142131 1009775 1006772 1060189 987529 955218 1003490 1172887 1361048 1047981
7568A047981l86843k02469O504J03392Q6259K67094N5156k22846j09603q5656
$$ 1047981 661138 458669 465173 568565 654824 921918 977074 754228 644625 558969
7558E58969l79J47983J73196R4784J48307o4021j86078m0904J63935O6918J1455
$$ 558969 558590 706573 879769 974553 1122860 1058839 872761 831857 995792 1062710 1074165
7547A074165j54875k12209j60690N922j886p403l6465j64974J96294L93433J11464
$$ 1074165 919290 707081 546391 552313 550427 543024 506559 341585 537879 931312 1042776
7536A042776o4070k02429j16432j043j47426Q844M0595J26856k9260J00888J71757
$$ 1042776 978706 776277 659845 658802 511376 520220 560815 687671 658411 759299 931056
7525I31056j91141j97870j7800n622L164j81447j51063o1672m8546M4283J43431
$$ 931056 739915 542045 524245 518623 521787 340340 189277 127605 79059 123342 266773
7514B66773p935j24964J71205O7927m4944m9752q3756K1021o6749j02045j33160
$$ 266773 258838 133874 305079 373006 328062 278310 194554 215575 148826 46781 -86379
7503h6379J9473K03883K81155J42681M7165L573o7429k2184j10971j80407J7300
$$ -86379 -66906 136977 418132 560813 607978 611551 544122 521938 410967 230560 247860
7492B47860J94838K35687M0811k4137j67268k14307j53600k5251q5795j57755
$$ 247860 442698 678385 719196 695059 527791 313484 159884 134633 48838 -108917
7482a08917q7304K47K13189L27946J81183M7442J1525j53482k52689j68452J61750
$$ -108917 -196221 -195974 17215 345161 526344 573786 585311 431829 179140 10688 172438
7471A72438L07613P9788j18193k15968k0805P5512O2742j32926j91824K0486O6370
$$ 172438 480051 559839 441646 225678 204873 280385 343127 210201 18377 38863 105233
7460A05233L9253M8184L019j21305j32624l8931J37531J87782n7789q5241O7634
$$ 105233 144486 192670 195689 74384 -58240 -97171 40360 228142 170353 85112 152746
7449A52746k7165l2854K60620L32517J3123k08894k21027j47214k40214L3531
$$ 152746 125581 92727 353347 685864 698987 490093 269066 121852 -118362 -84831
7439h4831K99467J19090j4078m4622q6079m1008j79937j32726J0340L3860J04660
$$ -84831 214636 333726 319648 275026 188947 147939 -31998 -164724 -154384 -120524 -15864
7428a5864j19654k1697J95836K80832O3875j1923K8109o8982J50147L00063K46155
$$ -15864 -135518 -157215 38621 319453 383328 371405 399514 330532 480679 780742 1026897
7417A026897k4830q3931q2412P7998N7566k19292m75264l85110q3850o6813J26411
$$ 1026897 1002067 918136 835724 913722 971288 751996 276732 -108378 -192228 -259041 -132630
7406a32630R2337n4089o6345J2672J05927L94253N32542J99512k65804k90384
$$ -132630 -40293 -94382 -160727 -148055 -42128 352125 884667 1084179 818375 527991
7396E27991k30742k71926q3375J09308J17771n1003j77461l307K8570k24624j97678
$$ 527991 297249 25323 -58052 51256 169027 118024 -59437 -62744 -34174 -258798 -456476
7385d56476R5677J62776P6949j4137J66762K11897j9972m2964J31177K35668J19739
$$ -456476 -360799 -198023 -121074 -135211 31551 243448 223476 180512 311689 547357 667096
7374F67096k3175r5273q1329L7505m3138k32828l29493j70547J16687J30220j04825
$$ 667096 643921 548648 467319 504824 461686 228858 -100635 -271182 -154495 -24275 -129100
7363a29100j08273j7790O8599j52006o7066L10844J69229J10499J99778J068j40336
$$ -129100 -237373 -255163 -186564 -338570 -405636 -94792 74437 184936 384714 385782 245446
7352B45446p4586q7068j21862j94380k1197Q3442J65532J3629r5365n6935P6146
$$ 245446 170860 83792 -38070 -232450 -253647 -170205 -4673 8956 -86409 -143344 -67198
7341f7198J62992J61217k6298r8691p987q3943k8314j20217o4457K6091L1507
$$ -67198 95794 257011 230713 132022 124035 40092 11778 -108439 -172896 -146805 -115298
7330a15298J7952q486L4589j1101N0505J10537N8038J9203L474n5306j59814p8150
$$ -115298 -97346 -105832 -71243 -82344 -31839 78698 136736 155939 159413 104107 -55707 -133857
7318a33857k5352r7345J23811J80519m7008n0054K0903K787R3160O4865J32488
$$ -133857 -159209 -256554 -132743 47776 768 -49286 -28383 -25596 67564 132429 264917
7307B64917J00109k36565j96124k3452M7315J6045j30172p3038K40855J14058
$$ 264917 365026 128461 -67663 -91115 -43800 -27755 -157927 -230965 9890 123948
7297A23948J09649K27198j336j75925p9005p3887j34010k64657p2421J22273p2097
$$ 123948 233597 460795 459459 283534 204529 130642 -3368 -268025 -340446 -218173 -290270
7286b90270q0482j83459K6405K27609K16254Q2129J05630M5603j73618K1868K36849
$$ -290270 -370752 -554211 -527806 -300197 -83943 -1814 103816 149419 -24199 -2331 234518
7275B34518J01070j1252k12121j25726J67901K49896P5496j02452j34926m9511
$$ 234518 335588 324336 112215 -13511 154390 404286 479782 377330 242404 192893
7265A92893L5381J27261k0857k2612R815J23190N2163m04820k47915n4201K4780
$$ 192893 228274 355535 334678 312066 321881 445071 497234 92414 -155501 -209702 -184922
7254a84922J78508K74090J95065Q952j44083p9107k13838j23961J40479K47815
$$ -184922 -6414 267676 462741 471693 327610 248503 34665 -89296 51183 298998
7244B98998J01411j03948k56521k2079J87965m1756j00205j7306n6059k08411
$$ 298998 400409 296461 39940 17861 205826 164070 63865 46559 -9500 -217911
7234b17911L727J87287J50338J4732K5435L0960K288j39225j73728M3381K33504
$$ -217911 -214184 -26897 123441 138173 163608 194568 196856 57631 -116097 -72716 160788
7223A60788J85445J12839j7024k06426j90156n2180P0440m6608l6949l3907j39575
$$ 160788 346233 459072 442048 235622 45466 -6714 63726 17118 -19831 -53738 -193313
7212a93313p1779p8024Q8612K8936O8083J67404J05755n6611p6697N9270N1692
$$ -193313 -265092 -343116 -254504 -225568 -157485 9919 115674 59063 -17634 41636 93328
7201I3328j0838n2866O8099l5972o1892k87579J6674K43290j01314k24664k87049
$$ 93328 82490 29624 97723 61751 -141 -287720 -271046 -27756 -129070 -353734 -640783
7190f40783j47826Q3384K86651J62699Q7585J16436J89971P7418J8767m9923p6383
$$ -640783 -788609 -705225 -418574 -255875 -168290 -51854 138117 215535 234302 184379 107996
7179A07996L319Q5064J65236N9228K8080K8184J112Q4767o864J8274K8122k46486
$$ 107996 111315 196379 361615 420843 448923 477107 478219 562986 556122 574396 602518 356032
7167C56032k93617j04733J2073l4395J1955J24615k1635P3569J67276L6320N6820
$$ 356032 62415 -42318 -30245 -64640 -52685 71930 50295 123864 291140 327460 384280
7156C84280l1828j25096o6601m0391J46332R3933q7034r4018j6205O1242J40999
$$ 384280 352452 227356 160755 120364 266696 360629 273595 179577 163372 224614 365613
7145C65613R9582k46461l41458j74934K06679K46675L6923j10444j43476j5943
$$ 365613 465195 218734 -122724 -297658 -90979 155696 192619 82175 -61301 -77244
7135g7244k1694q6223j0559O0697n2925o549Q4895L2766j0772L0029k3246m4232
$$ -77244 -98938 -185161 -195720 -135023 -187948 -194497 -109602 -76836 -87608 -57579 -80825 -125057
7123a25057M7641q091r6128j6115R082J33375K40022R8518n3310j28098j23792
$$ -125057 -77416 -85507 -181635 -197750 -188668 -55293 184729 283247 229937 101839 -21953
7112b1953n6253M5454Q4003J09249M2638k7582m6883p0865J0702L01382L22654
$$ -21953 -78206 -32752 51251 160500 203138 175556 128673 57808 68510 369892 692546
7101F92546O7107N8604q7457j63458q4991k31189n2314j11167o4269K03144K30989
$$ 692546 759653 818257 730800 567342 482351 251162 198848 87681 23412 226556 457545
7090D57545J11122q2525k73875o9895O1114j21862j9572j70960j39885l0215M4049
$$ 457545 568667 486142 212267 142372 203486 81624 62052 -108908 -248793 -279008 -234959
7079b34959P4066J52813K02428J23214r643N3439K1779j35466j39167j954P9054
$$ -234959 -160893 -8080 194348 317562 307919 361358 383137 247671 108504 106550 185604
7068A85604l8874j48711j4117K3307o227l2698m8891n1687r9196r4543J5073O1115
$$ 185604 146730 -1981 -16098 7209 982 -31716 -80607 -132294 -231490 -326033 -310960 -249845
7056b49845J46993P1570p4085L8313N7302J112Q1672J07346k4456j42650j10307
$$ -249845 -102852 -31282 -105367 -67054 -9752 -8640 73032 180378 155922 13272 -97035
7045i7035R6239j04880m7406Q6334m5314J02724L46226P5697k34923j64348J19336
$$ -97035 -796 -105676 -153082 -66748 -112062 -9338 336888 412585 177662 13314 132650
7034A32650J20039l4111j21297Q4590n056r0128q2632L7271J69559O8583j74022
$$ 132650 252689 218578 97281 181871 176815 86687 4055 41326 210885 279468 105446
7023A05446l48170j84236J83623K68293O6749p7823j37361j39680M7793J04215
$$ 105446 -242724 -426960 -243337 24956 91705 13882 -123479 -263159 -215366 -111151
7013a11151o8638q1544o2149N1445j7390j89537q7675P2859J11763N7861L0461
$$ -111151 -179789 -261333 -323482 -272037 -289427 -478964 -566639 -493780 -382017 -324156 -293695
7002b93695q933J14781K22911n4250o4427K880n1773j18456j9184J07525j19077
$$ -293695 -302628 -187847 35064 -19186 -83613 -80733 -132506 -250962 -270146 -162621 -281698
6991b81698j76409N4063P0631q5834j3692N6856n7642Q1490L22163L18205Q6068
$$ -281698 -458107 -404044 -333413 -419247 -432939 -376083 -433725 -352235 -30072 288133 374201
6980C74201L4354K7971j26861r8852J46363Q9528j83963k90263k30298k3441J28491
$$ 374201 408555 436526 309665 210813 357176 446704 262741 -27522 -257820 -281261 -152770
6969a52770N1180J3455j01441j74834j61190P9935M39198K37281L7910q62k02429
$$ -152770 -101590 -88135 -189576 -364410 -525600 -445665 -6467 230814 268724 267862 65433
6958F5433k62426R8607J4380p2489M4973N3242r7801N805Q327n3233J40040K14067
$$ 65433 -196993 -98386 -84006 -156495 -111522 -58280 -156081 -150276 -141949 -195182 -55142 158925
6946A58925o4428j13889k22000j30298K52129K03536o3673R1958J43710j73602
$$ 158925 94497 -19392 -241392 -371690 -119561 83975 20302 112260 255970 82368
6936H2368p5992J60129r7042k61037n0747K4252R7208q3598L423M3867J30410
$$ 82368 6376 166505 69463 -191574 -242321 -218069 -120861 -204459 -201036 -157169 -26759
6925b6759J68748P7041j69690l51402l7158P6290K805M0817J27292l5768j3078
$$ -26759 141989 219030 49340 -302062 -339220 -262930 -260125 -219308 -92016 -127784 -140862
6914a40862L8841n806j12589n1049Q9684J95802K05285J64324J15248J16292j97527
$$ -140862 -102021 -107827 -220416 -271465 -181781 14021 219306 383630 498878 615170 417643
6903D17643k49293r9394k40356k3176J94458K92762R0857n6966j32981J9315M9850
$$ 417643 168350 68956 -171400 -194576 -118 292644 383501 326535 193554 212869 262719
6892B62719n2462Q4893M08Q051n0757r801r6877o3767J23192J00244l5610j27957
$$ 262719 210257 295150 295558 303609 252852 243051 146174 82407 205599 305843 270233 142276
6880A42276Q746N1477j27446j30397r8279r2672O8243R4401K1873J35834r8254
$$ 142276 151022 202499 75053 -55344 -153623 -246295 -178052 -83651 -61778 74056 -24198
6869b4198l15506o7549K6202r9533J8486K38321J92625J54579R6000j878K9099
$$ -24198 -339704 -407253 -381051 -480584 -462098 -223777 -31152 123427 219427 217549 246648
6858B46648J2543J84240J96366j29464J7545J19719m3134k09711m4641m0125o0709
$$ 246648 259191 443431 639797 510333 527878 647597 604463 394752 350111 309986 249277
6847B49277p9075P1852J43863P2493J54956Q7903j0163r0078k63770k46323q5309
$$ 249277 170202 242054 385917 458410 613366 701269 691106 601028 337258 90935 5626
6836E626L6369n5916n7269p6905q671j03651r6779j40930p9611R0284m1342J04347
$$ 5626 41995 -13921 -71190 -148095 -156766 -260417 -357196 -498126 -577737 -487453 -528795 -424448
6824d24448K84768J90852N0597o1304q9573j76355j54522j67969J22610L26528
$$ -424448 -139680 51172 101769 40465 -49108 -225463 -379985 -547954 -425344 -98816
6814i8816Q0379r8732J8835K6547r4494l8815J06762j29784n9095J22433J01610
$$ -98816 -18437 -117169 -98334 -71787 -166281 -205096 -98334 -228118 -287213 -164780 -63170
6803f3170J09599M9017j58086k06446o5624k9850j09478J2938J12540L7644R677
$$ -63170 46429 95446 -62640 -269086 -334710 -364560 -474038 -461100 -348560 -310916 -301239
6792c01239N1339J32811P4718O5824R5350O0167k72877j89175Q9307J54943R9537
$$ -301239 -249900 -117089 -42371 23453 118803 178970 -93907 -283082 -193775 -38832 60705
6781F0705J37706P12j22806j10911j58081j74558Q2536Q5874l1396j1122J44913
$$ 60705 198411 199123 76317 -34594 -192675 -367233 -284697 -198823 -230219 -241341 -96428
6770i6428K55206N0994N9537Q1586J65236J91190n3733k10248j46341j08732q0725
$$ -96428 158778 209772 269309 350895 516131 707321 653588 443340 296999 188267 107542
6759A07542P0267r0345l10505l48024o7006J66020J66842L7817K08629J59247
$$ 107542 177809 87464 -223041 -571065 -638071 -472051 -305209 -267392 -58763 100484
6749A00484k08050j00586N8354j4688k21875P5864J54936K6426J01174J68334
$$ 100484 -107566 -208152 -149798 -164486 -386361 -310497 -155561 -129135 -27961 140373
6739A40373J03726P9570o6129m9749N5547M7688o3035j89266j45876k6483J6259
$$ 140373 244099 323669 257540 207791 263338 311026 247991 58725 -87151 -113634 -97375
6728i7375N8227J47241j4197J17Q8921K58039J24688p9341j09253p4553l4301
$$ -97375 -39148 108093 93896 94013 182934 440973 565661 486320 377067 302514 268213
6717B68213j01000r29l1j06187m4921J33046N570k5245j07426q3435j11512K0099
$$ 268213 167213 166284 166253 60066 15145 148191 153761 128516 21090 -62345 -173857 -153758
6705a53758J26469K3320J43048J84754J53693J85506K0918q8921k05494k56072
$$ -153758 -27289 -3969 139079 323833 477526 663032 683950 595029 389535 133463
6695A33463k6181J76424j17596l19469K7821J36712m2521j73211l4081J00421
$$ 133463 107282 283706 166110 -153359 -125538 11174 -31347 -204558 -238639 -138218
6685a38218J40500j3904K9922k0487P49K73180J9855k2905K46672J63882o1715
$$ -138218 2282 -11622 18300 -2187 -1438 271742 291597 268692 515364 679246 617531
6674F17531k62574j82139M9606M141k30635m06307k51477J80188M35221K49027
$$ 617531 354957 172818 222424 226565 -4070 -410377 -661854 -481666 -46445 202582
6664B02582q525K9619o0154K676n1617k67578k80995n1235K19215J93018J18822
$$ 202582 194057 223676 163522 166198 114581 -152997 -433992 -485227 -266012 -72994 45828
6653D5828K0825k85R0221J1741R0849J12015l6009j37902j21015p0535l0809O8516
$$ 45828 66653 66368 156589 168330 259179 371194 335185 197283 76268 5733 -25076 43440
6641D3440J12254M7239M6737j28804j00373p50j72351k24655m7576J88398J69802
$$ 43440 155694 202933 249670 120866 20493 19743 -152608 -377263 -424839 -236441 -66639
6630f6639K91096L13954J95432L5480k13971k00776j73918p9820j99599k20089
$$ -66639 224457 538411 733843 769323 555352 354576 180658 100838 -98761 -318850
6620c18850j1040K07217K01341Q1060l8507n422K5345O5153k0994q0636j32478
$$ -318850 -329890 -122673 78668 159728 121221 115799 141144 206297 185303 104667 -27811
6609b7811k5991r9719j17780J24284J78841J65996K09910L4967K1203N6389j08134
$$ -27811 -53802 -153521 -271301 -147017 31824 197820 407730 442697 463900 520289 412155
6598D12155n1666N993n412n7213o1001k09281j45767m856m7412K16225L19275
$$ 412155 360489 366482 361070 303857 242856 33575 -112192 -117048 -164460 51765 371040
6587C71040K84819J88470q435N5711k7661l24639l23512l46057p4869Q0548j21808
$$ 371040 655859 844329 835894 891605 863944 539305 215793 -130264 -205133 -124585 -246393
6576b46393K4459L33066K07420l2383k33283p0586J43861M6903m9539o0085J4852
$$ -246393 -221934 111132 318552 286169 52886 -17700 126161 173064 123525 63440 78292
6565G8292j30849l2842j63301j31187L03267L77906k3977p3330M1992L6760l0154
$$ 78292 -52557 -85399 -248700 -379887 -76620 301286 277309 203979 245971 282731 252577
6554B52577J5217J09951o6926k05667O1289J63921L48631L36977Q3096M16k33926
$$ 252577 267794 377745 310819 105152 166441 330362 678993 1015970 1099066 1099482 865556
6543H65556l74636j35813k5260j2378M8234k50493M1345P1098j44623k8678R9907
$$ 865556 490920 355107 329847 317469 365703 115210 156555 227653 83030 54352 154259
6532A54259N8284j705r2203r0864J21811O7259Q3101L4951J03246Q3854K008k5315
$$ 154259 212543 210838 118635 27771 149582 216841 299942 334893 438139 521993 524001 498686
6520D98686m6798k48680j64855k1272l8870M6543J75689J25794j45357j44273
$$ 498686 451888 203208 38353 17081 -21789 24754 200443 326237 180880 36607
6510C6607o199J04228J97829P2166M7324j70314o08068m36633K0519L00934J87840
$$ 36607 30408 134636 332465 404631 451955 281641 -326427 -763060 -742541 -441607 -253767
6499b53767l3312k28312O0038J69990Q7054M8392L871n2092j10327r3846j36582
$$ -253767 -287079 -515391 -455353 -285363 -198309 -149917 -146046 -198138 -308465 -402311 -538893
6488e38893J80853K03118K10206J33101J21524J22632J5022J66828J70405N9104
$$ -538893 -358040 -154922 55284 188385 309909 432541 447563 614391 784796 843900
6478H43900K2869q8984l43113k15658j30588j5939R695l6523j36587k55571J2236
$$ 843900 866769 777785 434672 219014 88426 72487 82182 45659 -90928 -346499 -334263
6467c34263Q0205o1176r4017j33340K0788K3371R7636K81207J10594n6782p1126
$$ -334263 -254058 -315234 -409251 -542591 -521803 -498432 -400796 -119589 -8995 -65777 -136903
6456a36903K6985J3876J90119J79619J5207J21350l0143p2265m7952k9985J9319
$$ -136903 -109918 -96042 94077 273696 288903 410253 380110 307845 259893 229908 249227
6445B49227j88758j56018r4562O8304n419K8697J1931J60868L86043K79394p0269
$$ 249227 60469 -95549 -190111 -121807 -127226 -98529 -86598 74270 460313 739707 669438
6434F69438m6693p6235k43679l17777r8550L3900J29998r174J0540q5456l84246
$$ 669438 622745 546510 302831 -14946 -113496 -79596 50402 41228 51768 -33688 -417934
6423d17934j28704J11094O0705J32801n7980J50177J20550N9686J19586J50787
$$ -417934 -546638 -435544 -374839 -242038 -300018 -149841 -29291 30395 149981 300768
6413C00768K08317Q8488M9331j90034l4664O905p1685k24175k30992m3652j04269
$$ 300768 509085 597573 646904 456870 422206 429111 357426 133251 -97741 -141393 -245662
6402b45662j27706M4805K6490n8940M0464L88212J17917l2139j01817M4331K77827
$$ -245662 -373368 -328563 -302073 -361013 -320549 67663 185580 153441 51624 95955 373782
6391C73782J16542o9219K25331L0163k64161l6045J72578q0053m10980l42430
$$ 373782 490324 421105 646436 676599 412438 376393 548971 468918 57938 -284492
6381b84492o6741R2712J31921J70233p2927j76179J432J94877L85454O1985k02539
$$ -284492 -351233 -258521 -126600 43633 -29294 -205473 -204041 -9164 376290 438275 235736
6370B35736j43971j8545L2093j00310j61078J51413M27008J32276j61671k49305
$$ 235736 91765 73220 105313 5003 -156075 -4662 422346 554622 392951 143646
6360A43646j96990m954J97611J43383m8345K0460L8907p7404m3227j10136j80386
$$ 143646 -53344 -58298 139313 282696 234351 254811 293718 216314 173087 62951 -117435
6349a17435m3541M3393p8926k40684K4359K20836Q1971j41926Q2666J65824K363
$$ -117435 -160976 -117583 -196509 -437193 -412834 -191998 -110027 -251953 -169287 -3463 -1100
6338a100K34869L39138O8762k89709l88396k86888K7783J25856O6435m8727m7488
$$ -1100 233769 572907 641669 351960 -36436 -323324 -295541 -169685 -103250 -151977 -199465
6327a99465j60473k18483m5014J3246Q7009J67721J36979M4266j28028L2532K68992
$$ -199465 -359938 -578421 -623435 -610189 -523180 -355459 -218480 -174214 -302242 -269710 -718
6316g18j7153k6019O4986J68992K90244K58164j05620k13180k34113l14385k90274
$$ -718 -17871 -43890 21096 190088 480332 738496 632876 419696 185583 -128802 -419076
6305d19076j61825N2150J05715L9387j13218l8781l07459q5259J62771K61391
$$ -419076 -580901 -528751 -423036 -383649 -496867 -535648 -843107 -928366 -765595 -504204
6295e04204K27968Q1016K18492O1261q6444l5292M1779J99093j48488l15947j40624
$$ -504204 -276236 -195220 23272 84533 -1911 -37203 4576 203669 55181 -260766 -401390
6284d01390L6838K36800Q9768p829k2912j04694l329J8420K18926L98193k038
$$ -401390 -364552 -127752 -37984 -45813 -68725 -173419 -176748 -158328 60598 458791 456753
6273D56753j92773j63583k09041r8903J81689K75662Q6637k46861j30298j563
$$ 456753 263980 100397 -108644 -207547 -25858 249804 336441 89580 -40718 -42281
6263d2281l8246M2151K08349J2097j0021j34053n1134N0564M0116l9939M035K66640
$$ -42281 -80527 -38376 169973 182070 172049 37996 -13138 37426 77542 37603 41638 308278
6251C08278Q9596p7098q7528k07965r0180P9007o3735j27634K37783L88129J65952
$$ 308278 397874 320776 233248 25283 -64897 14110 -49625 -177259 60524 448653 614605
6240F14605p9576j47067j33686J5603M9321R653K2839j51049r0049J03276J56518
$$ 614605 535029 387962 254276 269879 319200 328853 351692 200643 110594 213870 370388
6229C70388J26418L42374J22591m8430m4903l09289l64378m5476J60669K07285
$$ 370388 496806 839180 961771 913341 868438 559149 194771 149295 309964 517249
6219E17249J16874J04695Q5738J65017L72766K14725O6697J53980K35571K55558
$$ 517249 634123 738818 824556 989573 1362339 1577064 1643761 1797741 2033312 2288870
6209B288870K14720L02061J39629o3950k4246J79439L63036L85042L11692L93697
$$ 2288870 2503590 2805651 2945280 2881330 2857084 3036523 3399559 3784601 4096293 4489990
6199D489990M85699N62131N90147P09818R83994J396270J848767K210989K302664
$$ 4489990 4975689 5537820 6127967 6837785 7821779 9218049 11066816 13277805 15580469
6190A5580469K699187K876852K298384J331148L02076l14481k11564O7310Q2081
$$ 15580469 18279656 21156508 23454892 24786040 25088116 24773635 24562071 24629381 24711462
6181B4711462k80551j338962k391092l196128l183995k611613j883361j273958
$$ 24711462 24430911 23091949 20700857 17504729 14320734 11709121 9825760 8551802
6173H551802j121967j111819j028984p51116n19767n46916n67286o06037l98683
$$ 8551802 7429835 6318016 5289032 4537916 4018149 3471233 2903947 2297910 1899227
6164A899227j18897k3679M2636m901N6070J9202m2691l1037j59899k05373j06289
$$ 1899227 1780330 1756651 1799287 1794386 1850456 1869658 1826967 1795930 1636031 1430658 1324369
6153A324369J95366O4456j86308j37015j92609q0370L7669K9212r2131j61507
$$ 1324369 1519735 1584191 1397883 1260868 1068259 987889 1025558 1054770 962639 801132
6143H01132p9196j7656j87537J2368K73344L12537P0022m5202m9546p1478P6651
$$ 801132 721936 704280 516743 529111 802455 1114992 1185014 1139812 1090266 1018788 1095439
6132A095439k56619j25848N3903j43635o8933j42634J2K31063J73469J65814p9733
$$ 1095439 838820 712972 766875 623240 554307 411673 411685 642748 816217 982031 902298
6121I02298j39761k444M5440j85755k58363J48398K51848K5604P4251J18628n2872
$$ 902298 762537 760093 805533 619778 361415 509813 761661 787265 861516 980144 927272
6110I27272r3345R4194k6231q6983j42694k82507J34812K14175J8609k2149J02087
$$ 927272 833927 928121 901890 814907 672213 389706 524518 738693 757302 735153 837240
6099H37240J6823J32313R6234k02930k14100o3773K5832n9000k0970j26953j32724
$$ 837240 854063 986376 1082610 879680 665580 601807 627639 568639 547669 420716 287992
6088B87992M6025Q0482R1343J49126K1077l6890K75077L96967J36963J68403L26504
$$ 287992 334017 414499 505842 654968 676045 639155 914232 1311199 1448162 1616565 1943069
6077A943069J31624J29472L53352K35092J81781M86034O14720N42097N41577L53969
$$ 1943069 2074693 2204165 2557517 2792609 2974390 3460424 4075144 4617241 5158818 5512787
6067E512787O5159L06211L67961L29544L76165N34974N94718L48620J85902M41020
$$ 5512787 5577946 5884157 6252118 6581662 6957827 7492801 8087519 8436139 8622041 9063061
6057I063061P34305J205176J845633K253352K507357K375614J692167M40765m86519
$$ 9063061 9797366 11002542 12848175 15101527 17608884 19984498 21676665 22117430 21630911
6048B1630911m61676M5222N67834N54403l50128j647915k385206k530350k528807
$$ 21630911 21169235 21214457 21782291 22336694 21986566 20338651 17953445 15423095 12894288
6039A2894288k204322j773649j355416r20976n78162n13174n66581o95944o75089
$$ 12894288 10689966 8916317 7560901 6639925 6061763 5548589 4982008 4286064 3610975
6030C610975m79877j83100l07378l47452o0150m6735j09580l11539j00691j23522
$$ 3610975 3131098 2947998 2640620 2293168 2233018 2186283 2076703 1765164 1664473 1540951
6020A540951j11433q1541P175L4898j32372j22574R5151L648N722m6993m11987
$$ 1540951 1429518 1347977 1355152 1390050 1257678 1135104 1230255 1233903 1239625 1192632 780645
6009G80645m19071L4171K37006J38376L4649p3102k6920P8135j07334m44222q6080
$$ 780645 361574 395745 632751 771127 805776 732674 705754 783889 676555 232333 146253
5998A46253J47592p7986q1968J97698L89562L45158J36258k43858j22784j1247
$$ 146253 293845 215859 133891 331589 721151 1066309 1202567 958709 835925 824678
5988H24678j82177j51613q8151k39525l54266j40946m0010r367N9428J73379J25901
$$ 824678 642501 490888 402737 163212 -191054 -332000 -372010 -381377 -321949 -148570 -22669
5977b2669K28783K5708j48738j93045J3770J41496O1966K03423J61358r3251M6078
$$ -22669 206114 231822 83084 -109961 -96191 45305 107271 310694 472052 378801 424879
5966D24879J18705p5788O292O9864m0440j07171j02336j4788J8165j42765o8200
$$ 424879 543584 467796 474088 543952 503512 396341 294005 279217 297382 154617 86417
5955H6417l1496p9648N9550J40204J17818M2412J1227r8984j68890K6891J99444
$$ 86417 54921 -24727 34823 175027 292845 335257 346484 247500 78610 105501 304945
5944C04945J02796K2468k29718p8173m5514r6139j1900R5281P2820m0093k86784
$$ 304945 407741 430209 200491 122318 76804 -19335 -31235 64046 136866 96773 -190011
5933a90011j30482J13902K36681K17028P4956p3621j99609k2936K31914J89077
$$ -190011 -320493 -206591 30090 247118 322074 248453 48844 25908 257822 446899
5923D46899Q0745n6467l43883l53825l28265l9874M31288L79488Q2920l2349r1912
$$ 446899 527644 471177 127294 -226531 -554796 -594670 -163382 216106 299026 266677 174765
5912A74765j52378j94098k6169Q6149m4181n7242j44444R3107J84176O0260j7049
$$ 174765 22387 -171711 -197880 -111731 -155912 -213154 -357598 -264491 -80315 -20055 -37104
5901c7104N475K5735J71867J85488j6022l3898Q967j66943m3215r6825n5132P7362
$$ -37104 -31629 -5894 165973 351461 335439 301541 310508 143565 100350 3525 -51607 25755
5889B5755q6032m1428j50464l00851j09015L5728J39338J79175O4198K13430K11207
$$ 25755 -60277 -101705 -252169 -553020 -662035 -626307 -486969 -307794 -243596 -30166 181041
5878A81041J00380k2923R4123j69934k88299j6689R2369n1224l0510j12721j40122
$$ 181041 281421 258498 352621 182687 -105612 -122301 -29932 -81156 -111666 -224387 -364509
5867c64509j11848O9467R2368J63051R9107j68205k86092o2220K06670M9109j2152
$$ -364509 -476357 -406890 -314522 -151471 -52364 -220569 -506661 -568881 -362211 -313102 -325254
5856c25254K8298j10033j24925J37185J77832K885J6937K26841L9501o0495J1562
$$ -325254 -296956 -406989 -531914 -394729 -216897 -214012 -197075 29766 69267 8772 20334
5845B0334O1377J51800R8262m2897j66717k02132k76666j17060J75130K45549
$$ 20334 81711 233511 331773 288876 122159 -79973 -356639 -473699 -298569 -53020
5835e3020P9559j47592j06346Q5291K32187O6955K0907J80200n0457p2222R4438
$$ -53020 26539 -121053 -227399 -142108 90079 157034 177941 358141 307684 235462 329900
5824C29900r3394j39803O3724K89075Q6905j53685k87371l35936j36605J12060
$$ 329900 236506 96703 160427 449502 536407 382722 95351 -240585 -377190 -265130
5814b65130Q5482n2102j8106J13461L0683N9193K0842o4363m0190q9689k8702
$$ -265130 -179648 -231750 -249856 -136395 -105712 -46519 -25677 -90040 -130230 -219919 -248621
5803b48621P1410L4836Q5495K29315N0380j80621j92276j41847P7929J04943J6618
$$ -248621 -177211 -142375 -56880 172435 222815 42194 -150082 -291929 -214000 -109057 -92439
5792i2439j80878j78058J81249L60918J72693M8q437J10332K3095j82196n4675
$$ -92439 -273317 -451375 -270126 90792 263485 263533 255096 365428 388523 206327 151652
5781A51652K14995P8098j9483m1629j1642p4386J5767L6723p6210q9850n1124
$$ 151652 366647 444745 425262 383633 371991 297605 313372 350095 273885 184035 132911
5770A32911P2884j51015j53050m5121J9182R1826J37276N9422J09573M2750J29975
$$ 132911 205795 54780 -98270 -143391 -124209 -32383 104893 164315 273888 316638 446613
5759D46613K7685J81749Q7281j51320j82257j18783k26970J86636K87071j64003
$$ 446613 474298 656047 743328 592008 409751 290968 63998 250634 537705 373702
5749C73702l84639j55484R7707O3992J36797K08926J03195p3493K6376R0767j33425
$$ 373702 -10937 -166421 -68714 -4722 132075 341001 444196 370703 397079 487846 354421
5738C54421j31298p2288Q1448J23721K17633K50981J26229P8208j64086l92206
$$ 354421 223123 150835 232283 356004 573637 824618 950847 1029055 864969 472763
5728D72763r3172K60642O4390j44345J7912J97420O7373j16107J6004m2041q31
$$ 472763 379591 640233 704623 560278 578190 775610 842983 726876 742880 700839 700008
5717G00008j67577j05199J29675J78477J89635J50012R9225J75931J41498M0801
$$ 700008 532431 427232 556907 735384 925019 1075031 1174256 1350187 1491685 1532486
5707A532486M1670J66286M51968K55972L31864N63322N47678L23238L59686M48382
$$ 1532486 1574156 1740442 2192410 2448382 2780246 3343568 3891246 4214484 4574170 5022552
5697E022552L04548M68297N94187O71302Q88413J197761J293659J121820R23098
$$ 5022552 5327100 5795397 6389584 7060886 7949299 9147060 10440719 11562539 12485637
5688A2485637K63634m12894j137350j667687j394730j104228j018193q14518n73939
$$ 12485637 12749271 12336377 11199027 9531340 8136610 7032382 6014189 5199671 4625732
5679D625732n62355n19857l00424j32815j23050j42704j74232k07609k69806M386
$$ 4625732 4063377 3543520 3243096 3110281 2987231 2844527 2670295 2462686 2192880 2197266
5669B197266M5964k13065j22716m9785j00182k72964k77245j68573J2699M6057
$$ 2197266 2243230 2030165 1907449 1857664 1757482 1484518 1207273 1038700 1051399 1097456
5659A097456p0406l2274k23937j35617r4441j56034k47684j69585q8919M3020
$$ 1097456 1027050 994776 770839 635222 540781 384747 137063 -32522 -121441 -78421
5649g8421J90275M5843j30642j99266j32306j2143K24065K52431J58840K04388
$$ -78421 111854 157697 27055 -172211 -304517 -316660 -92595 159836 318676 523064
5639E23064O5276L9755q283k36566q2996Q7508j10254k36867M2281J47637p7528
$$ 523064 588340 628095 619812 383246 300250 387758 277504 40637 82918 230555 153027
5628A53027l0256O9377O0948j16166q7542N1237n9291j77747j54312J05457M4235
$$ 153027 122771 192148 253096 136930 49388 100625 41334 -136413 -290725 -185268 -141033
5617a41033K1487j29599j87045k6853r1898r7470J48046K79468K44141K9597n2471
$$ -141033 -119546 -249145 -436190 -463043 -554941 -652411 -504365 -224897 19244 48841 -3630
5606c630n084K77221K39009q2428l6834j9191R4635L1859j70270m3451j67640
$$ -3630 -8714 268507 507516 425088 388254 369063 463698 495557 325287 281836 114196
5595A14196k14157q6441J83433M57927K53389k67605k79053Q4029J36528l6437
$$ 114196 -99961 -186402 -2969 454958 708347 440742 161689 245718 382246 345809
5585C45809j8353O3052O5963O7444m6472j74471k32306j48853j33553J1829k1363
$$ 345809 327456 390508 456471 523915 477443 302972 70666 -78187 -211740 -199911 -221274
5574b21274p0225J68882J25829J12779K01703J02201j24153p1479l6023p7985
$$ -221274 -291499 -122617 3212 115991 317694 419895 295742 224263 188240 110255
5564A10255l5716K54700J72067N8488K12027J63865k41076k77748j13500J13908
$$ 110255 74539 329239 501306 559794 771821 935686 694610 416862 303362 417270
5554D17270j38966l11290k60907k06292J06041K07084J95972J43060N9778l6277
$$ 417270 278304 -32986 -293893 -500185 -394144 -187060 8912 151972 211750 175473
5544A75473k16663k30963k1564K74760K61709m786q8783L7898k181j0941N3074
$$ 175473 -41190 -272153 -293717 -18957 242752 237966 149183 187081 184900 173959 227033
5533B27033L6464J48038J76270k260j28008j43335k8099J05660j00255j63360
$$ 227033 263497 411535 587805 585545 457537 314202 286103 391763 291508 128148
5523A28148J9853K44840K8522j33435j68140j3878K06840k4469l47272k26402
$$ 128148 148001 392841 421363 287928 119788 105910 312750 288281 -58991 -285393
5513b85393J25180J98579j01987k3239L54924K14252Q8069J3506q0085o9596j59484
$$ -285393 -160213 38366 -63621 -86860 268064 482316 570385 583891 503806 434210 274726
5502B74726m37518j83373J61722L27954J30888l54l7261K02606L00613l2013l00163
$$ 274726 -162792 -346165 -184443 143511 274399 274045 236784 439390 740003 707990 407827
5491D07827l59106j31318J01627J88387J13828J43675J88913m4615j99762j19376
$$ 407827 48721 -82597 19030 207417 321245 464920 653833 609218 409456 290080
5481B90080J48396O0341Q129J15707k1681k03532j68534r5977n7299J35069K45007
$$ 290080 438476 498817 506946 622653 600972 397440 228906 132929 75630 210699 455706
5470D55706J65629J81141K71470J49979R8477N5619K62655M15317K52445J17684
$$ 455706 621335 802476 1073946 1223925 1322402 1378021 1640676 2055993 2308438 2426122
5460B426122J26792J06192L10558N09696N02479L95453L60457K98365K87114L20010
$$ 2426122 2552914 2659106 2969664 3479360 3981839 4377292 4737749 5036114 5323228 5643238
5450E643238N21983R15773J234888J089868Q34135J002846R70551K32340p17013
$$ 5643238 6165221 7080994 8315882 9405750 10239885 11242731 12213282 12445622 11728609
5441A1728609j152160j098332j171953j320861q87292o23395o67520m88633k85545
$$ 11728609 10576449 9478117 8306164 6985303 6098011 5474616 4807096 4318463 4032918
5432D032918j67238k42427m16303l56583k98348j65879j99946j12111J7769k64405
$$ 4032918 3865680 3623253 3206950 2850367 2552019 2386140 2186194 2074083 2091852 1827447
5422A827447k17208r2196j47478j86442K3105n4653j66135K3235J17181j4244
$$ 1827447 1610239 1518043 1370565 1184123 1207228 1152575 986440 1009675 1126856 1112612
5412A112612j45716k37703M8626K62805P9414q9178k25978k05627k0489j03946
$$ 1112612 966896 729193 777819 1040624 1120038 1030860 804882 599255 578766 474820
5402D74820J07768R7218J22770K52792J64707J73510N2681o2893O3321m9565k54623
$$ 474820 582588 679806 802576 1055368 1220075 1393585 1446266 1383373 1446694 1397129 1142506
5391A142506k90992k08969k20046j84101j75343l0507J32828J51748J12307N6733
$$ 1142506 851514 642545 422499 238398 63055 32548 165376 317124 429431 486164
5381D86164l3279N6000p6609l62499j41125O8138J47171J00871j560q1322Q8535
$$ 486164 452885 508885 432276 69777 -71348 -3210 143961 244832 243272 161950 250485
5370B50485J88768O7914j16621j34238k65520r7730L46554M02252J12989l22780
$$ 250485 439253 507167 390546 256308 -9212 -106942 239612 641864 754853 432073
5360D32073k53891j924J89606K44566O1963k62184m14084j06208j6098j77274
$$ 432073 178182 176258 365864 610430 672393 410209 -3875 -110083 -126181 -303455
5350c03455j5084M61j59334j3995J33155K75969Q0234n0866p7068j92213m1552
$$ -303455 -318539 -318078 -477412 -491407 -358252 -82283 -2049 -52915 -129983 -322196 -363748
5339c63748Q7208m4018J42041J77292k8729j57730L9267J57988p5022P3989M8334
$$ -363748 -276540 -320558 -178517 -1225 -29954 -187684 -148417 9571 -65451 8538 56872
5328E6872n352K2190J73980L43094L17064J20209j76318p7093J15169j9449k03638
$$ 56872 51520 73710 247690 590784 907848 1028057 851739 774646 889815 870366 666728
5317F66728k07420k7979K71483K54870r4885j78215R405p5452p1033k8709J13469
$$ 666728 459308 431329 702812 957682 862797 684582 693987 618535 547502 518793 632262
5306F32262J16944n9639l47048o8337L27723K84575M14052J45553N2985J46108
$$ 632262 749206 689567 342519 274182 601905 886480 1300532 1446085 1499070 1645178
5296A645178R3569K0583m3498n9887K97390N02507J12813o7935L46268P00147
$$ 1645178 1738747 1759330 1715832 1655945 1953335 2455842 2568655 2500720 2846988 3547135
5286C547135P20715J052865J490390J669873K120022K485196K427940K313427
$$ 3547135 4267850 5320715 6811105 8480978 10601000 13086196 15514136 17827563
5278A7827563K044701R12275r36163k257519k619088k188946j709490j158261
$$ 17827563 19872264 20784539 19848376 17590857 14971769 12782823 11073333 9915072
5270I915072q36357q36505m85829l24628j07781L10757N39878O41686O07759R68425
$$ 9915072 9078715 8242210 7756381 7431753 7323972 7634729 8174607 8816293 9424052 10392477
5260A0392477J776297K061824K211206K148776J830598Q66028q74571k573429
$$ 10392477 12168774 14230598 16441804 18590580 20421178 21287206 20412635 17839206
5252A7839206k829378k473515k208531j804223j589488j362163q52089m57159
$$ 17839206 15009828 12536313 10327782 8523559 6934071 5571908 4719819 4262660
5244D262660k93519k70211m93659p42668n44471j59348k14366j67179j48557l9360
$$ 4262660 3969141 3698930 3205271 2462603 1918132 1758784 1544418 1377239 1228682 1189322
5234A189322R1649j38592j92259k28238j18862N9204o7508m5250n7331r6550J72731
$$ 1189322 1280971 1142379 950120 721882 603020 662224 594716 549466 492135 395585 568316
5223E68316K78900o7283l80774n2435K77571O4258j03354j65771k96117k19417
$$ 568316 847216 779933 399159 346724 624295 688553 585199 419428 123311 -96106
5213i6106r067n822J4860J61394L24181N4720j81183K9326R3449j46691q2825
$$ -96106 -105173 -110995 -96135 65259 389440 444160 262977 292303 385752 239061 156236
5202A56236L7164l2108k26426L6971L66972K53895P2858P0134j83541j45532O0266
$$ 156236 193400 161292 -65134 -28163 338809 592704 665562 735696 552155 406623 466889
5191D66889P710k3487L0342l7876R6923K28112J8156m06141l42513k6705N9291
$$ 466889 474599 451112 481454 443578 540501 768613 786769 380628 38115 11410 70701
5180G0701n799N2965k5179l00969j18859J28280J83011J28070M1407o2832q9658
$$ 70701 64902 117867 92688 -208281 -327140 -198860 -15849 112221 153628 90796 1138
5169A138j75371k0929J32260J88991K39427L05028J58549n6733j27437k66810
$$ 1138 -174233 -195162 -62902 126089 365516 670544 829093 772360 644923 378113
5159C78113j86325r7232r509j31130k48938m7671J01396J78174J5781j04188J43576
$$ 378113 191788 94556 85047 -46083 -295021 -342692 -241296 -63122 -47341 -151529 -7953
5148g953J49540m809K1481q7989m704j9072Q581k8132j60320j65239N4519k4028
$$ -7953 141587 136778 158259 70270 65566 46494 55075 26943 -133377 -298616 -244097 -268125
5136b68125P6716J05187k8332p1488N4490N9744N607K8471p835Q5865L16539O3727
$$ -268125 -191409 -86222 -114554 -186042 -131552 -71808 -66201 -37730 -45565 40300 356839 420566
5124D20566j92223k19760k91195n9031K52023J85507m5522j07749M3749J78781
$$ 420566 228343 8583 -282612 -341643 -89620 95887 50365 -57384 -13635 165146
5114A65146n767k10802k52873k14653m7180K80321J49872q2758N005J52013R1100
$$ 165146 159379 -51423 -304296 -518949 -566129 -285808 -135936 -218694 -213689 -61676 29424
5103B9424O6422J72574K41998L3395k90252k96462k46657l34289k09412K11206
$$ 29424 95846 268420 510418 543813 253561 -42901 -289558 -623847 -833259 -622053
5093f22053L05467j945n5841m0838j06858m6602M4116O8148J15591N2159l1706
$$ -622053 -316586 -318531 -374372 -415210 -522068 -568670 -524554 -456406 -340815 -288656 -320362
5082c20362l7976J13048Q6400K53727K81002L0436r4290r8287R3500N0684j33183
$$ -320362 -358338 -245290 -158890 94837 375839 406275 311985 213698 307198 357882 224699
5071B24699r2879j21873j44335k1501J688J34891J55100O4020P4200J27258J11468
$$ 224699 131820 9947 -134388 -155889 -154201 -19310 135790 199810 274010 401268 512736
5060E12736Q213j30821k68562M9923J60050Q865k49834l94972k21436J62193L51996
$$ 512736 520949 390128 121566 171489 331539 340404 90570 -304402 -525838 -363645 -11649
5049a1649L6970o5966o9602p4016K0422J10873J45170l3127j12938O3415J53228
$$ -11649 25321 -40645 -110247 -184263 -163841 -52968 92202 59075 -53863 9552 162780
5038A62780J29234J14099n0186p7880j54151l1570K086J04075K62992N9664j5522
$$ 162780 292014 406113 355927 278047 123896 92326 94412 198487 461479 521143 505621
5027E05621m2358n08k6529j25753q334k4047M7309q1715O1116J13829J55954J01912
$$ 505621 463263 462755 436226 310473 302139 278092 325401 243686 304802 418631 574585 676497
5015F76497L9444K03186K5258J5163O6295n9592r7540q4793j16916k51723j06781
$$ 676497 715941 919127 944385 959548 1025843 966251 868711 783918 667002 415279 308498
5004C08498J03043L26668L39611J61028K44463J52620J46556K87286O67712P29323
$$ 308498 411541 738209 1077820 1238848 1483311 1635931 1782487 2069773 2737485 3466808
4994C466808M03128M08492Q65278J241640J446810J660179K377326K886831K958848
$$ 3466808 3869936 4278428 5143706 6385346 7832156 9492335 11869661 14756492 17715340
4985A7715340K870651J855179N2174j588924k360187k265853j670681j079386
$$ 17715340 20585991 22441170 22493344 20904420 18544233 16278380 14607699 13528313
4977A3528313n32025K09978Q74212J093603J388428K139599K601045J861822l1792
$$ 13528313 12996288 13206266 14080478 15174081 16562509 18702108 21303153 23164975 23133183
4968B3133183k176488l149929k737686k239918j907214j659674j314912p63084
$$ 23133183 20956695 17806766 15069080 12829162 10921948 9262274 7947362 7184278
4960G184278q55728r24734p16731n31103k39148j28372k37810l29877l02404k34908
$$ 7184278 6328550 5403816 4687085 4155982 3916834 3788462 3550652 3220775 2918371 2683463
4950B683463k25972k00805k44491k50851q7046j56101k64362l47471k88025p7166
$$ 2683463 2457491 2256686 2012195 1761344 1674298 1518197 1253835 906364 618339 541173
4940E41173j0141K29460M42836O1242k883o9499k59997j89229j49439j51023N0049
$$ 541173 531032 760492 1203328 1264570 1261687 1192188 932191 742962 593523 442500 492549
4929D92549J67904J12852k20831j54420O4665n8412k01698j78496J39126J76778
$$ 492549 660453 773305 552474 398054 462719 404307 202609 24113 163239 340017
4919C40017K8939N0101L5209L059j18168J45003Q6364j91369k19158j56554Q0505
$$ 340017 368956 419057 454266 457325 339157 484160 570524 379155 159997 3443 83948
4908H3948P8275j58083r0728K7323Q4385L6327j18821j40092J18291K27281m8577
$$ 83948 162223 4140 -86588 -59265 25120 61447 -57374 -197466 -79175 148106 99529
4897I9529j78622k45586L8401K13348J50315J06149N8886o350m4918O8667J39239
$$ 99529 -79093 -324679 -286278 -72930 77385 183534 242420 236070 191152 259819 399058
4886C99058p1826l19260J4648L55721J3534m4931j16948J12960K40134J33639
$$ 399058 327232 7972 22620 378341 391875 346944 229996 342956 583090 716729
4876G16729k27075m27221k72474j54706K2088J82229o7117J2385J19839l5704
$$ 716729 489654 62433 -210041 -364747 -342659 -160430 -227547 -215162 -95323 -131027
4866a31027J3827O6947k25198j36188J75088M26239M30055j38833m16440j12762
$$ -131027 -117200 -50253 -275451 -411639 -236551 189688 619743 480910 64470 -48292
4856d8292l5909j57459j30977k9037L75047L88850P3706N6068J56122j17772k04016
$$ -48292 -84201 -241660 -372637 -401674 -26627 362223 435929 491997 648119 530347 326331
4845C26331j68405j4841Q89O2293K00380M2313p2656J05458J13803k11922l12530
$$ 326331 157926 143085 143974 206267 406647 448960 376304 481762 595565 383643 71113
4834G1113j35276j92130m031J1127k525O6262P5492J04136J8959k604O0080L05935
$$ 71113 -64163 -256293 -260324 -249197 -251722 -185460 -109968 -5832 13127 10523 70603 376538
$$ [...]
##END NTUPLES=NMR SPECTRUM
##END=
