##TITLE=C13_LR-688A-C2
 CDCl3, 23000 sc

 24.9.2019
##JCAMPDX= 6.0         $$ Bruker NMR JCAMP-DX V2.0
##DATA TYPE= NMR SPECTRUM
##DATA CLASS= NTUPLES
##ORIGIN= UXNMR, Bruker Analytische Messtechnik GmbH
##OWNER= root
$$ XWIN-NMR		Version 3.5
$$ Wed Sep 25 13:55:55 2019 Russian Standard Time (UT+4h)  she@DPX200
##.OBSERVE FREQUENCY= 50.327896
##.OBSERVE NUCLEUS= ^13C
##.ACQUISITION MODE= SIMULTANEOUS
##.ACQUISITION SCHEME= undefined
##.AVERAGES= 23000
##.DIGITISER RES= 17
##SPECTROMETER/DATA SYSTEM= spect
##.PULSE SEQUENCE= zgpg30
##.SOLVENT NAME= CDCl3
##.SHIFT REFERENCE= (INTERNAL, CDCl3, 0, 222.624)
##AUDIT TRAIL= $$ (NUMBER, WHEN, WHO, WHERE, WHAT)
$$ ##TITLE= Audit trail, XWIN-NMR		Version 3.5
$$ ##JCAMPDX= 5.01
$$ ##ORIGIN= Bruker BioSpin GmbH
$$ ##OWNER= she
$$ F:/spectra/data/she/nmr/c13/1/pdata/1/auditp.txt
$$ ##AUDIT TRAIL=  $$ (NUMBER, WHEN, WHO, WHERE, WHAT)
(   1,<2019-09-25 13:54:41.93 +0400>,<she>,<DPX200>,
      <created by zg, POWCHK disabled, PULCHK disabled
       terminated by command 'halt'
       configuration hash MD5:
       00 E9 B6 7A A2 85 ED C7 34 08 36 98 17 FE 4E 26
       data hash MD5: 32K
       6E 1B 0E A7 BD 0A 0D 02 6B FC ED 8B 54 30 F3 F2>)
(   2,<2019-09-25 13:54:44.29 +0400>,<she>,<DPX200>,
      <Start of raw data processing
       efp BC_mod = 2 LB = 1 FT_mod = 6 PKNL = 1 PHC0 = -378.7427 PHC1 = 32.60638 SI = 32K 
       data hash MD5: 32K
       9D EB 74 32 8B D6 4C A7 11 C5 44 EE AE EA F3 17>)
(   3,<2019-09-25 13:54:47.65 +0400>,<she>,<DPX200>,
      <abs ABSG = 5 
       data hash MD5: 32K
       9C 08 7B A8 03 AF EB D0 15 12 DD A1 71 37 90 FD>)
(   4,<2019-09-25 13:55:10.39 +0400>,<she>,<DPX200>,
      <pk PHC0 = 0.2044471 PHC1 = 0.9999999 
       data hash MD5: 32K
       CE AF 8F 7A 32 08 74 72 AC DF C7 E2 CD 71 AB 81>)
(   5,<2019-09-25 13:55:14.00 +0400>,<she>,<DPX200>,
      <abs ABSG = 5 
       data hash MD5: 32K
       78 52 AF 6C 83 B8 CE F7 76 A6 41 74 19 A1 22 65>)
$$ ##END=
$$ 
$$ hash MD5
$$ 98 FA 3A D0 C7 A4 3B 92 A1 2E A7 80 91 F7 4A E4
##$RELAX= 
##$RELAX= 
##$RELAX= 
##$RELAX= 
##$RELAX= 
##$RELAX= 
##$RELAX= 
##$RELAX= 
$$ Bruker specific parameters
$$ --------------------------
##$DU= <F:/spectra>
##$EXPNO= 1
##$NAME= <c13>
##$PROCNO= 1
##$TYPE= <nmr>
##$USER= <she>
##$AMP= (0..31)
100 100 100 100 100 100 100 100 100 100 100 100 100 100 100 100 100 100 
100 100 100 100 100 100 100 100 100 100 100 100 100 100 
##$AQSEQ= 0
##$AQ_mod= 1
##$AUNM= <au_zg>
##$AUTOPOS= <>
##$BF1= 50.322709
##$BF2= 200.13
##$BF3= 50.322709
##$BF4= 500.13
##$BF5= 500.13
##$BF6= 500.13
##$BF7= 500.13
##$BF8= 500.13
##$BYTORDA= 1
##$CFDGTYP= 0
##$CFRGTYP= 5
##$CHEMSTR= <none>
##$CNST= (0..31)
1 1 145 1 1 1 1 1 1 1 1 1 1 1 1 1 1 1 1 1 1 1 1 1 1 1 1 1 1 1 1 1 
##$CPDPRG= <waltz16>
##$CPDPRG1= <>
##$CPDPRG2= <waltz16>
##$CPDPRG3= <>
##$CPDPRG4= <mlev>
##$CPDPRG5= <mlev>
##$CPDPRG6= <mlev>
##$CPDPRG7= <mlev>
##$CPDPRG8= <mlev>
##$CPDPRGB= <>
##$CPDPRGT= <>
##$D= (0..31)
$$ [...]
##$SUBNAM4= <"">
##$SUBNAM5= <"">
##$SUBNAM6= <"">
##$SUBNAM7= <"">
##$SUBNAM8= <"">
##$SUBNAM9= <"">
##$SW= 239.972175391363
##$SWIBOX= (0..15)
0 1 3 0 0 0 0 0 0 0 0 0 0 0 0 0 
##$SW_h= 12077.2946859903
##$TD= 32768
##$TD0= 1
##$TE= 0
##$TE2= 300
##$TE3= 300
##$TEG= 300
##$TL= (0..7)
120 120 120 120 120 120 120 120 
##$TP= (0..7)
150 150 150 150 150 150 150 150 
##$TP07= 0
##$TPNAME0= <>
##$TPNAME1= <>
##$TPNAME2= <>
##$TPNAME3= <>
##$TPNAME4= <>
##$TPNAME5= <>
##$TPNAME6= <>
##$TPNAME7= <>
##$TPOAL= (0..7)
0.5 0.5 0.5 0.5 0.5 0.5 0.5 0.5 
##$TPOFFS= (0..7)
0 0 0 0 0 0 0 0 
##$TUNHIN= 0
##$TUNHOUT= 0
##$TUNXOUT= 0
##$USERA1= <user>
##$USERA2= <user>
##$USERA3= <user>
##$USERA4= <user>
##$USERA5= <user>
##$V9= 5
##$VALIST= <valist>
##$VCLIST= <CCCCCCCCCCCCCCC>
##$VD= 0
##$VDLIST= <DDDDDDDDDDDDDDD>
##$VPLIST= <PPPPPPPPPPPPPPP>
##$VTLIST= <TTTTTTTTTTTTTTT>
##$WBST= 1024
##$WBSW= 4
##$XGAIN= (0..3)
0 0 0 0 
##$XL= 0
##$YL= 0
##$YMAX_a= 157437950
##$YMIN_a= -38812966
##$ZGOPTNS= <>
##$ZL1= 120
##$ZL2= 120
##$ZL3= 120
##$ZL4= 120
##$ABSF1= 222.624
##$ABSF2= -17.3728
##$ABSG= 5
##$ABSL= 3
##$ALPHA= 0
##$AQORDER= 0
##$ASSFAC= 0
##$ASSFACI= 0
##$ASSFACX= 0
##$ASSWID= 0
##$AUNMP= <proc_1d>
##$AZFE= 0.1
##$AZFW= 0.5
##$BCFW= 0
##$BC_mod= 2
##$BYTORDP= 0
##$COROFFS= 0
##$CY= -3
##$DATMOD= 1
##$DC= 0
##$DFILT= <>
##$DTYPP= 0
##$F1P= 0
##$F2P= 0
##$FCOR= 0.5
##$FTSIZE= 32768
##$FT_mod= 6
##$GAMMA= 0
##$GB= 0
##$INTBC= 1
##$INTSCL= 4.134877e-10
##$ISEN= 128
##$LB= 1
##$LEV0= 0
##$LPBIN= 0
##$MAXI= 10000
##$MC2= 0
##$MEAN= 0
##$ME_mod= 0
##$MI= 0.1934396
##$NCOEF= 0
##$NC_proc= 3
##$NLEV= 6
##$NOISF1= 120.0001
##$NOISF2= 80.00006
##$NSP= 0
##$NTH_PI= 0
##$NZP= 0
##$OFFSET= 222.624
##$PC= 1.4
##$PHC0= -378.5383
##$PHC1= 33.60638
##$PH_mod= 1
##$PKNL= yes
##$PPARMOD= 0
##$PSCAL= 0
##$PSIGN= 0
##$REVERSE= no
##$SF= 50.3227315989248
##$SI= 32768
##$SIGF1= 140
##$SIGF2= 120
##$SINO= 11.81781
##$SIOLD= 32768
##$SREGLST= <13C.CDCl3>
##$SSB= 0
##$STSI= 32768
##$STSR= 0
##$SW_p= 12077.2946859903
##$SYMM= 0
##$S_DEV= 0
##$TDeff= 32768
##$TDoff= 0
##$TI= <>
##$TILT= no
##$TM1= 0
##$TM2= 0
##$TOPLEV= 0
##$USERP1= <user>
##$USERP2= <user>
##$USERP3= <user>
##$USERP4= <user>
##$USERP5= <user>
##$WDW= 1
##$XDIM= 32768
##$YMAX_p= 286363498
##$YMIN_p= -1169960
$$ End of Bruker specific parameters
$$ ---------------------------------
##NTUPLES= NMR SPECTRUM
##VAR_NAME=  FREQUENCY,     SPECTRUM/REAL,   SPECTRUM/IMAG
##SYMBOL=    X,             R,               I
##VAR_TYPE=  INDEPENDENT,   DEPENDENT,       DEPENDENT
##VAR_FORM=  AFFN,          ASDF,            ASDF
##VAR_DIM=   32768,         32768,           32768
##UNITS=     HZ,            ARBITRARY UNITS, ARBITRARY UNITS
##FACTOR=    0.368581032318806, 1,           1
##FIRST=     11203.0474431902, 0,            0
##LAST=      -874.247242800138, 0,           0
##MIN=       -874.247242800138, -1169960,    0
##MAX=       11203.0474431902, 286363498,    0
$$ Real data points
##PAGE= N=1
##DATA TABLE= (X++(R..R)), XYDATA
$$ [...]
15958c7147q9928m0861N0602j33732n7641J16950J45675k1802j40114j25969M1243
$$ -37147 -127075 -167936 -117334 -251066 -308707 -191757 -46082 -67884 -207998 -333967 -292724
15947b92724J66232K35605J9895j26633j9622j01525j25407Q6488R9908L6991
$$ -292724 -126492 109113 129008 2375 -17247 -118772 -244179 -157691 -57783 -20792
15937b0792n6847j25339J30411J17873n0608r7205k49286k9701J5073n4226R5387
$$ -20792 -77639 -202978 -72567 45306 -5302 -102507 -351793 -381494 -366421 -420647 -325260
15926c25260m4785j84890j59750J93708K09462M6298K26689K46838R9753n5514
$$ -325260 -370045 -554935 -714685 -520977 -311515 -265217 -38528 208310 308063 252549
15916B52549j57680j66930j94674l5374o2948J13049J26838k3047j25578J01188
$$ 252549 94869 -72061 -266735 -302109 -365057 -252008 -125170 -148217 -273795 -172607
15906a72607J87609K66960P8851j20217p9532j19952p7478O5971K25385J01267
$$ -172607 15002 281962 360813 240596 161064 41112 -36366 29605 254990 356257
15896C56257j2073J38485j57271l52106l55786j65221J15707Q5791j5045L99281
$$ 356257 344184 482669 325398 -26708 -382494 -547715 -432008 -346217 -361262 38019
15886C8019M16399O9794j60936l50171l81615j5618K70344K03502K12209K44056
$$ 38019 454418 524212 363276 13105 -368510 -384128 -113784 89718 301927 545983
15876E45983j85507l55067k56257j18805K85961M37241L09566J70662M8747r0717
$$ 545983 360476 5409 -250848 -369653 -83692 353549 663115 833777 882524 791807
15866G91807l12758j91716j55791m9121K10181j07150l21833k92902k942J88205
$$ 791807 479049 287333 131542 82421 292602 185452 -136381 -429283 -432225 -244020
15856b44020J62071R9894M0592o7430P8944K41509K16166j9101M0648j7919j10532
$$ -244020 -81949 17945 58537 -8893 70051 311560 527726 508625 549273 531354 420822
15845D20822j86142j10058N8099L7784j1407n432J22861k68192l33009j45770
$$ 420822 234680 124622 182721 220505 209098 203666 326527 58335 -274674 -420444
15835d20444l2667J2585p8650k1936K25592L50932J3811j63559m0996l6423m0834
$$ -420444 -453111 -440526 -519176 -541112 -315520 35412 49223 -114336 -155332 -191755 -232589
15824b32589J61055N6743M5072J16504o966k17385p033R9253J13455L107J53613
$$ -232589 -71534 -14791 30281 146785 139819 -77566 -84599 14654 128109 131216 284829
15813B84829P1331k38061j35743Q801J77376J25391j38930j11124K36173J4270
$$ 284829 356160 118099 -17644 -8843 168533 293924 154994 43870 280043 294313
15803B94313k03289n762j4046j03894m7458M9169q0968j73203j33976P2317L64662
$$ 294313 91024 85262 71216 -32678 -80136 -30967 -111935 -285138 -419114 -346797 17865
15792A7865K81144R3902k5073r5688J6977n910r4753K2280J29576J42020O6443
$$ 17865 299009 392911 367838 272150 289127 283217 188464 210744 340320 482340 548783
15781E48783j22465k33159o7087J18673L1386k59094k37227p359J45557J77923
$$ 548783 426318 193159 126072 244745 276131 17037 -220190 -227549 -81992 95931
15771I5931J78023K7328j93649l35536m651J67408K9668j02396j5646r6316k62552
$$ 95931 273954 301282 107633 -227903 -232554 -65146 -35478 -137874 -153520 -249836 -512388
15760e12388p5520K78837K32424J18507k8375o5993l2230n4608l0897O2972j06656
$$ -512388 -587908 -309071 -76647 41860 13485 -52508 -84738 -139346 -170243 -107271 -213927
15749b13927n2709J18039k65243l45527M2131R4663n3453J08056L04213L46546
$$ -213927 -266636 -148597 -413840 -759367 -717236 -622573 -676026 -567970 -263757 82789
15739H2789P8620j29746k52017j02842K75502K80387k07010m16198j03946J36358
$$ 82789 161409 31663 -220354 -323196 -47694 232693 25683 -390515 -494461 -358103
15729c58103J02231Q4865J31314P6075p363R5104r0349j8725K44681O3642q1681
$$ -358103 -255872 -171007 -39693 36382 29019 124123 33774 15049 259730 323372 241691
15718B41691l15317k11445K16687K12306K3374O9159N6353k30720j61705M2665
$$ 241691 -73626 -285071 -68384 143922 167296 236455 292808 62088 -99617 -56952
15708e6952M340n8266J68108L61427j27999k82139J6068k21374N0589M34847K40899
$$ -56952 -52612 -110878 57230 418657 290658 8519 24587 -196787 -146198 288649 529548
15697E29548O903n668r4451p4467k54035m03068o2747J10863q1765m4435K7660
$$ 529548 536451 530783 436332 361865 107830 -295238 -357985 -247122 -328887 -373322 -345662
15686c45662P8938o0744j79859j55088J17290K0680R8278K01569J27292R2581
$$ -345662 -266724 -327468 -507327 -662415 -545125 -524445 -426167 -224598 -97306 -4725
15676d725j61667Q440Q8464J91669M8341k8648O2449j922j62439j19622j79252
$$ -4725 -166392 -157952 -69488 122181 170522 141874 204323 202401 39962 -79660 -258912
15665b58912l6611J15046J36687r1036k07507J2831J72557Q5827O0003K42711
$$ -258912 -295523 -180477 -43790 -134826 -342333 -329502 -156945 -71118 -11115 231596
15655B31596J44430q500k73169m06159j99803q524J33613K4261k1861K05641J50739
$$ 231596 376026 367526 94357 -311802 -511605 -520129 -386516 -362255 -384116 -178475 -27736
15644b7736j15244j70793j73326j86265K4617K05576J60951L9556j66879J80150
$$ -27736 -142980 -313773 -487099 -673364 -648747 -443171 -282220 -242664 -409543 -229393
15634b29393L45793L3386O4687J33398r45k26620k33880o2288J17886k6184K0709
$$ -229393 116400 149786 214473 347871 346926 120306 -113574 -175862 -57976 -84160 -63451
15623f3451J13730j8808k35547N8317K22183J33483p7247k06176Q7347J46597
$$ -63451 50279 31471 -204076 -145759 76424 209907 132660 -73516 13831 160428
15613A60428l148k08319j78366L0031K32746l8596k38106j66186j4906J95587
$$ 160428 157280 -51039 -229405 -199374 33372 -5224 -243330 -409516 -424422 -228835
15603b28835P3895m8060J9485K4648M6643J73572K43058J06926k09984k11708
$$ -228835 -154940 -203000 -183515 -158867 -112224 61348 304406 411332 201348 -10360
15593a0360Q559P1200K9194R4003n6090k84172k53169k8108J39339M1866O9141
$$ -10360 -1801 69399 98593 192596 136506 -147666 -400835 -428943 -289604 -247738 -178597
15582a78597J87371J64605O2051j08115l4473j57563j30716N2504K1831O9159
$$ -178597 8774 173379 235430 127315 92842 -64721 -195437 -142933 -121102 -51943
15572e1943p1405K0864K43704R9373M4618k30099j28275L384O535k36747M5446
$$ -51943 -123348 -102484 141220 240593 285211 55112 -73163 -69779 -63244 -299991 -254545
15561b54545L22315N628r6702o7594O3897P9784R0015J6010P0122J3409l2317
$$ -254545 67770 73398 -23304 -90898 -27001 52783 142798 158808 228930 242339 210022
15550B10022n8443n7356m6856Q4572M7854l783j64798k08466r6571J73701K36684
$$ 210022 151579 94223 47367 131939 179793 176010 11212 -197254 -293825 -120124 116560
15539A16560L5025k03863l10337j12511Q5384L2312n3384q2455L6133J1958n7411
$$ 116560 151585 -52278 -362615 -475126 -389742 -357430 -410814 -493269 -457136 -445178 -502589
15528e02589J19421J48497k539j72335j56438p1259j2614O9310K86879L06512
$$ -502589 -383168 -234671 -237210 -409545 -565983 -637242 -649856 -580546 -293667 12845
15518A2845J69038J81318n0717j40534o5259k09357n5773k3427M0652K80195K68529
$$ 12845 181883 363201 312484 171950 106691 -102666 -158439 -181866 -141214 138981 407510
15507D07510J30813k977j74530k25261j43012N9749o9549k7728j7734r7757l7559
$$ 407510 538323 535346 360816 135555 -7457 52292 -17257 -44985 -62719 -160476 -198035
15496a98035Q4153J47321p6423j35098q0750J12513J86706N7844k67177k67232
$$ -198035 -113882 33439 -42984 -178082 -258832 -146319 40387 98231 -168946 -436178
15486d36178K9382J83966J55181O8553M0367N9719J58633J01659j83245l40171
$$ -436178 -406796 -222830 -67649 904 41271 100990 259623 361282 178037 -162134
15476a62134q0134J20390J9811p4225q1145k7915k2567Q7783m3155r6065j23348
$$ -162134 -242268 -121878 -102067 -176292 -257437 -285352 -307919 -220136 -263291 -359356 -482704
15465d82704L4176p6669k4189Q8137O0443P5958k6120j52614o8207j48437l3749
$$ -482704 -448528 -525197 -549386 -461249 -400806 -324848 -350968 -503582 -571789 -720226 -753975
15454g53975J91891L2974j12411R0068L08728J19294o7246M5926K01966k449m8973
$$ -753975 -562084 -529110 -641521 -551453 -242725 -123431 -190677 -144751 57215 54766 5793
15443E793Q7725O893M8642m5568l53778K2987L14336N8369j57449Q5271K42122
$$ 5793 93518 100411 149053 103485 -250293 -227306 87030 145399 -12050 73221 315343
15432C15343j13642k10280N0723J97482O7274O5110n4326j88563j11567n0572
$$ 315343 201701 -8579 42144 239626 306900 372010 317684 129121 17554 -33018
15422c3018L6678L6536N3342j04437j9629J23351k9075l0044J99882M8374j07892
$$ -33018 3660 40196 93538 -10899 -30528 92823 63748 33704 233586 281960 174068
15411A74068K31076K79845M4013j64845j11853N2099O2335K7199j66048k82708
$$ 174068 405144 684989 729002 564157 452304 504403 566738 593937 427889 145181
15401A45181k09242L4258J96429J88894j17554l16914j47376O6570l7436r7238
$$ 145181 -64061 -29803 166626 355520 237966 -78948 -226324 -159754 -197190 -294428
15391b94428J60919Q3632j87092J1324n9978j16571J14252O9949L8907J48507
$$ -294428 -133509 -49877 -236969 -225645 -285623 -402194 -287942 -217993 -179086 -30579
15381c0579J09016J06474n728j95471k57223j07257k1342r7488j18759l1639N7771
$$ -30579 78437 184911 179183 -16288 -273511 -380768 -402110 -499598 -618357 -649996 -592225
15370e92225p9834p0098J20691R5355r3949N7913P6018Q9495L0673O103J08776
$$ -592225 -672059 -742157 -621466 -526111 -620060 -562147 -486129 -396634 -365961 -359858 -251082
15359b51082J14990J55994K326p4900J06214K245p0837J23231P3362n1133J40696
$$ -251082 -136092 19902 22228 -52672 53542 55787 -15050 108181 181543 130410 271106
15348B71106J68138J74838K38584o2663j77164r4003o2360j93165k30430o8136
$$ 271106 439244 614082 852666 790003 612839 518836 456476 263311 32881 -35255
15338c5255k8382L507n1712M2593N8868n1381M2026N6296j81289j77444K9318
$$ -35255 -63637 -60130 -111842 -69249 -10381 -61762 -19736 36560 -144729 -322173 -292855
15327b92855J79652J02928J36290J45205k6441k0045n2952k96119l00606j18138
$$ -292855 -113203 -10275 126015 271220 244779 224734 171782 -124337 -424943 -543081
15317e43081K9655K05354J39661l9813j4695M1098J98983L32972J55971R1622
$$ -543081 -513426 -308072 -168411 -208224 -222919 -181821 17162 350134 506105 597727
15307E97727N6894n6229O034J3335o8668l04205l38873o2864o338J75597J56230
$$ 597727 654621 598392 604426 617761 549093 244888 -93985 -156849 -163187 12410 168640
15296A68640k11469k14368k1914m1594J09914K05002M50262J85835l32680k77472
$$ 168640 -42829 -257197 -279111 -320705 -210791 -5789 444473 630308 297628 20156
15286B0156j03533k13011J62196L04971J05993j40362k22308j45062o0597J5825
$$ 20156 -83377 -296388 -134192 170779 276772 136410 -85898 -230960 -291557 -275732
15276b75732J59965K36069J73816O2697j32425K9083R3163j22823q7594O6291
$$ -275732 -115767 120302 294118 356815 224390 253473 346636 223813 136219 202510
15266B02510J65244p2319j8526q017j79721j71921p0795J41437J20786j42860
$$ 202510 367754 295435 276909 268892 89171 -82750 -153545 -12108 108678 -34182
15256c4182r5651q1287J7938J84111J46473O4722j25937k70925j78851M4834Q4302
$$ -34182 -129833 -211120 -193182 -9071 137402 202124 76187 -194738 -373589 -328755 -244453
15245b44453K10316K05471O4579j36843j09654N7968j85379l82392o894N2956
$$ -244453 -34137 171334 235913 99070 -10584 47384 -137995 -520387 -527281 -474325
15235d74325J74138J05839j3349j00669N4213J55890J26537j46315j49990P3615
$$ -474325 -300187 -194348 -207697 -308366 -254153 -98263 28274 -118041 -268031 -194416
15225a94416K41968K45235m8311j27575k64628m12709j09373K39168k222k50784
$$ -194416 47552 292787 244476 116901 -147727 -560436 -669809 -430641 -432863 -683647
15215f83647J90396L66797l0302k85383l5779J80755K61357K07207J70070m2015
$$ -683647 -493251 -126454 -156756 -442139 -477918 -297163 -35806 171401 341471 299456
15205B99456m9310Q0300j0421L3779j09399l53555l92228l68661K6550M37847
$$ 299456 250146 330446 320025 353804 244405 -109150 -501378 -870039 -843489 -405642
15195d05642N18385L14929o7280k28059o4563l1920j16214p02K58166K38155J76045
$$ -405642 112743 427672 360392 132333 67770 35850 -80364 -81066 177100 415255 591300
15184E91300l6265l76198j57618q1655J01334p2950j90947R1718R8443q394J40309
$$ 591300 555035 178837 21219 -60436 40898 -32052 -222999 -131281 -32838 -41232 99077
15173I9077N9889J28547Q9404k17865m12109m07039k12923J76632Q4017o6073
$$ 99077 158966 287513 376917 159052 -253057 -660096 -873019 -696387 -612370 -678443
15163f78443n8053K08483J36576k6316P2929M3741j36069k15710K3390J41453
$$ -678443 -736496 -528013 -391437 -417753 -344824 -301083 -437152 -652862 -629472 -488019
15153d88019Q5814J40001R4136K2144j09102k54439j71791J65014L66242n6178
$$ -488019 -402205 -262204 -168068 -145924 -255026 -509465 -681256 -516242 -150000 -206178
15143b06178k04283k8788J00109K65817J22846q9345n0765L1783L8940q7532j55997
$$ -206178 -410461 -439249 -339140 -73323 49523 -39822 -90587 -58804 -19864 -107396 -263393
15132b63393J617R6573r324L3574J52648O9353j76070j41770r042N8979J74585
$$ -263393 -261776 -165203 -174527 -140953 11695 81048 -95022 -236792 -245834 -186855 -12270
15121a2270J88543p2040j36737k65270k62455l9592K74865L50219L32080J84158
$$ -12270 176273 104233 -32504 -297774 -560229 -599821 -324956 25263 357343 541501
15111E41501j35832l41409k44652K88907K76198p483k8452o791l5625n3135n9955
$$ 541501 405669 64260 -180392 108515 384713 377230 348778 341987 306362 253227 193272
15100A93272p5417k58303l44376J2852M0354J77443L03412R7743j35133K10012
$$ 193272 117855 -140448 -484824 -471972 -431618 -254175 49237 146980 11847 221859
15090B21859Q6373j38540j44504j82191n9621l3268j96541J8214J83382L39265
$$ 221859 308232 169692 25188 -157003 -216624 -249892 -446433 -428219 -244837 94428
15080I4428K96564l4363k28487j35418J62960J97045p7932l10419k70428k13936
$$ 94428 390992 356629 128142 -7276 155684 352729 274797 -35622 -306050 -519986
15070e19986r9517o6842L7970K04449Q4003j60789q2144r3056N4042R2703j8440
$$ -519986 -619503 -686345 -648375 -443926 -359923 -520712 -602856 -695912 -641870 -549167 -567607
15059e67607r4354m1387L8840m2503j98121m2159J18529K87005L08611J31216
$$ -567607 -661961 -703348 -664508 -707011 -905132 -947291 -828762 -541757 -233146 -101930
15049a01930l5089p5592p6808j08958l6871J28878J43748K9461k4251k13526j82873
$$ -101930 -137019 -212611 -289419 -398377 -435248 -306370 -162622 -133161 -157412 -370938 -553811
15038e53811J22807J71490j44465l64809j49668J72998K31448P5596R2535K13742
$$ -553811 -431004 -259514 -403979 -768788 -918456 -745458 -514010 -438414 -345879 -132137
15028a32137K9365L6032k3664j24921j6346P0034q2565j93999o3914n2546j595
$$ -132137 -102772 -66740 -90404 -215325 -231671 -161637 -244202 -438201 -502115 -554661 -556256
15017e56256O0484r96j20213M3196R3099j48298r1489N2195O1390K24408M39557
$$ -556256 -495772 -496768 -616981 -573785 -480686 -628984 -720473 -668278 -606888 -382480 57077
15006E7077M46302o2779r6501j10090j95046l2605Q0658K4853O9299J61308J8320
$$ 57077 503379 440600 344099 234009 38963 6358 87016 111869 181168 342476 360796
14995C60796m5722j87235k84689j2694R3083M3189j70544L1555L41006K56562
$$ 360796 315074 127839 -156850 -169544 -76461 -33272 -203816 -172261 168745 425307
14985D25307J02918j6777j07788k95125k26073r8270o9549o8061r310O327J7421
$$ 425307 528225 511448 403660 108535 -117538 -215808 -285357 -353418 -362728 -356401 -338980
14974c38980N1944N4280l2618o7561L8352J10365j19640l42859j09333k402j24563
$$ -338980 -287036 -232756 -265374 -332935 -294583 -184218 -303858 -646717 -756050 -758452 -883015
14963h83015l0116K80494K18940J43225K53885P1534k10989m9900J67228J30003
$$ -883015 -913131 -632637 -413697 -270472 -16587 54947 -156042 -205942 -38714 91289
14953I1289n5686J39300K77178j50286l08712k44735q4973m8567m7992j51181
$$ 91289 35603 174903 452081 301795 -6917 -251652 -336625 -385192 -433184 -584365
14943e84365J0453N1527r9466J29188K70562J37341R1413r0380k62222j06618
$$ -584365 -573912 -522385 -621851 -492663 -222101 -84760 6653 -83727 -345949 -452567
14933d52567j2687K90165J80901J5978L00774L50112q4395k88976l00913k76790
$$ -452567 -465254 -175089 5812 21790 322564 672676 588281 299305 -1608 -278398
14923b78398O7267J59016J86565j0292q7923q7886j43650m3051m5945K603N2935
$$ -278398 -211131 -52115 134450 124158 36235 -51651 -195301 -238352 -284297 -281694 -228759
14912b28759J49918K8625j7050p417J1940j16792k67789q3521K1835n3032j4793
$$ -228759 -78841 -50216 -67266 -74683 -62743 -179535 -447324 -530845 -509010 -562042 -576835
14901e76835R9022M6424n3656J31182j270j15393k8897Q6629J5140j19768j10917
$$ -576835 -477813 -431389 -485045 -353863 -355133 -470526 -499423 -412794 -397654 -517422 -628339
14890f28339q2534L6059k3784o2813J47274L35646J84005J52497p9057l17253
$$ -628339 -710873 -674814 -698598 -761411 -614137 -278491 -94486 58011 -21046 -338299
14880c38299l38246n0133O22r3274K3767J36709r8911j20666j0098r4577J06005
$$ -338299 -676545 -726678 -726056 -819330 -795563 -658854 -757765 -878431 -888529 -983106 -877101
14869h77101J19617p0015Q6985K16574J92681N1720o7546n4403m269J08160L3736
$$ -877101 -757484 -827499 -740514 -523940 -331259 -279539 -347085 -401488 -405757 -297597 -263861
14858b63861k17514q3475K24770J55225n599N7759J54372J34747Q2447j77253
$$ -263861 -481375 -564850 -340080 -184855 -190454 -132695 21677 156424 238871 61618
14848F1618p9634j8906k74881j92246J3176m293r2443o4946k00041Q0625K70004
$$ 61618 -18016 -36922 -311803 -504049 -490873 -495166 -587609 -652555 -852596 -771971 -501967
14837e01967K08325J76247K39423J47629K1550j27118k857J51666j41138m48379
$$ -501967 -293642 -117395 122028 269657 291207 164089 161232 312898 171760 -276619
14827b76619k08460P4503J25858K48676J01960j56363k05868o8574J40569K67278
$$ -276619 -485079 -410576 -284718 -36042 65918 -90445 -296313 -364887 -224318 42960
14817D2960P8657o0963k94417k74103j74248j09741M7033R2605J5511m6287k5185
$$ 42960 121617 60654 -233763 -507866 -682114 -791855 -744822 -652217 -636706 -682993 -708178
14806g08178k391J4906J33046K52503J04411O0750K21065L43489K15832j18743
$$ -708178 -710569 -695663 -562617 -310114 -205703 -144953 76112 419601 635433 516690
14796E16690j86652j65241j2567j2833q6446N4096J37278j03552j53635o9578
$$ 516690 330038 164797 152230 139397 52951 107047 244325 140773 -12862 -82440
14786h2440n4292K6318L7238P3882k18466M4535K43446r9506l80106j28481J49886
$$ -82440 -136732 -110414 -73176 706 -217760 -173225 70221 -29285 -409391 -537872 -387986
14775c87986K43204J09493j57781o6523P9076Q9892r0190j01570j8536R8607J30016
$$ -387986 -144782 -35289 -193070 -259593 -180517 -90625 -180815 -282385 -300921 -202314 -72298
14764g2298J11871j9828r3453p6289K6777R0878Q8459J24852K22655J26496k67872
$$ -72298 39573 19745 -73708 -149997 -123220 -32342 56117 180969 403624 530120 262248
14753B62248l06132k16447j10425J30007Q2626j30357J06232K05903j54742k282
$$ 262248 -43884 -260331 -370756 -240749 -158123 -288480 -182248 23655 -131087 -133369
14743a33369J50088J17473N0680j89747j21284N9171k931j00300Q7670J08759
$$ -133369 16719 134192 184872 -4875 -126159 -66988 -69919 -170219 -82549 26210
14733B6210j51219j81602R025L8776P957P0169J13858J5499O6528M4250j22450
$$ 26210 -125009 -306611 -297586 -258810 -250853 -180684 -66826 -51327 15201 59451 -62999
14722f2999o2825p2747l1286J38312o5834k70230M4578J18864j67579J62410J93904
$$ -62999 -125824 -198571 -229857 -91545 -157379 -427609 -383031 -264167 -431746 -269336 -75432
14711g5432j63946q5018m6965q0755J03379k0207j9897O1208J13732R5444n2657
$$ -75432 -239378 -324396 -371361 -452116 -348737 -368944 -388841 -327633 -213901 -118457 -171114
14700a71114r5995k6216P1334J91925L37683J85926M2717k5156k19828k98986
$$ -171114 -267109 -293325 -221991 -30066 307617 493543 536260 511104 291276 -7710
14690g710j02277J8351j26982k60913k3814R4417R9191K55588M4380j37102l8736
$$ -7710 -109987 -91636 -218618 -479531 -503345 -408928 -309737 -54149 -9769 -146871 -185607
14679a85607L1256J52793J94793o9641j44236p1051o5842j0080M5711j3553l29724
$$ -185607 -154351 -1558 193235 123594 -20642 -91693 -157535 -167615 -121904 -135457 -465181
14668d65181m6096J16135K07434K87810J90483m6613l02621j76158O2864J25042
$$ -465181 -511277 -395142 -187708 100102 290585 243972 -58649 -234807 -171943 -46901
14658d6901O6303J84406P109k0852n3660j51698l965J02331L096Q1896J88800
$$ -46901 19402 203808 210917 190065 136405 -15293 -19258 83073 86169 168065 356865
14647C56865p0088k5708j54777l64266j09488J11356K67092J73072j30775j79370
$$ 356865 286777 261069 106292 -257974 -367462 -256106 10986 184058 53283 -126087
14637a26087j65086j30133J61252L28115L9178q9440j04602j02725J12908L09710
$$ -126087 -291173 -421306 -260054 68061 107239 17799 -86803 -189528 -76620 233090
14627B33090L15403p3577l16145k37331j38609p0683l3237J6539n0096L7760R0981
$$ 233090 548493 474916 158771 -78560 -217169 -287852 -321089 -304550 -354646 -316886 -225905
14616b25905P8265k1921K7111j08759q1868j7829m6849J49722K57088J73860Q8480
$$ -225905 -147640 -169561 -142450 -251209 -333077 -350906 -397755 -248033 9055 182915 271395
14605B71395j7533k92276j92583J757N0770K08285p7959l57048l19270Q8840K95173
$$ 271395 253862 -38414 -230997 -229240 -178470 29815 -48144 -405192 -724462 -635622 -340449
14594c40449N9538o4531N2323J43621K92032K71805M8122j79935k04631M9948
$$ -340449 -280911 -345442 -293119 -149498 142534 414339 462461 282526 77895 127843
14584A27843k3805m12993l05656Q1713K22481K98997N9257k97022p1410P9055
$$ 127843 104038 -308955 -614611 -532898 -310417 -11420 47837 -249185 -320595 -241540
14574b41540J4351M3258R6812M7120j9482J55258n8444k39774k93565l1219J88250
$$ -241540 -227189 -183931 -87119 -39999 -59481 95777 37333 -202441 -496006 -527225 -338975
14563c38975J30286R9991J17897r8404j49051m1087p9979j19860O2376K31842
$$ -338975 -208689 -108698 9199 -89205 -238256 -279343 -359322 -479182 -416806 -184964
14553a84964P3724k07653j9993J17709R6265J39663j57941o2833j24048j17555
$$ -184964 -111240 -318893 -338886 -221177 -124912 14751 -143190 -206023 -330071 -447626
14543d47626K08281K67917l7947j09877J40538J43369j47500k02426J8003K45407
$$ -447626 -239345 28572 -9375 -119252 21286 164655 17155 -185271 -167268 78139
14533G8139O0489j98222j81129P3061J28960j69287j43429J33922K89353J28650
$$ 78139 138628 -59594 -240723 -167662 -38702 -207989 -351418 -217496 71857 200507
14523B00507n2574j19058k5088l8053j12215Q914J79874j23369R2805J08744l11514
$$ 200507 147933 28875 3787 -34266 -146481 -137567 42307 -81062 11743 120487 -191027
14512a91027j89319m2379j9411k01354o1639K07505M21747L26625P2966j19791
$$ -191027 -380346 -422725 -442136 -643490 -705129 -497624 -75877 250748 323714 203923
14502B03923r0575j29949l09887j66400j24345M5346J79355J19763k1637M0980
$$ 203923 113348 -16601 -326488 -492888 -617233 -571887 -392532 -272769 -294406 -253426
14492b53426M0852m8481P0568q4819k11218j29939R813J80015L92810K07586o4579
$$ -253426 -212574 -261055 -190487 -275306 -486524 -616463 -606650 -426635 -33825 173761 109182
14481A09182k03774j11090Q6039K24763J22033J1390j4018n1182p1823r0915J4817
$$ 109182 -94592 -205682 -119643 105120 227153 238543 224525 173343 101520 10605 25422
14470B5422j31128k0493J60089M7198R3631J74661m0125n9169l5780J28523L0882
$$ 25422 -105706 -126199 33890 81088 174719 349380 309255 250086 214306 342829 373711
14459C73711M9493R8687p8396l3023j09667o9376j58115j30519k08738j44675
$$ 373711 423204 521891 443495 410472 300805 231429 73314 -57205 -265943 -410618
14449d10618L4972J50978O8486j02104r9144m9765J02273J03941j1394J9248J45946
$$ -410618 -375646 -224668 -156182 -258286 -357430 -407195 -304922 -200981 -212375 -193127 -47181
14438d7181K5267p3787j1151r9470k91221k55262j34198K8778M59955K48970J02577
$$ -47181 -21914 -95701 -106852 -206322 -497543 -752805 -887003 -858225 -398270 -149300 -46723
14427d6723O1993r4777j7315J0973j82404m6720J08034N4610J5410j47018j34998
$$ -46723 15270 -79507 -96822 -85849 -268253 -314973 -206939 -152329 -136919 -283937 -418935
14416d18935l9505J17908k444j07858P2922K24767J01239P7439j82868l15857
$$ -418935 -458440 -340532 -342976 -450834 -377912 -153145 -51906 25533 -157335 -473192
14406d73192r8994K03929Q9789O6183K46804J47118R5067K2686n3015O1034O0491
$$ -473192 -572186 -368257 -278468 -212285 34519 181637 276704 299390 246375 307409 367900
14395C67900j14705r1386n9441m2634j33971o0633l5073M2153O5517j39341j38281
$$ 367900 253195 161809 102368 59734 -74237 -134870 -169943 -127790 -62273 -201614 -339895
14384c39895k87445n8590K45518K19924J60003n9131l5913N3273R7246J24801
$$ -339895 -627340 -685930 -440412 -220488 -60485 -119616 -155529 -102256 -5010 119791
14374A19791n3473P2723J4341J2690N1028J17736N9292M2819J02909n6386o7234
$$ 119791 66318 139041 153382 166072 217100 334836 394128 436947 539856 483470 416236
14363D16236p3692J19433K21590J91943K32064l8355k96968l66441j11837o8919
$$ 416236 342544 461977 683567 875510 1107574 1069219 772251 405810 293973 225054
14353B25054n5147j43384k33382M4878J83404M3056K2263J3659m0394j7147J444
$$ 225054 169907 26523 -206859 -161981 21423 64479 86742 100401 60007 42860 44304
14342D4304m2470k9723J38136R7390q2346j53107j7626J33721o4617j18998j3764
$$ 44304 1834 -27889 110247 207637 125291 -27816 -45442 88279 23662 -95336 -109100
14331a09100o5135k9588r3382p0785J14932J61852J04196j82901M628K1609p3893
$$ -109100 -174235 -203823 -297205 -367990 -253058 -91206 12990 -169911 -165283 -143674 -217567
14320b17567J53365L47518j18507k39861k10393j24596k27338j34171K41625j7262
$$ -217567 -64202 283316 164809 -75052 -285445 -410041 -637379 -771550 -529925 -547187
14310e47187k92644p6388J44207J59643J71737J33686Q4387k0956o097r8693m1446
$$ -547187 -839831 -916219 -772012 -612369 -440632 -306946 -222559 -243515 -249612 -348305 -389751
14299c89751L0017J40967R4484Q8164O3232J51550P8773q2191o9432k59321j14500
$$ -389751 -359734 -218767 -124283 -36119 27113 178663 257436 175245 105813 -153508 -268008
14288b68008N9587M6562m4809j52848j80845j54689m8795J2450O2497J96226K25859
$$ -268008 -208421 -161859 -206668 -359516 -540361 -695050 -743845 -731395 -668898 -472672 -246813
14277b46813K5136j14212l850L13788L15657L7210j22593j00416j13768j15258
$$ -246813 -221677 -335889 -339739 -25951 289706 326916 204323 103907 -9861 -125119
14267a25119j85547j41415J7376J76158N3722M0605J60349O4708k536K7163r536
$$ -125119 -310666 -452081 -434705 -258547 -204825 -164220 -3871 60837 58301 85464 75928
14256G5928j71216q7192P0205j19954P8208L45353M68798L74292K04983j9890
$$ 75928 -95288 -182480 -112275 -232229 -154021 191332 660130 1034422 1239405 1219515
14246A219515l87835l36228j19251j26834j33145p56J4298j07969j08266j86166
$$ 1219515 831680 495452 376201 249367 116222 115466 129764 21795 -86471 -272637
14236b72637m47j1833O1615J41036n9864k24995k16475M804L6579K0643J61444
$$ -272637 -273084 -284917 -223302 -82266 -142130 -367125 -583600 -578796 -542217 -521574 -360130
14225c60130K55019K48197R5400q1584j97094r1301k32604j22125o170k15629
$$ -360130 -105111 143086 238486 156902 -40192 -131493 -364097 -486222 -492392 -708021
14215g08021j18070J87316K25124J97080R9853J3475P8482J69913j27678o7741
$$ -708021 -826091 -638775 -413651 -216571 -116718 -103243 -24761 145152 17474 -50267
14205e0267J80191l3996L610j13776j78733o1794j26789l0301R7736J37996K51985
$$ -50267 129924 95928 99538 -14238 -192971 -254765 -381554 -411855 -314119 -176123 75862
14194G5862K65948k4119k88119q4911J80288j7785o8421L3526R411k7537j77142
$$ 75862 341810 317691 29572 -55339 124949 107164 38743 72269 81680 54143 -122999
14183a22999j04773l7255J48825K35927o5466j44199r6724j62028J8778J10929
$$ -122999 -227772 -265027 -116202 119725 54259 -89940 -186664 -348692 -329914 -218985
14173b18985L15631L13406J15m4241k43959o458J55966R622k678p6004k77043
$$ -218985 96646 410052 410167 365926 121967 115509 271475 281097 278419 202415 -74628
14162g4628m08502k04409J25769J00260j86417J28196K86493r3387j01396O990
$$ -74628 -483130 -687539 -561770 -461510 -647927 -519731 -233238 -326625 -428021 -421031
14152d21031r0025j42015M5965K47527J15227J25382R1321p2053j92120J79991
$$ -421031 -511056 -653071 -607106 -359579 -244352 -118970 -27649 -99702 -291822 -111831
14142a11831K38799j08524L0957J15999j12534j42864K42636K11475K1301j74705
$$ -111831 126968 18444 49401 165400 52866 -89998 152638 364113 385414 210709
14132B10709j62837K5626j25170n4965J52791K3401J03042K31415q2800l77238
$$ 210709 47872 73498 -51672 -106637 46154 69555 172597 404012 321212 -56026
14122e6026m04988k91577R4638L06996N9500P574R0413p2042j05066k1618K5405
$$ -56026 -461014 -752591 -657953 -350957 -291457 -283883 -193470 -265512 -370578 -392196 -366791
14111c66791j07990o3699J68587J41194p6857J37656K82605r2569o5969p263j36060
$$ -366791 -474781 -538480 -369893 -228699 -305556 -167900 114705 22136 -43833 -51096 -187156
14100a87156J46446L21869J64457M9203r792q8167j49725j26303j73028j50644
$$ -187156 -40710 281159 445616 494819 485027 396860 247135 120832 -52196 -202840
14090b02840j30880K8132j8423L3156J22318M1085J14787M1748k00693k22321
$$ -202840 -333720 -305588 -324011 -290855 -168537 -127452 -12665 29083 -171610 -393931
14080c93931j07358L5376K29463K15395j58697k08050K0897J59869O0367j42598
$$ -393931 -501289 -465913 -236450 -21055 -179752 -387802 -366905 -207036 -146669 -289267
14070b89267j52325n7003K08558K08929L03837J77589k13913k51172j69871j41185
$$ -289267 -441592 -498595 -290037 -81108 222729 400318 186405 -64767 -234638 -375823
14060c75823J06950K62460N4821k52674o9082J37090q172l4434Q6712K639j09952
$$ -375823 -268873 -6413 48408 -204266 -273348 -136258 -144430 -178864 -92152 -89513 -199465
14049a99465q2149o5990Q943j62247j25384O7438K57416J53746m1246P4696J35226
$$ -199465 -281614 -347604 -338661 -500908 -626292 -558854 -301438 -147692 -188938 -114242 20984
14038B0984j01283j06431k05918k38768L2156m735r6282R5877J44444J56186l8645
$$ 20984 -80299 -186730 -392648 -631416 -599260 -603995 -700277 -604400 -459956 -303770 -342415
14027c42415J10697K94036K55769K35455l6017l32753l07182j49326j1028o7487
$$ -342415 -231718 62318 318087 553542 517525 184772 -122410 -271736 -282764 -350251
14017c50251j98036n1013J11021R7753R9400J13418J25389N0124n1453n4117o7073
$$ -350251 -548287 -599300 -488279 -390526 -291126 -177708 -52319 -2195 -53648 -107765 -174838
14006a74838j47991o4979j08957q1385q033J08883K41301K06844M5854j04563
$$ -174838 -322829 -387808 -496765 -578150 -586183 -477300 -235999 -29155 16699 -87864
13996h7864J08165R9028k03240k51825j43884p7479k1763o3330j7622L32668L26669
$$ -87864 20301 119329 -83911 -335736 -479620 -557099 -578862 -642192 -659814 -327146 -477
13985d77q5807j38789r0428j69147q287m5648J07095M17509K53947J97490N7692
$$ -477 -86284 -225073 -315501 -484648 -492935 -538583 -431488 -13979 239968 437458 495150
13974D95150k79684k16327k6223K9208r1375j66575o3574R1394J31643P8016P9830
$$ 495150 215466 -861 -27084 2124 -89251 -255826 -319400 -228006 -96363 -18347 61483
13963F1483Q3294K6532p074m4137K7584J40190q1606j52634o045j11296q5687
$$ 61483 144777 171309 164235 120098 147682 287872 206266 53632 47587 -63709 -149396
13952a49396J9273j55256o7129J69021J83675J52588N5030j95424j51985O671
$$ -149396 -130123 -285379 -352508 -183487 188 152776 207806 12382 -139603 -132932
13942a32932j19444l0611o3343P9758P2696k6141M2961L2508J43532Q0907L4541
$$ -132932 -252376 -282987 -346330 -266572 -193876 -220017 -177056 -144548 -1016 79891 114432
13931A14432L664q2619o1475r8780R4274J95557J53945K42522k7719p9224r2211
$$ 114432 118096 35477 -25998 -124778 -30504 165053 318998 561520 533801 454577 362366
13920C62366j84088l02754k56502j22351n3835L9880J53570K3241k7189J44619
$$ 362366 178278 -124476 -380978 -503329 -557164 -517284 -363714 -340473 -367662 -223043
13910b23043K23662K04351k17272k48273R0249K16860m7658j67531K3466L4338
$$ -223043 619 204970 -12302 -260575 -170326 46534 -1124 -168655 -145189 -110851
13900a10851j04608j07096J10335J37975J51797M3214P1484L9169q1447j04202
$$ -110851 -215459 -322555 -212220 -74245 77552 120766 192250 231419 149972 45770
13890D5770j98061k07054J51706P8786n1453q812j154k947j15472r3828j0410
$$ 45770 -152291 -359345 -207639 -128853 -180306 -189118 -190272 -193219 -308691 -402519 -412929
13879d12929J25981Q2520p5494j00242j65138j64333j0001K05895K2867M4755
$$ -412929 -286948 -204428 -279922 -380164 -545302 -709635 -719636 -513741 -490874 -446119
13869d46119J19884n5392J9442K41228P2284j28462j38301j05129j3922Q850J44982
$$ -446119 -326235 -381627 -362185 -120957 -48673 -177135 -315436 -420565 -434487 -425637 -280655
13858b80655K91738p6563l33348p4277J40804Q5129J42311R6185N1451j14486
$$ -280655 11083 -65480 -398828 -473105 -332301 -247172 -104861 -8676 42775 -71711
13848g1711j38913l4615l0378Q6882N5791J0882n5147R2647O7175q3392j37911
$$ -71711 -210624 -245239 -275617 -188735 -132944 -122062 -177209 -84562 -17387 -100779 -238690
13837b38690m8377J56804J74289O036r3398k08095j06844J33826k3067j4214K11372
$$ -238690 -287067 -130263 44026 50062 -43336 -251431 -358275 -224449 -247516 -261730 -50358
13826e0358L45632J55729j9687j18891j01780l6153o8150N928O344J03470J7818
$$ -50358 295274 451003 431316 312425 210645 174492 106342 112270 118614 222084 239902
13815B39902l6809k49274j98127q7234L8693K41873K83115J38739j51611q4969
$$ 239902 203093 -46181 -244308 -331542 -292849 -50976 232139 370878 219267 134298
13805A34298j87033M1000J46378P0498O7401p932p8296J74161j02900l08352k51524
$$ 134298 -52735 -11735 134643 205141 272542 264610 186314 360475 257575 -50777 -302301
13794c02301l5890L4059N6157Q8594K6134m2002k48496q9842J56943J87686J67452
$$ -302301 -338191 -304132 -247975 -159381 -133247 -175249 -423745 -513587 -356644 -168958 -1506
13783a506N7266j71921p6091j01571j42192O5495L11553K57013J47078o1818l01001
$$ -1506 55760 -116161 -192252 -293823 -436015 -370520 -58967 198046 345124 283306 -17695
13772a7695j93233J88314N28871L32072j59387l63296m50902r8665O7150N4984
$$ -17695 -210928 -22614 506257 838329 678942 315646 -135256 -233921 -166771 -111787
13762a11787J33390J73039j31262k00977P898J63819J39386j52983j92252J2397
$$ -111787 21603 194642 63380 -137597 -129699 34120 173506 20523 -171729 -159332
13752a59332R9732J28711M5640o7181k2538l7875r8802J8788L2254P8319m0004
$$ -159332 -59600 69111 114751 47570 25032 -12843 -111645 -92857 -60603 17716 -22288
13741b2288l26184j95102K6569J55250K08262J53427J3123j32735j47060j10278
$$ -22288 -348472 -543574 -517005 -361755 -153493 -66 13057 -119678 -266738 -377016
13731c77016k83044l12451n5380L11428L13852Q5771j60802j09251J46343J43486
$$ -377016 -660060 -972511 -1027891 -716463 -402611 -316840 -477642 -586893 -440550 -297064
13721b97064j47595j62439L24919K81728O4822J10149j1254m1600K9087p924o2736
$$ -297064 -444659 -607098 -282179 -451 64371 174520 163266 121666 150753 142829 80093
13710H0093k54152k12447k4188O5738j04618r1178o1853J57424j13252l96493
$$ 80093 -174059 -386506 -410694 -344956 -449574 -540752 -602605 -445181 -558433 -954926
13700i54926N5828L31487J50727J33033J62931L40740J4094j47794n8173r2080
$$ -954926 -899098 -567611 -416884 -283851 -120920 219820 233914 86120 27947 -64133
13690f4133k18313k10865k53201j17708Q9918L5469N4636l6554j71509J8731L74782
$$ -64133 -282446 -493311 -746512 -864220 -774302 -738833 -684197 -720751 -892260 -873529 -498747
13679d98747K90132J40019K0672j94476j28738o6208o5990J18863K67014J66726
$$ -498747 -208615 -68596 -47924 -242400 -371138 -437346 -503336 -384473 -117459 49267
13669D9267m7181m3295o7195j08735m7336J4448K17518M16672K79774j03947l33221
$$ 49267 2086 -41209 -108404 -217139 -264475 -250027 -32509 384163 663937 559990 226769
13658B26769j08588M3358L8514M2021J3613q0784j52488q1938K11708K41415K44564
$$ 226769 118181 161539 200053 242074 255687 174903 22415 -59523 152185 393600 638164
13647F38164N0449J82588M1506k54340k45331j50602j14650J198j43138k79385
$$ 638164 688613 871201 912707 658367 413036 262434 147784 148982 5844 -273541
13637b73541l5579Q4760M5936q7209r6612N260J25479J41049R253J64406P7031
$$ -273541 -309120 -224360 -178424 -265633 -362245 -356985 -231506 -90457 -81204 83202 160233
13626A60233r4451q0105j45363k40939n4458J90673J99339k8425m4369L5850J3603
$$ 160233 65782 -14323 -159686 -400625 -455083 -264410 -65071 -93496 -137865 -102015 -88412
13615h8412P7123P3614J14109n3542q2822L6877O3180J10260q782j04392M809
$$ -88412 -11289 62325 176434 122892 40070 76947 140127 250387 241605 137213 142022
13604A42022j14297j82930p747P9034J59063L1991o9933J20150R6468J52923J70906
$$ 142022 27725 -155205 -162952 -83918 75145 107136 37203 157353 253821 406744 577650
13593E77650N4983J04362M0604N4927n7157J50L4889k86141n19358k96727J12701
$$ 577650 632633 736995 777599 832526 775369 775519 810408 524267 4909 -291818 -179117
13582a79117J35408P9266n3228p114J16340J94530J29581k9962r9676k01441k0714
$$ -179117 -43709 35557 -17671 -24785 91555 286085 415666 385704 286028 84587 63873
13571F3873J23016J12786r3787j04466K5791P0325m1207j12441J24062K00338
$$ 63873 186889 299675 205888 101422 127213 197538 156331 43890 167952 368290
13561C68290j13354l26804j29240r0778k9932O9783J04471J44812J95642J83589
$$ 368290 254936 -71868 -201108 -291886 -321818 -252035 -147564 -2752 192890 376479
13551C76479j07184K6269J3929j64231q0278j27731n0133j13004J6116J85919
$$ 376479 269295 295564 309493 145262 64984 -62747 -112880 -225884 -209768 -23849
13541b3849J54681L5969j65004J2120J93591N9125o8591k67525o9781L8921J74680
$$ -23849 130832 166801 1797 13917 207508 266633 198042 -69483 -139264 -100343 74337
13530G4337J59283N710j01785j07966r3768J72390L04609J96239n0445j69753
$$ 74337 233620 239330 137545 29579 -64189 108201 412810 609049 558604 388851
13520C88851m9382J16683J13793J14846M3347j44131j96429J2244N8634p8334
$$ 388851 339469 456152 569945 684791 728138 584007 387578 399822 458456 380122
13510C80122R9455J73516Q0994o8904m3720n0795J26004P4683j2160J9654j28573
$$ 380122 479577 653093 734087 665183 621463 570668 696672 771355 759195 778849 650276
13499F50276k90923k07161K613K7308o4409L8771J95682J12146j40338k57596
$$ 650276 359353 152192 154805 182113 117704 156475 352157 464303 323965 66369
13489F6369j95541l4356R3628K06818n8980k76851k27717J44330J15210m4125
$$ 66369 -129172 -163528 -69900 136918 77938 -198913 -426630 -282300 -167090 -211215
13479b11215R1422J7685J62986o117k48427k31342J39815K42775J46518K63442
$$ -211215 -119793 -102108 60878 54761 -193666 -425008 -285193 -42418 104100 367542
13469C67542P3815j93125k41538j34609M8429J49609J12099J69719M2284j29558
$$ 367542 441357 248232 6694 -127915 -79486 70123 182222 351941 394225 264667
13459B64667m5075J45135J36905j7603j91771j49386j92829k38051j2615J10788
$$ 264667 219592 364727 501632 484029 292258 142872 -49957 -288008 -300623 -189835
13449a89835J11347K69217K22478j76298j58140K56093M78141K92837q4775l57358
$$ -189835 -78488 190729 413207 236909 78769 334862 813003 1105840 1021065 663707
13439F63707k76059l2344J36820N9236l8632k31580k82563J979K57762J84357
$$ 663707 387648 355304 492124 551360 512728 281148 -1415 564 258326 442683
13429D42683j34873p3768J2878n5280l02599k33633r1593o7221k1695P3803K23698
$$ 442683 307810 234042 246920 191640 -110959 -344592 -436185 -503406 -525101 -451298 -227600
13418b27600J4625M1613o1782l034K3709m9184J98237J69443J6314J10729M947
$$ -227600 -212975 -171362 -233144 -236178 -212469 -261653 -63416 106027 122341 233070 238017
13407B38017r3068o5242q7124J99490J81326j23150j24803j18808Q444K46759
$$ 238017 144949 79707 -7417 192073 373399 250249 125446 6638 15082 261841
13397B61841J65105N1495O0499M9697K0012m6137N6065O0598n0705N7964J21978
$$ 261841 426946 478441 538940 588637 608649 562512 618577 679175 628470 686434 808412
13386H08412J084j6329O4212j01209m09005k91523j88719R524L34171J55786M3005
$$ 808412 809496 793167 857379 756170 347165 55642 -133077 -123553 210618 366404 409409
13375D09409L2953n0042o5902j02764k2291J17918m315o0119j80768k22163q2230
$$ 409409 442362 392320 326418 223654 201363 319281 314966 254847 74079 -148084 -230314
13364b30314p875q0796L23082N34184J87292l0328j16499o6543M0915J03m8070
$$ -230314 -238189 -318985 4097 538281 725573 695245 578746 512203 553118 553221 505151
13353E05151j43330m6820j23376p6495K86855P0459j00529j29210P0564K85597
$$ 505151 361821 315001 191625 115130 401985 472444 371915 242705 313269 598866
13343E98866J53811j20044Q203J30749J6195J41432J76702O7032p8814k07447
$$ 598866 752677 632633 640836 771585 787780 929212 1105914 1172946 1094132 886685
13333H86685p6697J77914P5262l9618j61163k92248k14851n9534L6605j37615
$$ 886685 809988 987902 1063164 1023546 862383 570135 355284 295750 332355 194740
13323A94740O5007O5214j06607j17693j15203R731K66846L27834J19745j4646
$$ 194740 259747 324961 218354 100661 -14542 -4811 262035 589869 709614 694968
13313F94968r5413k65743j08920J67870k0584l6801J56007K42985O4705j23299
$$ 694968 599555 333812 224892 392762 372178 335377 491384 734369 799074 675775
13303F75775N5984J03619N1006R3295J07078j18267l84455j80691l5421J05729
$$ 675775 731759 835378 886384 979679 1086757 968490 584035 403344 367923 473652
13293D73652J02323k5879k07891q5044N5505p4364n8388M5966j24006L3097l7761
$$ 473652 575975 550096 342205 257161 312666 238302 179914 225880 101874 134971 97210
13282I7210j43079L2103J14808J55706j7506j04937p8825n0881j85336p9618J64146
$$ 97210 -45869 -13766 101042 256748 239242 134305 55480 4599 -180737 -260355 -96209
13271i6209N7722n1362J45659J49380m0876n071O8835j82596M591J84956J57415
$$ -96209 -38487 -89849 55810 205190 164314 159243 228078 45482 50073 235029 392444
13260C92444J11754j25356r3326k07178m1711R0904L9337O3220k6863j58447Q3647
$$ 392444 504198 378842 285516 78338 36627 127531 166868 230088 203225 44778 128425
13249A28425J91137j12223J88466K64970J9326j64362j13447j4204K4939K5430
$$ 128425 319562 207339 395805 660775 680101 515739 402292 388088 413027 438457
13239D38457m4016m1215Q6971k278j68997j34556j02077P4679L32068J75135j26724
$$ 438457 394441 353226 440197 437919 268922 134366 32289 106968 439036 614171 487447
13228D87447j17414j572P6966Q5317M6800k2725j35967j7355L09709K10092j39020
$$ 487447 370033 368461 445427 530744 577544 554819 418852 401497 711206 921298 782278
13217G82278j29896j09209m5484J98431J93437J16650p5040j58903j04027j23565
$$ 782278 652382 543173 497689 696120 889557 1006207 931167 772264 668237 544672
13207E44672L1854p9011k24960N7370P8368j13407q0784P1974q709l2138k6431
$$ 544672 576526 497515 272555 329925 408293 294886 214102 286076 277367 245229 218798
13196B18798n2939N7398J76310L08438J57864p0483m1422J11695Q1551L7070p994
$$ 218798 165859 223257 399567 708005 865869 795386 753964 865659 947210 984280 976286
13185I76286q8940o3870j78309j47191K8590J07624J4007j75135k47234K30021
$$ 976286 887346 823476 645167 497976 526566 634190 648197 473062 225828 455849
13175D55849L68945J27507j6545k09080j73770m0428m9153J1593R2682L4303j28609
$$ 455849 824794 952301 935756 726676 552906 512478 463325 474918 567600 601903 473294
13164D73294m3695K04339J27957J5580J04406l7471j06689M8612Q2549n7704j79271
$$ 473294 429599 633938 761895 777475 881881 844410 737721 786333 868882 811178 631907
13153F31907P3203J27021p9533l07489l27183K2152J59227j0023J41257L63149
$$ 631907 705110 832131 752598 445109 117926 140078 299305 289282 430539 793688
13143G93688L79685J18584j5697k16768j95330j9045l8599q9631k08147j05565
$$ 793688 1173373 1291957 1276260 1059492 864162 845117 806518 716887 508740 403175
13133D03175K7743K03875L44545K29537K1012j52429p1786l3043o9356j30833
$$ 403175 430918 634793 979338 1208875 1229887 1077458 1005672 972629 903273 772440
13123G72440k02366o2561J22864K65176K36944N5161l0291J39137J38519q3281
$$ 772440 570074 507513 630377 895553 1132497 1187658 1157367 1296504 1435023 1351742
13113A351742k76059k02729k47460k91667L1103l656j31378L5816O7898J03388
$$ 1351742 1075683 872954 625494 333827 364930 361274 229896 265712 333610 436998
13103D36998K15741J97059J63592J86853K22295j20153l46237P126J65316O9266
$$ 436998 652739 849798 1013390 1200243 1422538 1302385 956148 963274 1128590 1197856
13093A197856n8743j71268L5396O0911k1855j28603j65166J16861J46191Q3213
$$ 1197856 1139113 967845 1003241 1064152 1042297 913694 748528 865389 1011580 1094793
13083A094793J76747M0879N1140J53335L4260P9295J34670J10434J5989k19372
$$ 1094793 1271540 1312419 1363559 1516894 1551154 1630449 1765119 1875553 1891542 1672170
13073A672170l09955j13490J6188P9533K0481J13986J23551P9643N4685j07012
$$ 1672170 1362215 1248725 1264913 1344446 1364927 1478913 1602464 1682107 1736792 1629780
13063A629780j01985J9202L8671j19513r3222j11424K19952L87386K19534J43156
$$ 1629780 1527795 1546997 1585668 1466155 1372933 1261509 1481461 1868847 2088381 2231537
13053B231537P6784k29214l06141j99797k0101o9738m6885J11651K41535J58185
$$ 2231537 2308321 2079107 1772966 1573169 1553068 1483330 1436445 1548096 1789631 1947816
13043A947816J87434K34000K45400J79508l77484l47639J239J81813L07923R7678
$$ 1947816 2135250 2369250 2614650 2794158 2416674 2069035 2070274 2252087 2560010 2657688
13033B657688j95603K5376K41305L4668j49060J34300K29483N42l62484j92723
$$ 2657688 2462085 2487461 2728766 2763434 2614374 2748674 2978157 2978699 2616215 2423492
13023B423492o90j19580o0418J86186J20165j9280J16754K67007L27655J75963
$$ 2423492 2422802 2303222 2242804 2428990 2549155 2529875 2646629 2913636 3241291 3417254
13013C417254O5648n2995P9986J99497m1252k4815J09971J22221K1477l1624K38456
$$ 3417254 3482902 3429907 3509893 3709390 3668138 3643323 3753294 3875515 3896992 3865368 4103824
13002D103824M16301L66336N9586k4861J21966K22736L34631N26873O48480Q11287
$$ 4103824 4520125 4886461 4946047 4921186 5043152 5265888 5600519 6127392 6775872 7587159
12992G587159O24870N28708O61748N94705O87833Q55745J347798J904758K203812
$$ 7587159 8212029 8740737 9402485 9997190 10685023 11540768 12888566 14793324 16997136
12983A6997136K811070L728610M598439N339282O973532R454516J2716145J7188456
$$ 16997136 19808206 23536816 28135255 33474537 40448069 49902585 62618730 79807186
12975G9807186K4066167L3716461M5002201N1816023M0434897M187295l4002115
$$ 79807186 103873353 137589814 182592015 234408038 274842935 279030230 245028115
12968B45028115m9289611m4803779l4239111k5073202j8246936j3664093j0296721
$$ 245028115 195738504 150934725 116695614 91622412 73375476 59711383 49414662
12961D9414662p738321o164801n048028l996793l285104k629094k275991j913678
$$ 49414662 41676341 35511540 30463512 26466719 23181615 20552521 18276530 16362852
12953A6362852j448864j146370j059094j063732r47588o13494m89404n34591n05567
$$ 16362852 14913988 13767618 12708524 11644792 10697204 10083710 9594306 9059715 8554148
12944H554148o89505o17803l56088k91070j95402j01521j85855k38754j04102
$$ 8554148 7864643 7246840 6890752 6599682 6404280 6302759 6116904 5878150 5774048
12935E774048j24783M1169J36215L344L0649O6292R380L76330K14463l71412j95091
$$ 5774048 5649265 5690434 5826649 5829993 5860642 5926934 5936314 6312644 6527107 6155695 5960604
12924E960604J71565K71748K81602K70682M01624O85154R60459J376047J880623
$$ 5960604 6132169 6403917 6685519 6956201 7357825 8042979 9003438 10379485 12260108
12915A2260108K626490L409654L806318L423060J158204j698620l250109l129344
$$ 12260108 14886598 18296252 22102570 25525630 26683834 24985214 21735105 18605761
12907A8605761k347785j622231r51490o61508j35009M16277M80494P91725J343538
$$ 18605761 16257976 14635745 13684255 13022747 12887738 13304015 13784509 14576234 15919772
12898A5919772J639744K057465K656463L463432M610039N812858P645583J0139982
$$ 15919772 17559516 19616981 22273444 25736876 30346915 36159773 43805356 53945338
12890E3945338J3684479J8805987K6244627L6670113M8446292N3372982L5193680
$$ 53945338 67629817 86435804 112680431 149350544 197796836 251169818 286363498
12883B86363498p035297m2508079n1263976m3500972l2436323k3547269j7234832
$$ 286363498 279328201 236820122 185556146 142055174 109618851 86071582 68836750
12876F8836750j2629236r417933p166671n510567m671381l941472l103521k503682
$$ 68836750 56207514 46789581 39622910 34112343 29440962 25499490 22395969 19892287
12868A9892287k157073j801476j324971j193848j028557q60017q25416n94158
$$ 19892287 17735214 15933738 14608767 13414919 12386362 11526345 10700929 10106771
12860A0106771n11807n25810m71529n29153o36019l77430l18055n73848l25942
$$ 10106771 9594964 9069154 8597625 8068472 7432453 7055023 6736968 6163120 5837178
12851E837178l04415j65499j53476l01766j38782j28173j64589j58405r1500k3256
$$ 5837178 5532763 5367264 5213788 4912022 4773240 4645067 4480478 4322073 4230573 4207317
12841D207317j54763k14360q0952J05235J90782K11148J99989J87215J72190K29198
$$ 4207317 4052554 3838194 3757242 3862477 4053259 4264407 4464396 4651611 4823801 5052999
12831E052999J48355Q4646J30976K14009Q8721K7288O1176K94124N65930L66108
$$ 5052999 5201354 5286000 5416976 5630985 5719706 5746994 5808170 6102294 6668224 7034332
12821G034332L41246K65603K07678M78676P05757R95331J241729J217899J372206
$$ 7034332 7375578 7641181 7848859 8327535 9033292 10028623 11270352 12488251 13860457
12812A3860457J614902J752746K208800K920579L833990M965751O433868Q419576
$$ 13860457 15475359 17228105 19436905 22357484 26191474 31157225 37591093 46010669
12804D6010669J1018351J4540249K0084705K8166783L8779223M9325578M9222583
$$ 46010669 57029020 71569269 91653974 119820757 158599980 207925558 257148141
12797B57148141K4541996j6878596m4986344m8531005l9969855k9746904k1374659
$$ 257148141 281690137 264811541 219825197 171294192 131324337 101577433 80202774
12790H0202774j5440508j1594644q988157p014904n587984m436653l488353k625437
$$ 80202774 64762266 53167622 44179465 37164561 31576577 27139924 23651571 21026134
12782B1026134k229014j915282j689174j509482j201047j062196r52579j005572
$$ 21026134 18797120 16881838 15192664 13683182 12482135 11419939 10467360 9461788
12774I461788q98935p69150p02569n91457o70163m41914j89520r9050l94923l67196
$$ 9461788 8562853 7793703 7091134 6499677 5829514 5387600 5198080 5099030 4704107 4336911
12764D336911j23288j66076k10627k55004k23431j65941k12952j8485l0985l9819
$$ 4336911 4213623 4047547 3836920 3581916 3358485 3192544 2979592 2961107 2930122 2890303
12754B890303j16864l24555j34394k6904l00427k95603P10j13685j66503J8226
$$ 2890303 2773439 2448884 2314490 2287586 1987159 1691556 1692266 1578581 1412078 1430304
12744A430304k1667J33271J75672R1463L088n0830n1189p2652j47607j26708K080
$$ 1430304 1408637 1541908 1717580 1809043 1812131 1761301 1710112 1637460 1489853 1363145 1365225
12733A365225n3516j96858o0219K42303K71584j9563j34867k56051k75828j0962
$$ 1365225 1311709 1114851 1054632 1296935 1568519 1548956 1414089 1158038 882210 871248
12723H71248Q1298k7052Q5567K2118K5847P9824j37191l78649k62007R2876Q9082
$$ 871248 952546 925494 1011061 1033179 1059026 1138850 1001659 623010 361003 453879 542961
12712E42961k9585O345p24Q1634R9664K6417j01176N2211J97557R1142J12614
$$ 542961 513376 519721 518997 600631 700295 726712 625536 677747 875304 966446 1079060
12701A079060j9662j2886j36823p7649J12451J03088J96507J9378k76757k04930
$$ 1079060 1059398 1046512 909689 832040 944491 1047579 1244086 1263464 986707 781777
12691G81777J09193J54098j05038k25860j18684J59603m3904j56131q0647j9791
$$ 781777 890970 1045068 940030 714170 595486 755089 711185 555054 474407 454616
12681D54616J54610M2092k9284L4623O5242m4803p2598n3646j69783k23341j33743
$$ 454616 609226 651318 622034 656657 721899 677096 604498 550852 381069 157728 23985
12670B3985j38226j8838J74487O8503K2872J34558K30859K49323K7961n633J18390
$$ 23985 -114241 -133079 41408 109911 132783 267341 498200 747523 775484 769851 888241
12659H88241j49382q0340N4960p6021j07259l9785j73636j8234J22753q981m7214
$$ 888241 738859 658519 713479 637458 530199 490414 316778 298544 421297 412316 365102
12648C65102J33618J18119J71759L60456J00438j69484m07174l44292j17516J145
$$ 365102 498720 616839 788598 1149054 1249492 1080008 672834 328542 211026 212171
12638B12171M0843K637j04565J22774Q2379L2677q1612j79960j15229K3605K44586
$$ 212171 253014 255651 151086 273860 356239 388916 307304 127344 12115 35720 280306
12627B80306J69603K144l5254j275j80534k06995J01810K36164n3699j92295m023
$$ 280306 449909 452053 416799 415524 234990 27995 129805 365969 312270 119975 115952
12616A15952j38109k03914j74573j26184j21827J901K63650K62074L0451j43919
$$ 115952 -22157 -226071 -400644 -526828 -648655 -646754 -383104 -121030 -90579 -234498
12606b34498m7791K9319J47054J24233Q9573j40389j82609K9678J04597J83288
$$ -234498 -282289 -252970 -105916 18317 107890 -32499 -215108 -185430 -80833 102455
12596A02455K14665j5642k10676J9028q954q9951N0925J03230K35693J04426Q7489
$$ 102455 317120 301478 90802 109830 100876 10925 61850 165080 400773 505199 592688
12585E92688J94174M621j48205o2526j32202j03957j7763j07915R4429K07178
$$ 592688 786862 791483 643278 580752 448550 344593 326830 218915 313344 520522
12575E20522n2885j50618n0714Q4493Q2347j00399k9009j40426k30279r9750J25261
$$ 520522 467637 317019 266305 350798 433145 332746 303737 163311 -66968 -166718 -41457
12564d1457J32293j45228j06108j30436j62881j1893J75643J28523l4059j26274
$$ -41457 90836 -54392 -160500 -290936 -453817 -465710 -290067 -161544 -195603 -321877
12554c21877J75581L79279J36777j63057q2931P9803J38673J27996R693j16880
$$ -321877 -146296 232983 369760 206703 123772 203575 342248 470244 479937 363057
12544C63057j72690q7192L5920J21049J1162p0697k16800j38251n918M1221L20712
$$ 363057 190367 103175 139095 260144 271306 200609 -16191 -154442 -160360 -119139 201573
12533B01573j06085j40161K13368P7128L6620K70987J41216j54207k13186l495
$$ 201573 95488 -44673 168695 245823 282443 553430 694646 540439 327253 323758
12523C23758K3220n5870J19510Q6943k47911l32106j47748J15286K86672J1131
$$ 323758 346978 291108 410618 497561 249650 -82456 -230204 -114918 171754 182885
12513A82885O838r7964j11452r7703R9618L25758J85947p1085p5732k5605J83916
$$ 182885 189723 91759 -19693 -117396 -17778 307980 493927 422842 347110 321505 505421
12502E05421J36997j42127j42165j66004j54337j96164j58060L0495j08080K1993
$$ 505421 642418 500291 358126 192122 37785 -158379 -316439 -285944 -394024 -372031
12492c72031M8404o2587J32786K64054J89293M3566m6276j53753k83540j40621
$$ -372031 -323627 -386214 -253428 10626 199919 243485 197209 43456 -240084 -380705
12482c80705Q6629J1300r590Q457L8664K13026K1127o1749N2117R8500J24459
$$ -380705 -294076 -282776 -292366 -283909 -245245 -32219 -11092 -72841 -20724 77776 202235
12471B02235Q4959k49936k73821j92980j8866L71113K63023M8367L16217J20j66698
$$ 202235 287194 37258 -236563 -429543 -448409 -77296 185727 234094 550311 550431 383733
12460C83733n5239j9795p224j99028k61893j34675N5199Q2211l7534M6652O3166
$$ 383733 328494 308699 301475 102447 -159446 -294121 -238922 -156711 -194245 -147593 -84427
12449h4427j33725q2784O6743J43706K51638J37868n2164p3632k64953j29140
$$ -84427 -218152 -300936 -234193 -90487 161151 299019 246855 173223 -91730 -220870
12439b20870L7054N2830J09163J39742J51008J95597K73209O6054l13634l41536
$$ -220870 -183816 -130986 -21823 117919 268927 464524 737733 803787 490153 148617
12429A48617q4322L1240J00241J36158j2170K01851J42235j67096k33067j97253
$$ 148617 64295 95535 195776 331934 319764 521615 663850 496754 263687 66434
12419F6434k22267n6923O7523J84434K35763J35580j64103k11426j07975k10108
$$ 66434 -155833 -212756 -145233 39201 274964 410544 246441 35015 -72960 -283068
12409b83068j87488K24411L02693J34219J03102j30844r8556J6658o5876L5952
$$ -283068 -470556 -246145 56548 190767 293869 163025 64469 81127 15251 51203
12399E1203J77169p926j19726J72852l2005r6695O4633J3428j94315q819M7420
$$ 51203 228372 220446 100720 273572 241567 144872 209505 222933 28618 19799 67219
12388F7219Q401K01578J0805j93164j08853j11874j54402M372K71075L32991K67042
$$ 67219 75620 277198 288003 94839 -14014 -125888 -280290 -275918 -4843 328148 595190
12377E95190k5056N7038l0813O2665J52462o737K2834M4379o319L8009M4885l4128
$$ 595190 570134 627172 596359 659024 811486 804749 827583 871962 865643 903652 948537 914409
12365I14409J8829K195j93824k34088l36433j56073j803N7003p1794R2967J57443
$$ 914409 933238 935433 741609 507521 171088 15015 13212 70215 -1579 91388 248831
12354B48831n0807j01639J41464L11749P7945j06271j06589k27673k29692q1806
$$ 248831 198024 96385 237849 549598 627543 521272 414683 187010 -42682 -124488
12344a24488L9886J7412q2825j15133M4534J3945j01926J75974K25421J14254
$$ -124488 -84602 -67190 -150015 -265148 -220614 -206669 -308595 -132621 92800 207054
12334B07054j8584N4017N8882o1090k29061j99474o0709n787K9639J326L4379
$$ 207054 188470 242487 301369 240279 11218 -188256 -248965 -254752 -225113 -223787 -189408
12323a89408Q5897l7242j25440j19261J51796K25538J14086m4074n8692r8639
$$ -189408 -103511 -140753 -266193 -385454 -233658 -8120 105966 61892 3200 -95439
12313i5439N2825K5309j3146R9054R8054q2554j00095J7944P6110k7527j97930
$$ -95439 -42614 -17305 -30451 68603 166657 84103 -15992 1952 78062 50535 -147395
12302a47395o687K13920R1314o9614j97867J9358J35840O6264N2222J30784L01268
$$ -147395 -154082 59838 151152 81538 -116329 -96971 38869 105133 157355 288139 589407
12291E89407J26898j18787j30898l15017j50228k0167j77973r0092J86936J80314
$$ 589407 716305 597518 466620 151603 1375 -18792 -196765 -286857 -99921 80393
12281H0393P2753j01005j84886j17626R0125J21689j40717j62511j77551O72K83324
$$ 80393 153146 52141 -132745 -250371 -160246 -38557 -179274 -341785 -519336 -518664 -235340
12270b35340K19614N2451P5908J21439J25036J8912n18821n10204r7146k6884
$$ -235340 -15726 36725 112633 234072 359108 378020 -140801 -651005 -748151 -775035
12260g75035M247K5897L2555l2064n1348K94811J77885J19680j1114q6508j41925
$$ -775035 -770788 -744891 -712336 -744400 -795748 -500937 -323052 -203372 -214486 -300994 -442919
12249d42919o2360J45729J28860R386K6788J94130L859r4126j06336n4284O633
$$ -442919 -505279 -359550 -230690 -221304 -194516 -386 3473 -90653 -196989 -251273 -244640
12238b44640R982j30042r6456J42743K78720Q0670k4194j51149j18745q2972P9385
$$ -244640 -234658 -364700 -461156 -318413 -39693 40977 16783 -134366 -253111 -336083 -256698
12227b56698K91803J54919j04909j48048m7141q1157j75567j8660J65969J11514
$$ -256698 35105 190024 85115 -62933 -110074 -191231 -366798 -385458 -219489 -107975
12217a07975P5585r8884n0152J3189o4056P956M3635L1607J31437Q6979L8416
$$ -107975 -32390 -131274 -181426 -168237 -232293 -224337 -180702 -149095 -17658 69321 107737
12206A07737l0454j60880l1285Q6780M4725n5617r2400N4310J48777k5133j3936
$$ 107737 77283 -83597 -114882 -28102 16623 -38994 -131394 -77084 71693 46560 32624
12195C2624J37643r6698j45638j40407l902J16673p6803l11703j83585K6417J64188
$$ 32624 170267 73569 -72069 -212476 -216378 -99705 -176508 -488211 -671796 -645379 -481191
12184d81191L34794R5273j55107k3836N4574n6646j37613r6062j06708j74541
$$ -481191 -146397 -51124 -206231 -230067 -175493 -232139 -369752 -465814 -572522 -747063
12174g47063K10789N16855L52756j93271k44239q3618Q0645j2024n1991J72793
$$ -747063 -536274 -19419 333337 140066 -104173 -187791 -107146 -119170 -171161 1632
12164A632J24811j62160j48405K7063j414J56040J09187M9972n1846N8615L3802
$$ 1632 126443 -35717 -184122 -157059 -158473 -2433 106754 156726 104880 163495 197297
12153A97297k93855k76532k54843k4257l0600Q3730J97337k2179r9243M0946J18482
$$ 197297 -96558 -373090 -627933 -652190 -682790 -599060 -401723 -423902 -523145 -482199 -363717
12142c63717N2223L3355L2110K2771J47742J23105j15286j46512o1602K19485
$$ -363717 -311494 -278139 -246029 -223258 -75516 47589 -67697 -214209 -275811 -56326
12132e6326J79524J72059O1064j30291j58411j75228k74578M0793K49388l1625
$$ -56326 123198 295257 356321 226030 67619 -107609 -382187 -341394 -92006 -123631
12122a23631j5355J48912j04149k39364R4231J97443J29235J39358j06439m2781
$$ -123631 -138986 9926 -94223 -333587 -239356 -41913 87322 226680 120241 77460
12112G7460J45575k8274j07428K5707k5490j76658o3643j06523p5050k0186r613
$$ 77460 223035 194761 87333 113040 87550 -89108 -152751 -259274 -334324 -354510 -364123
12101c64123J19456K86740J32315N2153J14717j72922r0536m7412k12956j08966
$$ -364123 -244667 42073 174388 226541 341258 168336 77800 30388 -182568 -291534
12091b91534J41736J79280Q8604o5099k4817n5772j88999j91140j00760J77823
$$ -291534 -149798 29482 118086 52987 28170 -27602 -216601 -407741 -508501 -330678
12081c30678k6892j90791J82703L17534m1498m1006j51110k20494M4799J85486
$$ -330678 -357570 -548361 -365658 -48124 -89622 -130628 -281738 -502232 -457433 -271947
12071b71947L05765n5888j06131k1006q1919R2384J9925j42858J8504K16447J58181
$$ -271947 33818 -22070 -128201 -149207 -231126 -138742 -118817 -261675 -243171 -26724 131457
12060A31457r9834n412J05569J41901J27275L0807p0493l7132q5904j29184J43889
$$ 131457 31623 26211 131780 273681 400956 431763 361270 324138 238234 109050 252939
12049B52939J76921J2051j20174k68880j04463J87770J92800K58982R2888Q6179
$$ 252939 429860 441911 321737 52857 -51606 136164 328964 587946 680834 767013
12039G67013Q2369n7620n6226l75512k68343p9461q1936q2365o0072j88479r2706
$$ 767013 849382 791762 735536 360024 91681 12220 -69716 -152081 -212153 -400632 -493338
12028d93338M9505J38553K94844J52315p0097p2679N8693J34369L6723j50152
$$ -493338 -443833 -305280 -10436 141879 71782 -897 57796 192165 228888 78736
12018G8736j01229j13464J68824J58239N3901R7769N1185R7825K29338J0489j17216
$$ 78736 -22493 -135957 32867 191106 245007 342776 393961 491786 721124 731613 614397
12007F14397j37007q4500l32778j67578J31013Q4429l9552L9385K42918K28858
$$ 614397 477390 392890 60112 -107466 23547 107976 68424 107809 350727 579585
11997E79585j61430k48534M712J95038j21974j82021M4354N7500N505r6902l9176
$$ 579585 418155 169621 174333 369371 247397 65376 109730 167230 172735 75833 36657
11986C6657J35236J72206K8286k2555j47621j16533L789Q9672R1800k5625p3897
$$ 36657 171893 344099 372385 349830 202209 85676 89465 179137 270937 245312 171415
11975A71415r6064j10821J0508L02759J66009p5159K1892j1273P7974n917o2622
$$ 171415 75351 -35470 -24962 277797 443806 368647 390539 379266 457240 451323 388701
11964C88701k01241j07500N0417j30461j56854L9530o5492n7797q9662j08121
$$ 388701 187460 79960 130377 -84 -156938 -117408 -182900 -240697 -330359 -438480
11954d38480O6262J73532J34120Q1644l6583j9817J98495J34302K0039o4573k12139
$$ -438480 -372218 -198686 -64566 17078 -19505 -39322 159173 293475 313514 248941 36802
11943C6802k52007J55237J83733J03230P3336J47143j3191r9825j25953k24429
$$ 36802 -215205 -59968 123765 226995 300331 447474 434283 334458 208505 -15924
11933a5924R7332K78j14379r824O1965m1474M7625J25007j55638k06528o4715
$$ -15924 81408 81686 -32693 -42517 19448 -22026 25599 150606 -5032 -211560 -276275
11922b76275l261J27896n2621j06689p4345j28088O5566J35247j5652J17902r114
$$ -276275 -279536 -151640 -204261 -310950 -385295 -513383 -447817 -312570 -328222 -210320 -219434
11911b19434m7397N0592J4638K6450n001J23174K91404K35086L7915j86213l30686
$$ -219434 -266831 -216239 -201601 -175151 -180152 -56978 234426 469512 507427 321214 -9472
11900i472k40967L6402j00417j94124M1876K18608J43571J13791J01037o6925
$$ -9472 -250439 -214037 -314454 -508578 -466702 -248094 -104523 9268 110305 43380
11890D3380l7358j66480n5359K16224J37212M7508M3663M1236M7271L2237J25589
$$ 43380 6022 -160458 -215817 407 137619 185127 228790 270026 317297 349534 475123
11879D75123l2875j66615j39830k7826k6350Q34K666J08598J24037r3201j05484
$$ 475123 442248 275633 135803 107977 81627 82461 85127 193725 317762 224561 119077
11868A19077r9988k3712K33787K18343L835l0758m4344P4589K39465O0450m3974
$$ 119077 19089 -4623 229164 447507 451342 420584 376240 450829 690294 750744 706770
11857G06770M7093K9046j53363j18427j35969j27239k14217j45139P4772L49830
$$ 706770 753863 782909 629546 511119 375150 247911 33694 -111445 -36673 313157
11847C13157K76369J00876k7878o725O278p7912J4443Q0027M9445q0231r5340
$$ 313157 589526 690402 662524 655799 662077 584165 598608 678635 728080 647849 552509
11836E52509j1728p1672K3768O1397q1226J35927L44817M72901K67621L8925M10577
$$ 552509 540781 469109 492877 554274 473048 608975 953792 1426693 1694314 1733239 2143816
11825B143816J004219J118396R35850R50094J185042J669639K724607L686754
$$ 2143816 3148035 4266431 5202281 6152375 7337417 9007056 11731663 15418417
11817A5418417L251172P02699k300436l474979l062758k299893j773376j423891
$$ 15418417 18669589 19372288 17071852 13596873 10534115 8234222 6460846 5036955
11809E036955j139890q12019l94105k19134k71227k65631m02519l70058j83509
$$ 5036955 3897065 3085046 2690941 2471807 2200580 1934949 1532430 1162372 978863
11800I78863j26035R909J53610L1009k01232q8462J70340M8293m8196L3570m0637
$$ 978863 852828 862737 1016347 1047356 846124 757662 928002 976295 928099 961669 921032
11789I21032j73819l38915j84656J05740K63758J35289n6811q9241q6298o9972
$$ 921032 747213 408298 223642 329382 593140 728429 671618 582377 496079 426107
11779D26107r2101j06717k1842j84274j88911K46828N10688J69971j8031q4947
$$ 426107 334006 227289 205447 21173 -167738 79090 589778 759749 741718 656771
11769F56771l4683K869J7041j56491k35845l4404J52169K1571j40202M1132k1334
$$ 656771 622088 624957 641998 485507 249662 215258 367427 388998 248796 289928 268594
11758B68594M1240N730j29500L3792J37074m1046p2987J34502K85078L10890J29807
$$ 268594 309834 315564 186064 219856 356930 315884 242897 377399 662477 973367 1103174
11747A103174j38245k65260j55905J33205O8090J9612l9149P6791J61298L39195
$$ 1103174 964929 699669 543764 676969 745059 764671 725522 802313 963611 1302806
11737A302806K14685j42052Q212J02117j11048q1174r975r8949P7171K9152q991
$$ 1302806 1517491 1375439 1383651 1485768 1374720 1293546 1283571 1184622 1261793 1290945 1281954
11726A281954J72319K93451J97979L59528L30620L79264N13253N38121R49268
$$ 1281954 1454273 1747724 1945703 2305231 2635851 3015115 3528368 4066489 5015757
11717E015757J503446J834017J998929K235680K883299M122330N933807Q392509
$$ 5015757 6519203 8353220 10352149 12587829 15471128 19593458 25527265 33919774
11709C3919774R607007O805393K3652p295333j0136694q293902n587673l916211
$$ 33919774 43526781 50332174 50355826 43060493 32923799 24629897 19042224 15126013
11701A5126013k980188k255241j421118p65087l63338j86666o47357j244759j150082
$$ 15126013 12145825 9890584 8469466 7704379 7341041 7154375 6507018 5262259 4112177
11692D112177o98158k97798o6460o5936m26684o20193m54388l07161J43679P8558
$$ 4112177 3414019 3116221 3049761 2983825 2557141 1936948 1482560 1175399 1319078 1397636
11682A397636l53914n9931j11678j86458j10809j92786j92144j6321j306p1419
$$ 1397636 1043722 983791 872113 685655 574846 382060 189916 173595 172289 100870
11672A00870R3522K22131N9348Q2132J23441k7321k46448m04958j68164j386K8484
$$ 100870 194392 416523 475871 558003 681444 654123 407675 2717 -165447 -166833 -138349
11661a38349m205O0973R8736K60639K15754Q9200R3090o840p5620M8832R7462
$$ -138349 -142554 -81581 17155 277794 493548 582748 675838 668998 593378 642210 739672
11650G39672j20008k40698l94391o9403K56229K50563K08552o7413o5923M7849
$$ 739672 619664 378966 -15425 -84828 171401 421964 630516 563103 497180 545029
11640E45029M4592l1462k14500j55696j0442m4940N5160K4828J2712L7229J39303
$$ 545029 589621 558159 343659 187963 177521 132581 187741 212569 225281 262510 401813
11629D01813J81473q5879J10350K88325N0187j87715k23792m9460j72246k81959
$$ 401813 583286 497407 607757 896082 946269 758554 534762 485302 313056 31097
11619C1097l3626J52622k2411J83089J98471M2832j37200r1268N3587o0188j80330
$$ 31097 -2529 150093 127682 310771 509242 552074 414874 323606 377193 317005 136675
11608A36675L9687N3657N9096K18522J53433j02696p9568L5139M1801J6361r2805
$$ 136675 176362 230019 289115 507637 661070 558374 478806 513945 555746 572107 479302
11597D79302j75177L702l5845j18880k4696n1684L587K9621M7156J67119J45928
$$ 479302 304125 307827 271982 153102 128406 76722 80309 109930 157086 324205 470133
11586D70133J70619O8435j96341j89619p8256j10323k62518k28203M1265J76570
$$ 470133 640752 709187 512846 323227 244971 134648 -127870 -356073 -314808 -138238
11576a38238p2477n7154j35002M6003L00101K52556L8016Q1762P8260r8810r8133
$$ -138238 -210715 -267869 -402871 -356868 -56767 195789 233805 315567 393827 295017 196884
11565A96884J5077j33033p2258K70539K52309J70268k9953k43398r919K15500
$$ 196884 211961 78928 6670 277209 529518 699786 669833 426435 416516 632016
11555F32016P4012k45568l28508p1174K7696j03745k6156Q3111J3067l8374j31093
$$ 632016 706028 460460 131952 60778 88474 -15271 -41427 41684 54751 16377 -114716
11544a14716n3366J30949K2445q1536J8550J27147K35665K65236O1427p1742j25842
$$ -114716 -168082 -37133 -14688 -96224 -77674 49473 285138 550374 611801 540059 414217
11533D14217j08197P4438j1882n857o8885j46784j66662l83045m04908l8697L03953
$$ 414217 306020 380458 368576 362719 293834 147050 -19612 -402657 -807565 -846262 -542309
11522e42309N11474K01868k45195J78446K02257r355O3661l6346q303K0992P4002
$$ -542309 -30835 171033 -74162 104284 306541 297186 360847 324501 316198 337190 411192
11511D11192N8601O2017O8615j7810m2366R467j59746j85674j20686j93033p4648
$$ 411192 469793 531810 600425 582615 540249 549716 389970 204296 83610 -109423 -184071
11500a84071l2332j9937m8831j27373M7153n1344R9099M48547K10270J7304q5538
$$ -184071 -216403 -236340 -285171 -412544 -365391 -416735 -317636 130911 341181 358485 272947
11489B72947k17473j83665j17520l7339N7038J66944K11591J51163P1262j45804
$$ 272947 55474 -128191 -245711 -283050 -226012 -59068 152523 303686 374948 229144
11479B29144k68344j96334Q0703J77990r578o3390j244O6964j5609k4418P9729
$$ 229144 -39200 -235534 -154831 23159 13581 -49809 -51053 15911 302 -24116 55613
11468E5613N9924K0121P4803j3761j06275N8272p576q616P6158J63996J17338
$$ 55613 115537 135658 210461 196700 90425 148697 141121 132505 208663 372659 489997
11457D89997K17973L72374J98426K4923O5669l6987j45392m42000m40229o0010
$$ 489997 707970 1080344 1278770 1303693 1369362 1332375 1186983 744983 304754 244744
11447B44744R02P7921J59484j5641j7927O4738k1614J05390R4279j09913k23048
$$ 244744 245646 323567 483051 467410 449483 514221 492607 597997 692276 582363 359315
11436C59315j24753J26330K22955R1171k37620k40097n8316R0536J55953K4543
$$ 359315 234562 360892 583847 675018 437398 197301 138985 229521 385474 410017
11426D10017n5656p9567p0351R1649o399j85994n233L38007L89985M12562L4391
$$ 410017 354361 274794 204443 296092 289693 103699 98466 436473 826458 1239020 1273411
11415A273411j73753q7544m27216l15129k09116j40639J8228M3444J77486J12964
$$ 1273411 1099658 1012114 584898 269769 60653 -79986 -61758 -18314 159172 272136
11405B72136K0636J40370J05879j68058j73844j4177n0161j9837j36264j18099
$$ 272136 292772 433142 539021 370963 197119 182942 132781 112944 -23320 -141419
11395a41419m3122L21018J51286m519R0276k30020k16311J29739J7271k21637
$$ -141419 -184541 136477 287763 283244 373520 143500 -72811 56928 74199 -147438
11385a47438k43167P2438K39025J08423J57357J2772j93920j40546k42325K5939
$$ -147438 -390605 -318167 -79142 29281 186638 199410 5490 -135056 -377381 -351442
11375c51442M37613L54104J88759r1874q2518K2315k5170l17590k01322o3399
$$ -351442 86171 440275 629034 537160 454642 476957 451787 134197 -67125 -130524
11365a30524k3371Q4528J54626P0990p5861p1628J69005J30668N5220m886j77273
$$ -130524 -153895 -69367 85259 156249 80388 8760 177765 308433 363653 358767 181494
11354A81494m4151l42954m30493n0948K63550J5286k63986o9408L54666M31907
$$ 181494 137343 -205611 -636104 -687052 -423502 -408216 -672202 -741610 -386944 44963
11344D4963K07399Q5080J19704L44545J90423j66168l61214m36229l72675m4059
$$ 44963 252362 337442 457146 801691 992114 825946 464732 28503 -344172 -388231
11334c88231P1674N8080J40285J38781o6507j10175l7498K5347R6915l9546n590
$$ -388231 -316557 -258477 -118192 20589 -45918 -156093 -193591 -168244 -71329 -110875 -116465
11323a16465P309j22718O0788J58906o5982j30570l5367j01851o5661J91823K43618
$$ -116465 -109156 -231874 -171086 -12180 -78162 -208732 -244099 -345950 -411611 -219788 23830
11312B3830L5522q0090K9299R7755j9636o5953J21781p3448k87083j22285m140
$$ 23830 59352 -20738 8561 106316 86680 20727 142508 69060 -218023 -340308 -344448
11301c44448N3372J02540Q9230p1015j01638O5767N1496l4818J29957J72915k9020
$$ -344448 -291076 -188536 -99306 -170321 -271959 -206192 -154696 -189514 -59557 113358 84338
11290H4338k40790j54994L4942K3914M2783l3143j74045q5168l8042j01431L888
$$ 84338 -156452 -311446 -276504 -252590 -209807 -242950 -416995 -502163 -540205 -641636 -637748
11279f37748Q2021J42682J37662J01033J45585K22774J1930j61043j79174j39415
$$ -637748 -555727 -413045 -275383 -174350 -28765 194009 205939 44896 -134278 -273693
11269b73693M7658L05548J4108k25956Q3396J67622K581j33841k38659k91701
$$ -273693 -226035 79513 93621 -132335 -48939 118683 121264 -12577 -251236 -542937
11259e42937j75463Q7016R3054k1174K59435K40289N5065l3698r9023O6069J13639
$$ -542937 -718400 -631384 -538330 -559504 -300069 -59780 -4715 -38413 -137436 -71367 42272
11248D2272l2123L5644K3740m510J32098n4417k09738j96671j72087l2306L38011
$$ 42272 10149 45793 69533 65023 197121 142704 -67034 -263705 -435792 -468098 -130087
11237a30087K24061j00760m4602j029P0723p3267M1284j5048j47305J86515J92336
$$ -130087 93974 -6786 -51388 -52417 18306 -54961 -13677 -28725 -176030 10485 202821
11226B02821o6572k23281M5528N8207J36975j05640q6414R8944l2006R302O6780
$$ 202821 136249 -87032 -41504 16703 153678 48038 -38376 60568 28562 37864 104644
11215A04644Q4032P0519J4154L8294J37789N1576j99037j41729o6905j05973n6961
$$ 104644 188676 259195 273349 311643 449432 501008 301971 160242 93337 -12636 -69597
11204f9597m7432Q5501K1555j16407k29932j25813Q6721P9696j08895n5764J04198
$$ -69597 -117029 -31528 -9973 -126380 -356312 -482125 -395404 -315708 -424603 -480367 -376169
11193c76169j4319M2741J18432K55559L83121N0248j42200o7777j45934L9724
$$ -376169 -390488 -347747 -229315 26244 409365 459613 317413 249636 103702 143426
11183A43426J89391J98609O0964j03148l15002n9048j05049J5267L31384L37496
$$ 143426 332817 531426 592390 489242 174240 115192 10143 25410 356794 694290
11173F94290M00171K74742j9089k35025l80086r2605k4835k36347r3171N6966
$$ 694290 1094461 1369203 1350114 1115089 735003 642398 617563 381216 288045 345011
11163C45011o8629j1828K41231n7874r5167r6374k06763j25586p7502L9716J54419
$$ 345011 276382 264554 505785 447911 352744 256370 49607 -75979 -153481 -113765 40654
11152D0654L32327J15662P795Q1456p1823j40743K7435K12158Q6838q0034j33180
$$ 40654 372981 488643 496438 577894 506071 365328 392763 604921 691759 611725 478545
11141D78545p8052j80903r3432j48234p6665J88452J57310r4341j24594o8278
$$ 478545 400493 219590 126158 -22076 -98741 89711 247021 152680 28086 -40192
11131d0192r2214j02365o6179M8417M1735l1281o1520j37484o9720K19105K12656
$$ -40192 -132406 -234771 -300950 -252533 -210798 -242079 -303599 -441083 -510803 -291698 -79042
11120g9042j36347m0807K32005J74535j5708n8426J25765L37781J41280n5273
$$ -79042 -215389 -256196 -24191 150344 134636 76210 201975 539756 681036 625763
11110F25763l16064q0636L3310j06439o4048j29933j7995J32888k1441j04721
$$ 625763 309699 229063 262373 155934 91886 -38047 -56042 76846 55405 -49316
11100d9316q7415J24047K3103j51311j51397J09096K49416N6083Q0787P5902n7932
$$ -49316 -136731 -12684 10419 -140892 -292289 -183193 66223 122306 203093 278995 221063
11089B21063P33j30316j34996J70011K45152K32921J11627k21284j34511k4660
$$ 221063 221796 91480 -43516 126495 371647 604568 716195 494911 360400 335740
11079C35740K4654j20279j23697j65019r9042M3380J94863J49697j55381k307
$$ 335740 360394 240115 116418 -48601 -147643 -104263 90600 240297 84916 82609
11069H2609J20290r5123j82242k06236j45152J63664K47173O7157J47467l6444
$$ 82609 202899 107776 -74466 -280702 -425854 -262190 -15017 52140 199607 163163
11059A63163j44308k62285k77595J5283L72139K83465j7896k76488j77752n0574
$$ 163163 18855 -243430 -521025 -505742 -133603 149862 131966 -144522 -322274 -372848
11049c72848J70653L84989L25032K32459J15872j88744p3005j02307l59327r0812
$$ -372848 -202195 182794 507826 740285 856157 667413 594408 492101 132774 41962
11039D1962Q1204J59892J51718K61961R2974j19418m01240l16336q1781R2634
$$ 41962 123166 283058 434776 696737 789711 670293 269053 -47283 -129064 -36430
11029c6430L6811P7377j9026k95925l60800j09688N9279K16917K69443R9351m4889
$$ -36430 381 77758 58732 -237193 -597993 -707681 -648402 -431485 -162042 -62691 -107580
11018a07580M1211K16935J05696k98578k24581P7414J19066O782l9268L4771J16320
$$ -107580 -66369 150566 256262 -42316 -266897 -189483 -70417 -63635 -102903 -68132 48188
11007D8188J5406K46045J14049n1658j09804k42588k72590r2973J5148r9056k37339
$$ 48188 63594 309639 423688 372030 262226 19638 -252952 -345925 -330777 -429833 -667172
10996f67172k07226P6472O4027J48110r3780j21149L03911L65995P8018o9632
$$ -667172 -874398 -797926 -733899 -585789 -679569 -800718 -496807 -130812 -52794 -122426
10986a22426j84902j31535L3042J67679K25926J42704O4293L4564j30135q6105
$$ -122426 -307328 -438863 -405821 -238142 -12216 130488 194781 229345 99210 13105
10976A3105J29727O1244j21477r4920J18322L55541K36443p2419k18124j68460
$$ 13105 142832 204076 82599 -12321 106001 461542 697985 625566 407442 238982
10966B38982n2646J0303J29575J4807l04023k24726P2343K10057R5910K0958k39830
$$ 238982 186336 196639 326214 341021 36998 -187728 -115385 94672 190582 211540 -28290
10955b8290j19880J96931K37691K25661M5952O1189p2758k70539j38528K7396
$$ -28290 -148170 48761 286452 512113 558065 619254 546496 275957 137429 164825
10945A64825J61524l2932K8697J12002J19802N2059P193L87158N39537K89914
$$ 164825 326349 293417 322114 434116 553918 605977 613170 1000328 1539865 1829779
10935A829779L0601L50241O61948Q45570R09875J160231J553309K421446L601618
$$ 1829779 1860380 2210621 2872569 3718139 4628014 5788245 7341554 9763000 13364618
10926A3364618N808425Q471712R557611P525430L174496k589306p776084q820945
$$ 13364618 19173043 27644755 37202366 44727796 47902292 45312986 37536902 28715957
10918B8715957o731992m601152k871428j570539n43126L66821J277158K180757
$$ 28715957 21983965 17382813 14511385 12940846 12397720 12764541 14041699 16222456
10910A6222456K581696K175968N56083j490223l158699l819829l190052k188180
$$ 16222456 18804152 20980120 21536203 20045980 16887281 13067452 9877400 7689220
10902G689220j312656o84852k58277k84136l28013k91409k37571r6502j23015
$$ 7689220 6376564 5691712 5433435 5149299 4821286 4529877 4292306 4195804 4072789
10893D072789M8617K6405j48395N0712K11726K03445J55926J41551K72007J56207
$$ 4072789 4121406 4147811 3999416 4050128 4261854 4465299 4621225 4762776 5034783 5190990
10883E190990p8639l15602m79841m39776k06670k884k7198j68630k70831l17200
$$ 5190990 5112351 4796749 4316908 3877132 3670462 3667578 3640380 3471750 3200919 2883719
10873B883719k86537k96971l38644l65021k34481o8936J10669M3695j0465l6021
$$ 2883719 2597182 2300211 1961567 1596546 1362065 1293129 1403798 1447493 1437028 1401007
10863A401007J6130Q817R3639R3476j61256l03740k13157K872J1849J11626R2358
$$ 1401007 1417137 1425954 1519593 1613069 1451813 1148073 934916 937788 949637 1061263 1153621
10852A153621k62792l05202p4324l4649J95459K63963J060l22174l89598k90438
$$ 1153621 890829 585627 511303 476654 672113 936076 937136 614962 225364 -65074
10842f5074J22482K00764n7386j92904j0314J20966J3771j07368L6610Q0747p6907
$$ -65074 57408 258172 200786 7882 -2432 118534 132305 24937 61547 142294 65387
10831F5387j1079J52956p8047j68016N95L1319n777r5930J99288L79215L05278
$$ 65387 54308 207264 129217 -38799 -38204 -6885 -12662 -108592 90696 469911 775189
10820G75189K0365l15440k93014O7475P0703o7311p9539p7709L2276L9056r8677
$$ 775189 795554 480114 187100 254575 325278 257967 178428 100719 132995 172051 73374
10809G3374j75120o6505o9536O9381K0256J5239M4424j580N4321J996j21796K5480
$$ 73374 -101746 -168251 -237787 -168406 -148150 -132911 -88487 -90067 -35746 -33750 -155546 -130066
10797a30066O1109K4146P3069l9663m7522J40258J00980j7735J1131k5453q7488
$$ -130066 -68957 -44811 28258 -11405 -58927 81331 182311 164576 175707 150254 62766
10786F2766l8796l9362j1633j3891r475K23641N0676j25546q1044k0158K8464
$$ 62766 23970 -15392 -27025 -40916 -50391 173250 223926 98380 17336 -2822 25642
10775B5642j51432l34999r1912J89430K98563K9744o9279J94786J69174j7N6552
$$ 25642 -125790 -460789 -552701 -363271 -64708 -34964 -104243 90543 259717 259700 316252
10764C16252j33246o3164J37759l0682M5099J70718M4855l995k28410n1628J86565
$$ 316252 183006 119842 257601 226919 272018 442736 487591 483596 255186 203558 390123
10753C90123J22617J01559m3090m7534j3052j92720k50151J31907k2721k06660
$$ 390123 512740 614299 571209 523675 510623 317903 67752 199659 176938 -29722
10743b9722r4699j93513K2461l1346J22464K74200J64218P6925l6744L8015O3985
$$ -29722 -124421 -317934 -295473 -326819 -204355 69845 234063 310988 274244 312259 376244
10732C76244J1387J9434J46363j0800M3385k0246j79423j61831J7750M6084n8304
$$ 376244 387631 407065 553428 542628 586013 565767 386344 224513 242263 288347 230043
10721B30043r9635j29400j48409Q8329Q2760k2830K2435M3237n5244j555L4086
$$ 230043 130408 1008 -147401 -59072 23688 858 23293 66530 11286 9731 43817
10710D3817p7652j61947j62839Q1526J29155L7736j1995r2804K8993q8770k54384
$$ 43817 -33835 -195782 -358621 -277095 -147940 -110204 -122199 -215003 -186010 -274780 -529164
10699e29164o1302N917J94797P7627m8407O8876k4340q6269l4819m9994M1149
$$ -529164 -590466 -584549 -389752 -312125 -360532 -291656 -315996 -402265 -437084 -487078 -445929
10688d45929K24060L49334J07141j15516j48598j01906M1653L6668O4623L0015
$$ -445929 -221869 127465 234606 119090 -29508 -131414 -89761 -53093 11530 41545
10678D1545J08950k7574J6529N1438m1530L5027N1897j22925l10797k25728L0388
$$ 41545 150495 122921 139450 190888 149358 184385 236282 113357 -197440 -423168 -392780
10667c92780K5686J69034K74546J66903J3372o5307J13795N0735j6176k10605
$$ -392780 -367094 -198060 76486 243389 256761 191454 305249 355984 339808 129203
10657A29203j01386n9408j04878m0171L0962K29090K32799n1881l42188m59806
$$ 129203 27817 -31591 -136469 -176640 -145678 83412 316211 264330 -77858 -537664
10647e37664l09094p1639J17778K42491J11453K9190j4465j07710r4290N2313
$$ -537664 -846758 -918397 -800619 -558128 -446675 -417485 -431950 -539660 -633950 -581637
10637e81637J00505K60489J70691j98307l9317K68133L48574O0113j51257j50361
$$ -581637 -481132 -220643 -49952 -248259 -287576 -19443 329131 389244 237987 87626
10627H7626J20029J84931N2107M8058L0441Q8287J8267j51755j32118n9705j62011
$$ 87626 207655 392586 444693 492751 523192 611479 629746 477991 345873 286168 124157
10616A24157k66848r0358m1256j37317J53982K34261K430n1463m7104J7309n5181
$$ 124157 -142691 -233049 -274305 -411622 -257640 -23379 -20949 -72412 -119516 -102207 -157388
10605a57388p3787J97814K31084P2040k8962l15659j82966J31993K07401J06641
$$ -157388 -231175 -33361 197723 269763 240801 -74858 -257824 -125831 81570 188211
10595A88211j21799R6059K16213j56227m21198k12742L9717J82072J08795R1285
$$ 188211 66412 162471 378684 222457 -198741 -411483 -371766 -189694 -80899 10386
10585A0386J00233p1884k81604l76478l5224M42484N23621K81418J16438r2050
$$ 10386 110619 38735 -242869 -619347 -654571 -212087 311534 592952 709390 617340
10575F17340q084J510k84369l00127o4558O5272J05900l1653j89520m8063J73079
$$ 617340 609256 610766 326397 26270 -38288 26984 132884 101231 -88289 -136352 36727
10564C6727Q8477O0348J34054J46030K21799J51351k39597k35125j92136r4231
$$ 36727 125204 185552 319606 465636 687435 838786 599189 364064 171928 77697
10554G7697j30896J5419l0351N1915K60578K40311L4647p8412j87099j95558O5943
$$ 77697 -53199 -37780 -68131 -16216 244362 484673 519320 440908 253809 58251 124194
10543A24194o8498j78926k66082j0430K12329K5197l6913l1896j10503J5895M1684
$$ 124194 55696 -123230 -389312 -399742 -187413 -162216 -199129 -231025 -341528 -325633 -283949
10532b83949L2715J08827j9125j31788j13203J20992K52218J53706j51780j57580
$$ -283949 -251234 -142407 -161532 -293320 -406523 -285531 -33313 120393 -31387 -188967
10522a88967p0359j01182q9965l3499J98736L29935K66329J82305R5353l1453
$$ -188967 -259326 -360508 -450473 -483972 -285236 44699 311028 493333 588686 557233
10512E57233q9646k73218j48815j45408j09891m1991P5405J65196J33047K61368
$$ 557233 467587 194369 45554 -99854 -209745 -251736 -176331 -11135 121912 383280
10502C83280K15527N4652j43217m57921l87575J5647N8161r0537P0797p3487j22761
$$ 383280 598807 653459 510242 52321 -335254 -319607 -261446 -351983 -281186 -354673 -477434
10491d77434M5097j65810q5533K02964L12978o5321o6140J48627K23296K7338
$$ -477434 -432337 -598147 -683680 -480716 -167738 -233059 -299199 -150572 72724 100062
10481A00062j90540m571p9076j70784j8553p3756K840K71523K64676j29648k52397
$$ 100062 -90478 -95049 -174125 -344909 -363462 -437218 -434378 -162855 101821 -27827 -280224
10470b80224P0684J88207J15426L8188q823j71J77526J30176J05665j25856q2093
$$ -280224 -209540 -21333 94093 132281 123458 123287 300813 430989 536654 410798 328705
10459C28705J7118J2206K4373l4231p1707n8584k27273j90189q1909Q2740j40920
$$ 328705 345823 358029 382402 348171 276464 217880 -9393 -199582 -281491 -198751 -339671
10448c39671j77816K54324q0428q6760L638j07961n2311J07544J01425J32527
$$ -339671 -517487 -263163 -343591 -430351 -426713 -534674 -586985 -479441 -378016 -245489
10438b45489L6585j30302k916K73818K41262R3308j82395j15475L5214P9303J64295
$$ -245489 -208904 -339206 -342122 -68304 172958 266266 83871 -31604 3610 82913 247208
10427B47208l9048q2112P4962K3683q0569J827J09348j97626j61444p325O253
$$ 247208 208160 126048 201010 224693 144124 145951 255299 57673 -103771 -111096 -104843
10416a04843O2573J1803J6975K1315j43946j53820k69654l45776q783L09648L47330
$$ -104843 -42270 -30467 -13492 7823 -136123 -289943 -559597 -905373 -914156 -604508 -257178
10405b57178j37195l18222l1034J49800M675o1725K96202M00886k3325j55334
$$ -257178 -394373 -712595 -743629 -593829 -589154 -650879 -354677 46209 22884 -132450
10395a32450j70805N6710J13970J23948o7772j03982r4901j9576J29365K2209
$$ -132450 -303255 -246545 -132575 -8627 -76399 -180381 -275282 -294858 -165493 -143284
10385a43284l6899J90071J20532j75495j53049P8219K24647M5899k7058J11583
$$ -143284 -180183 9888 130420 -45075 -198124 -119905 104742 150641 123583 235166
10375B35166J45711o7535m5843O4353j85757p5490J91503J38781q3336q9227j04846
$$ 235166 380877 313342 267499 331852 146095 70605 262108 400889 317553 228326 123480
10364A23480j91777r9512m4705j68748o9094K76948K79595K9999j62572j03333
$$ 123480 -68297 -167809 -212514 -381262 -450356 -173408 106187 136186 -26386 -129719
10354a29719J84058J81158O5699O5515k3034k40520l17177j37210l397K36251
$$ -129719 54339 235497 301196 366711 343677 103157 -214020 -351230 -354627 -118376
10344a18376K68184M4273J7306j13430j59616r7086r8842j6455J34993J32877
$$ -118376 149808 194081 211387 97957 -61659 -158745 -257587 -274042 -139049 -6172
10334f172J74349J58689N7351O4171J4726l8065j83968k42858j04890j29487o5822
$$ -6172 168177 326866 384217 448388 463114 425049 241081 -1777 -106667 -236154 -301976
10323c01976K21560K88781R8858L2248p2806j82196k08118j5564J20637K01217
$$ -301976 -80416 208365 307223 339471 266665 84469 -123649 -139213 -18576 182641
10313A82641j7125j88553l53242j28337J02222J29463J37890K27269K28888r134
$$ 182641 165516 -23037 -376279 -504616 -402394 -272931 -135041 92228 321116 311982
10303C11982k9893q043m9670r3986m8708j33629j57182k12198j06308O6956N9547
$$ 311982 282089 274046 224376 130390 81682 -51947 -209129 -421327 -527635 -460679 -401132
10292d01132r6991j45304L0920J74385P4366O6931J7880K662N7308K33736J71184
$$ -401132 -498123 -643427 -612507 -438122 -363756 -296825 -278945 -276283 -218975 14761 185945
10281A85945k21690j49205j12487O5979L31149J58546j39516k10042m3669J3492
$$ 185945 -35745 -184950 -297437 -231458 99691 258237 118721 -91321 -134990 -121498
10271a21498q4984k12293k16731j31559K5534J87717K19352K87189Q6623K0159
$$ -121498 -206482 -418775 -635506 -767065 -741531 -553814 -334462 -47273 39350 59509
10261E9509j461J20927p722l36608l15192j25405K0125J11432K25929K1698J4837
$$ 59509 58048 178975 171253 -165355 -480547 -605952 -585827 -474395 -248466 -226768 -211931
10250b11931N0228P5199j18438k18924j07446J69127R8076j3091J5747l1983l5319
$$ -211931 -161703 -86504 -204942 -423866 -531312 -362185 -264109 -277200 -261453 -293436 -328755
10239c28755J50143j13460j33295K38542K51616J08479O4443k1227n2811p4613
$$ -328755 -178612 -292072 -425367 -186825 64791 173270 237713 216486 163675 89062
10229H9062j48563l30226j00365J69122J26251K07814n1196r0002o8498j34532
$$ 89062 -59501 -389727 -490092 -320970 -194719 13095 -38101 -128103 -196601 -331133
10219c31133k27016j11034j6375J13486M6167j59797k44902K12174M43916J98654
$$ -331133 -558149 -669183 -685558 -572072 -525905 -685702 -930604 -718430 -274514 -75860
10209g5860j6218m669j27194j77731j2119J74581k1599l95829q8281K76428P7891
$$ -75860 -92078 -96747 -223941 -401672 -413791 -239210 -260809 -656638 -744919 -468491 -390600
10198c90600j16171q5343K88884M91313R3992k24558j89744m8234j01587r6343
$$ -390600 -506771 -592114 -303230 188083 282075 57517 -132227 -180461 -282048 -378391
10188c78391J48798K11421o3848O0257O0746K3067q4113j8429l8673N209p8507
$$ -378391 -229593 -18172 -82020 -21763 38983 62050 -22063 -40492 -79165 -73956 -152463
10177a52463k40529n7367J34930O9661J41036J45276n9289N4534k45431k10378
$$ -152463 -392992 -450359 -315429 -245768 -104732 40544 -18745 35789 -209642 -420020
10167d20020l3866L9830Q5041l9878M69992N16362N0734r2105N7609o1947k99317
$$ -420020 -453886 -414056 -329015 -368893 101099 617461 668195 576090 633699 571752 272435
10156B72435k41125Q6291O3004L2515J7736l6371K4598K048J0051J02965j54145
$$ 272435 31310 117601 180605 213120 230856 194485 219083 221131 231182 334147 180002
10145A80002j51012L2288M7742j28226j44835J56418R7103k02714j34887J1822
$$ 180002 28990 61278 109020 -19206 -164041 -7623 89480 -113234 -248121 -236299
10135b36299q0576m7609P8041n660M2704K82539L00269L4900m07179l90653j67288
$$ -236299 -316875 -364484 -286443 -292103 -249399 33140 333409 368309 -38870 -429523 -596811
10124e96811J35683L14190O6747N0368J54799K59967J09633j69910o2293k3830
$$ -596811 -461128 -146938 -80191 -29823 124976 384943 494576 324666 262373 238543
10114B38543j7553Q9383r718o1764J06654J73701K42857L21446J03007m6659K29959
$$ 238543 220990 310373 300655 238891 345545 519246 762103 1083549 1186556 1139897 1369856
10103A369856K16353k6978O1849N07857P88665Q28849Q19786R45238P38285J57264
$$ 1369856 1586209 1559231 1621080 2128937 2917602 3746451 4566237 5511475 6249760 6407024
10093F407024l76082q52770q78903n58032l17576m04925m20745m06445l02180
$$ 6407024 6030942 5178172 4299269 3741237 3423661 3018736 2597991 2191546 1889366
10084A889366k07279k01474k63201k15600k90755l50507j28751K2454R4246L0501
$$ 1889366 1682087 1480613 1217412 1001812 711057 360550 231799 254253 348499 379000
10074C79000J13189j21754j18931J18286q0528n2702K39757M4005j93234l38600
$$ 379000 492189 370435 251504 369790 289262 236560 476317 520322 327088 -11512
10064a1512l19748M648J39929J23297O4975l8829n7855J7143J21758J90011K16909
$$ -11512 -331260 -326612 -186683 -63386 1589 -37240 -95095 -77952 43806 233817 450726
10053D50726J58858l5481L2473J49738k5269j70650k14870k96591m3391j10170
$$ 450726 609584 574103 606576 756314 731045 560395 345525 48934 5543 -104627
10043a04627n1630J77780R1733J27369O5393L3593k22905k33557k705J21120K36090
$$ -104627 -156257 21523 113256 240625 306018 339611 116706 -116851 -119556 1564 237654
10032B37654j60437k64685J96304J44989j21835j8884J7085j26844j82831Q1632
$$ 237654 77217 -187468 8836 153825 31990 13106 30191 -96653 -279484 -197852
10022a97852K35543J11245j5757l4463J11577J02232n3386m6944K30811Q4775
$$ -197852 37691 148936 133179 98716 210293 312525 259139 212195 443006 527781
10012E27781j51200k01774j32833j68664J557Q8860R4190r4927J36894K84866
$$ 527781 376581 174807 41974 -126690 -125133 -36273 57917 -37010 99884 384750
10002C84750l0278M4836R450J4025j07581j36484m2820M6677J16408L8167p7152
$$ 384750 354472 399308 408758 422783 315202 178718 135898 182575 298983 337150 259998
9991B59998q3232K39758K22584L851j13333k59834l36860l47979j68830J81165
$$ 259998 176766 416524 639108 642959 529626 269792 -67068 -415047 -583877 -402712
9981d02712K07211O0199K26131J29484n5023l740L48395K71539j80398k22382
$$ -402712 -195501 -135302 90829 220313 165290 161550 509945 781484 601086 378704
9971C78704j03929j82545j90121Q5138L65349L03844J65788K09810K26584J34854
$$ 378704 274775 92230 -97891 -12753 352596 656440 822228 1032038 1258622 1393476
9961A393476J23764K36005M38757N60252O56126N77411O25286O54056R67271J429809
$$ 1393476 1517240 1753245 2192002 2752254 3408380 3985791 4611077 5265133 6232404 7662213
9951G662213K111399K894667K969754K334979O70605j431916k820345k973141
$$ 7662213 9773612 12668279 15638033 17973012 18643617 17211701 14391356 11418215
9943A1418215k368294j789607j345724j047528q74420o28633m31980l41666k48368
$$ 11418215 9049921 7260314 5914590 4867062 3992642 3364009 2932029 2590363 2341995
9934B341995j77005r4119j07673k74786r1149j23404r2213K6692J3572j11474
$$ 2341995 2164990 2070871 1963198 1688412 1597263 1473859 1381646 1408338 1421910 1310436
9924A310436j47516j46928k279P7365K0849l4502J05688o1178m02569j59043K9812
$$ 1310436 1162920 1015992 1013713 1091078 1111927 1077425 1183113 1121935 719366 560323 590135
9913E90135o0553j71222k38795k30304L136J4245J03335J11857K03631J01395
$$ 590135 529582 358360 119565 -110739 -107603 -93358 9977 121834 325465 426860
9903D26860R0346J47834r878L8867J40685L7384k9109j66323j43911J28603J53252
$$ 426860 517206 665040 655162 694029 834714 872098 842989 676666 532755 661358 814610
9892H14610o7200N2946O0689r0013j74732l70389l50949p2174j31090j02555q4814
$$ 814610 747410 800356 861045 771032 596300 225911 -125038 -197212 -328302 -430857 -515671
9881e15671l2306k2402J05524J77297Q8393N016q6107q394J39412Q4353k32917
$$ -515671 -547977 -570379 -464855 -287558 -199165 -194149 -280256 -288650 -149238 -64885 -297802
9870b97802n0393L0222R9644J58960M1770n3934n3904k42221l1883L9005M8508
$$ -297802 -348195 -317973 -218329 -59369 -17599 -71533 -125437 -367658 -399541 -360536 -312028
9859c12028J51882j17651j63794J15400R8026J99047N8489j18788j1505Q3260
$$ -312028 -160146 -277797 -441591 -326191 -228165 -29118 29371 -89417 -100922 -17662
9849a7662J69646K95338J12776k44170j93420M0319N873r1152j76278n3457P8082
$$ -17662 151984 447322 560098 315928 122508 162827 168700 77548 -98730 -152187 -74105
9838g4105J48014Q1841p9711N2021k9013m2280L894N6179L3599n5670m733J99526
$$ -74105 73909 155750 76039 128060 99047 56767 60661 116840 150439 94769 90036 289562
9826B89562J26290L2029R9277P1480K18102K68432J48225J71751J77546M46793
$$ 289562 415852 447881 547158 618638 836740 1105172 1253397 1425148 1602694 2049487
$$ [...]
##END NTUPLES=NMR SPECTRUM
##END=
