##TITLE=C13_LR-688-C4-AK
 D2O, 25000 sc

 9.6.2020
##JCAMPDX= 6.0         $$ Bruker NMR JCAMP-DX V2.0
##DATA TYPE= NMR SPECTRUM
##DATA CLASS= NTUPLES
##ORIGIN= UXNMR, Bruker Analytische Messtechnik GmbH
##OWNER= root
$$ XWIN-NMR		Version 3.5
$$ Wed Jun 10 13:21:30 2020 Russian Standard Time (UT+4h)  she@DPX200
##.OBSERVE FREQUENCY= 50.327896
##.OBSERVE NUCLEUS= ^13C
##.ACQUISITION MODE= SIMULTANEOUS
##.ACQUISITION SCHEME= undefined
##.AVERAGES= 25000
##.DIGITISER RES= 17
##SPECTROMETER/DATA SYSTEM= spect
##.PULSE SEQUENCE= zgpg30
##.SOLVENT NAME= CDCl3
##.SHIFT REFERENCE= (INTERNAL, CDCl3, 0, 222.624)
##AUDIT TRAIL= $$ (NUMBER, WHEN, WHO, WHERE, WHAT)
$$ ##TITLE= Audit trail, XWIN-NMR		Version 3.5
$$ ##JCAMPDX= 5.01
$$ ##ORIGIN= Bruker BioSpin GmbH
$$ ##OWNER= she
$$ F:/spectra/data/she/nmr/c13/1/pdata/1/auditp.txt
$$ ##AUDIT TRAIL=  $$ (NUMBER, WHEN, WHO, WHERE, WHAT)
(   1,<2020-06-10 13:19:03.60 +0400>,<she>,<DPX200>,
      <created by zg, POWCHK disabled, PULCHK disabled
       terminated by command 'halt'
       configuration hash MD5:
       00 E9 B6 7A A2 85 ED C7 34 08 36 98 17 FE 4E 26
       data hash MD5: 32K
       09 7F 75 A1 F6 66 E7 2D B7 FF 41 A2 A7 97 F9 C0>)
(   2,<2020-06-10 13:19:14.28 +0400>,<she>,<DPX200>,
      <Start of raw data processing
       efp BC_mod = 2 LB = 1 FT_mod = 6 PKNL = 1 PHC0 = -230.1702 PHC1 = 25.20639 SI = 32K 
       data hash MD5: 32K
       E5 26 3F AD 91 15 D2 7A 63 A3 CA 76 47 DE 62 CE>)
(   3,<2020-06-10 13:19:16.82 +0400>,<she>,<DPX200>,
      <abs ABSG = 5 
       data hash MD5: 32K
       73 97 23 91 3C AF 8E 5F 5F CA 0F 89 EA B7 E4 9A>)
(   4,<2020-06-10 13:20:14.39 +0400>,<she>,<DPX200>,
      <pk PHC0 = -21.71458 PHC1 = 22.6 
       data hash MD5: 32K
       06 67 38 1C F4 2C 94 97 A7 02 76 85 F8 03 66 95>)
(   5,<2020-06-10 13:20:17.73 +0400>,<she>,<DPX200>,
      <abs ABSG = 5 
       data hash MD5: 32K
       0E 4E DC 61 4A 82 10 4D 85 A6 C9 A0 8F 35 78 A4>)
(   6,<2020-06-10 13:20:58.50 +0400>,<she>,<DPX200>,
      <pk PHC0 = -10.47667 PHC1 = 22.6 
       data hash MD5: 32K
       DE 3E 39 98 77 02 AB 8C CD B0 67 FD CD 64 D0 C5>)
(   7,<2020-06-10 13:21:01.82 +0400>,<she>,<DPX200>,
      <abs ABSG = 5 
       data hash MD5: 32K
       05 4C BC D8 68 FF 1B 53 5A EE 38 9B BF 6C 56 32>)
$$ ##END=
$$ 
$$ hash MD5
$$ A8 7B EB 8D 17 A4 1C 18 32 FA 82 A8 65 6E 28 A0
##$RELAX= 
##$RELAX= 
##$RELAX= 
##$RELAX= 
##$RELAX= 
##$RELAX= 
##$RELAX= 
##$RELAX= 
$$ Bruker specific parameters
$$ --------------------------
##$DU= <F:/spectra>
##$EXPNO= 1
##$NAME= <c13>
##$PROCNO= 1
##$TYPE= <nmr>
##$USER= <she>
##$AMP= (0..31)
100 100 100 100 100 100 100 100 100 100 100 100 100 100 100 100 100 100 
100 100 100 100 100 100 100 100 100 100 100 100 100 100 
##$AQSEQ= 0
##$AQ_mod= 1
##$AUNM= <au_zg>
##$AUTOPOS= <>
##$BF1= 50.322709
##$BF2= 200.13
##$BF3= 50.322709
##$BF4= 500.13
##$BF5= 500.13
##$BF6= 500.13
##$BF7= 500.13
##$BF8= 500.13
##$BYTORDA= 1
##$CFDGTYP= 0
##$CFRGTYP= 5
##$CHEMSTR= <none>
$$ [...]
##$SUBNAM4= <"">
##$SUBNAM5= <"">
##$SUBNAM6= <"">
##$SUBNAM7= <"">
##$SUBNAM8= <"">
##$SUBNAM9= <"">
##$SW= 239.972175391363
##$SWIBOX= (0..15)
0 1 3 0 0 0 0 0 0 0 0 0 0 0 0 0 
##$SW_h= 12077.2946859903
##$TD= 32768
##$TD0= 1
##$TE= 0
##$TE2= 300
##$TE3= 300
##$TEG= 300
##$TL= (0..7)
120 120 120 120 120 120 120 120 
##$TP= (0..7)
150 150 150 150 150 150 150 150 
##$TP07= 0
##$TPNAME0= <>
##$TPNAME1= <>
##$TPNAME2= <>
##$TPNAME3= <>
##$TPNAME4= <>
##$TPNAME5= <>
##$TPNAME6= <>
##$TPNAME7= <>
##$TPOAL= (0..7)
0.5 0.5 0.5 0.5 0.5 0.5 0.5 0.5 
##$TPOFFS= (0..7)
0 0 0 0 0 0 0 0 
##$TUNHIN= 0
##$TUNHOUT= 0
##$TUNXOUT= 0
##$USERA1= <user>
##$USERA2= <user>
##$USERA3= <user>
##$USERA4= <user>
##$USERA5= <user>
##$V9= 5
##$VALIST= <valist>
##$VCLIST= <CCCCCCCCCCCCCCC>
##$VD= 0
##$VDLIST= <DDDDDDDDDDDDDDD>
##$VPLIST= <PPPPPPPPPPPPPPP>
##$VTLIST= <TTTTTTTTTTTTTTT>
##$WBST= 1024
##$WBSW= 4
##$XGAIN= (0..3)
0 0 0 0 
##$XL= 0
##$YL= 0
##$YMAX_a= 135017330
##$YMIN_a= -38819722
##$ZGOPTNS= <>
##$ZL1= 120
##$ZL2= 120
##$ZL3= 120
##$ZL4= 120
##$ABSF1= 222.624
##$ABSF2= -17.3728
##$ABSG= 5
##$ABSL= 3
##$ALPHA= 0
##$AQORDER= 0
##$ASSFAC= 0
##$ASSFACI= 0
##$ASSFACX= 0
##$ASSWID= 0
##$AUNMP= <proc_1d>
##$AZFE= 0.1
##$AZFW= 0.5
##$BCFW= 0
##$BC_mod= 2
##$BYTORDP= 0
##$COROFFS= 0
##$CY= -3
##$DATMOD= 1
##$DC= 0
##$DFILT= <>
##$DTYPP= 0
##$F1P= 0
##$F2P= 0
##$FCOR= 0.5
##$FTSIZE= 32768
##$FT_mod= 6
##$GAMMA= 0
##$GB= 0
##$INTBC= 1
##$INTSCL= 4.134877e-10
##$ISEN= 128
##$LB= 1
##$LEV0= 0
##$LPBIN= 0
##$MAXI= 10000
##$MC2= 0
##$MEAN= 0
##$ME_mod= 0
##$MI= 0.1934396
##$NCOEF= 0
##$NC_proc= -2
##$NLEV= 6
##$NOISF1= 120.0001
##$NOISF2= 80.00006
##$NSP= 0
##$NTH_PI= 0
##$NZP= 0
##$OFFSET= 222.624
##$PC= 1.4
##$PHC0= -262.3615
##$PHC1= 70.40639
##$PH_mod= 1
##$PKNL= yes
##$PPARMOD= 0
##$PSCAL= 0
##$PSIGN= 0
##$REVERSE= no
##$SF= 50.3227315989248
##$SI= 32768
##$SIGF1= 140
##$SIGF2= 120
##$SINO= 11.81781
##$SIOLD= 32768
##$SREGLST= <13C.CDCl3>
##$SSB= 0
##$STSI= 32768
##$STSR= 0
##$SW_p= 12077.2946859903
##$SYMM= 0
##$S_DEV= 0
##$TDeff= 32768
##$TDoff= 0
##$TI= <>
##$TILT= no
##$TM1= 0
##$TM2= 0
##$TOPLEV= 0
##$USERP1= <user>
##$USERP2= <user>
##$USERP3= <user>
##$USERP4= <user>
##$USERP5= <user>
##$WDW= 1
##$XDIM= 32768
##$YMAX_p= 421296038
##$YMIN_p= -36917609
$$ End of Bruker specific parameters
$$ ---------------------------------
##NTUPLES= NMR SPECTRUM
##VAR_NAME=  FREQUENCY,     SPECTRUM/REAL,   SPECTRUM/IMAG
##SYMBOL=    X,             R,               I
##VAR_TYPE=  INDEPENDENT,   DEPENDENT,       DEPENDENT
##VAR_FORM=  AFFN,          ASDF,            ASDF
##VAR_DIM=   32768,         32768,           32768
##UNITS=     HZ,            ARBITRARY UNITS, ARBITRARY UNITS
##FACTOR=    0.368581032318806, 1,           1
##FIRST=     11203.0474431902, 0,            0
##LAST=      -874.247242800138, 0,           0
##MIN=       -874.247242800138, -36917609,   0
##MAX=       11203.0474431902, 421296038,    0
$$ Real data points
##PAGE= N=1
##DATA TABLE= (X++(R..R)), XYDATA
$$ [...]
##PAGE= N=2
##DATA TABLE= (X++(I..I)), XYDATA
$$ plain form
8312 312812348 312561120 303165312 298645729 299950944 303782856 311728225 318912141 321845864
8304 321845864 315597308 308929328 313627121 321925743 319582269 310677323 303775653 303515625
8296 303515625 307647391 314260062 312986731 305879640 301584199 302053128 304261746 303364480
8288 303364480 307872942 315926084 322445485 325216434 322763422 324376311 320446450 306770807
8280 306770807 295829307 294337444 299293022 303717189 309416443 320106640 327082272 331349642
8272 331349642 328694750 323975464 320973480 315618830 314904867 319334029 311664277 299954324
8264 299954324 300557032 306937034 307298657 308480020 312707346 318929951 324113458 328594583
8256 328594583 327353996 323062673 320814296 316498377 315228793 320863685 330887932 333467117
$$ packed form
8312C12812348k51228r395808m519583J305215L831912P945369P183916K933723
8304C21845864o248556o667980M697793Q298622k343474q904946o901670k60028
8296C03515625M131766O612671j273331p107091m295441M68929K208618q97266
8288C03364480M508462Q053142O519401K770949k453012J612889l929861j3675643
8280C06770807j0941500j491863M955578M424167N699254J0690197O975632M267370
8272C31349642k654892m719286l001984n354650p13963M429162p669752j1709953
8264B99954324O02708O380002L61623J181363M227326O222605N183507M481125
8256C28594583j240587m291323k248377m315919j269584N634892J0024247K579185
$$ plain form
8248 333467117 328730590 328850614 337175549 340735751 335861127 324898434 311914407 304697594
8240 304697594 307161035 317780215 328587283 332918925 334624280 328305117 320086444 315557275
8232 315557275 312566080 308024436 307919451 309351431 305616790 300303065 298319353 295378682
8224 295378682 293855612 292718868 290096259 290800746 300588904 312410574 313264855 307283340
8216 307283340 314286718 328270994 336395593 331209591 320491820 316704047 316030609 314802780
8208 314802780 319178640 327391520 331188697 328005451 325694860 319742174 317443325 320977072
8200 320977072 325883536 329437371 333835979 332189073 333661772 334476343 323248960 309595343
8192 309595343 303686988 306606958 305126216 305175768 307935689 306775728 305529921 300649930
$$ packed form
8248C33467117m736527J20024Q324935L560202m874624j0962693j2984027p216813
8240C04697594K463441J0619180J0807068M331642J705355o319163q218673m529169
8232C15557275k991195m541644j04985J431980l734641n313725j983712k940671
8224B95378682j523070j136744k622609P04487R788158J1821670Q54281n981515
8216C07283340P003378J3984276Q124599n186002j0717771l787773o73438j227829
8208C14802780M375860Q212880L797177l183246k310591n952686k298849L533747
8200C20977072M906464L553835M398608j646906J472699Q14571j1227383j3653617
8192C09595343n908355K919970j480742M9552K759921j159961j245807m879991
$$ plain form
8184 300649930 298929720 304904744 315498734 318240229 314226968 312144742 318595435 325720211
8176 325720211 329676598 332469438 334110632 331700167 326219237 319134766 316147648 321164033
8168 321164033 322117885 321261846 321321809 321231977 318636951 319272286 318773647 313165939 306570820
8159 306570820 301269634 307717168 313425192 314376880 304592924 295682591 300933661 309023723
8151 309023723 308711589 307114323 313838769 315374834 312914426 314735421 321141803 318552320
8143 318552320 315297192 315503521 313903194 306815898 304064223 308770931 314899765 319692316
8135 319692316 317598950 314104753 312241254 308854583 307951727 303968870 301594201 302277542
8127 302277542 306766827 307373713 304278664 306985594 315558034 325884313 329798781 329744361
$$ packed form
8184C00649930j720210N975024J0593990K741495m013261k082226O450693P124776
8176C25720211L956387K792840J641194k410465n480930p084471k987118N016385
8168C21164033R53852q56039N9963q9832k595026O35335m98639n607708o595119
8159C06570820n301186O447534N708024R51688r783956q910333N251070Q090062
8151C09023723l12134j597266O724446J536065k460408J820995O406382k589483
8143C18552320l255128K06329j600327p087296k751675M706708O128834M792551
8135C19692316k093366l494197j863499l386671r02856l982857k374669O83341
8127C02277542M489285O06886l095049K706930Q572440J0326279L914468n4420
$$ plain form
8119 329744361 326947484 320268898 317812154 313822907 304608496 298195847 299494767 306559480
8111 306559480 308819686 307357536 303331248 305726629 314547873 320566460 317685685 304099241
8103 304099241 296418649 292633303 292395072 294725626 302589125 308292903 317610788 321851709
8095 321851709 317751367 309664778 305901577 306520628 300008049 296052865 301636352 306586070
8087 306586070 311033838 316608164 320259815 324326338 321813690 321651808 322270265 317795579
8079 317795579 316930652 314984347 316383341 321432600 321903662 318337035 319990885 317073086
8071 317073086 314210328 312678525 314525253 318207123 312379886 308173776 315941703 317908761
8063 317908761 305967139 295090461 288782450 292087018 300170585 309493142 312700157 312084643
$$ packed form
8119C29744361k796877o678586k456744l989247r214411o412649J298920P064713
8111C06559480K260206j462150m026288K395381Q821244O018587k880775j3586444
8103C04099241p680592l785346k38231K330554P863499N703778R317885M240921
8095C21851709m100342q086589l763201O19051o512579l955184N583487M949718
8087C06586070M447768N574326L651651M066523k512648j61882O18457m474686
8079C17795579q64927j946305J398994N049259M71062l566627J653850k917799
8071C17073086k862758j531803J846728L681870n827237m206110P767927J967058
8063C17908761j1941622j0876678o308011L304568Q083567R322557L207015o15514
$$ plain form
8055 312084643 319068094 326200079 325102632 320471937 317357591 311434444 306856310 301569739
8047 301569739 301172858 306817556 313389562 319725881 327230000 324282747 317010899 315951835
8039 315951835 311395073 305268206 300611869 300268692 305365053 308451932 308887972 312686018
8031 312686018 314320176 311613611 310767993 312757966 312075924 310658500 317528689 327536334
8023 327536334 331341444 332763052 333214080 328786925 323785208 317716475 317297707 321648507
8015 321648507 321875062 318216539 314234336 317137462 318296196 314458003 308522957 302712806
8007 302712806 295915552 294324376 303205699 311279843 308172107 310241409 327156635 332261313
7999 332261313 321488214 316051893 311190119 304277755 304838984 308588523 311372815 310215872
$$ packed form
8055C12084643O983451P131985j097447m630695l114346n923147m578134n286571
8047C01569739l96881N644698O572006O336319P504119k947253p271848j059064
8039C15951835m556762o126867m656337l43177N096361L086879M36040L798046
8031C12686018J634158k706565q45618J989973o82042j417424O870189J0007645
8023C27536334L805110J421608M51028m427155n001717o068733m18768M350800
8015C21648507K26555l658523l982203K903126J158734l838193n935046n810151
8007C02712806o797254j591176Q881323Q074144l107736K069302J6915226N104678
7999C32261313j0773099n436321m861774o912364N61229L749539K784292j156943
$$ plain form
7991 310215872 308759266 311014144 316392652 319724461 321872381 326557623 325004010 315488319
7983 315488319 311606510 316268749 320254557 315356624 310204713 312550238 313582370 314194335
7975 314194335 314616199 310987754 306897228 305793873 308788619 312114712 310277693 309060728
7967 309060728 308026092 310671537 315921581 320359347 318822723 314499409 319917663 328450739
7959 328450739 331141978 325210578 322898542 325103538 318009709 310795434 308653868 311406495
7951 311406495 319950799 322908421 321710244 318974133 312319877 302854174 299573762 299540253
7943 299540253 297422996 298676943 302831017 300848093 296697651 299288216 302853485 305720118
7935 305720118 301767180 300923449 308192774 316703544 322438392 324340733 321606546 317881956
$$ packed form
7991C10215872j456606K254878N378508L331809K147920M685242j553613r515691
7983C15488319l881809M662239L985808m897933n151911K345525J032132O11965
7975C14194335M21864l628445m090526j103355K994746L326093j837019j216965
7967C09060728j034636K645445N250044M437766j536624m323314N418254Q533076
7959C28450739K691239n931400k312036K204996p093829p214275k141566K752627
7951C11406495Q544304K957622j198177k736111o654256r465703l280412l3509
7943B99540253k117257J253947M154074j982924m150442K590565L565269K866633
7935C05720118l952938q43731P269325Q510770N734848J902341k734187l724590
$$ plain form
7927 317881956 320351929 318953968 312649208 312741092 314947039 322892761 326899300 317876502
7919 317876502 309561184 309063165 315635210 318815175 316295599 319139128 322306576 324418258
7911 324418258 327832769 331021153 327814055 327344573 330594613 332610293 329069964 331226775
7903 331226775 331500165 332231221 333201179 332628147 330814307 325611833 321423493 320509700 320602457
7894 320602457 321377349 318165631 312725990 315356264 321233729 324524946 326117558 325411194
7886 325411194 321446537 318960136 319134879 319052488 315083563 315725043 323851026 323846166 318761748
7877 318761748 310049993 305387301 310337860 313410055 318739858 317534191 305578094 302453104
7869 302453104 313326145 314980871 307351282 304026432 302911961 301054461 301626205 305337287
$$ packed form
7927C17881956K469973j397961o304760R1884K205947P945722M006539r022798
7919C17876502q315318m98019O572045L179965k519576K843529L167448K111682
7911C24418258L414511L188384l207098m69482L250040K015680l540329K156811
7903C31226775K73390P31056R69958n73032j813840n202474m188340r13793R2757
7894C20602457P74892l211718n439641K630274N877465L291217J592612p06364
7886C25411194l964657k486401J74743q2391l968925O41480Q125983m860n084418
7877C18761748q711755m662692M950559L072195N329803j205667j1956097l124990
7869C02453104J0873041J654726p629589l324850j114471j857500N71744L711082
$$ plain form
7861 305337287 307760618 304646019 304931957 308032757 306209613 310562498 325651475 338578137
7853 338578137 344831887 344146183 338127050 331068486 329483409 329406243 326326558 327171183 329411674
7844 329411674 331084199 332976167 335750095 329355476 323825826 327105267 332572302 327071920
7836 327071920 320693182 323200090 326613618 325473228 322613295 320336683 317978446 316493982
7828 316493982 311987117 311364241 313421041 315803896 322303091 330980583 334202221 329121693
7820 329121693 327133475 321389713 314664379 310557216 308693845 306432331 307609256 305854246
7812 305854246 308585257 313913681 315597294 311239842 302679531 300440841 301878097 301929402
7804 301929402 299482038 299670921 297911262 298666731 304671888 307201658 308469808 310871781
$$ packed form
7861C05337287K423331l114599K85938L100800j823144M352885J5088977J2926662
7853C38578137O253750o85704o019133p058564j585077p7166l079685Q44625K240491
7844C29411674J672525J891968K773928o394619n529650L279441N467035n500382
7836C27071920o378738K506908L413528j140390k859933k276612k358237j484464
7828C16493982m506865o22876K056800K382855O499195Q677492L221638n080528
7820C29121693j988218n743762o725334m107163j863371k261514J176925j755010
7812C05854246K731011N328424J683613m357452q560311k238690J437256N1305
7804C01929402k447364J88883j759659P55469O005157K529770J268150K401973
$$ plain form
7796 310871781 311258500 313658826 318775115 321891779 314112651 311140454 317248697 320549386
7788 320549386 320766244 314331517 308042865 304745218 309044361 311737969 314141471 317633034
7780 317633034 320692236 322558370 317923284 317463168 319181883 317997364 315813621 308883341
7772 308883341 308181797 317326131 317754458 311536614 308540233 310019160 315706779 321364030
7764 321364030 323162555 319453247 316117501 316457146 311402228 310024701 308357328 305901410
7756 305901410 307393280 307786413 303565355 304734006 309589362 311033186 312602213 317292663
7748 317292663 323091031 330887500 334656716 320360050 307596309 313949491 316468214 313357447
7740 313357447 309686835 311506014 313370748 310293976 308472235 311129324 316618036 314602122
$$ packed form
7796C10871781L86719K400326N116289L116664p779128k972197O108243L300689
7788C20549386K16858o434727o288652l297647M299143K693608K403502L491563
7780C17633034L059202J866134m635086m60116J718715j184519k183743o930280
7772C08883341p01544R144334M28327o217844k996381J478927N687619N657251
7764C21364030J798525l709308l335746L39645n054918j377527j667373k455918
7756C05901410J491870L93133m221058J168651M855356J443824J569027M690450
7748C17292663N798368P796469L769216j4296666j2763741O353182K518723l110767
7740C13357447l670612J819179J864734l076772j821741K657089N488712k015914
$$ plain form
7732 314602122 310729262 311007836 310317066 313237437 313538255 314434491 320270463 329859914 334349241
7723 334349241 338488470 343760913 336125674 331126255 331587252 329436701 321389343 312195761
7715 312195761 311977384 316328323 326112254 328522721 328013589 327366596 319341662 312088537
7707 312088537 310575296 314434656 319889113 324303342 325540148 326669500 327726507 321549687
7699 321549687 318201955 318466171 324098892 319396931 315365728 323532692 325413303 321966260
7691 321966260 324877727 326034003 319250075 315223191 320667571 326247643 326025875 324075981
7683 324075981 321681196 316984924 311851787 312322384 313088870 314991789 324685851 336884007
7675 336884007 336725542 327544187 320538786 319418073 319520116 314536788 317448400 319151137
$$ packed form
7732C14602122l872860K78574o90770K920371L00818Q96236N835972R589451M489327
7723C34349241M139229N272443p635239m999419M60997k150551q047358r193582
7715C12195761k18377M350939R783931K410467n09132o46993q024934p253125
7707C12088537j513241L859360N454457M414229J236806J129352J057007o176820
7699C21549687l347732K64216N632721m701961m031203Q166964J880611l447043
7691C21966260K911467J156276o783928m026884N444380N580072k21768j949894
7683C24075981k394785m696272n133137M70597P66486J902919R694062J2198156
7675C36884007j58465r181355p005401j120713J02043m983328K911612J702737
$$ plain form
7667 319151137 315729120 312164005 313919581 319478593 316727588 316904750 318547366 321237216
7659 321237216 319398774 311677357 312259382 313797557 315718992 315391302 308906279 309518528
7651 309518528 314426023 309840064 314269599 322325368 329045728 338218794 341797173 347274078
7643 347274078 343670936 334741217 330546584 331589163 330868745 326965732 323126153 314184112
7635 314184112 308515443 307036101 314102081 318294625 311579445 306329385 301788237 300793467
7627 300793467 313088171 321324688 317641895 311734580 307638113 301133061 302950362 312604444
7619 312604444 318363450 324781026 330228992 329712035 325624584 323270255 322401973 323846160
7611 323846160 321971653 318636997 316647072 311490639 303788717 304084186 303972271 301357956
$$ packed form
7667C19151137l422017l565115J755576N559012k751005J77162J642616K689850
7659C21237216j838442p721417N82025J538175J921435l27690o485023O12249
7651C09518528M907495m585959M429535Q055769O720360R173066L578379N476905
7643C47274078l603142q929719m194633J042579p20418l903013l839579q942041
7635C14184112n668669j479342P065980M192544o715180n250060m541148r94770
7627C00793467J2294704Q236517l682793n907315m096467o505052J817301R654082
7619C12604444N759006O417576N447966n16957m087451k354329q68282J444187
7611C23846160j874507l334656j989925n156433p701922K95469j11915k614315
$$ plain form
7603 301357956 302818297 299881091 298104693 300272239 303084734 312579132 314380976 312422470
7595 312422470 311557049 312960303 322404271 330515721 332397765 329376087 329648317 326903474
7587 326903474 325085494 322915858 316799465 317158259 322290562 327701910 325872638 324096012
7579 324096012 320735139 316438585 313692221 311400931 310388304 311983170 314217926 318953622
7571 318953622 317820147 316292277 316539049 317218935 317455643 315606491 314241099 313371587 311414637
7562 311414637 305176249 302364071 311243306 321487164 325947681 325348196 322346897 318122266
7554 318122266 310916518 306994912 311038353 317670449 314890632 310935060 308950577 307690103
7546 307690103 308330817 306315810 305369871 317292367 324148099 325140443 325386048 313730178
$$ packed form
7603C01357956J460341k937206j776398K167546K812495R494398J801844j958506
7595C12422470q65421J403254R443968Q111450J882044l021678K72230k744843
7587C26903474j817980k169636o116393L58794N132303N411348j829272j776626
7579C24096012l360873m296554k746364k291290j012627J594866K234756M735696
7571C18953622j133475j527870K46772O79886K36708j849152j365392q69512j956950
7562C11414637o238388k812178Q879235J0243858M460517n99485l001299m224631
7554C18122266p205748l921606M043441O632096k779817l955572j984483j260474
7546C07690103O40714k015007r45939J1922496O855732R92344K45605j1655870
$$ plain form
7538 313730178 303476001 299697091 298370679 305029927 313025222 313452040 314367591 320504951
7530 320504951 329559816 331995338 333859872 342019006 344862230 338513783 331199284 319038367
7522 319038367 309499930 307906719 314304383 323329735 331064139 327448086 325094459 331519666
7514 331519666 333738167 333543764 327572821 319031010 315891554 313693285 319073889 321619068
7506 321619068 314971993 306751882 300624316 300233958 302657204 307064468 313384049 317798231
7498 317798231 323651884 330440797 329777558 324647789 318376062 309828821 306660047 308799626
7490 308799626 308932483 315132049 313792220 307037006 305818093 306122037 310629465 316468579
7482 316468579 314059207 308124542 309337729 313435975 321480563 327598881 322823357 317592170
$$ packed form
7538C13730178j0254177l778910j326412O659248P995295M26818R15551O137360
7530C20504951R054865K435522J864534Q159134K843224o348447p314499j2160917
7522C19038367r538437j593211O397664R025352P734404l616053k353627O425207
7514C31519666K218501j94403n970943q541811l139456k198269N380604K545179
7506C21619068o647075q220111o127566l90358K423246M407264O319581M414182
7498C17798231N853653O788913o63239n129769o271727q547241l168774K139579
7490C08799626J32857O199566j339829o755214j218913L03944M507428N839114
7482C16468579k409372n934665J213187M098246Q044588O118318m775524n231187
$$ plain form
7474 317592170 317771939 319788897 321328192 320303437 314510362 315570511 323680796 325010004
7466 325010004 323264674 324348179 325205335 327896079 325025493 322742614 325265272 323008630
7458 323008630 318731433 321500037 327602715 334007263 341255015 347651599 345072097 341650649
7450 341650649 341255438 331659765 318343960 318260226 321983252 326557718 322922006 318682284
7442 318682284 321214486 324022106 328757456 332082679 328810378 324956199 326562713 326776345
7434 326776345 325500315 322401545 322127738 322712945 323786665 326150111 328836996 327240691
7426 327240691 323984765 317292120 310188784 306727444 306277208 307149338 311978691 311181243
7418 311181243 314987112 321463698 323783610 319387284 317375543 318404769 318302337 317323888
$$ packed form
7474C17592170J79769K016958J539295j024755n793075J060149Q110285J329208
7466C25010004j745330J083505Q57156K690744k870586k282879K522658k256642
7458C23008630m277197K768604O102678O404548P247752O396584k579502l421448
7450C41650649l95211r595673j3315805q3734L723026M574466l635712m239722
7442C18682284K532202K807620M735350L325223l272301l854179J606514K13632
7434C26776345j276030l098770k73807N85207J073720K363446K686885j596305
7426C27240691l255926o692645p103336l461340m50236Q72130M829353p97448
7418C11181243L805869O476586K319912m396326k011741J029226j02432r78449
$$ plain form
7410 317323888 314573418 312555015 315404383 318152579 321743065 326813863 317473145 317054449
7402 317054449 324437449 326435772 334473645 344233894 345253633 334895175 326068670 323860136
7394 323860136 327543643 336872150 341547423 339123643 338516729 335699125 330074079 325305992
7386 325305992 320266195 317701651 314498368 313007151 316132598 319069992 326420482 333691197
7378 333691197 327850390 324463026 333912605 340057093 330525287 313413113 307248997 305912879
7370 305912879 302550645 309984666 324686350 326098337 321475450 319194948 322567773 322765731
7362 322765731 315031213 314402867 316125732 317043155 322984117 328262471 330267614 332576192
7354 332576192 333362230 327474537 318375967 315189457 319788434 325595898 325562204 323705205
$$ packed form
7410C17323888k750470k018403K849368K748196L590486N070798r340718m18696
7402C17054449P383000J998323Q037873R760249J019739j0358458q826505k208534
7394C23860136L683507R328507M675273k423780o06914k817604n625046m768087
7386C25305992n039797k564544l203283j491217L125447K937394P350490P270715
7378C33691197n840807l387364R449579O144488r531806j7112174o164116j336118
7370C05912879l362234P434021J4701684J411987m622887k280502L372825J97958
7362C22765731p734518o28346J722865R17423N940962N278354K005143K308578
7354C32576192P86038n887693r098570l186510M598977N807464l3694j856999
$$ plain form
7346 323705205 328302935 332043136 331278209 333184005 326695249 317300404 313376267 317927685
7338 317927685 325666974 327159915 322321774 315599110 312410566 317822050 323627528 321559365
7330 321559365 314732539 307297241 312665974 321425189 321411180 315766464 310324825 311131745
7322 311131745 310214050 307904008 308622479 303853634 294786671 293055744 300906938 308510627
7314 308510627 319138721 325074340 320750537 316032424 317001355 325763688 330861667 329281886
7306 329281886 325463995 325507758 326665585 332063558 335108046 336764773 338728576 340449717
7298 340449717 340263061 337881625 328874213 317967209 306800342 298727204 299672377 300694816
7290 300694816 308557282 319597358 332800521 342690832 342641255 339778318 338428630 336615689
$$ packed form
7346C23705205M597730L740201p64927J905796o488756r394845l924137M551418
7338C17927685P739289J492941m838141o722664l188544N411484N805478k068163
7330C21559365o826826p435298N368733Q759215j4009n644716n441639Q06920
7322C11131745r17695k310042P18471m768845r066963j730927P851194P603689
7314C08510627J0628094N935619m323803m718113R68931Q762333N097979j579781
7306C29281886l817891M3763J157827N397973L044488J656727J963803J721141
7298C40449717j86656k381436r007412j0907004j1166867q073138R45173J022439
7290C00694816P862466J1040076J3203163R890311m9577k862937j349688j812941
$$ plain form
7282 336615689 332258891 330988727 331685385 330967542 329603463 326670813 320043256 314957814
7274 314957814 313419936 311452580 308905599 317008921 324683928 324490014 324631620 321901117
7266 321901117 326044754 338860637 350522279 355712529 349507611 345019624 344249271 343837493
7258 343837493 345967761 346998460 340565558 328102447 317576242 321287370 322706373 324747303
7250 324747303 325177412 317098697 316214682 323195598 320744361 318475071 317759951 314245897
7242 314245897 311703930 310167717 316702293 319892311 319318312 317884211 317568448 319671065
7234 319671065 324050214 327254903 328726698 329390703 334255812 337609450 334076210 332162407
7226 332162407 334569373 330962110 325717690 319578918 317067098 322326117 333301558 339434755
$$ packed form
7282C36615689m356798j270164O96658p17843j364079k932650o627557n085442
7274C14957814j537878j967356k546981Q103322P675007j93914J41606k730503
7266C21901117M143637J2815883J1661642N190250o204918m487987p70353m11778
7258C43837493K130268J030699o432902j2463111j0526205L711128J419003K040930
7250C24747303M30109q078715q84015O980916k451237k269290p15120l514054
7242C14245897k541967j536213O534576L190018n73999j434101l15763K102617
7234C19671065M379149L204689J471795O64005M865109L353638l533240j913803
7226C32162407K406966l607263n244420o138772k511820N259019J0975441O133197
$$ plain form
7218 339434755 338433214 334347926 333608707 329485612 327537660 331601808 332565541 326621984
7210 326621984 328473845 331513294 329677998 328661946 322593894 321473280 322712922 324059268
7202 324059268 327139657 322884457 317693057 317458909 320789113 319414125 323498566 323176270
7194 323176270 318234476 321991273 327471378 327922979 327794511 326382643 320675103 316437095
7186 316437095 312715531 308116949 311454274 320560642 327216185 334073417 335396703 333490326
7178 333490326 330454960 326937783 328010404 332565978 327686893 325679128 326529240 322362448
7170 322362448 321389454 323228834 327936489 332581305 328323639 325977084 327316244 324118883
7162 324118883 325944872 333805724 341583179 340579786 334019553 327908693 317507199 312400159
$$ packed form
7218C39434755j001541m085288p39219m123095j947952M064148R63733n943557
7210C26621984J851861L039449j835296j016052o068052j120614J239642J346346
7202C24059268L080389m255200n191400k34148L330204j374988M084441l22296
7194C23176270m941794L756797N480105M51601j28468j411868n707540m238008
7186C16437095l721564m598582L337325R106368O655543O857232J323286j906377
7178C33490326l035366l517177J072621M555574m879085k007765Q50112m166792
7170C22362448r72994J839380M707655M644816m257666k346555J339160l197361
7162C24118883J825989P860852P777455j003393o560233o110860j0401494n107040
$$ plain form
7154 312400159 318388911 325608023 326700066 326141878 328824945 327604433 326056764 325298161
7146 325298161 330519609 335118925 330084948 326051442 320909803 318608596 322330083 326043641
7138 326043641 324768001 322442234 321750459 313751796 307944237 306294112 316366988 326879573
7130 326879573 328563857 330419422 329698596 332827088 335281436 332627908 332330797 331686590
7122 331686590 327038061 324633138 318108032 315802393 322834231 332407294 343247912 354402365
7114 354402365 353156619 346519121 338394226 329889522 321370798 309332504 302316245 305370860
7106 305370860 307378040 310277785 315171222 319174349 323787582 333383132 336356593 332317155
7098 332317155 328501751 332059541 335452354 330443753 320113934 313973158 314506920 312660527
$$ packed form
7154C12400159N988752P219112J092043n58188K683067j220512j547669p58603
7146C25298161N221448M599316n033977m033506n141639k301207L721487L713558
7138C26043641j275640k325767o91775p998663n807559j650125J0072876J0512585
7130C26879573J684284J855565p20826L128492K454348k653528k97111o44207
7122C31686590m648529k404923o525106k305639P031838R573063J0840618J1154453
7114C54402365j245746o637498q124895q504704q518724j2038294p016259L054615
7106C05370860K007180K899745M893437M003127M613233R595550K973461m039438
7098C32317155l815404L557790L392813n008601j0329819o140776N33762j846393
$$ plain form
7090 312660527 314854346 324804870 339593445 348711781 347553755 343697919 341523936 339575166
7082 339575166 339670191 332264702 321110410 317836477 321046145 328380706 330760124 329204604
7074 329204604 336219634 333897675 325533691 327082715 332543104 336035607 332308103 326846681
7066 326846681 324700988 326310400 328675087 328740361 327628611 327033076 329880072 338125690
7058 338125690 337716073 327130651 317404574 318193673 320273031 319712860 326244218 330333002
7050 330333002 328766905 326479502 321146738 317480805 318362329 320941763 324089777 321299642
7042 321299642 323189295 322113400 321750234 318230066 315151648 313861363 308995387 306402633
7034 306402633 311367144 317934129 319310748 323840400 325991897 323380909 323367079 326907667
$$ packed form
7090C12660527K193819R950524J4788575R118336j158026l855836k173983j948770
7082C39575166R5025p405489j1154292l273933L209668P334561K379418j555520
7074C29204604P015030k321959q363984J549024N460389L492503l727504n461422
7066C26846681k145693J609412K364687O5274j111750n95535K846996Q245618
7058C38125690m09617j0585422r726077P89099K079358n60171O531358M088784
7050C30333002j566097k287403n332764l665933Q81524K579434L148014k790135
7042C21299642J889653j075895l63166l520168l078418j290285m865976k592754
7034C06402633M964511O566985J376619M529652K151497k610988j3830L540588
$$ plain form
7026 326907667 327708778 323172365 319020389 323004204 325954251 325042646 323850532 322140017
7018 322140017 322053205 322715001 318631486 319678038 326716751 330265067 327121465 329518643
7010 329518643 334275859 331929357 322915320 319331217 313844855 307477676 307914206 308591811
7002 308591811 314453632 322620248 329618410 336738753 338855753 329447798 322415181 324360717
6994 324360717 332324257 335394238 331769851 326071291 329841171 333205939 328802236 320769362
6986 320769362 310708241 306370762 308732385 311983391 312189331 314001118 313511497 307728704
6978 307728704 306145129 315496364 320223033 321109388 322007283 319241434 316405533 316094635
6970 316094635 320477673 323844941 328994594 340289854 346920533 342383702 327004526 315118461
$$ packed form
7026C26907667Q01111m536413m151976L983815K950047r11605j192114j710515
7018C22140017q6812O61796m083515J046552P038713L548316l143602K397178
7010C29518643M757216k346502r014037l584103n486362o367179M36530O77605
7002C08591811N861821Q166616O998162P120343K117000r407955p032617J945536
6994C24360717P963540L069981l624387n698560L769880L364768m403703q032874
6986C20769362j0061121m337479K361623L251006K05940J811787m89621n782793
6978C07728704j583575R351235M726669Q86355Q97895k765849k835901l10898
6970C16094635M383038L367268N149653J1295260O630679m536831j5379176j1886065
$$ plain form
6962 315118461 307323936 306052759 305883572 310360153 316092216 320313595 323415554 323858085
6954 323858085 323497291 327981906 337730634 340211360 331456686 322942632 318042837 313454379
6946 313454379 314710693 321831273 329491959 330871724 326865322 325209418 326460236 329992233
6938 329992233 332092479 334071986 334126466 326423023 318375390 316061675 319208194 319315143
6930 319315143 312183192 313783299 317664222 315399892 312500751 311555777 317722097 326384991
6922 326384991 326359408 318703104 313605369 314737505 327373922 338380361 344761170 344085578
6914 344085578 339636654 334603644 332335590 333920272 337123656 337991758 338508207 337562631
6906 337562631 332392454 326025259 324280026 331319515 335688747 336186706 337090037 333730119
$$ packed form
6962C15118461p794525j271177j69187M476581N732063M221379L101959M42531
6954C23858085l60794M484615R748728K480726q754674q514054m899795m588458
6946C13454379J256314P120580P660686J379765m006402j655904J250818L531997
6938C29992233K100246J979507N4480p703443q047633k313715L146519J06949
6930C19315143p131951J600107L880923k264330k899141r44974O166320Q662894
6922C26384991k5583p656304n097735J132136J2636417J1006439O380809o75592
6914C44085578m448924n033010k268054J584682L203384Q68102N16449r45576
6906C37562631n170177o367195j745233P039489M369232M97959R03331l359918
$$ plain form
6898 333730119 329749191 334432430 340363922 341359491 338758786 336026181 330225405 325496914
6890 325496914 328031256 330715707 327496806 318359629 317920952 318607662 316914298 318223817
6882 318223817 323422784 329720180 330239603 328340792 327208237 325986456 331691472 341135734
6874 341135734 345941296 347435129 342727956 338026887 330797576 329929658 335410097 332641529
6866 332641529 331258781 334881054 338079401 335333023 330844037 328760002 326136639 325548324
6858 325548324 333670665 340768484 335536265 323533499 320952146 322721547 320117388 314983419
6850 314983419 319607442 327042303 331409153 330317693 329020730 328590453 326610432 327432410
6842 327432410 330576958 335462369 326323120 317698778 311962186 305423804 306178935 308587929
$$ packed form
6898C33730119l980928M683239N931492R95569k600705k732605n800776m728491
6890C25496914K534342K684451l218901r137177m38677O86710j693364J309519
6882C18223817N198967O297396N19423j898811j132555j221781N705016R444262
6874C41135734M805562J493833m707173m701069p229311q67918N480439k768568
6866C32641529j382748L622273L198347k746378m488986k084035k623363n88315
6858C25548324Q122341P097819n232219j2002766k581353J769401k604159n133969
6850C14983419M624023P434861M366850j091460j296963m30277j980021Q21978
6842C27432410L144548M885411r139249q624342n736592o538382P55131K408994
$$ plain form
6834 308587929 317606606 322268370 323957810 327627651 329603770 332248934 331189909 328297587
6826 328297587 325663496 320353004 316132641 316273888 320479010 326094471 327028160 322740753
6818 322740753 327292186 325649987 319854121 320134843 321917218 330786568 332192393 333650241
6810 333650241 336648360 338010388 336577338 327222768 325105661 328350293 331517417 330667788
6802 330667788 330669677 331999862 327237363 325312827 321609011 324359689 330310819 332344233
6794 332344233 329457507 330371391 332127164 333553636 336970193 332155164 326170801 328724600
6786 328724600 331746202 332149401 329757215 331405284 332131385 328834934 332317331 335356637
6778 335356637 340580372 341035695 333950689 324661056 318441994 312201918 309957365 309054054
$$ packed form
6834C08587929R018677M661764J689440L669841J976119K645164j059025k892322
6826C28297587k634091n310492m220363J41247M205122N615461R33689m287407
6818C22740753M551433j642199n795866K80722J782375Q869350J405825J457848
6810C33650241K998119J362028j433050r354570k117107L244632L167124q49629
6802C30667788J889J330185m762499j924536l703816K750678N951130K033414
6794C32344233k886726R13884J755773J426472L416557m815029n984363K553799
6786C28724600L021602M03199k392186J648069P26101l296451L482397L039306
6778C35356637N223735M55323p085006r289633o219062o240076k244553r03311
$$ plain form
6770 309054054 307662056 311613260 316028941 320958492 324541320 327994528 332018447 334762261
6762 334762261 340650337 342754200 341748286 343846899 347574951 349832054 343963116 332539307
6754 332539307 325754180 324213190 320954341 314363000 314357843 320137352 325289265 324093531
6746 324093531 322850900 322519629 322196114 325744273 325009303 322423425 324667615 324250840 328920420
6737 328920420 330913099 322335989 322322159 333420688 338890404 331794995 322908213 312055960
6729 312055960 303634981 304132857 313274344 324559364 322360176 320553688 328167745 334526132
6721 334526132 338273526 334825962 326550454 329095887 332849040 331669551 325745102 319713272
6713 319713272 330555225 338085168 332593408 321618202 317361700 322723757 330366529 338581230
$$ packed form
6770C09054054j391998L951204M415681M929551L582828L453208M023919K743814
6762C34762261N888076K103863j005914K098613L728052K257103n868938j1423809
6754C32539307o785127j540990l258849o591341n157N779509N151913j195734
6746C24093531j242631l31271l23515L548159p34970k585878K244190m16775M669580
6737C28920420J992679q577110j3830J1098529N469716p095409q886782j0852253
6729C12055960q420979M97876R141487J1285020k199188j806488P614057O358387
6721C34526132L747394l447564q275508K545433L753153j179489n924449o031830
6713C19713272J0841953P529943n491760j0975206m256502N362057P642772Q214701
$$ plain form
6705 338581230 334903433 333060103 337697881 342123255 340381303 340361539 341291668 339610622
6697 339610622 341229626 347698002 356179671 357141340 348421430 343082118 337556820 334303621
6689 334303621 335942342 328889611 324431808 327407507 328348173 333543188 336244896 332324731
6681 332324731 327787623 322923498 324272907 320714210 310018132 309121966 311802621 309671592
6673 309671592 305643763 307185772 323340672 333870707 337738526 336944699 332250814 328497072
6665 328497072 324879515 323506511 320681266 321230357 325472446 329955417 332022916 330974719
6657 330974719 330889314 329498132 324481171 321997970 320549460 324172940 328536712 328089518
6649 328089518 328819138 332136645 334443193 329734422 324494588 323365326 333897442 334653297
$$ packed form
6705C38581230l677797j843330M637778M425374j741952j9764R30129j681046
6697C39610622J619004O468376Q481669R61669q719910n339312n525298l253199
6689C34303621J638721p052731m457803K975699R40666N195015K701708l920165
6681C32324731m537108m864125J349409l558697j0696078q96166K680655k131029
6673C09671592m027829J542009J6154900J0530035L867819p93827m693885l753742
6665C28497072l617557j373004k825245N49091M242089M482971K067499j048197
6657C30974719q5405j391182n016961k483201j448510L623480M363772m47194
6649C28089518P29620L317507K306548m708771n239834j129262J0532116P55855
$$ plain form
6641 334653297 330426896 334327109 328256958 313037339 309320762 312217143 309224120 311550221
6633 311550221 322809482 325746545 321652316 320495420 318788059 320647766 326308606 323317454
6625 323317454 321528923 325671709 329461509 331782009 336742447 338707899 343222594 339965814
6617 339965814 332984648 332752490 329526364 320813190 313190743 308000660 308325431 313803261
6609 313803261 319924998 324769258 325708454 319925126 318890362 328744825 330665498 328146030
6601 328146030 328190568 325316311 325662555 324002228 324176680 328574877 321951814 312852102 308870739
6592 308870739 309101803 308576661 308317877 310352829 322430189 337935106 346902767 348607455
6584 348607455 344987140 340204877 336308229 333645825 330499431 333886124 335788008 337001191
$$ packed form
6641C34653297m226401L900213o070151j5219619l716577K896381k993023K326101
6633C11550221J1259261K937063m094229j156896j707361J859707N660840k991152
6625C23317454j788531M142786L789800K320500M960438J965452M514695l256780
6617C39965814o981166k32158l226126q713174p622447n190083L24771N477830
6609C13803261O121737M844260R39196n783328j034764R854463J920673k519468
6601C28146030M4538k874257L46244j660327J74452M398197o623063r099712l981363
6592C08870739K31064n25142k58784K034952J2077360J5504917Q967661J704688
6584C48607455l620315m782263l896648k662404l146394L386693J901884J213183
$$ plain form
6576 337001191 335255284 334239940 336040983 330786306 321688689 322217441 321421942 316438330
6568 316438330 315004892 316761774 320580857 324856895 329423049 326231301 319655573 312816553
6560 312816553 312809420 319048801 327860879 331938605 331406094 334220022 331374090 326468598 325517716
6551 325517716 329752200 335854424 342410532 346379431 355020995 361439451 355129441 345330915
6543 345330915 335049884 329376229 330296649 329360775 332001325 337357705 337309497 335652530
6535 335652530 332971727 335778716 339743591 339204638 339187559 340110956 341252187 336591561 334066047
6526 334066047 339783843 341596953 337057539 333144247 328840155 323021477 322188673 328374246
6518 328374246 335660080 337277672 334243720 329252814 328988533 330361671 327843183 329910407
$$ packed form
6576C37001191j745907j015344J801043n254677r097617N28752p95499m983612
6568C16438330j433438J756882L819083M276038M566154l191748o575728o839020
6560C12816553p133O239381Q812078M077726n32511K813928k845932m905492r50882
6551C25517716M234484O102224O556108L968899Q641564O418456o310010r798526
6543C45330915j0281031n673655R20420r35874K640550N356380m8208j656967
6535C35652530k680803K806989L964875n38953j7079R23397J141231m660626k525514
6526C34066047N717796J813110m539414l913292m304092n818678q32804O185573
6518C28374246P285834J617592l033952m990906k64281J373138k518488K067224
$$ plain form
6510 329910407 333475588 336249211 341258739 344341648 350266268 353280657 350614473 342988898
6502 342988898 337818932 339798649 339209508 340418414 345206703 346884121 348974690 349427807
6494 349427807 346277384 340820413 337776890 333705823 329071344 329869585 337197744 338142494
6486 338142494 330839409 328180974 327013601 332697903 340330645 338186650 333478669 330197684
6478 330197684 333556423 336898953 333033490 330646786 327417035 323126394 328857086 334373633
6470 334373633 331524552 330962012 339082021 345679006 347653761 340231729 335502509 334656937
6462 334656937 336798144 334344751 324498011 316380548 320637740 329081218 328893433 325901823
6454 325901823 322700141 325945011 327570284 335682355 348606722 357551399 354519560 350892999
$$ packed form
6510C29910407L565181K773623N009528L082909N924620L014389k666184p625575
6502C42988898n169966J979717n89141J208906M788289J677418K090569M53117
6494C49427807l150423n456971l043523m071067m634479P98241P328159R44750
6486C38142494p303085k658435j167373N684302P632742k143995m707981l280985
6478C30197684L358739L342530l865463k386704l229751m290641N730692N516547
6470C34373633k849081n62540Q120009O596985J974755p422032m729220q45572
6462C34656937K141207k453393r846740q117463M257192Q443478j87785k991610
6454C25901823l201682L244870J625273Q112071J2924367Q944677l031839l626561
$$ plain form
6446 350892999 351039473 349026303 342782163 335488727 327263187 325962436 335528763 345640518
6438 345640518 347046868 343501171 338741896 332149938 329800637 331136201 331255402 331856408
6430 331856408 329578589 330246364 334624570 338429040 340791912 337427482 332217331 334954377
6422 334954377 341602598 344997566 347675303 346695405 340497555 335314090 335625411 335382588
6414 335382588 338948551 344028932 345854360 344598626 344393688 348399970 350688921 355664302
6406 355664302 360661201 357376825 346408195 344297854 349060537 346052835 344513433 343598637
6398 343598637 340211872 330852437 323222989 321342331 327365628 332005843 332998443 340405585
6390 340405585 347416913 344728397 334264085 326979545 331592971 335215054 330524626 327621650
$$ packed form
6446C50892999J46474k013170o244140p293436q225540j300751R566327J0111755
6438C45640518J406350l545697m759275o591958k349301J335564J19201O01006
6430C31856408k277819O67775M378206L804470K362872l364430n210151K737046
6422C34954377O648221L394968K677737r79898o197850n183465L11321k42823
6414C35382588L565963N080381J825428j255734k04938M006282K288951M975381
6406C55664302M996899l284376j0968630k110341M762683l007702j539402r14796
6398C43598637l386765r359435p629448j880658O023297M640215R92600P407142
6390C40405585P011328k688516j0464312p284540M613426L622083m690428k902976
$$ plain form
6382 327621650 326134921 326643593 327690231 328376960 328580593 329880551 329673361 326759160 324906384
6373 324906384 329181243 332260364 329633290 333764615 340401869 343299573 349781087 347546766
6365 347546766 334941549 331755706 339782197 344453926 342378078 339610516 343998870 351337965
6357 351337965 355492108 354069957 353854650 352674909 346872914 341832091 341029745 342647314
6349 342647314 338561346 334971772 335345061 338734776 337134559 327752719 321748477 324391761
6341 324391761 329996250 329690022 324348923 322284264 320025102 318204202 318947592 321482454
6333 321482454 323099732 324805261 327336905 330087033 330688096 327274973 325545563 328792868
6325 328792868 334129564 334277958 331803921 330974745 329099046 330094359 329494685 326398789 322775103
$$ packed form
6382C27621650j486729N08672J046638O86729K03633J299958k07190k914201j852776
6373C24906384M274859L079121k627074M131325O637254K897704O481514k234321
6365C47546766j2605217l185843Q026491M671729k075848k767562M388354P339095
6357C51337965M154143j422151k15307j179741n801995n040823q02346J617569
6349C42647314m085968l589574L73289L389715j600217r381840o004242K643284
6341C24391761N604489l06228n341099k064659k259162j820900P43390K534862
6333C21482454J617278J705529K531644K750128O01063l413123j729410L247305
6325C28792868N336696J48394k474037q29176j875699R95313n99674l095896l623686
$$ plain form
6316 322775103 317144487 315197739 320675538 324515316 328187382 328843718 327153521 331889091
6308 331889091 332906579 332780720 335377171 336004092 335193865 338348841 341535950 339671301
6300 339671301 341219652 341752079 337532527 334161823 334990242 334838251 328720515 329708470 324914457
6291 324914457 318054941 321868194 331602063 335518036 337762072 340507835 335707574 333246640
6283 333246640 333919087 332875833 334145284 342649744 348709412 351841449 358065992 366085886
6275 366085886 365568242 358652525 351464198 348672305 343747594 340649254 335734324 338650952
6267 338650952 342353786 340416657 337072988 340030764 349064853 352802484 353453764 357900974
6259 357900974 355176741 348339592 345855108 343341551 340989749 341516582 342805599 345169092
$$ packed form
6316C22775103n630616j946748N477799L839778L672066O56336j690197M735570
6308C31889091J017488j25859K596451O26921q10227L154976L187109j864649
6300C39671301J548351N32427m219552l370704Q28419j51991o117736R87955m794013
6291C24914457o859516L813253R733869L915973K244036K745763m800261k460934
6283C33246640O72447j043254J269451Q504460O059668L132037O224543Q019894
6275C66085886n17644o915717p188327k791893m924711l098340m914930K916628
6267C38650952L702834j937129l343669K957776R034089L737631O51280M447210
6259C57900974k724233o837149k484484k513557k351802N26833J289017K363493
$$ plain form
6251 345169092 344870148 346428666 349088327 346033773 339877476 329693775 323355116 325654898
6243 325654898 329831364 338972887 350310073 352594163 349243676 344936432 345511286 340687565
6235 340687565 342868883 347636658 342512120 342771198 344366346 342618985 339733463 336887303
6227 336887303 339958459 350260527 357183624 359634188 358240899 356380908 359533216 364362094
6219 364362094 365050039 368636413 366576613 363197119 360849326 358037712 359970405 367306402
6211 367306402 366123043 359259068 350967139 344619799 347116652 351966565 353115141 348223863
6203 348223863 344524605 346484252 347633056 346412595 341370643 330516536 327345417 336527564
6195 336527564 338974235 339477770 346388791 353667576 357408744 357259676 360521544 361495570
$$ packed form
6251C45169092k98944J558518K659661l054554o156297j0183701o338659K299782
6243C25654898M176466R141523J1337186K284090l350487m307244N74854m823721
6235C40687565K181318M767775n124538K59078J595148j747361k885522k846160
6227C36887303L071156J0302068O923097K450564j393289j859991L152308M828878
6219C64362094O87945L586374k059800l379494k347793k811614J932693P335997
6211C67306402j183359o863975q291929o347340K496853M849913J148576m891278
6203C48223863l699258J959647J148804j220461n041952j0854107l171119R182147
6195C36527564K446671N03535O911021P278785L741168j49068L261868R74026
$$ plain form
6187 361495570 357497518 348937811 350847537 352986758 355108045 355548492 351118046 342840334
6179 342840334 341121140 347002996 357670195 362340390 360058991 359274866 353233745 347878761
6171 347878761 343607376 339703228 332218421 325027760 320803491 320806521 324212310 330282606
6163 330282606 339680793 339607579 341812503 351300327 355064668 351694285 347191004 349507012
6155 349507012 350920773 341926106 340903381 345101576 345773009 348004488 350144190 348545517
6147 348545517 345868791 348881930 356049304 362627632 362651727 360410972 358766042 355132020
6139 355132020 343623427 336969047 342026096 353842436 364008877 366267812 364737097 359012784
6131 359012784 354254671 344912028 347364582 360378192 363006016 360929165 364254998 373430700
$$ packed form
6187C61495570l998052q559707J909726K139221K121287M40447m430446q277712
6179C42840334j719194N881856J0667199M670195k281399p84125o041121n354984
6171C47878761m271385l904148p484807p190661m224269L030L405789O070296
6163C30282606R398187p3214K204924R487824L764341l370383m503281K316008
6155C49507012J413761q994667j022725M198195O71433K231479K139702j598673
6147C48545517k676726L013139P167374O578328K4095k240755j644930l634022
6139C55132020j1508593o654380N057049J1816340J0166441K258935j530715n724313
6131C59012784m758113r342643K452554J3013610K627824k076851L325833R175702
$$ plain form
6123 373430700 379560781 373511712 367365417 370552949 374136210 367164150 354324476 352700355
6115 352700355 352982291 349760304 347540214 344199876 347420750 353873956 352579274 348017664
6107 348017664 350289491 354014055 357561661 362641064 361843648 361767391 363512165 360092216
6099 360092216 357057222 357947983 360648443 363863316 365842059 366752652 366575785 368396586
6091 368396586 374471277 377967774 374663561 368929776 363502110 358306317 353003957 352043531
6083 352043531 354579890 357075024 361045734 365211702 372366575 373508939 374575481 378450367
6075 378450367 374164537 363031768 353162108 351521029 356372993 359312752 362457462 370351644
6067 370351644 371242038 363307035 361239883 361547377 361531766 362537243 366667810 367792926 376201122
$$ packed form
6123C73430700O130081o049069o146295L187532L583261o972060j2839674j624121
6115C52700355K81936l221987k220090l340338L220874O453206j294682m561610
6107C48017664K271827L724564L547606N079403p97416p6257J744774l419949
6099C60092216l034994Q90761K700460L214873J978743R10593j76867J820801
6091C68396586O074691L496497l304213n733785n427666n195793n302360r60426
6083C52043531K536359K495134L970710M165968P154873J142364J066542L874886
6075C78450367m285830j1132769r869660j641079M851964K939759L144710P894182
6067C70351644Q90394p935003k067152L07494j5611J005477M130567J125116Q408196
$$ plain form
6058 376201122 378440219 372824875 367284331 360818396 359792258 365508823 373445360 379484656
6050 379484656 380095920 383180225 389144322 394065174 399423282 404918383 413689117 420822490
6042 420822490 420614232 420538856 421720423 421862850 424071928 431448539 441465555 443349096
6034 443349096 450108430 460439703 465999578 478874461 490475593 497280100 512025829
6027 512025829 528626854 541450431 542688696 517713853 456107268 369175452 278720558
6020 278720558 196097913 138924680 114022948 113070261 123978606 137430152 153452721
6013 153452721 163606004 173150260 186235685 199434754 209988979 213947943 216234664
6006 216234664 225094755 235847215 238193174 237949212 239729375 241489018 245479722 254580840
$$ packed form
6058C76201122K239097n615344n540544o465935j026138N716565P936537O039296
6050C79484656O11264L084305N964097M920852N358108N495101Q770734P133373
6042D20822490k08258p5376J181567J42427K209078P376611J0017016J883541
6034D43349096O759334J0331273N559875J2874883J1601132O804507J4745729
6027E12025829J6601025J2823577J238265k4974843o1606585q6931816r0454894
6020B78720558q2622645n7173233k4901732r52687J0908345J3451546J6022569
6013A53452721J0153283R544256J3085425J3199069J0554225L958964K286721
6006B16234664Q860091J0752460K345959k43962J780163J759643L990704R101118
$$ plain form
5998 254580840 262723331 262336617 260825941 261535750 262688720 263786194 266277048 269376705
5990 269376705 275384676 277507416 273256475 269869304 267325323 277650817 292572124 300663131
5982 300663131 302668550 298253990 293455695 295128931 296535493 291737667 285786272 281589763
5974 281589763 283731189 279056905 277659719 283326338 288515137 298126375 304271228 301668014
5966 301668014 294704652 293962478 293811432 294545675 295051597 297276958 299682316 299916349 302029474
5957 302029474 309775710 315122978 307964400 296001463 299439260 310269070 314781833 317332706
5949 317332706 316359302 309787571 310127017 311875954 314325545 321353181 319291087 308845252
5941 308845252 303683600 307791119 312650786 315795949 319303187 321925375 325149261 328820892
$$ packed form
5998B54580840Q142491l86714j510676P09809J152970J097474K490854L099657
5990B69376705O007971K122740m250941l387171k543981J0325494J4921307Q091007
5982C00663131K005419m414560m798295J673236J406562m797826n951395m196509
5974B81589763K141426m674284j397186N666619N188799R611238O144853k603214
5966C01668014o963362p42174j51046P34243N05922K225361K405358K34033K113125
5957C02029474P746236N347268p158578j1962937L437797J0829810M512763K550873
5949C17332706r73404o571731L39446J748937K449591P027636k062094j0445835
5941C08845252n161652M107519M859667L145163L507238K622188L223886L671631
$$ plain form
5933 328820892 331138452 329423167 325244975 317679864 310828842 312732965 315015159 310550861
5925 310550861 296551537 289106160 291344092 289756495 289672368 294943375 298079619 302206399
5917 302206399 305474058 304544501 302650206 307556594 310724627 307693482 303437095 301679796
5909 301679796 305768379 309809068 309129699 314602148 324175954 324168768 321901294 328298485 335973656
5900 335973656 335266289 325302727 318060271 316785468 316101209 315757223 318819825 322315688
5892 322315688 322664531 321667048 320932374 318391325 314937974 317655628 317696588 313063350 313110624
5883 313110624 311588597 314177073 318566156 317456023 315466320 317871963 323412030 325610307
5875 325610307 328354194 335048244 333482278 327227653 328765250 332581459 339392232 347717470
$$ packed form
5933C28820892K317560j715285m178192p565111o851022J904123K282194m464298
5925C10550861j3999324p445377K237932j587597q4127N271007L136244M126780
5917C02206399L267659r29557j894295M906388L168033l031145m256387j757299
5909C01679796M088583M040689o79369N472449R573806p186k267474O397191P675171
5900C35973656p07367r963562p242456j274803o84259l43986L062602L495863
5892C22315688L48843r97483p34674k541049l453351K717654M0960m633238M7274
5883C13110624j522027K588476M389083j110133j989703K405643N540067K198277
5875C25610307K743887O694050j565966o254625J537597L816209O810773Q325238
$$ plain form
5867 347717470 351034590 344974069 336559648 336479510 337964624 340880068 342712500 345292917
5859 345292917 352313042 351925204 341332058 334921475 334814692 332633025 334582747 335478075
5851 335478075 338335409 352487088 369299734 378552223 381002858 377314229 374909902 375318886
5843 375318886 369732060 361495181 356943698 360078273 362346860 364591841 367810782 365682990
5835 365682990 364159555 365399151 373007238 380464061 381566003 385218765 393328571 399132635
5827 399132635 398343186 385757034 370913932 349957770 324122511 303115012 285439547
5820 285439547 278458110 273357335 267334747 265648116 272761658 279281221 275814836 270637280
5812 270637280 267385355 266551387 268497485 271724601 276684846 277347388 280710576 283706314
$$ packed form
5867C47717470L317120o060521q414421q0138J485114K915444J832432K580417
5859C45292917P020125l87838j0593146o410583j06783k181667J949722Q95328
5851C35478075K857334J4151679J6812646R252489K450635l688629k404327M08984
5843C75318886n586826q236879m551483L134575K268587K244981L218941k127792
5835C65682990j523435J239596P608087P456823J101942L652762Q109806N804064
5827C99132635p89449j2586152j4843102k0956162k5835259k1007499j7675465
5820B85439547o981437n100775o022588j686631P113542O519563l466385n177556
5812B70637280l251925q33968J946098L227116M960245O62542L363188K995738
$$ plain form
5804 283706314 287354562 281626276 274953109 273186311 268293326 274731154 283131200 285857878
5796 285857878 291659154 298547969 297804292 295784561 292202173 290659635 293751996 294304048
5788 294304048 294486678 294912674 300086324 306270108 305383409 301897569 302043714 299194626 296916376
5779 296916376 295018082 296151719 298685402 297292852 297128685 295252494 291777720 293687420
5771 293687420 295799105 292603581 291948835 292519772 296583393 304480976 304151594 303160164 309339617
5762 309339617 318039099 326309346 329584755 320740067 314614341 314237432 315205606 318627576
5754 318627576 324026168 322049290 316088135 313473467 312605398 309124464 306063495 307743998
5746 307743998 309067680 304703912 300220800 300246693 301324789 297679928 298455953 299814070
$$ packed form
5804B83706314L648248n728286o673167j766798m892985O437828Q400046K726678
5796B85857878N801276O888815p43677k019731l582388j542538L092361N52052
5788B94304048J82630M25996N173650O183784q86699l485840J46145k849088k278250
5779B96916376j898294J133637K533683j392550j64167j876191l474774J909700
5771B93687420K111685l195524o54746N70937M063621P897583l29382r91430O179453
5762C09339617Q699482Q270247L275409q844688o125726l76909R68174L421970
5754C18627576N398592j976878n961155k614668q68069l480934l060969J680503
5746C07743998J323682m363768m483112K5893J078096l644861P76025J358117
$$ plain form
5738 299814070 306679199 318990684 316951603 314088211 315379287 313028993 311471745 321200376
5730 321200376 327746599 323346261 317802140 313985089 311170385 309362695 313157148 323820131
5722 323820131 331825650 334329466 330411044 326985253 324552693 317378077 312149892 309319423
5714 309319423 311286742 312020551 309375841 314660770 327889520 334614195 332365597 323675835
5706 323675835 320478162 316197126 313070042 316091625 321823680 328078616 327581987 326182482
5698 326182482 324569029 326326762 330111783 324370464 321844170 322353896 322461501 322294997
5690 322294997 316139317 312172964 314563597 316046922 316423137 322541547 328520131 331215879
5682 331215879 331711843 327085377 322376886 319713945 317298652 317557340 316177498 317935157
$$ packed form
5738B99814070O865129J2311485k039081k863392J291076k350294j557248R728631
5730C21200376O546223m400338n544121l817051k814704j807690L794453J0662983
5722C23820131Q005519K503816l918422l425791k432560p174616n228185k830469
5714C09319423J967319P33809k644710N284929J3228750O724675k248598q689762
5706C23675835l197673m281036l127084L021583N732055O254936m96629j399505
5698C26182482j613453J757733L785021n741319k526294N09726J07605j66504
5690C22294997o155680l966353K390633J483325L76215O118410N978584K695748
5682C31215879M95964m626466m708491k662941k415293K58688j379842J757659
$$ plain form
5674 317935157 320589449 322767730 324856577 326068549 324404345 321932354 317509947 315627975
5666 315627975 312868270 308999471 314555062 323539831 329674971 329748851 330063579 328475614
5658 328475614 325987286 327764104 327832586 320776096 320871031 329318804 326236782 318542143 314350995
5649 314350995 318266158 323364226 327032768 324984874 324383756 326689880 326433957 319099099
5641 319099099 306866183 303882978 310526494 322237930 330551260 332643353 327970060 328372417
5633 328372417 332495295 329773921 324282168 325631026 328495552 321020077 313777553 311693746
5625 311693746 315999930 321964641 321069592 318383655 324403660 324126612 319887891 316128026
5617 316128026 310761128 308994703 310534519 315233536 314101340 316165259 320113370 323451677
$$ packed form
5674C17935157K654292K178281K088847J211972j664204k471991m422407j881972
5666C15627975k759705l868799N555591Q984769O135140P3880L14728j587965
5658C28475614k488328J776818O8482p056490R4935Q447773l082022p694639m191148
5649C14350995L915163N098068L668542k047894o01118K306124k55923p334858
5641C19099099j2232916k983205O643516J1711436Q313330K092093m673293M02357
5633C28372417M122878k721374n491753J348858K864526p475475p242524k083807
5625C11693746M306184N964711q95049k685937O020005k77048m238721l759865
5617C16128026n366898j766425J539816M699017j132196K063919L948111L338307
$$ plain form
5609 323451677 335506902 346713304 357772374 364274805 363807653 360978378 355146898 351870578
5601 351870578 353927499 350252463 339279017 331552243 325530798 324573805 330548244 334955202
5593 334955202 339527270 347410245 353798758 348831927 347097339 353496163 354263487 353676286
5585 353676286 355334278 352426628 349094765 358075502 366156662 363643457 361649408 367403249
5577 367403249 376032984 383667890 393706578 405359230 410333191 409825455 413882314 417640432
5569 417640432 410534397 401445216 397495627 390144036 375069786 351745526 324927021 298543215
5561 298543215 282806880 275747560 269116498 266160695 264729297 257231802 254738769 256418351
5553 256418351 260013493 271182394 285940816 288825292 286193758 282992926 276533467 275345648
$$ packed form
5609C23451677J2055225J1206402J1059070O502431m67152k829275n831480l276320
5601C51870578K056921l675036j0973446p726774o021445r56993N974439M406958
5593C34955202M572068P882975O388513m966831j734588O398824P67324n87201
5585C53676286J657992k907650l331863Q980737Q081160k513205j994049N753841
5577C67403249Q629735P634906J0038688J1652652M973961n07736M056859L758118
5569D17640432p106035r089181l949589p351591j5074250k3324260k6818505k6383806
5561B98543215j5736335p059320o631062k955803j431398p497495k493033J679582
5553B56418351L595142J1168901J4758422K884476k631534l200832o459459j187819
$$ plain form
5545 275345648 276315188 278749084 281290565 276224434 271899902 276419682 282809146 287582119
5537 287582119 290355697 287176656 285201608 287342801 288340036 288072257 294131478 298540529
5529 298540529 296851126 293021609 293412339 296637580 300067157 299774966 300674775 297959225
5521 297959225 299954794 308016962 310574816 315073860 315636437 312026970 311078462 318937262
5513 318937262 328113474 329581216 324550908 318566304 312460594 315270557 318381204 320439321
5505 320439321 318460285 313336562 310895580 304169757 302303886 304644440 305485180 312930084
5497 312930084 325726688 323341347 317423492 315393591 315749713 314393151 320535390 329207386
5489 329207386 326670866 322944309 325810463 329466360 330968539 331653655 327305558 318499926
$$ packed form
5545B75345648R69540K433896K541481n066131m324532M519780O389464M772973
5537B87582119K773578l179041j975048K141193R97235k67779O059221M409051
5529B98540529j689403l829517L90730L225241L429577k92191Q99809k715550
5521B97959225J995569Q062168K557854M499044N62577l609467r48508P858800
5513C18937262R176212J467742n030308n984604o105710K809963L110647K058117
5505C20439321j979036n123723k440982o725823j865871K340554Q40740P444904
5497C12930084J2796604k385341n917855k029901L56122j356562O142239Q671996
5489C29207386k536520l726557K866154L655897J502179O85116m348097q805632
$$ plain form
5481 318499926 318359847 327355663 333869502 326561474 317992622 312422279 310160511 309605632
5473 309605632 311607072 313332645 311642569 302409386 297865080 302044053 305352864 313169410
5465 313169410 324635016 327970706 327771502 327597057 323318656 317551540 311823203 306777205
5457 306777205 303033529 304227510 301467929 298940732 300579525 300697969 305080726 311759204
5449 311759204 317409376 320431425 317877144 315542373 312601624 316798231 319086200 314741855
5441 314741855 316461328 323055339 323531915 318339816 318397013 325470109 329375663 326154233
5433 326154233 320112915 313076164 312049315 314669619 320567312 320434263 316529609 323064378
5425 323064378 334502191 346041063 352710437 349371248 346197472 341185023 331687669 326004759
$$ packed form
5481C18499926j40079Q995816O513839p308028q568852n570343k261768n54879
5473C09605632K001440J725573j690076r233183m544306M178973L308811P816546
5465C13169410J1465606L335690j99204j74445m278401n767116n728337n045998
5457C06777205l743676J193981k759581k527197J638793J18444M382757O678478
5449C11759204N650172L022049k554281k334771k940749M196607K287969m344345
5441C14741855J719473O594011M76576n192099N7197P073096L905554l221430
5433C26154233o041318p036751j026849K620304N897693j33049l904654O534769
5425C23064378J1437813J1538872O669374l339189l173776n012449r497354n682910
$$ plain form
5417 326004759 325365132 332324830 330980218 323394402 322795448 322705475 315635602 317232549 324842445
5408 324842445 325771251 322510098 320138217 317333149 318966617 320018411 319137011 315946753
5400 315946753 312609543 309624849 314656647 323710088 323069528 317553803 319747852 320619838
5392 320619838 323955151 331752836 326576512 320101928 323554328 325360578 329373278 333247294
5384 333247294 334071032 329202891 331716215 339216551 340492987 338037004 330131038 317636363
5376 317636363 317666967 323934516 325787416 326976907 318949771 310055266 311317399 319184642
5368 319184642 318837469 313561107 314903828 314897770 314971403 316794212 317340920 320790938 327232989
5359 327232989 324904069 318227015 319333082 323050305 325499315 333878169 338724535 333379758
$$ packed form
5417C26004759o39627O959698j344612p585816n98954q9973p069873J596947P609896
5408C24842445R28806l261153k371881k805068J633468J051794q81400l190258
5400C15946753l337210k984694N031798R053441o40560n515725K194049Q71986
5392C20619838L335313P797685n176324o474584L452400J806250M012700L874016
5384C33247294Q23738m868141K513324P500336J276436k455983p905966j2494675
5376C17636363L0604O267549J852900J189491q027136q894505J262133P867243
5368C19184642l47173n276362J342721o058P3633J822809N46708L450018O442051
5359C27232989k328920o677054J106067L717223K449010Q378854M846366n344777
$$ plain form
5351 333379758 327324747 324214289 324299175 325652839 324020809 323715416 321414305 322281769 322268486
5342 322268486 324624447 325077502 320053909 316940659 318099230 321455781 317887015 315849842
5334 315849842 321457350 322350235 327515474 333826140 332583218 330411142 325201419 323701728
5326 323701728 325892789 327943290 323706208 316728279 313504953 314012516 315137654 314237823
5318 314237823 313218443 314069253 322182722 321847887 317864789 321298450 323161591 325895839
5310 325895839 331735947 338059041 343232701 341379744 338351606 339122214 333638592 329890455
5302 329890455 333838182 335446726 332455967 332178812 336082527 333487293 324011008 327923582
5294 327923582 328478743 323850109 319113972 311375433 310012950 313533252 321007534 322559901
$$ packed form
5351C33379758o055011l110458Q4886J353664j632030l05393k301111Q67464j3283
5342C22268486K355961M53055n023593l113250J158571L356551l568766k037173
5334C15849842N607508Q92885N165239O310666j242922k172076n209723j499691
5326C23701728K191061K050501m237082o977929l223326N07563J125138q99831
5318C14237823j019380Q50810Q113469l34835l983098L433661J863141K734248
5310C25895839N840108O323094N173660j852957l028138P70608n483622l748137
5302C29890455L947727J608544k990759k77155L903715k595234r476285L912574
5294C27923582N55161m628634m736137p738539j362483L520302P474282J552367
$$ plain form
5286 322559901 315087033 307355598 314375753 327006938 327941169 330031485 333484504 335718644
5278 335718644 338495851 344373545 346998401 339290560 331482358 328903944 327836641 329649615
5270 329649615 338709111 341770598 345122630 344261254 337770275 328641017 317468416 309049263
5262 309049263 310021270 315357406 312366430 308273576 309897688 317272250 317655519 315772318
5254 315772318 320174772 323205453 318151399 310867570 313271399 316001863 318539549 318223990
5246 318223990 323034628 325754966 324972356 323696816 322184290 324755958 331554959 335518163
5238 335518163 334345087 335427015 341974662 341810577 331078120 319414935 316273751 326957893
5230 326957893 331787564 327572236 332102494 340870233 334431934 328702464 330480309 334416842
$$ packed form
5286C22559901p472868p731435P020155J2631185R34231K090316L453019K234140
5278C35718644K777207N877694K624856p707841p808202k578414j067303J812974
5270C29649615R059496L061487L352032q61376o490979r129258j1172601q419153
5262C09049263R72007N336136k990976m092854J624112P374562L83269j883201
5254C15772318M402454L030681n054054p283829K403829K730464K537686l15559
5246C18223990M810638K720338p82610j275540j512526K571668O799001L963204
5238C35518163j173076J081928O547647j64085j0732457j1663185l141184J0684142
5230C26957893M829671m215328M530258Q767739o438299n729470J777845L936533
$$ plain form
5222 334416842 338605458 339019798 336691536 335029194 335419171 335261097 335424660 333074949 330620380
5213 330620380 330100702 330910722 328311728 327416544 330112546 330553735 332624836 335679134 333373874
5204 333373874 332030160 334694283 342100151 347905776 351896052 350567819 347717909 344786555
5196 344786555 341483156 338146986 334559851 344707864 352662648 347481493 342905757 337302504
5188 337302504 330923285 336938146 347302156 351515804 354364084 359087121 356069263 353200526
5180 353200526 351668153 349421895 350483200 352373493 351626259 351478316 350906441 350063937 354767192
5171 354767192 353850292 350786232 352363791 353617896 355011524 347053401 344361695 349645050
5163 349645050 354470553 357779618 366873364 372188447 370597076 368026892 371789538 376651075
$$ packed form
5222C34416842M188616M14340k328262j662342L89977j58074J63563k349711k454569
5213C30620380n19678Q10020k598994q95184K696002M41189K071101L054298k305260
5204C33373874j343714K664123P405868N805625L990276j328233k849910k931354
5196C44786555l303399l336170l587135J0148013P954784n181155m575736n603253
5188C37302504o379219O014861J0364010M213648K848280M723037l017858k868737
5180C53200526j532373k246258J061305J890293p47234j47943n71875q42504M703255
5171C54767192r16900l064060J577559J254105J393628p958123k691706N283355
5163C49645050M825503L309065R093746N315083j591371k570184L762646M861537
$$ plain form
5155 376651075 371595207 366917345 373693821 378196028 380031985 378145440 374948197 371178327
5147 371178327 367148135 367139028 366745913 363029587 361565578 366827399 366879036 359694729 359402798
5138 359402798 371955500 374696555 366764473 362297321 362495342 361708414 361966363 368937639
5130 368937639 375931584 382752162 382621781 378452808 381712998 392210234 403991069 410613498
5122 410613498 410306969 411164096 411132719 411160511 410763953 408382568 403647639 405451530 412093090
5113 412093090 425326427 438529193 456067285 469923966 475150438 481628145 484388437
5106 484388437 479804372 453200422 401222034 339638534 298408545 284165238 282541676
5099 282541676 288198137 293707926 298143487 311931540 329912038 342656635 351520736 367853143
$$ packed form
5155C76651075n055868m677862O776476M502207J835957j886545l197243l769870
5147C71178327m030192r107l93115l716326j464009N261821N1637p184307k91931
5138C59402798J2552702K741055p932082m467152J98021p86928K57949O971276
5130C68937639O993945O820578j30381m168973L260190J0497236J1780835O622429
5122D10613498l06529Q57127l1377K7792l96558k381385m734929J803891O641560
5113D12093090J3233337J3202766J7538092J3856681N226472O477707K760292
5106D84388437m584065k6603950n1978388o1583500m1229989j4243307j623562
5099B82541676N656461N509789M435561J3788053J7980498J2744597Q864101J6332407
$$ plain form
5091 367853143 384477381 392460285 390238333 367578538 322557421 261192719 207400283
5084 207400283 185257563 184423760 189682112 194523169 206542580 212803842 217037220 225883056
5076 225883056 225097482 229407848 235379600 240275421 243370281 245436119 253414564 259999021
5068 259999021 258942634 255190142 250231585 253948988 260190168 269322269 275097067 278609966
5060 278609966 282678248 285397235 280763620 278674556 274429706 272647846 270884900 269527267
5052 269527267 271517180 269721976 267361676 264531641 268069031 278783919 286751534 292662860
5044 292662860 294870348 294173494 295959816 302812111 306254816 301248650 296252792 297822399
5036 297822399 300714417 301016851 296649423 296721917 303008775 312072312 316317631 316179811 314641768
$$ packed form
5091C67853143J6624238P982904k221952k2659795m5021117o1364702n3792436
5084B07400283k2142720q33803N258352M841057J2019411O261262M233378Q845836
5076B25883056p85574M310366N971752M895821L094860K065838P978445O584457
5068B59999021j056387l752492m958557L717403O241180R132101N774798L512899
5060B78609966M068282K718987m633615k089064m244850j781860j762946j357633
5052B69527267J989913j795204k360300k830035L537390J0714888P967615N911326
5044B92662860K207488o96854J786322O852295L442705n006166m995858J569607
5036B97822399K892018L02434m367428P2494O286858R063537M245319j37820j538043
$$ plain form
5027 314641768 306651845 298725509 296826641 303807284 306070060 305713467 315361686 322387916
5019 322387916 321945955 327295335 327845623 325373251 327462856 328069647 325242036 326752475
5011 326752475 329935496 328946251 324859371 313369122 305603898 314565663 315495144 309850686
5003 309850686 309422776 315134736 320616326 325914650 332926612 331597689 322000394 312852059
4995 312852059 310096077 308169621 305175712 302583463 301334283 302595834 306553214 316545626
4987 316545626 324438860 320797162 314572822 313045380 309966106 308641816 304785426 306251993
4979 306251993 311977213 314495906 315423811 316089290 313945559 313010847 317805315 328299652
4971 328299652 329501370 328169327 328710701 324824948 316885944 312794659 311593697 319461120
$$ packed form
5027C14641768p989923p926336j898868O980643K262776l56593R648219P026230
5019C22387916m41961N349380N50288k472372K089605O06791k827611J510439
5011C26752475L183021r89245m086880j1490249p765224Q961765R29481n644458
5003C09850686m27910N711960N481590N298324P011962j328923r597295r148335
4995C12852059k755982j926456k993909k592249j249180J261551L957380R992412
4987C16545626P893234l641698o224340j527442l079274j324290l856390J466567
4979C06251993N725220K518693R27905O65479k143731r34712M794468J0494337
4971C28299652J201718j332043N41374l885753p939004m091285j200962P867423
$$ plain form
4963 319461120 322298352 320803085 319318820 318570379 321678296 326410756 324324996 321189405
4955 321189405 324930846 333293917 335756499 333977530 328452915 324077744 327022620 332628709
4947 332628709 338304881 337807658 331820161 322626740 312752997 307047810 308832267 313536376
4939 313536376 317419001 327123433 332424563 330807217 331136399 328704751 326915799 325690075
4931 325690075 319755587 315839166 319322835 324700466 327200829 326373441 321640520 315262560
4923 315262560 319404639 324281158 327161271 331714619 329271065 326804942 327633134 330369539
4915 330369539 335048232 328240822 315638019 314064074 316942598 320000740 321896171 331025029
4907 331025029 339381681 337138730 327990738 319489886 313259286 310741168 307459911 309774885
$$ packed form
4963C19461120K837232j495267j484265p48441L107917M732460k085760l135591
4955C21189405L741441Q363071K462582j778969n524615m375171K944876N606089
4947C32628709N676172m97223n987497r193421r873743n705187J784457M704109
4939C13536376L882625R704432N301130j617346L29182k431648j788952j225724
4931C25690075n934488l916421L483669N377631K500363q27388m732921o377960
4923C15262560M142079M876519K880113M553348k443554k466123Q28192K736405
4915C30369539M678693o807410j2602803j573945K878524L058142J895431R128858
4907C31025029Q356652k242951r147992q500852o230600k518118l281257K314974
$$ plain form
4899 309774885 318313819 323234711 326597614 327649254 335477089 341857031 343246476 342304802
4891 342304802 338433292 331469833 328151376 323515292 311805535 307086765 312720204 324402258
4883 324402258 332510485 334296369 338077437 339108336 336559735 337871412 335062638 326949378
4875 326949378 322394557 323175002 328678536 331098064 333127959 336880272 340378855 349033487
4867 349033487 351305537 344838778 348984823 354673281 359186530 363219839 359020630 347542856
4859 347542856 337749027 329906227 323079820 321819436 331018603 339406355 342466118 338926975
4851 338926975 340326642 350728132 359709924 365299890 366235917 362897096 358254284 351216957
4843 351216957 340576449 334519382 339067318 344342071 335970703 324866915 327254135 336788473
$$ packed form
4899C09774885Q538934M920892L362903J051640P827835O379942J389445r41674
4891C42304802l871510o963459l318457m636084j1709757m718770N633439J1682054
4883C24402258Q108227J785884L781068J030899k548601J311677k808774q113260
4875C26949378m554821P80445N503534K419528K029895L752313L498583Q654632
4867C49033487K272050o466759M146045N688458M513249M033309m199209j1477774
4859C47542856r793829p842800o826407j260384R199167Q387752L059763l539143
4851C38926975J399667J0401490Q981792N589966R36027l338821m642812p037327
4843C51216957j0640508o057067M547936N274753q371368j1103788K387220R534338
$$ plain form
4835 336788473 350767203 361190344 358892277 350872050 345840145 346050640 353261022 360227536
4827 360227536 368960326 372318949 371623355 373803743 373999349 372448216 371290980 367358251
4819 367358251 366609837 372226314 376400307 384779990 391245026 398366539 406127241 411361654
4811 411361654 408453576 408878222 417838738 421232435 419155467 413524908 411715527 413917702
4803 413917702 421020758 430945155 443423799 456892611 463489214 469325508 463305456 426550336
4795 426550336 370802293 322070480 294782833 291637593 297777787 302875935 307477791 312620338
4787 312620338 322117781 334619367 356268749 372019405 369216190 344170346 296518181
4780 296518181 233471985 186567465 173516587 173892829 177575420 184745095 197432528 212376355
$$ packed form
4835C36788473J3978730J0423141k298067q020227n031905K10495P210382O966514
4827C60227536Q732790L358623o95594K180388J95606j551133j157236l932729
4819C67358251p48414N616477M173993Q379683O465036P121513P760702N234413
4811D11361654k908078M24646Q960516L393697k076968n630559j809381K202175
4803D13917702P103056R924397J2478644J3468812O596603N836294o020052l6755120
4795D26550336n5748043m8731813k7287647l145240O140194N098148M601856N142547
4787C12620338R497443J2501586K1649382J5750656k803215k5045844m7652165
4780B96518181o3046196m6904520j3050878L76242L682591P169675J2687433J4943827
$$ plain form
4772 212376355 224455759 231512788 234241136 236067415 237303583 237174709 240292921 238971182
4764 238971182 238238461 249360657 258427250 259036394 264579897 270751375 273792982 273215732
4756 273215732 271096189 270370417 270699239 271114406 273909396 276166589 278626605 276032771
4748 276032771 273212595 275719042 280929825 284317440 284462854 278483405 278499292 280827096
4740 280827096 279679152 284994513 288558250 283186351 281974551 283872589 283848206 287356321
4732 287356321 287203937 282875350 281592437 279607576 276387717 277265886 281319473 283046655
4724 283046655 289676763 292954757 290502353 286719576 283750478 277202993 263265261 255887170
4716 255887170 257403981 267408218 283530196 287700584 280065169 272728720 274724856 285306043
$$ packed form
4772B12376355J2079404P057029K728348J826279J236168j28874L118212j321739
4764B38971182p32721J1122196R066593O09144N543503O171478L041607n77250
4756B73215732k119543p25772L28822M15167K794990K257193K460016k593834
4748B76032771k820176K506447N210783L387615J45414n979449J5887K327804
4740B80827096j147944N315361L563737n371899j211800J898038k4383L508115
4732B87356321j52384m328587j282913j984861l219859Q78169M053587J727182
4724B83046655O630108L277994k452404l782777k969098o547485j3937732p378091
4716B55887170J516811J0004237J6121978M170388p635415p336449J996136J0581187
$$ plain form
4708 285306043 285095424 280384532 282153923 293563076 295854615 293739749 297823605 299948043
4700 299948043 298864763 298720299 295632901 293106159 294804316 292745352 289946264 296629685
4692 296629685 305999416 307823986 302882975 302458318 304203111 305085902 303625717 302725018
4684 302725018 305142403 304583718 301182831 299468154 302120002 306373749 299991579 294207770
4676 294207770 292435542 292351053 292992479 299344140 310113526 308742583 301614778 301988305
4668 301988305 303691293 306288098 307210718 308094365 302380905 296047371 298597613 299868565
4660 299868565 298363672 294338302 295304632 302551135 308352905 306384950 306314036 306411797 308920318
4651 308920318 312918626 311513314 305272070 300043172 294353693 291071554 297727881 306219768
$$ packed form
4708B85306043k10619m710892J769391J1409153K291539k114866M083856K124438
4700B99948043j083280j44464l087398k526742J698157k058964k799088O683421
4692B96629685R369731J824570m941011m24657J744793Q82791j460185r00699
4684C02725018K417385n58685l400887j714677K651848M253747o382170n783809
4676B94207770j772228q4489O41426O351661J0769386j370943p127805L73527
4668C01988305J702988K596805R22620Q83647n713460o333534K550242J270952
4660B99868565j504893m025370R66330P246503N801770j967955p0914R7761K508521
4651C08920318L998308j405312o241244n228898n689479l282139O656327Q491887
$$ plain form
4643 306219768 306432083 303353639 305962483 310193069 312698871 309651460 304902661 308488400
4635 308488400 313932491 313801066 307637253 305326113 307071583 310676497 315151624 314961194
4627 314961194 319489698 320375713 313789532 310886790 312742127 312448538 317567869 324996424
4619 324996424 325564754 321184397 321967883 326135397 328550018 331894815 332386515 336800650
4611 336800650 338129200 337413836 333926358 331458626 330432200 323038494 315485706 315817743
4603 315817743 316493501 318901495 317501885 308197712 301997015 300210415 296323452 296754411
4595 296754411 299609191 300545611 302608816 308426511 308519349 303949973 306713041 309183028
4587 309183028 315440547 327417870 330417566 319226595 312687306 320428314 327190491 333961116
$$ packed form
4643C06219768K12315l078444K608844M230586K505802l047411m748799L585739
4635C08488400N444091j31425o163813k311140J745470L604914M475127j90430
4627C14961194M528504Q86015o586181k902742J855337k93589N119331P428555
4619C24996424N68330m380357P83486M167514K414621L344797M91700M414135
4611C36800650J328550p15364l487478k467732j026426p393706p552788L32037
4603C15817743O75758K407994j399610r304173o200697j786600l886963M30959
4595B96754411K854780R36420K063205N817695R2838m569376K763068K469987
4587C09183028O257519J1977323K999696j1190971o539289P741008O762177O770625
$$ plain form
4579 333961116 336597223 332900881 323807734 314163906 310742683 312812750 320559529 323054556
4571 323054556 318710422 319785896 318503305 317408869 323109817 322885733 318535244 315617283
4563 315617283 321988408 318943323 308187281 297185628 280667242 276842552 285059159 292570327
4555 292570327 295716588 295914014 298637908 291384614 284668858 283823932 285694278 287897143
4547 287897143 284234305 275488664 273329558 277959120 288206676 302163268 312562600 320797432
4539 320797432 322907386 320574470 317907676 317915082 315686065 313127552 314598865 315264194 311635516
4530 311635516 312530854 318888726 317684616 312968656 309158719 311041795 313373296 312234000
4522 312234000 314574806 316300366 315119313 315585228 316404293 311488453 308327314 306590216
$$ packed form
4579C33961116K636107l696342r093147r643828l421223K070067P746779K495027
4571C23054556m344134J075474j282591j094436N700948k24084m350489k917961
4563C15617283O371125l045085j0756042j1001653j6518386l824690Q216607P511168
4555B92570327L146261J97426K723894p253294o715756q44926J870346K202865
4547B87897143l662838q745641k159106M629562J0247556J3956592J0399332Q234832
4539C20797432K109954k332916k666794P406k229017k558513J471313O65329l628678
4530C11635516Q95338O357872j204110m715960l809937J883076K331501j139296
4522C12234000K340806J725560j181053M65915Q19065m915840l161139j737098
$$ plain form
4514 306590216 305419641 305344872 307265065 308082225 306232486 305830427 306858809 306088839 305765096
4505 305765096 310141324 315605648 327212940 337852034 339230832 340582332 335562317 333254484
4497 333254484 331932135 328829959 328337894 319622368 309392249 304825870 307978632 313519442
4489 313519442 316030177 313598877 307827319 306872831 311939647 316739514 320863103 321006869
4481 321006869 317445835 318517897 315515740 314665837 320177117 317399012 313117802 313991504
4473 313991504 316414831 316937705 314765568 315987825 322418335 324041585 323233884 319228150
4465 319228150 312708775 308405351 308722493 308863218 311167254 315434833 320681488 330936492
4457 330936492 338265219 336614324 325352406 315496935 311016932 318264461 326392217 326564383
$$ packed form
4514C06590216j170575p4769J920193Q17160j849739m02059J028382p69970l23743
4505C05765096M376228N464324J1607292J0639094J378798J351500n020015k307833
4497C33254484j322349l102176m92065q715526j0230119m566379L152762N540810
4489C13519442K510735k431300n771558r54488N066816M799867M123589J43766
4481C21006869l561034J072062l002157q49903N511280k778105m281210Q73702
4473C13991504K423327N22874k172137J222257O430510J623250q07701m005734
4465C19228150o519375m303424L17142J40725K304036M267579N246655J0255004
4457C30936492P328727j650895j1261918r855471m480003P247529Q127756J72166
$$ plain form
4449 326564383 326764362 327994768 328903265 327240055 323673593 322454391 319324157 315953656
4441 315953656 312377376 306104780 300666510 305354471 315468579 323140998 327052373 329938238
4433 329938238 329233984 317797385 314320879 318866131 323514874 323962777 326206091 334682478
4425 334682478 334198989 326190877 322116793 322656523 326430323 326537076 322573922 319448763
4417 319448763 316111590 317745207 317536377 311200414 313550596 320870013 320198880 319524223
4409 319524223 318617639 310211648 311528566 320027762 327204279 327909546 323606595 320694137
4401 320694137 320693888 318496291 316487574 317379727 315178675 317404821 323542093 325855573 318879802
4392 318879802 311639828 312222491 320362997 325656958 329310223 329845002 327487128 326786004
$$ packed form
4449C26564383J99979J230406R08497j663210l566462j219202l130234l370501
4441C15953656l576280o272596n438270M687961J0114108P672419L911375K885865
4433C29938238p04254j1436599l476506M545252M648743M47903K243314Q476387
4425C34682478m83489q008112m074084N39730L773800J06753l963154l125159
4417C19448763l337173J633617k08830o335963K350182P319417o71133o74657
4409C19524223r06584q405991J316918Q499196P176517P05267m302951k912458
4401C20694137k49k197597k008717Q92153k201052K226146O137272K313480o975771
4392C18879802p239974N82663Q140506N293961L653265N34779k357874p01124
$$ plain form
4384 326786004 320822656 319550414 320615513 323490277 327080707 329220422 324059280 320516770
4376 320516770 318998107 315967309 314625193 310805992 311402332 312155461 314535988 323608772
4368 323608772 325328825 317053727 310275861 310297559 314018662 312213173 316144472 322988195
4360 322988195 321430330 313197634 310885766 318446494 321309527 320148681 323095865 325530997
4352 325530997 321430478 319204229 318568322 317410153 317955300 319527508 321732898 320337086
4344 320337086 325399555 327330908 328573678 321064308 309326286 309504236 307268309 309205218
4336 309205218 313384879 318718854 321246567 323326672 319947205 314647494 311186223 316751854
4328 316751854 322435746 321921738 323535226 331073477 334151494 333721430 326647843 320934783
$$ packed form
4384C26786004n963348j272242J065099K874764L590430K139715n161142l542510
4376C20516770j518663l030798j342116l819201N96340P53129K380527R072784
4368C23608772J720053q275098o777866K1698L721103j805489L931299O843723
4360C22988195j557865q232696k311868P560728K863033j160846K947184K435132
4352C25530997m100519k226249o35907j158169N45147J572208K205390j395812
4344C20337086N062469J931353J242770p509370j1738022J77950k235927J936909
4336C09205218M179661N333975K527713K080105l379467n299711l461271N565631
4328C16751854N683892n14008J613488P538251L078017m30064p073587n713060
$$ plain form
4320 320934783 320391432 326626527 328940420 328402159 327940603 321110767 317336050 316901665 316972969
4311 316972969 313605948 311966724 310329822 314400267 325406101 338869270 343175371 343946435
4303 343946435 342325472 337334637 331735213 331017201 329417956 329857302 334667157 337505437
4295 337505437 329313081 327620159 326359131 318698510 312828224 309832439 308107829 308985038
4287 308985038 310354571 316106786 320920074 318346946 318986229 328465645 335412196 332287048
4279 332287048 327497412 326746380 326695684 319291959 318782556 325415480 329586746 326780577 321872505
4270 321872505 320913898 318341868 315175768 317272124 319408563 318386307 319719644 318966330
4262 318966330 315372627 313379618 317667702 318953710 318240223 316967056 315272050 322407261
$$ packed form
4320C20934783n43351O235095K313893n38261m61556o829836l774717m34385P1304
4311C16972969l367021j639224j636902M070445J1005834J3463169M306101P71064
4303C43946435j620963m990835n599424p18012j599245M39346M809855K838280
4295C37505437q192356j692922j261028p660621n870286k995785j724610Q77209
4287C08985038J369533N752215M813288k573128O39283R479416O946551l125148
4279C32287048m789636p51032n0696p403725n09403O632924M171266k806169m908072
4270C21872505r58607k572030l166100K096356K136439j022256J333337p53314
4262C18966330l593703j993009M288084J286008p13487j273167j695006P135211
$$ plain form
4254 322407261 330133023 327621613 320074586 317300356 315395403 316111707 323268549 323349733
4246 323349733 323657709 329862087 333922029 333197790 328159984 323802167 320420545 314937620
4238 314937620 309988761 306757538 316087928 324929869 320551868 317715852 319035708 322819952
4230 322819952 322248112 315492036 313531327 312678658 318099617 322554614 317466498 313352891
4222 313352891 312382283 315432173 318085089 322704923 327815616 332439969 334522135 334552112
4214 334552112 330357904 330428792 332987741 330744109 333396148 340260995 339866077 333192276
4206 333192276 328884071 328631760 325111257 318937579 312776217 308519530 315917105 323976168
4198 323976168 326046204 327067784 326792662 325609561 326096213 323644621 314758920 306836452
$$ packed form
4254C22407261P725762k511410p547027k774230j904953P16304P156842Q1184
4246C23349733L07976O204378M059942p24239n037806m357817l381622n482925
4238C14937620m948859l231223R330390Q841941m378001k836016J319856L784244
4230C22819952n71840o756076j960709q52669N420959M454997n088116m113607
4222C13352891r70608L049890K652916M619834N110693M624353K082166K9977
4214C34552112m194208P0888K558949k243632K652039O864847l94918o673801
4206C33192276m308205k52311l520503o173678o161362m256687P397575Q059063
4198C23976168K070036J021580k75122j183101M86652k451592q885701p922468
$$ plain form
4190 306836452 301332040 302477930 304335823 307378454 311348553 311517199 319098394 322910804
4182 322910804 321817857 322014549 325877929 332865900 335454458 338081188 337319242 334593943
4174 334593943 335005611 333707305 337893674 336970744 333232219 330688764 325628147 326240940
4166 326240940 327305220 327639035 330879523 339181215 342601313 335161471 329413010 330384622
4158 330384622 330350664 331845534 331521296 335113810 338897547 339092429 335451107 327347003 323698539
4149 323698539 320243990 319930290 321163692 319024186 316205225 317421055 320196655 318249542
4141 318249542 312884951 312607161 319890690 329064469 333258458 335259983 331309201 328196911
4133 328196911 320281823 305632612 303041601 312806899 326596379 335397633 334120528 336484317
$$ packed form
4190C06836452n504412J145890J857893L042631L970099J68646P581195L812410
4182C22910804j092947J96692L863380O987971K588558K626730p61946k725299
4174C34593943M11668j298306M186369r22930l738525k543455n060617O12793
4166C26240940J064280L33815L240488Q301692L420098p439842n748461R71612
4158C30384622l3958J494870l24238L592514L783737J94882l641322q104104l648464
4149C23698539l454549l13700J233402k139506k818961J215830K775600j947113
4141C18249542n364591k77790P283529R173779M193989K001525l950782l112290
4133C28196911p915088j4649211k591011R765298J3789480Q801254j277105K363789
$$ plain form
4125 336484317 341286178 337057703 336648996 336218550 335592335 331699064 333714240 339671179
4117 339671179 339950094 335252243 328287032 324883384 321071669 316155789 321968475 327927673
4109 327927673 325698955 327659830 333570465 332598583 327790899 330061916 334242461 338839542
4101 338839542 346179105 346778300 341974671 336463684 329474598 325802443 325290912 325112077
4093 325112077 325776707 320429866 314202740 309129347 308921323 307536418 308329372 316108323
4085 316108323 321769211 328815154 328967430 323600842 318007201 323888146 322085255 321488322
4077 321488322 327651989 330314420 331198444 336169446 341254619 341137885 341186217 337814825 337815746
4068 337815746 339241495 341944064 339268870 331983304 325981408 316246973 306865658 315866075
$$ packed form
4125C36484317M801861m228475m08707m30446o26215l893271K015176N956939
4117C39671179K78915m697851o965211l403648l811715m915880N812686N959198
4109C27927673k228718J960875N910635r71882m807684K271017M180545M597081
4101C38839542P339563N99195m803629n510987o989086l672155n11531j78835
4093C25112077O64630n346841o227126n073393k08024j384905P92954P778951
4085C16108323N660888P045943J52276n366588n593641N880945j802891n96933
4077C21488322O163667K662431Q84024M971002N085173j16734M8332l371392R21
4068C37815746J425749K702569k675194p285566o001896r734435r381315R000417
$$ plain form
4060 315866075 325730006 327706826 327667871 321371495 314929941 317456947 318842553 315425654
4052 315425654 315557419 320286618 323864588 325626344 330221565 330186649 324903260 319864099
4044 319864099 322090804 325715671 327437173 327470902 325943083 325533748 330279886 329101009
4036 329101009 324189641 326692924 329445904 324584070 323650730 324790314 319187777 313669021
4028 313669021 310391481 313100438 320590852 325786748 322278279 317634309 318703677 323367086
4020 323367086 319389015 311630578 311704683 316348276 323570172 322644785 315188930 306504972
4012 306504972 303071004 302390015 303361255 309621619 309805427 307392642 307818257 316422412 323883193
4003 323883193 324706259 323746997 326587801 334524925 338283720 333116090 327370647 331298235
$$ packed form
4060C15866075R863931J976820l8955o296376o441554K527006J385606l416899
4052C15425654J31765M729199L577970J761756M595221l4916n283389n039161
4044C19864099K226705L624867J721502L3729j527819m09335M746138j178877
4036C29101009m911368K503283K752980m861834r33340J139584n602537n518756
4028C13669021l277540K708957P490414N195896l508469m643970J069368M663409
4020C23367086l978071p758437P4105M643593P221896r25387p455855q683958
4012C06504972l433968o80989R71240O260364J83808k412785M25615Q604155P460781
4003C23883193Q23066r59262K840804P937124L758795n167630n745443L927588
$$ plain form
3995 331298235 336896068 338469785 335142180 333944588 329344818 319601915 322022749 329933651
3987 329933651 335299814 335003831 332458634 334613205 338976249 336650320 329668781 324596056
3979 324596056 330142336 336959524 334758397 327879704 325056309 323384119 320530591 325825444
3971 325825444 333274811 340320808 341098086 336214414 334892891 333425304 325952856 322857518
3963 322857518 326693691 336371018 344509512 345604145 342966058 339124505 334211637 327793865
3955 327793865 325319221 326348843 329864448 333662407 333058591 333427303 335057143 334156954
3947 334156954 330807830 325310886 320495040 321878925 321350254 316975373 312515083 308247718
3939 308247718 306419417 305557773 316410196 331288139 334202006 326676594 320139320 314990124
$$ packed form
3995C31298235N597833J573717l327605j197592m599770r742903K420834P910902
3987C29933651N366163k95983k545197K154571M363044k325929o981539n072725
3979C24596056N546280O817188k201127o878693k823395j672190k853528N294853
3971C25825444P449367P045997P77278m883672j321523j467587p472448l095338
3963C22857518L836173R677327Q138494J094633k638087l841553m912868o417772
3955C27793865k474644J029622L515605L797959o03816L68712J629840r00189
3947C34156954l349124n496944m815846J383885n28671m374881m460290m267365
3939C08247718j828301q61644J0852423J4877943K913867p525412o537274n149196
$$ plain form
3931 314990124 315681837 317096433 316789922 318811638 320452441 329012586 331441900 324761932
3923 324761932 319651002 318455561 318339067 323527721 324931825 316822281 320579295 330230633
3915 330230633 332612793 331144245 334562231 334089969 335616600 330206650 321447689 322022104
3907 322022104 331519685 337270519 332176051 330051967 332118849 332736426 326099009 316767650
3899 316767650 314223652 313979006 316005888 315643014 320203594 326481190 321610414 315670502
3891 315670502 321264601 328129752 329451382 331833720 327813851 321502566 326425654 334932627
3883 334932627 331985212 324189727 320990852 321402011 325815620 329044433 329429608 330803537
3875 330803537 327250071 317860805 321001885 330388606 329648152 321749426 325169647 332741270
$$ packed form
3931C14990124O91713J414596l06511K021716J640803Q560145K429314o679968
3923C24761932n110930j195441j16494N188654J404104q109544L757014R651338
3915C30230633K382160j468548L417986m72262J526631n409950q758961N74415
3907C22022104R497581N750834n094468k124084K066882O17577o637417r331359
3899C16767650k543998k44646K026882l62874M560580O277596m870776n939912
3891C15670502N594099O865151J321630K382338m019869o311285M923088Q506973
3883C34932627k947415p795485l198875M11159M413609L228813L85175J373929
3875C30803537l553466r389266L141080R386721p40454p898726L420221P571623
$$ plain form
3867 332741270 332076016 327445018 326788946 331921296 336666369 336149911 332101563 326702298
3859 326702298 327478991 331132591 339074342 342299985 339361740 330534801 318791081 318663551
3851 318663551 321654153 327997948 328814787 331464203 333194003 333551599 334116928 332270589
3843 332270589 330446322 337313212 338340970 327279635 323594199 317247521 311341274 311711372
3835 311711372 310539625 316909223 321249418 317791147 308677467 305398630 308147842 314189388
3827 314189388 323384699 327979782 323977342 326538708 332194429 329005471 323273034 322495537
3819 322495537 322232953 325415661 325125340 323591236 326888649 331560456 330230362 325191533
3811 325191533 328244528 334562951 337971025 341213804 344744028 350525254 351017520 351970209
$$ packed form
3867C32741270o65254m630998o56072N132350M745073n16458m048348n399265
3859C26702298P76693L653600P941751L225643k938245q826939j1743720j27530
3851C18663551K990602O343795Q16839K649416J729800L57596N65329j846339
3843C32270589j824267O866890J027758j1061335l685436o346678n906247L70098
3835C11711372j171747O369598M340195l458271r113680l278837K749212O041546
3827C14189388R195311M595083m002440K561366N655721l188958n732437p77497
3819C22495537k62584L182708k90321j534104L297413M671807j330094n038829
3811C25191533L052995O318423L408074L242779L530224N781226M92266R52689
$$ plain form
3803 351970209 349111070 343200819 336698641 330129054 330502114 336254675 342560298 341858542
3795 341858542 339361176 338393984 335096382 325604520 321845071 322899076 330197920 335542501
3787 335542501 334564702 330702745 333649812 339635489 340838867 340791637 337469165 335531440
3779 335531440 336416171 331842828 325513176 326546209 327315390 327503073 327317319 330958484 330782691
3770 330782691 337322015 339243064 327981182 320143215 318082445 313301225 312082859 319585875
3762 319585875 323245355 323198569 325263795 331882760 327499361 325342321 328665626 332116481
3754 332116481 333900085 334354577 338419826 339714800 333096452 332559203 333065909 331279737
3746 331279737 326791077 320651666 312544535 310656031 316635714 318171452 317257742 314795350
$$ packed form
3803C51970209k859139n910251o502178o569587L73060N752561O305623p01756
3795C41858542k497366r67192l297602r491862l759449J054005P298844N344581
3787C35542501r77799l861957K947067N985677J203378m7230l322472j937725
3779C35531440Q84731m573343o329652J033033P69181J87683j85754L641165j75793
3770C30782691O539324J921049j1261882p837967k060770m781220j218366P503016
3762C19585875L659480m6786K065226O618965m383399k157040L323305L450855
3754C32116481J783604M54492M065249J294974o618348n37249N06706j786172
3746C31279737m488660o139411q107131j888504N979683J535738r13710k462392
$$ plain form
3738 314795350 315838924 316937349 316569385 317264856 318728838 317407913 316128262 323553119
3730 323553119 329514678 324606114 321832916 319303816 314953082 312686031 313456021 315690179
$$ packed form
3738C14795350J043574J098425l67964O95471J463982j320925j279651P424857
3730C23553119N961559m908564k773198k529100m350734k267051P69990K234158
$$ [...]
##END NTUPLES=NMR SPECTRUM
##END=
