##TITLE=C13_LR-685B-C1M-TFA
 CDCl3, 2500 sc

 31.7.2019
##JCAMPDX= 6.0         $$ Bruker NMR JCAMP-DX V2.0
##DATA TYPE= NMR FID
##DATA CLASS= NTUPLES
##ORIGIN= UXNMR, Bruker Analytische Messtechnik GmbH
##OWNER= root
$$ XWIN-NMR		Version 3.5
$$ Wed Jul 31 16:09:16 2019 Russian Standard Time (UT+4h)  she@DPX200
##.OBSERVE FREQUENCY= 50.327896
##.OBSERVE NUCLEUS= ^13C
##.DELAY= (6, 6)
##.ACQUISITION MODE= SIMULTANEOUS
##.ACQUISITION SCHEME= undefined
##.AVERAGES= 2500
##.DIGITISER RES= 17
##SPECTROMETER/DATA SYSTEM= spect
##.PULSE SEQUENCE= zgpg30
##.SOLVENT NAME= CDCl3
##.SHIFT REFERENCE= (INTERNAL, CDCl3, 0, 225.262)
##AUDIT TRAIL= $$ (NUMBER, WHEN, WHO, WHERE, WHAT)
$$ ##TITLE= Audit trail, XWIN-NMR		Version 3.5
$$ ##JCAMPDX= 5.01
$$ ##ORIGIN= Bruker BioSpin GmbH
$$ ##OWNER= she
$$ F:/spectra/data/she/nmr/c13/1/audita.txt
$$ ##AUDIT TRAIL=  $$ (NUMBER, WHEN, WHO, WHERE, WHAT)
(   1,<2019-07-31 16:08:06.21 +0400>,<she>,<DPX200>,
      <created by zg, POWCHK disabled, PULCHK disabled
       terminated by command 'halt'
       configuration hash MD5:
       00 E9 B6 7A A2 85 ED C7 34 08 36 98 17 FE 4E 26
       data hash MD5: 32K
       50 82 B4 57 3D B6 60 D9 CE B1 14 45 A2 B2 73 20>)
$$ ##END=
$$ 
$$ hash MD5
$$ 8F 31 90 9B 44 13 BD A5 D0 0F 28 9B FD 26 CC 58
##$RELAX= 
##$RELAX= 
##$RELAX= 
##$RELAX= 
##$RELAX= 
##$RELAX= 
##$RELAX= 
##$RELAX= 
$$ Bruker specific parameters
$$ --------------------------
##$DU= <F:/spectra>
##$EXPNO= 1
##$NAME= <c13>
##$PROCNO= 1
##$TYPE= <nmr>
##$USER= <she>
##$AMP= (0..31)
100 100 100 100 100 100 100 100 100 100 100 100 100 100 100 100 100 100 
100 100 100 100 100 100 100 100 100 100 100 100 100 100 
##$AQSEQ= 0
##$AQ_mod= 1
##$AUNM= <au_zg>
##$AUTOPOS= <>
##$BF1= 50.322709
##$BF2= 200.13
##$BF3= 50.322709
##$BF4= 500.13
##$BF5= 500.13
##$BF6= 500.13
##$BF7= 500.13
##$BF8= 500.13
##$BYTORDA= 1
##$CFDGTYP= 0
##$CFRGTYP= 5
##$CHEMSTR= <none>
##$CNST= (0..31)
1 1 145 1 1 1 1 1 1 1 1 1 1 1 1 1 1 1 1 1 1 1 1 1 1 1 1 1 1 1 1 1 
##$CPDPRG= <waltz16>
##$CPDPRG1= <>
##$CPDPRG2= <waltz16>
##$CPDPRG3= <>
##$CPDPRG4= <mlev>
##$CPDPRG5= <mlev>
##$CPDPRG6= <mlev>
##$CPDPRG7= <mlev>
##$CPDPRG8= <mlev>
##$CPDPRGB= <>
##$CPDPRGT= <>
##$D= (0..31)
0 2 0.00345 0 0 0 0 0 0 0 0 0.03 2e-05 3e-06 0 0 0 0 0 0 0 0 0 0 0 0 0 
0 0 0 0 0 
##$DATE= 1564566405
##$DBL= (0..7)
120 120 120 120 120 120 120 120 
##$DBP= (0..7)
150 150 150 150 150 150 150 150 
##$DBP07= 0
##$DBPNAM0= <>
##$DBPNAM1= <>
##$DBPNAM2= <>
##$DBPNAM3= <>
##$DBPNAM4= <>
##$DBPNAM5= <>
##$DBPNAM6= <>
##$DBPNAM7= <>
##$DBPOAL= (0..7)
0.5 0.5 0.5 0.5 0.5 0.5 0.5 0.5 
##$DBPOFFS= (0..7)
0 0 0 0 0 0 0 0 
##$DE= 6
##$DECBNUC= <off>
##$DECIM= 12
##$DECNUC= <off>
##$DECSTAT= 4
##$DIGMOD= 1
##$DIGTYP= 9
##$DL= (0..7)
120 120 120 120 120 120 120 120 
##$DP= (0..7)
150 150 150 150 150 150 150 150 
##$DP07= 0
##$DPNAME0= <>
##$DPNAME1= <>
##$DPNAME2= <>
##$DPNAME3= <>
##$DPNAME4= <>
##$DPNAME5= <>
##$DPNAME6= <>
##$DPNAME7= <>
##$DPOAL= (0..7)
0.5 0.5 0.5 0.5 0.5 0.5 0.5 0.5 
$$ [...]
##$SUBNAM3= <"">
##$SUBNAM4= <"">
##$SUBNAM5= <"">
##$SUBNAM6= <"">
##$SUBNAM7= <"">
##$SUBNAM8= <"">
##$SUBNAM9= <"">
##$SW= 239.972175391363
##$SWIBOX= (0..15)
0 1 3 0 0 0 0 0 0 0 0 0 0 0 0 0 
##$SW_h= 12077.2946859903
##$TD= 32768
##$TD0= 1
##$TE= 0
##$TE2= 300
##$TE3= 300
##$TEG= 300
##$TL= (0..7)
120 120 120 120 120 120 120 120 
##$TP= (0..7)
150 150 150 150 150 150 150 150 
##$TP07= 0
##$TPNAME0= <>
##$TPNAME1= <>
##$TPNAME2= <>
##$TPNAME3= <>
##$TPNAME4= <>
##$TPNAME5= <>
##$TPNAME6= <>
##$TPNAME7= <>
##$TPOAL= (0..7)
0.5 0.5 0.5 0.5 0.5 0.5 0.5 0.5 
##$TPOFFS= (0..7)
0 0 0 0 0 0 0 0 
##$TUNHIN= 0
##$TUNHOUT= 0
##$TUNXOUT= 0
##$USERA1= <user>
##$USERA2= <user>
##$USERA3= <user>
##$USERA4= <user>
##$USERA5= <user>
##$V9= 5
##$VALIST= <valist>
##$VCLIST= <CCCCCCCCCCCCCCC>
##$VD= 0
##$VDLIST= <DDDDDDDDDDDDDDD>
##$VPLIST= <PPPPPPPPPPPPPPP>
##$VTLIST= <TTTTTTTTTTTTTTT>
##$WBST= 1024
##$WBSW= 4
##$XGAIN= (0..3)
0 0 0 0 
##$XL= 0
##$YL= 0
##$YMAX_a= 14648978
##$YMIN_a= -4171209
##$ZGOPTNS= <>
##$ZL1= 120
##$ZL2= 120
##$ZL3= 120
##$ZL4= 120
##$ABSF1= 240
##$ABSF2= -10
##$ABSG= 5
##$ABSL= 3
##$ALPHA= 0
##$AQORDER= 0
##$ASSFAC= 0
##$ASSFACI= 0
##$ASSFACX= 0
##$ASSWID= 0
##$AUNMP= <proc_1d>
##$AZFE= 0.1
##$AZFW= 0.5
##$BCFW= 1
##$BC_mod= 2
##$BYTORDP= 1
##$COROFFS= 0
##$CY= 12.400447845459
##$DATMOD= 1
##$DC= 1
##$DFILT= <>
##$DTYPP= 0
##$F1P= 154.2805161984
##$F2P= -2.91768707477254
##$FCOR= 0.5
##$FTSIZE= 32768
##$FT_mod= 0
##$GAMMA= 1
##$GB= 0.4
##$INTBC= 1
##$INTSCL= 1
##$ISEN= 128
##$LB= 1
##$LEV0= 0
##$LPBIN= 0
##$MAXI= 10000
##$MC2= 0
##$MEAN= 0
##$ME_mod= 0
##$MI= 0.1934396
##$NCOEF= 0
##$NC_proc= 0
##$NLEV= 6
##$NOISF1= 120.0001
##$NOISF2= 80.00006
##$NSP= 1
##$NTH_PI= 0
##$NZP= 1
##$OFFSET= 225.2625
##$PC= 1.4
##$PHC0= -370.7479
##$PHC1= 38.60641
##$PH_mod= 0
##$PKNL= yes
##$PPARMOD= 0
##$PSCAL= 0
##$PSIGN= 0
##$REVERSE= no
##$SF= 50.3225993700027
##$SI= 32768
##$SIGF1= 140
##$SIGF2= 120
##$SINO= 80
##$SIOLD= 32768
##$SREGLST= <13C.CDCl3>
##$SSB= 0
##$STSI= 0
##$STSR= 0
##$SW_p= 12077.2946859903
##$SYMM= 0
##$S_DEV= 0
##$TDeff= 0
##$TDoff= 0
##$TI= <>
##$TILT= no
##$TM1= 0
##$TM2= 0
##$TOPLEV= 0
##$USERP1= <user>
##$USERP2= <user>
##$USERP3= <user>
##$USERP4= <user>
##$USERP5= <user>
##$WDW= 1
##$XDIM= 64
##$YMAX_p= 0
##$YMIN_p= 0
$$ End of Bruker specific parameters
$$ ---------------------------------
##NTUPLES= NMR FID
##VAR_NAME=  TIME,          FID/REAL,        FID/IMAG
##SYMBOL=    X,             R,               I
##VAR_TYPE=  INDEPENDENT,   DEPENDENT,       DEPENDENT
##VAR_FORM=  AFFN,          ASDF,            ASDF
##VAR_DIM=   16384,         16384,           16384
##UNITS=     SECONDS,       ARBITRARY UNITS, ARBITRARY UNITS
##FACTOR=    8.28000000000003e-05, 1,        1
##FIRST=     0,             0,               0
##LAST=      1.3565124,     0,               0
##MIN=       0,             -4171209,        0
##MAX=       1.3565124,     14648978,        0
$$ Real data points
##PAGE= N=1
##DATA TABLE= (X++(R..R)), XYDATA
0 0 0 0 0 0 0 0 -141 1125 -1765 2208 -2502 3229 -3839 4676 -5725 6939 -8262 9832 -11643 13642
20 13642 -15923 18490 -21401 24663 -28276 32322 -36814 41785 -47301 53377 -60040 67387
32 67387 -75493 84354 -94097 104748 -116486 129316 -143408 158926 -175999 194878
42 194878 -215724 238982 -264971 294145 -327274 365088 -408834 460025 -520942 594893
52 594893 -687002 805315 -963914 1189068 -1536291 2147496 -3522697 9576906 14648978
61 14648978 -3615931 2212429 -1441588 639671 -1925515 709004 -739645 461514
69 461514 -119237 816751 -200346 774982 -522068 -365025 -378108 273480 -499570 337267
79 337267 234780 426231 122393 298583 -511795 -265957 -549784 -312180 169722 661389
89 661389 232629 220790 149095 -152197 -598152 -422537 -205371 80387 218663 73653
99 73653 -31380 145937 -99383 -350658 -69540 280278 -2183 -42018 121777 245575
109 245575 194019 134739 -135558 -63691 -56500 -391967 -365951 208847 384015 144974 35105
120 35105 1147 -200819 -172076 -181396 -67155 311038 368173 -45883 -156175 81306 -191735
131 -191735 -113241 145473 36877 136229 113542 -116100 -115167 290432 239625 69445 204290
142 204290 -26451 -395417 -293888 -11839 -153679 94784 142791 -184435 -81160 37634
152 37634 -264792 -66217 164947 16542 -13095 82790 -120248 -61121 249710 102591 16099
163 16099 -46450 -221308 -266938 -9067 230920 161085 169259 191624 -59628 -314289 -241500
174 -241500 -347229 -177270 380410 251431 48247 157168 -121307 -452299 -71061 -91764
184 -91764 -227959 308170 410366 182742 442088 266292 -308221 -94650 -13008 -348758
194 -348758 -116194 215825 177362 283654 310531 -211879 -300987 -205770 -412155 -187096 254168
205 254168 296730 276019 433695 -25772 -381856 -302641 -231500 -337520 197536 449038 196943
216 196943 313380 154340 -195025 -165979 -240384 -374106 22283 350336 180606 74781
226 74781 277537 -130411 -446064 -363639 -460179 -269852 198618 367624 191611 448890
236 448890 235889 -313147 -279253 -201718 -127237 116709 343049 185210 371862 207688
246 207688 -383347 -331678 -167788 -206177 -11350 185166 279968 305896 151092 -94566 -277177
257 -277177 -98464 -198881 -233914 88306 317361 309416 128014 -57368 -111420 -128789 -103321
268 -103321 -94350 167238 498382 388695 94889 36430 -191680 -321972 -240900 -131412 42478
279 42478 117244 30692 15618 16891 -51501 -144518 -145408 51938 99583 91815 148302 24166
291 24166 4503 -20555 -123695 -141838 -49262 93682 81980 202131 201195 -172012 -194170 68342
303 68342 -34343 -61348 128400 188545 113376 -112318 -416217 -331792 -170441 -98434 -34997
314 -34997 446086 388819 44366 -92942 -131853 -12475 -80610 -178325 80538 484543 403544
325 403544 -62613 -189619 2204 -80252 -435899 -311639 117527 363130 340610 180242
335 180242 184403 15866 -427592 -759934 -360766 288535 394034 398405 512489 387849 -77268
346 -77268 -566646 -765622 -168217 320652 371237 437837 655242 452186 -179345 -580627
356 -580627 -646497 -408478 -249786 -152487 373784 722608 446691 -26961 -381454 -516985
366 -516985 -597307 -568581 -93564 594898 943592 580557 205291 -196354 -673254 -916249
376 -916249 -622958 -110833 606032 837416 571307 321715 2811 -670843 -1022565 -639852
386 -639852 -172179 330986 642966 760476 578279 85624 -589635 -868847 -679638 -367669
396 -367669 -29177 677237 1181884 928747 423531 -254962 -759043 -882778 -718429 -279627
406 -279627 513599 1073181 894141 484060 -98185 -826655 -1068881 -837620 -266615 409983
416 409983 907792 864627 655405 257517 -589959 -1042079 -921926 -559827 204335 716733
426 716733 878877 917427 440834 -236381 -860894 -985327 -775451 -116672 593294 1039468
436 1039468 918249 455925 -239724 -900999 -1186580 -999799 -409928 308334 859216 995923
446 995923 735474 18571 -531621 -865115 -787132 -488410 174416 686195 973817 800760
456 800760 360763 -252822 -835761 -899666 -692452 -213542 541961 876314 827657 553370
466 553370 -10278 -780763 -999199 -755865 -320333 269186 825801 812054 564485 73765
476 73765 -523137 -674593 -625418 -398312 231695 763874 852872 703699 326311 -343918
486 -343918 -630082 -791382 -667697 -167751 406604 666020 642018 384024 -51668 -613191
496 -613191 -776748 -665167 -177225 320518 758423 705969 461630 8867 -408605 -656177
506 -656177 -584740 -213653 171045 496806 551189 312554 85992 -222990 -419615 -415289 -287974
517 -287974 -7462 254980 447874 350153 119459 -196274 -523609 -512809 -312875 -4666
527 -4666 173368 414071 582869 375255 61091 -305216 -511851 -250710 8196 119337
537 119337 329813 475916 169860 -204794 -261732 -399096 -179998 32994 69245 226190
547 226190 326132 172262 -185894 -45303 -29114 -252744 -181257 -6681 89591 291802 179755
558 179755 -107049 -19950 -10654 -178227 -115824 195568 294308 296281 201160 -1187 -211228
569 -211228 -290578 -407496 -219434 248325 213858 10846 150019 -9911 -297935 -249752
579 -249752 -35588 -33697 324852 390661 119468 118857 -52827 -446917 -258017 116210 -23150
590 -23150 9382 264930 208226 107165 70077 -254410 -182590 28924 -188575 -157453 379535
601 379535 288920 -55950 -42027 -281909 -303126 -271535 -172694 105548 539084 512971 99029
612 99029 -77022 25941 -227455 -397672 -160616 310468 433654 253249 -2046 -14219
622 -14219 -3551 -396225 -503413 -109747 277427 121105 112832 230726 283550 -59032 -339944
633 -339944 -492793 -89947 57468 14132 214635 481389 366162 -153748 -421830 -170807
643 -170807 -76644 -21184 70928 325381 458728 137163 -298900 -242352 -181815 -310431 -378826
654 -378826 -64952 314552 317136 84366 -114361 -35014 -100581 -213894 -222983 68460 255555
665 255555 251098 183950 247695 -35813 -230205 -292184 -231840 72922 105786 36870 262498
676 262498 227343 -36395 -221130 -160063 -192714 -46381 21349 142663 100997 126894 -52430
687 -52430 -103372 15313 -135138 -221421 89504 231592 217137 154312 192149 63599 -2540
698 -2540 -66087 -267900 -88807 89813 -39073 -116515 55552 -61305 -97770 -62705 40846
709 40846 38295 162822 -86929 -224606 118668 14081 -168834 78114 87864 89366 10161
720 10161 -119974 -217196 47745 49561 -75349 113657 249634 -33958 8102 -127900 -161069
731 -161069 -69599 -140498 -226921 38767 153797 45949 61595 -41897 -100292 -259095 -190036
742 -190036 -97033 96787 350897 365735 274730 79259 -154170 -380746 -422524 -134109 111388
753 111388 351043 381988 192344 87804 -75060 -397422 -433530 -96867 -49991 271193
763 271193 435832 259129 55588 105255 -253805 -442204 -270174 -124550 127605 561871
773 561871 543456 333611 175577 -224059 -429716 -343345 -224107 -35729 354550 526778
783 526778 340300 16326 -218630 -649491 -570018 -262323 -69954 274022 645312 533821
793 533821 224225 -46948 -396231 -589912 -379601 -87950 101943 425681 554063 361520
803 361520 69350 -119227 -565045 -638692 -319991 -55309 372022 737274 512549 113347
813 113347 -146270 -559541 -775268 -508703 -162258 260202 577871 619603 316307 -36670
823 -36670 -280610 -453798 -494444 -86098 294167 487539 701207 429589 -5590 -232535
833 -232535 -553374 -701775 -389842 76604 322000 552422 595917 164942 -70776 -385634
843 -385634 -778456 -447053 3994 229182 471279 667287 385372 -62633 -375491 -744693
853 -744693 -576064 -58476 107082 328355 735445 588895 13746 -287781 -489778 -600571
863 -600571 -324764 -144588 93042 521633 416846 42374 -104419 -215849 -457026 -431619
873 -431619 -62451 270226 448539 468903 351926 61167 -229797 -540415 -544331 -160136
883 -160136 214741 230297 412842 527713 145601 -239602 -440488 -363558 -188192 -98441
893 -98441 23570 345948 528096 203331 -205020 -254735 -297110 -406733 -254465 99282
903 99282 503252 592023 275760 -20963 53618 -26326 -408247 -335301 116240 314080 196008
914 196008 153122 16830 1583 -202818 -428238 -224143 14981 158977 -48307 163699
924 163699 327103 111224 -201831 -366765 -168155 43821 -15180 -84842 214485 396689
934 396689 19529 -137027 -100469 -32981 -64753 -128790 106952 268101 211851 -71156 -140210
945 -140210 -135266 -118051 -338874 -245866 34857 110830 -87834 18846 81608 86178 45727
956 45727 -76190 -58050 150519 50668 -31261 110719 189306 6036 -70914 -49690 -105912
967 -105912 -70368 -41132 7958 71756 128561 -4840 17176 61006 -46821 -113700 -20043
978 -20043 43476 -69155 -88189 -28389 19687 93979 -26646 -7532 57208 84109 -52761
989 -52761 3662 92191 175713 40992 -2842 -84420 -18853 -160815 -196162 -96073 51788
1000 51788 -8189 -129109 -12189 181040 -16232 -138211 -60620 16481 8070 -14704 -55542
1011 -55542 34919 80345 38414 -20718 -24713 -52707 -113428 -62285 1202 203258 119749 -22515
1023 -22515 -71849 -46225 -29778 -111442 -129521 -26733 -16353 17795 -44315 -52788 -4718 -36635
1035 -36635 45964 113706 11420 113326 74004 -9661 31708 126474 2782 -7403 -38368
1046 -38368 -2176 -21131 -40550 16807 56360 117202 42999 -12731 -21843 46582 -56687 -115083
1058 -115083 -89994 -12743 23886 90635 111210 21764 80454 -19632 -80891 -54978 -29692
1069 -29692 97835 115800 234500 131421 38078 -88949 -199439 -190489 -149207 -78192 -30136
1080 -30136 31847 164594 116691 -40880 -23567 -193307 -139923 -131796 65092 193511 280627
1091 280627 143605 130412 -7985 -226935 -230134 -163565 -14617 209373 282411 185867 122839
1102 122839 19497 -135084 -278993 -268750 -150131 47246 217656 321414 225698 9201
1112 9201 -213033 -322380 -346180 -190308 -5291 258675 445699 419944 198144 -38321
1122 -38321 -218611 -401546 -447194 -142719 157922 393530 369010 141305 98525 -225054
1132 -225054 -489807 -464015 -151025 170800 389465 391156 230513 121337 -60881 -482461
1142 -482461 -518348 -212896 -1003 197318 428698 453439 318929 -40209 -341021 -478690
1152 -478690 -291631 -214007 27571 431836 615026 324374 -41925 -513592 -528026 -561122
1162 -561122 -383028 22351 399713 643302 417015 114103 -41372 -311601 -563494 -291171
1172 -291171 58404 268507 440554 410256 312309 68799 -405009 -579610 -393870 -71844
1182 -71844 61382 354375 588831 506321 70388 -325351 -502549 -534876 -337985 -166293
1192 -166293 311899 711496 599322 119008 -159668 -279736 -433247 -365545 -68225 375859
1202 375859 673743 564439 127629 -47281 -234846 -560098 -714471 -239679 137298 287516
1212 287516 367110 360062 180778 -81693 -544887 -588201 -148229 62383 100593 379873 574075
1223 574075 367153 -156470 -465578 -523279 -259804 -45780 86808 370937 640822 268201
1233 268201 -128221 -284959 -262226 -374753 -278747 -38194 213023 353151 140743 -121109
1243 -121109 -148333 -186270 -406112 -341058 61868 353052 311024 345792 244186 65394 -158581
1254 -158581 -264644 -355021 -42482 117507 138260 276308 253905 -14435 -165064 -280697
1264 -280697 -312646 -18267 37271 57417 227523 210718 23368 -131132 -121000 -161649 -214040
1275 -214040 -31230 64738 166181 176896 151924 2921 71924 -24222 -111321 59567 86316
1286 86316 54655 71589 114431 -49697 -116124 -161072 -167096 -27217 -33839 -60556 -63433 122712
1298 122712 -19427 -26368 -9622 -26919 -45493 88033 -1357 -87484 34141 10043 -12012
1309 -12012 6373 43363 -13004 3956 -66396 -58423 12366 -57472 -85180 50437 86126 112690
1321 112690 -36023 -63887 -125039 -180665 -124641 -64502 75849 213380 187330 174714 77814
1332 77814 108265 -46221 -131376 -1157 -321 145946 160717 74434 -24320 54095 -199718
1343 -199718 -209723 -86190 20908 143192 194560 143707 27986 -39074 -124875 -165913 -195374
1354 -195374 -55509 -7176 125999 271694 166602 754 -131501 -278737 -243848 -49003
1364 -49003 94401 161033 343441 323317 1534 -147036 -308078 -346487 -289368 -9958 102475
1375 102475 150899 216469 142067 -43491 -78802 -192561 -137293 62217 77124 277459 310518
1386 310518 142812 -37692 -41124 -253283 -266238 -160283 75793 130665 243849 236477 70952
1397 70952 -124667 -219763 -309946 -96775 -12190 50104 199939 157588 9737 -153685 -243571
1408 -243571 -185854 -47847 23173 220577 223705 247351 207668 -9333 -5144 -154742 -221808
1419 -221808 -113653 83853 65373 41417 70927 -85310 -86903 -115770 -272466 -183397 118802
1430 118802 187514 141493 48981 124037 -20202 -159687 -127297 18493 95673 25063 78172
1441 78172 201031 86645 -125622 -194306 12931 71512 135494 -13205 545 46348 -55866
1452 -55866 -270903 -171379 -31423 -605 -137034 23827 120489 90477 -55122 -32053 4197
1463 4197 93216 10328 782 199707 192739 -6994 -151856 -90664 -109600 -137167 -64802 91302
1475 91302 204574 177541 -107468 -171811 -103435 -112908 -241318 6080 258878 245950 -9756
1486 -9756 -54882 -42836 -189303 -191824 -211201 119883 375971 283544 167768 196240 187972 -205678
1498 -205678 -293252 -205138 -11583 164389 41137 147696 223574 21744 -398814 -414887
1508 -414887 -198171 -109976 36721 235225 346037 380796 43896 -357405 -258456 -189008
1518 -189008 -191174 -49676 300613 544199 368820 -6178 -107303 -168661 -274071 -371853
1528 -371853 -86715 308555 470405 262781 45077 -75331 -335929 -475705 -395141 -158431
1538 -158431 152788 319848 389874 386623 194191 -170066 -404783 -271571 -92398 175529
1548 175529 367311 374544 346942 168504 -237246 -481915 -441127 -312548 -110481 235862
1558 235862 502181 432491 151832 -21119 -285273 -438716 -368263 -159042 141584 454016
1568 454016 465433 279415 29920 -273285 -548486 -423925 -159447 103476 445265 469525
1578 469525 343399 142312 -125547 -437753 -526568 -330613 -93439 175663 400650 329863
1588 329863 234292 -39543 -325296 -483332 -299464 -123663 167788 412555 421079 279014
1598 279014 2043 -224290 -434912 -445979 -256873 6505 382382 543159 360965 59246
1608 59246 -120475 -335919 -407749 -245508 -32132 219226 306495 389481 92295 -97014
1618 -97014 -330183 -408791 -314484 -116872 168531 275932 463494 316731 129027 39409
1628 39409 -275778 -364949 -205479 26773 213908 298253 226408 63495 -89323 -228118
1638 -228118 -323105 -226766 20291 149843 315882 279837 112561 -67889 -174913 -240525
1648 -240525 -217728 -83139 104061 143045 224509 181868 37026 -112699 -97177 -222157 -83479
1659 -83479 -5253 105743 256456 116999 -9352 -100558 -232519 -256739 -232610 43515 39683
1670 39683 128257 173888 87386 42266 -32761 -66953 -61428 63676 31805 93270 101038 25035
1682 25035 20846 -53452 -184751 -59748 69856 47833 53289 103411 84176 -27319 -28798 -14519
1694 -14519 -43658 49218 -14509 44107 65371 101232 -93503 -71944 13908 101680 34786 72357
1706 72357 79467 76996 23620 -35119 -64227 44234 -17467 -42642 -22298 -39576 -66569 -197364
1718 -197364 -124445 -25741 -32314 9493 44271 163139 67625 -74003 -89754 -28658 -94140
1729 -94140 -104528 -11983 136750 203480 72056 -75852 -85040 -59566 -135377 -247306 10784
1740 10784 176771 181701 85380 -50803 -20459 -151039 -311348 -249411 -18660 120198 7395
1751 7395 -17258 175691 98842 -127158 -101093 54100 121985 147053 46568 177092 224859
1762 224859 20669 -188955 -184436 -84893 -103276 -92269 59856 207012 105733 -16364 -90265
1773 -90265 -8627 -26922 -292849 -101689 226334 170244 118025 35501 -49358 -2813 -158580
1784 -158580 -208396 1486 204474 97909 7327 215304 227182 -15584 -157800 -233332
1794 -233332 -3775 -139179 -43737 -2023 149708 181547 -113939 -252903 -46873 14561
1804 14561 -105454 14012 191073 161122 68504 8205 -68948 33239 -8920 -134976 -9729
1815 -9729 194275 53085 -34384 80637 109314 8192 -3615 -69053 -29328 71854 -38033
1826 -38033 -73761 119149 77791 -56803 -78141 -24764 -82573 -21415 -48177 18449 102612
1837 102612 178925 43012 35825 111733 -60776 -51837 4244 -3828 -72757 34481 -7686 14324
1849 14324 66195 -35393 -78582 -29218 -70160 -153198 -58689 182179 155237 113611 108207 -71810
1861 -71810 -158019 -96502 -170854 -43629 201163 125012 90678 155480 18083 -146485 -133343
1872 -133343 -71849 -126147 55986 67027 58021 133656 69588 -207921 -245772 -173448 -231677
1883 -231677 -48429 125340 205928 270374 106335 2914 -164815 -158691 -206948 -166630 189910
1894 189910 322225 249530 212288 49448 -139536 -282698 -219324 -149276 57077 204097
1904 204097 275775 150491 195352 -73554 -290248 -290258 -266974 -108809 103734 304186 275865
1915 275865 244898 68290 -209253 -325884 -235952 -164233 111567 347892 347212 307793 90157
1926 90157 -181774 -397487 -354384 -269093 -66659 174489 337086 211231 206208 22051 -285761
1937 -285761 -278540 -249010 -77192 208479 277773 293314 224474 97231 -213444 -333410 -264963
1948 -264963 -158288 16547 308792 355575 277402 137020 -124647 -429685 -374451 -315317
1958 -315317 -60026 145549 275526 187095 117101 -27681 -223600 -349732 -211715 -100060
1968 -100060 200107 389428 339480 220059 132752 -97802 -295883 -293531 -111534 -27691 183657
1979 183657 402044 309208 95854 -136023 -334535 -343722 -147875 -35385 141280 291255
1989 291255 311220 116569 -10690 -166662 -288247 -223692 -111565 91071 233724 351515
1999 351515 174911 77170 62478 -129981 -336030 -181305 37904 97986 105176 175679 95180
2010 95180 -67813 -285288 -325701 -120042 -4070 24062 129046 244912 162816 -2017
2020 -2017 -183743 -157980 -70116 -90475 56494 192922 204770 110029 -72360 -12602 -69145
2031 -69145 -114085 -103708 -50477 156647 166549 -5268 23812 38299 -63314 -242466 -143816
2042 -143816 22958 113042 89103 18160 159907 62966 -60916 -99427 61043 157766 60121
2053 60121 19988 63719 147126 16490 -155433 -77126 97586 -15686 -78951 -27522 5873
2064 5873 -23193 -112104 -75461 35373 36610 -68823 -35531 55576 76090 -3118 -124484 46728
2076 46728 70439 -61617 -6690 -59872 140818 21130 -73564 -52220 -8079 91963 -33913
2087 -33913 -51586 48586 26528 -163949 -177620 -96310 -64577 -101116 -92614 133008 258592
2098 258592 44032 -52964 14473 93313 -18564 -54928 37517 136480 71004 -11650 18253
2109 18253 -3848 -33971 -82083 -49348 79464 143656 32068 60358 46250 -13147 -99988
2120 -99988 -155285 -102843 -31870 -7850 53198 128578 138121 -27945 -97455 -58496 16738 4089
2132 4089 97987 147257 150728 95035 45345 -68040 -171632 -155045 -96189 41347 59714 8795
2144 8795 79468 60766 -3351 672 -109881 -96828 4715 67452 123737 98877 34474 54658
2156 54658 -96356 -42147 -74967 -61841 57945 83044 56777 98201 14860 -53934 -90458
2167 -90458 8307 -87875 -34217 -25713 -61707 -619 -4702 -56443 -69299 -59673 -87922 31688
2179 31688 49622 79122 108849 113897 56787 54150 10270 -34622 -36978 63215 25829 33520
2191 33520 5592 -25979 -34994 -65177 61085 29807 4212 -35707 -54487 -51951 14036 -6174
2203 -6174 60966 117645 -29265 -74063 -61561 -150751 -26875 -10178 84991 125277 106447 102915
2215 102915 20896 18047 -34898 -100845 -104148 -31248 13680 12996 41076 5815 -84799 -164633
2227 -164633 -189367 -130252 -63584 58743 129511 243392 157531 -47967 -108911 -111713 -202823
2238 -202823 -73860 40636 100626 216681 256312 -25844 -124729 -118591 -231192 -70732 11875
2249 11875 148903 127621 170343 119113 -16690 -121164 -257956 -283743 -143453 77823 182263
2260 182263 261842 294003 119255 -59498 -227565 -186313 -181213 13901 221888 228504 324061
2271 324061 69086 -217204 -264255 -229706 -249766 -37493 213953 272005 300309 167473 -68044
2282 -68044 -227810 -152557 -325389 -209679 44947 303745 233849 310906 97202 -105044
2292 -105044 -238217 -377749 -193610 77582 221183 304164 328688 262042 -141895 -410495
2302 -410495 -474928 -298894 -164091 105827 186696 351140 231127 -111272 -246692 -202362
2312 -202362 -261669 -251465 66620 368862 461160 329584 51250 -148073 -204645 -380767
2322 -380767 -335449 3722 307680 291853 255729 173033 -20044 -225621 -462058 -373251 -42261
2333 -42261 201331 287501 255899 307312 118955 -285238 -464706 -261099 -58256 86348
2343 86348 292065 426377 455611 229985 -170455 -306041 -247143 -238281 -199020 154161 263230
2354 263230 334373 74066 -100233 -259047 -207935 -354973 -244925 168593 454335 336571
2364 336571 136893 106179 -123646 -264701 -391512 -183584 68495 248081 282361 189589
2374 189589 172089 -55751 -290782 -339319 -104039 -62326 67635 198951 258193 190816 -75199
2385 -75199 -336841 -288783 -226714 -171279 15909 280270 342874 168835 -22843 -6394 -45705
2396 -45705 -93718 -169850 9423 194134 213075 105568 6405 -39753 -130409 -237242 -118718
2407 -118718 -47686 128914 159733 202140 214390 72596 -138654 -257244 -182978 -94809 30784
2418 30784 88565 162454 120020 113381 -54055 -147927 -64456 -22265 -2455 136822 55471 130398
2430 130398 10195 -53999 -107752 -124138 -34637 -27591 -12670 31108 29284 78747 36751 5582
2442 5582 -1010 -3507 -46059 -18750 56080 61309 13884 71498 -56135 -65493 -39756 -24841 -20262
2455 -20262 28940 74208 -9184 66877 -5346 -26579 -47876 -2993 -47230 -3451 15369 -80864
2467 -80864 -65828 5023 -42413 -3954 13572 30773 3682 889 46110 38974 84242 77481
2479 77481 63854 -7584 16565 -30978 -6173 -20171 -35488 -32905 32715 -26320 2399 51334
2491 51334 -34361 -37419 55768 -33967 -97467 -22518 -20463 53263 85037 71672 994 -97878
2503 -97878 -82469 -51838 45103 163123 96543 144046 86657 40265 -104793 194 -105629
2514 -105629 -119086 -39095 -33602 -17036 7803 -10409 -81308 -14073 -22030 -69128 58228 115248
2526 115248 57679 105341 35697 -71325 -11100 -63946 -57611 -9006 29689 111099 35745 46739
2538 46739 -70406 -64025 -75310 -50664 -42964 -46576 2026 -81150 -24124 -42901 -12894 -19487
2550 -19487 -14237 -34357 71659 22877 6126 53966 57342 24 -20683 52942 65341 -7306
2562 -7306 -50929 25172 -33460 -28604 -126997 -89658 -29371 -18544 -65731 -21297 94639 26312
2574 26312 -93869 -12304 -27456 66114 -60745 -49924 69070 9584 -3560 -130495 -56172
2585 -56172 76610 58493 1206 56806 90421 40891 -77718 -72500 43416 -14461 -34635
2596 -34635 9022 70859 41084 -53954 -140259 -103611 -14797 -105344 -27992 102744 219666
2607 219666 130652 36513 4352 16824 -68015 -173342 -73515 127230 174402 48855 50290
2618 50290 99502 -53447 -243680 -147833 -2457 84075 59896 34899 183519 73817 -124673
2629 -124673 -232271 -146222 7162 -19125 -30959 136312 322398 140842 -14524 -128479
2639 -128479 -54127 -122953 -127601 58971 277687 281006 27636 -106665 -88892 -182171 -304957
2650 -304957 -169957 17467 231473 201306 139457 87413 57631 -164669 -321762 -130372
2660 -130372 89848 147393 193269 203027 166200 12377 -249671 -336374 -135822 -96333 -2975
2671 -2975 139319 318032 255379 -20697 -219386 -288027 -254772 -197186 -104356 178038 273646
2682 273646 190092 -22577 -92720 -199117 -268439 -167884 50417 197558 372533 259973
2692 259973 125644 -8171 -132117 -302180 -270638 -65770 17209 187466 314071 269500
2702 269500 62166 -158239 -309872 -317180 -140958 37348 196896 257622 247306 63231
2712 63231 -42902 -290819 -157673 -190176 -33793 106027 286747 280242 95360 375 -146259
2723 -146259 -227065 -177936 -150608 33831 192304 136125 165762 -369 -137056 -297545 -284361
2734 -284361 -210855 -24781 151031 228128 236127 159635 -73085 -98229 -252929 -194643 -79585
2745 -79585 57318 204139 222177 162823 10501 -135754 -167625 -197259 -62558 29871 72194
2756 72194 170333 200813 53728 -140712 -86769 -221372 -126948 -41727 18942 209224 242310
2767 242310 135310 71773 -99453 -84726 -116222 -28451 66282 102427 162434 72223 -27938
2778 -27938 -140018 -128658 -145381 -34142 35920 66824 82331 86611 44607 -15814 -36271 -66016
2790 -66016 -92470 41201 47308 102587 72703 27701 52898 -91 -87616 -120953 11922 51673
2802 51673 10200 115332 98329 6801 -56565 -19526 -106619 -122965 -84718 -82427 -19048 33272
2814 33272 63719 18998 46853 26613 -54930 -11411 -31589 35387 7513 4748 35531 -4147
2826 -4147 -34413 -69896 -50370 51637 -69123 -25083 -14581 66216 15888 80863 68043 43884
2838 43884 72831 -38218 -86514 -25294 5229 -53648 -23220 102385 49356 -19112 -46964
2849 -46964 -40014 -7819 85456 104715 182250 119927 73348 -125466 -45926 -63342 -102680 -132230
2861 -132230 -41896 88476 122795 -42174 -90999 3596 18862 -127077 -68726 -22559 64063
2872 64063 55547 80496 55528 83900 -36518 -165884 -93174 63773 36100 19557 100153
2883 100153 188041 84655 -113915 -102459 -120513 -9671 9292 -9177 97433 74566 -59567
2894 -59567 -172267 -62188 107099 -40479 -22159 34317 177399 113039 39456 19151 80162
2905 80162 1030 -163037 -169728 96597 57803 -21533 82421 106109 -3832 -129811 -95979
2916 -95979 15795 72613 45958 -47491 113854 175084 -122864 -105196 -91719 51083 12742
2927 12742 -40299 75338 116780 82381 -110775 -28426 49019 23291 -75986 16637 154186
2938 154186 59314 18926 -61806 -76539 11006 -154518 -181548 25082 110190 242 18963
2949 18963 80985 18485 -25541 -51021 9073 96658 106438 -38461 -111252 64846 49319 -73005
2961 -73005 -65859 92739 25209 11426 -66287 1516 12029 -27576 -93884 5474 53456 22562
2973 22562 -45691 -54784 4131 -67056 -41849 -16733 76054 131393 130310 83829 111287 52287
2985 52287 -43544 -72324 18960 -38981 5458 38779 31214 31491 -34918 -80370 -83166 -1201 -40520
2998 -40520 47650 156208 42006 85 -19851 -26262 -150947 -59350 -103627 56825 164631
3009 164631 187685 126239 2190 -40836 -169595 -61249 -28767 130671 145444 158570 72570
3020 72570 -21531 -130407 -209101 -290037 -101385 -18693 116607 209962 98214 71884 6109
3031 6109 -100001 -119197 -78530 -5514 47580 130092 227758 94009 -60100 -103616 -142937
3042 -142937 -197868 -44273 53034 85821 187609 200183 43868 -85716 -117030 -147715 -106244
3053 -106244 -11643 178389 183233 172900 100258 -80532 -193620 -218750 -120669 81129 97793
3064 97793 251971 266506 167421 97159 -74022 -200069 -252483 -147153 20039 86938 221763
3075 221763 148805 61967 -152526 -196570 -254219 -157362 56503 109028 158378 145251 141172
3086 141172 -68936 -214260 -221565 -157855 16654 126942 116497 147404 102361 14152 -107733
3097 -107733 -143399 -197697 -123603 66672 120982 149370 158947 -6588 -127050 -219716 -255061
3108 -255061 -258469 -5403 109362 251456 148546 172525 27783 -93761 -107726 -179921 -53051
3119 -53051 109664 126999 179720 97157 -418 -118628 -192633 -163973 -60534 26300 99726
3130 99726 138941 170989 124322 -116937 -215401 -90915 -87185 -131545 63812 157992 210798
3141 210798 69661 -69410 -110471 -66134 -95232 -54234 60987 143717 116883 51995 -84063
3152 -84063 -57164 -185948 -231097 -200930 23023 36779 87142 73210 31816 -3735 -97421
3163 -97421 -108991 -66939 75739 32631 67883 66238 142573 -20091 -93369 -128555 -85716 12380
3175 12380 -9667 4215 152445 66565 -126741 -68483 1778 -99941 -57988 -79438 22753
3186 22753 145545 -8705 -33255 2035 33707 662 -74138 36999 122791 142400 15799
3197 15799 17291 46029 -1397 -94668 -121818 31955 -13594 -105019 -42623 32550 38687 -123791
3209 -123791 -49631 27286 41896 -31302 -38687 21109 40678 -56861 -95994 -37940 117552 53381
3221 53381 -122963 -25866 65853 12409 14393 -107160 77474 72121 -32301 32444 36673 47656
3233 47656 -108427 -120435 -64014 37824 45631 -14225 -53449 85359 27765 -30732 2214
3244 2214 97584 -10542 -2492 47262 16915 94190 -52345 -81275 -45796 -10461 -45009 2314
3256 2314 105765 104092 23502 -16401 9577 -8849 28161 -81269 -11500 73717 3172 -33404
3268 -33404 -37274 -19488 -8227 -48152 -50112 36953 77037 142301 60442 56121 83417 -8523
3280 -8523 -66539 -49808 -111836 21546 44864 29300 -6843 -11872 -95967 -62844 -40132 -61379
3292 -61379 -35315 86252 68541 4485 29560 -10934 2506 -112530 -20563 75930 23867
3303 23867 48028 27146 55542 21690 987 -8187 -54721 24848 -21719 43452 41392 -25707
3315 -25707 13286 -80074 -48903 -111738 13765 9342 -39994 28382 114698 19907 90654 -9187
3327 -9187 -22210 49509 29321 -93460 6035 -51537 -19285 23570 -8594 -3066 1413 26210
3339 26210 -1243 -25980 23682 -963 -30923 58901 71793 58772 3092 6128 -37843 -27972
3351 -27972 -108647 -72206 58610 78628 129354 110145 9268 -14176 -18398 6311 -34522 1449
3363 1449 54163 -42846 16104 -44588 -159258 -207268 -103918 -56278 6367 105407 115727 77976
3375 77976 -5025 -55445 -65750 -144788 -91928 -38956 -16481 115586 54832 78570 24432 -111386
3387 -111386 -117324 -142048 -55682 79076 124133 139309 82016 17475 -94736 -165654 -136186
3398 -136186 -129142 -7361 25528 131955 137134 98360 -5842 -49889 -99584 -85917 3177
3409 3177 133517 163209 152999 100054 35100 -103606 -245529 -203990 -81621 61171 117183
3420 117183 164402 151956 94466 -75506 -218934 -109347 -69040 -12589 45523 194769 206499
3431 206499 105687 -41204 -177127 -177388 -198141 -94406 120471 200230 222302 91537 55715
3442 55715 -75931 -159667 -165809 -114276 24994 140491 162177 18926 117000 -19747 -234549
3453 -234549 -246431 -49576 50628 112570 118611 197222 118213 14047 -219053 -232134 -123987
3464 -123987 -99527 -22089 159972 227946 178518 42659 -146941 -149405 -94921 -140210 -84247
3475 -84247 187101 241948 101192 3766 -19689 -108878 -218713 -213911 -66375 136597 232203
3486 232203 121658 103112 97151 -43757 -231969 -109556 -6694 51004 91591 78363 161795
3497 161795 131654 -96770 -341483 -148661 -53170 1617 -54575 171864 243666 67616 -107869
3508 -107869 -30269 -76360 -106158 -79561 -25243 158587 219829 74045 -45180 -33213 -68247
3519 -68247 -135444 -134091 64497 83432 112636 43279 -16943 22884 -134419 -212508 -164085 -30372
3531 -30372 39066 58485 88494 143298 13857 -69922 -68039 9911 63522 50548 60092 90397
3543 90397 69473 -50588 -28161 -112254 -32622 -55109 33509 67277 59598 94281 -68172 -1396
3555 -1396 22434 -78709 -75755 -28497 20601 38211 61178 -41016 -38409 23955 -34831 -59799
3567 -59799 56896 64318 32190 131818 18120 90365 6786 -21079 -32347 -53267 -73260 -80480
3579 -80480 -13440 15701 -19928 -2740 43220 15606 -34336 -12059 -15675 3738 -3245 -53329
3591 -53329 27411 90976 -9506 -43208 12151 26187 -56639 -2260 -5054 -61858 66612 16017
3603 16017 -39150 22313 27694 -54885 -59703 -70412 -118195 -48480 -7225 546 54886 10306
3615 10306 -62503 -60091 20694 54222 20865 94591 109035 86032 -14796 -26633 -80809 -83935
3627 -83935 -46151 -56327 -45332 61845 25653 41970 -22605 -84410 -79039 -13777 -19518 32448
3639 32448 90144 28564 -5793 37104 -60204 -79847 -27034 -48121 21294 73691 46613 154926
3651 154926 -24533 -3562 -59767 3829 -85489 1033 69675 34435 5735 -103508 -56864
3662 -56864 -61902 -31967 -111376 -27795 14059 57195 96651 71758 47785 -5555 -63618 -100898
3674 -100898 6449 5555 16559 78299 89258 16560 -82584 -32768 3626 -2604 17120 14121
3686 14121 33551 -4907 25460 -70578 -27932 -55899 -49543 -50268 29819 -44201 -12908 -38581
3698 -38581 -40369 79038 15560 5013 64657 53617 27849 -11214 -72104 -5007 -25757 -45335
3710 -45335 16697 86449 39338 1430 -8363 42518 4109 -16524 5016 63013 85729 38470
3722 38470 -9546 -11809 47843 -50219 -80146 -9651 64259 65026 -4029 -54424 105154 2064
3734 2064 -60888 -94713 49634 24286 23210 -32355 54660 15381 -92131 -163935 -37680 -30459
3746 -30459 -15759 14509 152962 173342 56943 -81494 -115238 -19089 -40264 -97114 -37924
3757 -37924 177732 125820 -3195 -54614 -57304 -55263 -70336 -23190 63217 119745 27058 -11360
3769 -11360 -31035 6717 -93865 -180952 -6477 51042 124645 51278 111647 122044 16689
3780 16689 -114014 -142686 22050 111149 78581 88558 94265 94328 -141177 -232426 -167002 -144224
3792 -144224 -84093 32987 142184 174902 91868 -61567 -110584 -67809 -156077 -153117 80103
3803 80103 259939 109859 70935 34298 -69378 -126750 -235334 -137604 61258 167810 150344
3814 150344 91578 75558 -72935 -120631 -223622 -91484 54097 88364 131696 129008 94923
3825 94923 9148 -131439 -262682 -150574 -62384 25323 190610 220934 196061 48275 -111875
3836 -111875 -138504 -116713 -149583 37 84072 173307 130161 49553 -9928 -134038 -146897
3847 -146897 -100214 -57690 136537 154779 94913 97915 56000 -138186 -165692 -164095 -136603 58843
3859 58843 108957 180625 172322 123067 -76138 -108101 -99359 -84496 22921 123290 135250 165514
3871 165514 75344 -71999 -127100 -154109 -109052 -89435 85814 128179 128424 153948 42940
3882 42940 -99332 -149941 -65878 -49822 72439 177761 107458 32121 35797 -66709 -101003
3893 -101003 -95207 -19228 -23087 118199 161764 77404 93222 31246 -147635 -149729 -109519 -95875
3905 -95875 31092 68753 32237 61291 23048 -32928 -73379 -18020 -65518 20763 138366
3916 138366 103064 72830 14123 -8684 -89045 -82795 -111314 32755 56948 60775 50584 -7379
3928 -7379 13824 -69983 -137032 2250 -39132 42636 131259 68327 57604 35507 -86039 -94465
3940 -94465 -18504 41110 15079 23809 51732 -66150 20660 38139 5738 -55316 -29177 -25082
3952 -25082 -8089 33653 -58980 -52992 -51913 14460 -65205 -14371 12246 -28780 -8000 -7976 39300
3965 39300 40915 -2583 37295 38216 -31109 689 -21586 52468 36014 -55719 -8480 -18552
3977 -18552 -27792 75703 -466 6476 -49701 -73397 -63083 7949 48637 -5657 -9722 88775
3989 88775 -21849 -3096 -48215 -37417 20292 119799 48812 88068 84180 12891 -43574 28710
4001 28710 -68055 -29904 -17588 -72932 -9395 -14488 -11006 -68974 -35079 20320 -5120 -109276
4013 -109276 30228 122179 25497 -61663 -26443 -26238 335 -79257 -37764 71486 141870 -13337
4025 -13337 66455 105797 19720 -109243 -114904 -1948 -3733 26918 -32944 66495 84502 -42013
4037 -42013 -218508 -13938 -7882 -54051 -38484 88036 162239 82325 16108 -16597 76339
4048 76339 -6145 -62657 -38755 56058 144957 -45347 31934 -20728 9688 -12400 -92212 30873
4060 30873 76123 13611 -28882 22838 39968 -28415 -107256 -19773 15203 94749 -30833 79632
4072 79632 61842 24992 -30523 -28790 96572 13188 -66418 -29214 77107 25068 -102168
4083 -102168 -23080 -24735 32533 -72230 -66507 -16237 48086 -87530 -65910 32139 30258 27679
4095 27679 4868 -6902 21103 -5845 -19860 -20201 31546 70773 -60194 64717 -21310 17489
4107 17489 -3908 -46407 -36157 -59820 38268 45080 4035 32309 -16004 -77055 -111335 -126191
4119 -126191 50138 -12784 -19310 51811 72700 -22313 -24751 12379 -13985 -13172 26198 104980
4131 104980 77550 56058 -12879 -47530 -1828 -98037 -22366 10607 94200 -16131 43936
4142 43936 -29776 -9202 -98500 -84559 -83961 4578 34807 84741 89994 137376 73376 -85994
4154 -85994 -85511 -62186 -58977 -20594 95207 179101 109632 57376 -41084 -95276 -141581 -119071
4166 -119071 -96365 51215 6083 88829 -10590 27351 3102 -83370 -7721 -8596 23739 68038
4178 68038 124992 74988 76279 -75763 -126876 -101477 -91500 -32296 60667 93606 138959 68595
4190 68595 -54649 -103747 -44896 -110175 -85610 -34495 177913 206288 74454 6607 -76226
4201 -76226 -127038 -77214 -46522 -42404 164562 170294 166324 131544 19598 -161957 -178617 -78852
4213 -78852 -80712 46583 107044 142914 108590 -82784 -109379 -83112 -149208 -118674 6371
4224 6371 176976 156065 166567 67486 2603 -53993 -38941 -45124 26238 99409 146709 104199
4236 104199 71436 -27636 -63134 -105419 -141086 -58644 18743 89963 93688 44657 14566 -101301
4248 -101301 -246301 -122056 -116723 -87100 36396 121018 93717 71432 -39461 -80241 -77787
4259 -77787 -90984 30909 115930 75221 129512 68368 -3874 -51402 -90202 -144307 -108124 28900
4271 28900 99188 122803 -8576 -33506 -37744 -44224 -82580 -32486 46225 109566 159892 67479
4283 67479 81115 21030 -133874 -90262 -82099 15033 42721 97991 121797 86191 -14872 -88852
4295 -88852 -54331 -61839 -177224 -147415 82350 122295 29004 7220 34976 -27893 -35911 -79017
4307 -79017 -15770 74042 35123 -2712 -15849 73143 15280 -33273 -31412 48199 50150 -22076
4319 -22076 23599 19719 17494 39974 -43981 21370 23998 -43934 -106722 -686 70313 -17945
4331 -17945 -124329 -59116 50663 -57345 -59534 -7689 118473 46509 60565 -909 53342
4342 53342 29993 -104599 -34538 62430 98992 -2506 -41628 -3119 81603 18865 -69064
4353 -69064 17814 51999 -48997 -87692 -72481 60043 -8767 -61418 -3051 55357 -5967
4364 -5967 -17986 -20452 39856 83160 -49536 2701 42814 31899 -34500 -8029 20184 25755
4376 25755 29470 -46544 -17536 59096 -74225 -76156 -57618 1617 -8215 -12755 -7421 95598
4388 95598 156400 37244 24291 -24183 -25625 -54702 -4328 65673 85016 73714 -4761 34549
4400 34549 36860 -52479 -110780 29817 2311 44162 -106689 68854 93267 46233 9197
4411 9197 8278 -10830 -63879 -56320 -10142 78655 52873 26350 21422 3183 16311 18336 -30126
4424 -30126 14126 15832 7177 -7515 -82188 16603 83681 -95334 -35426 -19829 26566 -6570
4436 -6570 12311 -11526 -8925 -33664 10609 -56641 -17271 21880 18625 -7885 24712 -20512
4448 -20512 38346 -13723 -17157 -13945 28112 -29978 17918 -23714 -75697 -22984 -45354 6689
4460 6689 -24270 795 19882 -13951 -37505 -29419 36165 66629 38246 45691 56566 58410 23940
4473 23940 -1869 -44708 -27700 80384 19624 -33997 -30884 -12214 -55097 21193 -37544 18553
4485 18553 -22408 23611 138285 70418 3494 28111 -1063 -24462 -16594 -34089 83067 55237
4497 55237 62612 12647 -14915 -50924 -57098 -22556 6148 39352 123888 126618 -7578 -71926
4509 -71926 -50760 -167081 -159268 -56419 4227 61644 92358 69386 -42736 -14865 -20581 -6255
4521 -6255 -50418 37748 28417 74301 92018 36775 11930 -132557 -57902 -67743 -49403 44250
4533 44250 111988 66534 37117 -13719 -102845 -110525 -91452 -4150 14155 91184 61961 63989
4545 63989 -4913 -55395 -118288 -71568 -32167 52773 95330 196716 154487 64530 50508 -45077
4557 -45077 -105748 -126771 -33169 140497 121007 118810 17840 -67081 -43246 -217715 -219832 -68738
4569 -68738 73944 103813 130894 93066 92250 -63705 -99403 -134061 -31043 52023 21732 47448
4581 47448 145118 71176 -18066 -113289 -109615 -47582 -27214 20435 92974 124133 -14534 -56564
4593 -56564 -67905 -83000 -159953 -95463 1708 121409 144898 43484 57129 -49427 -57001
4604 -57001 -117048 -47788 99115 48023 33953 71361 73307 56903 -151042 -93222 -6642 78334
4616 78334 83041 -49195 87029 139581 41128 -123645 -81168 -117111 -121278 -66885 89655
4627 89655 155481 100262 21297 -64045 90201 -11964 -101086 12515 161071 191286 27318
4638 27318 -15628 -58654 21435 -60637 -210123 -29277 46361 9595 63017 28335 52117
4649 52117 -25674 -151612 -102694 -87098 106576 -1374 56039 100861 38762 -56269 -56981 -11664
4661 -11664 9470 -48514 -56298 57712 144872 7621 -42439 -81234 -17800 -20090 -87233 -6150
4673 -6150 79071 -27962 -83502 2626 -16225 -9971 -83129 -46373 97644 120951 32377 13005
4685 13005 43272 -2583 -58541 -40240 11724 36812 -30858 -17597 -31425 20737 -13257 -74824
4697 -74824 -16215 34314 15105 -3729 -40277 -37063 -1145 1111 -31392 -18721 26336 -521
4709 -521 4329 -17453 50208 68979 -26899 24270 31624 26801 912 -55931 -44476 -41671 -56711
4722 -56711 -32614 906 -13682 -27180 -28868 12270 -22169 -2149 16477 -38258 22350 60153
4734 60153 -15910 89413 48095 29149 -4539 -19439 795 -28081 -21252 52926 137163 29966
4746 29966 24432 44326 -43345 -75897 -29536 47276 33682 58818 45535 -24896 -38625 -84862
4758 -84862 -51698 31864 -38446 14790 77218 63772 97616 47882 -14626 -60622 6139 -24634
4770 -24634 -39505 -17876 27237 18228 -24719 -119850 -40951 -51168 25062 1115 -3526 42334
4782 42334 -318 -12039 25146 1973 -40046 -32180 50561 86132 56323 103960 48178 22423
4794 22423 -55316 -61946 -34246 42822 22415 111989 3518 58054 -118211 -40913 -75349 -105788
4806 -105788 -66717 16197 3181 31007 118047 48878 -4093 40991 -37287 11265 46787 24158
4818 24158 32535 -12136 -25905 55443 3794 -32796 -11690 -66827 -35973 -53086 78732 28217
4830 28217 -27103 11812 17765 -21774 2169 -30462 -59686 62905 -3218 21268 -44846 32927
4842 32927 33897 34821 84024 105853 35120 72053 5977 -207 -10394 23250 -50436 -4909 25508
4855 25508 -23278 1435 -77985 3049 14586 8728 5270 16182 57017 -27419 -53170 -5712
4867 -5712 5946 -70780 -53216 -25851 18320 8184 14873 -22134 -553 -5482 -102184 -20059
4879 -20059 43300 71282 37714 -43690 -80486 -36628 -47048 -149233 13629 134968 13985
4890 13985 -33168 46395 136557 4165 -78703 -50801 17097 31303 -32851 57973 102468 47629
4902 47629 -83692 -79807 -76728 17683 -83410 -9989 94233 58296 43235 -97717 -41407
4913 -41407 -30981 -40916 -45713 52027 102720 68480 -41002 -54570 -90510 -29415 -135670 -35056
4925 -35056 149251 144016 71906 92569 121225 11709 -114619 -167837 -94293 34090 47500
4936 47500 55056 -19895 80840 -50034 -112723 -152823 16404 6703 -583 148354 194167 108272
4948 108272 -38237 -130593 -119455 -58487 -70991 -47246 38710 114912 75858 16542 -21888
4959 -21888 -57252 -58069 -101657 -34921 121238 153521 -5563 9966 -74381 -111257 -156803 -80941
4971 -80941 32295 22827 159890 98488 117422 104687 -56369 -83885 -138304 -8970 47451
4982 47451 33255 133135 36677 8771 -41024 -96735 -139264 -80035 13647 73086 34383 151719
4994 151719 56843 -8267 -32028 -32208 -70586 -41006 -4016 120529 101846 57191 -15225 -43498
5006 -43498 -67044 -64864 60381 73073 52996 154494 58135 17789 -92177 -181855 -131682
5017 -131682 -141290 -31959 -1600 46676 75536 116672 -25343 -63372 -73285 -78611 33804 5320
5029 5320 104765 124661 54664 56189 -70529 -17441 -57212 19199 22643 91742 41369 12249
5041 12249 90684 -30041 -55501 -117999 -29265 -2863 -33479 -29662 23985 11692 -15548 -61348
5053 -61348 -11413 38021 -3214 60444 137513 86572 96629 43477 -26307 -21093 -16205 -22775
5065 -22775 -49196 -246 30928 43733 -54840 -22038 -3352 -55963 -109601 17011 28920 33245
5077 33245 57812 7312 -43952 3395 -7214 -28827 54326 49664 21218 84365 -36591 -15031
5089 -15031 5774 71278 18980 -7470 18881 -16540 2472 -67923 -7830 -37077 -72016 -35175
5101 -35175 3294 -9423 4164 88487 -7442 65096 36804 5092 4902 11403 106368 54414
5113 54414 -37422 15300 72130 -297 -10383 26722 14638 -27523 20733 -8826 39561 38297
5125 38297 34964 -19119 28844 34755 33430 -25862 2108 732 -21183 -2295 -42413 22446 81706
5138 81706 -63525 32537 45541 30182 -41871 -80462 -2235 -2672 -11010 23301 -4390 -12517
5150 -12517 11450 -24826 -54539 -47799 -19970 -44699 69095 40018 36427 48564 3020 12574
5162 12574 -32557 -63944 -14243 90709 57263 50358 21377 -60396 4809 -18947 -44116 -6496
5174 -6496 43420 -34728 -47153 -17284 -2400 -73813 -99183 -34000 72455 19709 -54367 15451
5186 15451 65793 27569 13925 -6859 40060 69593 37579 -23496 5318 67649 -63990 -43746
5198 -43746 5080 -19943 16631 -37856 3750 80417 -14192 -27244 -94653 24179 53590 22563
5210 22563 -45057 2882 11821 -67773 48621 2402 33370 -9124 -62451 31205 -48078 37402
5222 37402 39055 -14615 89576 8596 -41093 -56040 5192 -112447 -127243 -18689 -45790
5233 -45790 -16329 -20663 15488 78903 68848 -14433 -55866 53532 80937 17955 4706 24156
5245 24156 83878 -15842 3877 -16978 -4270 -224 -40587 -23393 -1899 -5721 -13305 -76498
5257 -76498 -18596 20199 -45200 -51037 -17884 46237 11770 23316 37237 9089 -4581 28402
5269 28402 16714 53519 60327 66817 98599 45339 23312 -72853 -26717 -46430 5135 -70326
5281 -70326 9129 64769 77626 -43516 29940 -60108 -90046 -12643 -47777 75129 53519
5292 53519 21796 -36612 -17139 -74574 -81879 -38763 -42009 24598 94020 65464 35752 11122
5304 11122 -43165 -40066 -71746 -67273 -20363 45127 42663 34542 12674 -60270 -65861 -26248 -70269
5317 -70269 -9134 66563 62570 105922 106130 -59885 -149349 -37362 -120244 -16163 46429 71579
5329 71579 85913 31425 38448 -80238 -74827 -43491 -27613 30105 65198 115282 31471 21266
5341 21266 20672 -117350 -107540 -42349 -29085 31691 26206 112927 52011 8762 -38944 -60921
5353 -60921 -82790 3568 72160 42680 62611 68141 6627 -33621 -67332 -12369 -45498 -12072
5365 -12072 44063 69195 17572 -24121 41499 -132735 -123103 -112912 -4308 4358 8357 42403
5377 42403 36101 -15751 -108324 -61148 -45998 -42322 8295 58254 67766 69482 -6440 -31830 -24818
5390 -24818 -25820 -38752 -16410 2396 104330 22345 38386 -10257 -44504 -87548 -67289 -43988
5402 -43988 101351 9257 81301 35463 -34636 27625 -62187 -47088 -60342 14496 16491 65621
5414 65621 39020 -24065 -73939 -33703 -42423 -28576 -140488 37893 54774 16979 18674 -9732
5426 -9732 -12001 52804 -17719 -54494 50189 56984 53005 -4228 28778 53842 15215 -62606
5438 -62606 -4266 -25540 -57484 -56589 43462 53880 -82739 -13568 -54586 -4470 45292 -6290
5450 -6290 82636 -22927 -6394 -94169 -24987 16948 52526 -14881 -36029 75674 -9638 -30340
5462 -30340 -106559 42586 18788 -20877 -49905 25287 50880 -944 -28219 13529 32685 27828
5474 27828 -87319 -88809 42502 17583 -40797 -10465 45182 27744 3658 20299 1276 50107
5486 50107 -34169 -100769 62287 4824 -7731 -42033 5223 111850 489 -74061 -68176
5497 -68176 83887 25153 -36962 5843 121607 29910 -4770 -16325 75406 18418 -31552
5508 -31552 -85390 22063 74184 -4460 17670 5557 13228 -35719 -28673 -67317 1618 -23007
5520 -23007 -18506 32101 7179 2332 -91065 -42841 -40535 27598 9538 18207 43441 48553 -6303
5533 -6303 47443 20551 61290 42335 -12636 30166 45772 -13066 -10368 -32752 39781 -15970
5545 -15970 -53846 -11546 27233 39360 -8023 16354 2650 -6789 -95734 -29800 81658 -1113
5557 -1113 -31904 -41565 110300 -12265 36910 -34407 95637 15211 28823 -22191 21683 14811
5569 14811 -31286 2737 -27503 -11618 -31189 -9877 27640 59733 60252 25707 1142 40955
5581 40955 -79021 -17662 7075 -18558 32877 -86 -4275 -63654 -7914 -30795 33029 24914
5593 24914 -31701 -42377 114885 -5309 -39612 58305 41690 24340 -7378 -36888 -106334
5604 -106334 -42431 -87250 -83981 -10272 55420 -15534 5839 -6233 76555 -2393 60837 45248
5616 45248 -24796 27400 -5373 12725 -9143 14629 -13563 -88912 -32465 -52802 -18898 -11134
5628 -11134 -10344 30957 29324 -53514 -30437 -48409 -4990 -48396 20431 -15756 -21012 54708 3966
5641 3966 -42336 -10630 -4965 -13388 123409 73390 61821 12579 31720 -22862 -57235 -57386 -25474
5654 -25474 32853 -14656 24869 14254 31763 -24287 -61122 -28151 -41669 36300 -755 43600
5666 43600 46665 56246 27313 -51042 -66034 -85616 -63659 -36429 49306 108125 138303 36784
5678 36784 -43677 -86677 -109798 -90162 10085 74906 77469 -14948 24458 -20010 -139309 -37329
5690 -37329 -109085 39050 64189 99017 107405 85253 15040 -6670 -51437 -44647 -40102 64995
5702 64995 32679 131468 31608 -695 -9430 -57317 -39789 21303 28594 78142 61218 89287
5714 89287 -38287 -26750 -34273 -1809 -50029 -62451 21103 14053 71735 33489 54645 -68476
5726 -68476 -49598 -44944 7342 71708 41221 55599 69729 35586 -30636 -117824 -123547 -20981
5738 -20981 -21671 -40699 -9930 154215 119603 -20972 6424 -41384 -18586 20056 7356 80842
5750 80842 103002 -11494 -52497 4184 -63029 -67818 -60402 -48615 67042 36399 -25571 21248
5762 21248 44756 -55399 -167468 8194 23407 -5573 37568 15039 72779 48225 -83413
5773 -83413 -61599 -64488 86168 33629 45192 59970 89875 -15690 -71389 4680 3407 -59588
5785 -59588 -84331 99269 51573 25932 3722 7392 40173 575 -59295 16312 46664 98221
5797 98221 -14348 -20242 86332 1271 -74001 -94061 31127 43371 57603 26225 87158
5808 87158 2144 -55338 -47935 -41564 49042 20172 -48875 -23903 35432 43806 -38639 -48506 22130
5821 22130 23741 -35293 45002 71240 41019 44093 32200 27329 -11102 -45553 15825 -51397
5833 -51397 46661 66864 -87004 -29511 50248 4149 -57191 -67089 -13398 29560 51496 -30430
5845 -30430 -3253 -848 -22070 -77285 -46004 8792 29836 -27773 -11417 22327 87622 -9942
5857 -9942 -36375 33914 -57674 4307 -27527 -53153 21124 7976 65581 15386 1596 -39498
5869 -39498 -44519 -5564 -13266 -31662 -4696 -114 21914 3410 43580 -54055 10353 -32289
5881 -32289 8050 4133 -24813 -44967 484 17243 4577 39522 7843 25758 44879 46315
5893 46315 -6093 -46124 -46736 -8669 3605 -7244 17267 3984 -5436 19000 74591 -24673
5905 -24673 -36874 -8898 23571 6369 -41102 -25528 15982 -6080 17133 -9324 -46553 45201
5917 45201 -9838 -78239 -62228 -51006 15229 45299 44450 20935 63757 -32587 -9343 -103533
5929 -103533 923 -22954 35624 21814 23361 -13791 -43765 -22327 31572 -62998 34658 71554
5941 71554 12006 37727 -33660 -6435 -88748 39490 -45723 -15561 -103920 -22953 -11432 -18336
5953 -18336 4366 -2177 -18194 11929 5543 -7694 -8158 595 15318 32217 23819 -67327 49585
5966 49585 24613 19988 29874 -63043 12526 -17447 -18963 30742 16518 27519 -47871 44876
5978 44876 -8988 -9425 37437 18394 28438 -62880 9794 41924 -42926 -17466 -4107 4417
5990 4417 52595 -155 11364 36530 40053 4701 32079 -4329 -35902 -28296 -20671 -15716 -30187
6003 -30187 14355 -29443 -33255 -43681 8879 -32979 -28082 33655 44522 -3862 1855 23974
6015 23974 -13152 -52030 -740 11636 21357 -45100 -13353 36281 8580 -40396 -124394 -87342
6027 -87342 -51561 -33063 14164 1687 61364 29199 -101626 17988 32734 -40185 2229
6038 2229 10364 80878 46434 16964 -104418 40076 -55103 -29232 -129315 -37421 76687
6049 76687 9206 53857 -3977 9720 15341 -62315 -24108 63025 90244 17489 27977 135497
6061 135497 -44674 -117566 -72007 -51511 26043 -2876 5510 131226 19693 -15118 -62066
6072 -62066 -58161 63127 -58392 -66801 47093 23438 -8962 -32465 17355 -40526 -29712 -182405
6084 -182405 -26986 15969 81528 51316 435 52263 -10553 -57406 -102405 10966 44177
6095 44177 59961 -5905 -3099 -1773 154 -17834 -85027 -70054 49578 6069 87929 105023
6107 105023 10761 31920 -119454 -54471 -77926 -132396 -37433 24209 113654 80569 -43828
6118 -43828 -11879 -20635 32014 -109810 -15987 121250 58655 -16279 20787 -26341 -36266 -101886
6130 -101886 -32178 -19024 30910 107225 20851 36644 3941 -26670 -47114 -117840 -16271
6141 -16271 -31839 46911 85138 99624 105362 -86487 -50434 -55834 -42877 13356 44484 87112
6153 87112 132083 3555 -19704 -30225 -80648 -36027 -52044 -13388 22279 -25647 15462 -42649
6165 -42649 41284 7888 -14249 34134 -36189 5313 59958 37568 -25636 -69395 -84138 -36482
6177 -36482 -34184 51702 41709 25019 10461 5397 -38572 -8680 -19185 91218 772 -48624
6189 -48624 56822 32312 -37204 -28733 -758 -38278 -5714 -7949 26336 69882 94032 -6425
6201 -6425 100717 5493 -56312 -55876 -38608 56136 95325 -26373 -12962 -20531 44321 -83154
6213 -83154 -71664 -13650 20489 21243 19270 23150 7913 29760 -7756 5119 -33228 58317 -3123
6226 -3123 50466 17574 45260 -574 20738 -3534 -40932 47135 -43004 -47585 40010 17366
6238 17366 4031 -71872 69744 -34847 -32867 15757 -2058 -78263 42360 75835 -23105
6249 -23105 -47282 16745 -7560 -57148 -47456 106267 21607 49751 -22327 -14261 33166 37750
6261 37750 -54821 -29930 20376 51937 -69034 -43655 7383 -20025 31673 -36527 51369 -65412
6273 -65412 -19478 -7091 -15147 31518 55437 29249 39443 13339 -24274 -30153 72000 101222
6285 101222 -12914 76413 9564 78288 6394 -60419 -38909 -10118 -101734 -29150 25625
6296 25625 88481 27383 -63401 -23700 -56382 -39302 -36331 403 52931 1199 -21592 27524
6308 27524 36667 21369 -82911 -127447 -66160 33340 -41540 -85623 26889 60582 2177 -79950
6320 -79950 -61351 -58512 -143511 -78958 -17862 -64577 47314 -64541 -35590 38330 37181 -111762
6332 -111762 -33855 24560 63149 -22902 37182 -18997 22398 37813 -47504 14934 38107 24937
6344 24937 -12559 -13723 9887 23805 -12743 -34519 -10769 -11573 -7692 -28943 -39951 -37938 -417
6357 -417 1867 -28422 64562 3614 8325 12818 29786 -11546 -48971 49995 100275 71605 -11619
6370 -11619 -21062 -35951 -13305 -100219 -47453 -30083 51503 -51080 38955 50867 55815 -38123
6382 -38123 -27241 -54413 50889 13059 54243 21470 65511 71328 -43074 -44912 26028 39220
6394 39220 -16125 47906 23815 55901 -63471 -17221 -21686 -56272 -29103 -10136 45303 37150
6406 37150 -41387 -63293 -59475 -837 12336 -47250 35544 -16563 41025 2244 100903 63657
6418 63657 543 -21963 -55270 -63536 -22938 46942 49820 37392 44283 -7811 -41806 -66651
6430 -66651 342 26807 30581 31168 37914 58897 10660 -215 -24353 -32528 25590 -3404 14209
6443 14209 39344 -3153 -33568 -23701 -43158 -32375 -4827 12249 85391 53728 78513 63656
6455 63656 -48708 -29326 -33108 -13774 34885 34709 41090 30579 52117 15161 -46859 -32087
6467 -32087 -56674 -65137 67978 -6586 78636 -36058 34906 -49842 -28349 -5300 -47648 -17604
6479 -17604 95096 25690 39646 41051 -29611 -65112 -31329 -89490 -31416 63486 26566 41608
6491 41608 52748 -100326 -120813 -90023 35132 39017 75475 48375 105861 91044 21050 -8387
6503 -8387 -53994 -71183 -42854 18521 14221 64048 44475 27635 -6517 -137071 -22656 -27790
6515 -27790 -44411 51672 49702 13411 -55359 15074 -25836 -70827 -108520 18066 48988 7723
6527 7723 93856 27273 -19924 -60152 -5872 -75032 -469 -53164 -35326 29701 -11038 -13199
6539 -13199 -24236 -38458 -39930 -55992 51914 27575 96426 81907 -3619 -11446 21658 -23660
6551 -23660 -34112 -13997 59185 -10830 18017 577 51513 38239 -24832 22857 -14239 34943
6563 34943 -28869 5901 60806 52072 -114351 -12980 820 -10049 23231 7228 54671 62376
6575 62376 40412 44907 -12496 13702 -5783 -32850 54956 53629 30341 -55210 4918 -21873
6587 -21873 5467 6686 -38488 26891 79940 -50651 -39563 29517 -25104 -32952 -89057 10200
6599 10200 52681 39227 -13499 -4157 70391 -18474 -78848 34096 33452 70315 41041 -6433
6611 -6433 3862 59798 -56531 -38828 44303 26857 15002 -10233 89963 51289 -28530 -91137
6623 -91137 -45745 9433 73251 43377 -3817 50185 37647 -89171 30648 69196 23194
6634 23194 -50170 -69166 19728 14651 -39264 1038 85112 -25158 -55534 -22800 5255 2142
6646 2142 -26571 -7846 3273 47026 13747 1663 5112 75360 62693 18730 -53764 -33159
6658 -33159 -51899 -49872 -48694 29683 -7137 -49444 -29007 -8348 27508 -65490 -78169 -38000
6670 -38000 31766 -15766 38627 27508 30807 23956 -16540 28089 73201 10848 -2214 15865
6682 15865 8392 -15537 21919 -21683 -3893 -6704 -1344 -17491 26889 80609 4201 -39830
6694 -39830 -19606 46221 26600 -23248 20692 -39289 2205 -16132 51689 14982 179 -11003
6706 -11003 27711 31211 26106 -21826 17190 17642 40775 9509 -29672 -25181 -71395 -68803 -36512
6719 -36512 5135 -14480 -41827 10333 26840 -4563 58202 -29340 -51804 45597 -34317 -20933
6731 -20933 24972 23920 7766 -38169 -15386 29462 -5954 -36225 8322 17276 -4101 -21280
6743 -21280 -24073 -76667 -44235 -18128 -22327 -32420 -2785 -35703 51538 -3107 -21906 -6333
6755 -6333 -18634 28887 45293 58330 5766 -2412 -28910 22548 -7089 -36765 -22143 32928
6767 32928 -12342 -2202 83169 81434 -52084 -48198 37084 -57628 -1846 18268 66410 -1493
6779 -1493 8805 -5560 -66897 -55310 62347 -84978 -17194 45663 93154 68722 51823 46397
6791 46397 -18526 -20020 -13439 -71167 -60202 13403 2727 69098 14822 -22708 601 -4850
6803 -4850 -107928 -31613 -34099 39097 8170 34847 37040 27621 -31500 29712 -54711 -14285
6815 -14285 -12550 -16021 111821 32815 -5955 -16644 3131 1177 -24061 -35997 -3191 -42984
6827 -42984 -1883 -100222 -69463 -33177 7244 -79426 16227 -33612 43257 -14777 31684 -12149
6839 -12149 -27036 -26479 -1290 -4357 79937 114885 4906 13247 -26642 -55822 -97883 21525
6851 21525 -20687 28658 20145 25755 54614 22989 -48089 -54926 -6633 -11365 -50362 41820 77349
6864 77349 83516 16249 -56809 2164 -39206 -34681 -48523 40786 78099 60625 -30093 -29940 -32652
6877 -32652 -63481 -60233 -1364 -372 22213 42212 -17045 60426 30594 -19599 -41112 -40593 32585
6890 32585 -51877 -4817 17002 101765 -32315 -95273 -1239 -13622 -51421 -86935 -12144 65006
6902 65006 26192 -80471 -3054 -44439 -13502 -19100 -6518 87196 89539 -47216 -14289 7964
6914 7964 -63514 9726 17942 9346 36423 46714 37867 12356 6937 -5816 -37988 31113 22950
6927 22950 -2308 7339 -39170 14163 -34516 250 -39951 -6573 -52107 -26673 -9396 48298
6939 48298 61793 6321 -42040 -76723 -41 -28921 -60679 16094 17381 -9851 -28551 54764
6951 54764 21086 6664 -69756 -5449 25773 64673 -28903 -95366 49410 -12081 -329 -9015
6963 -9015 238 -23134 -12787 -47352 12887 -45535 21852 1433 -30317 51513 43659 -74615
6975 -74615 31052 31373 -56213 -58961 -32765 12735 -85050 -41750 -17960 27472 -10109 5719
6987 5719 -74261 -55310 21036 50758 -15627 27267 -20165 45035 -26831 2743 63837 84949
6999 84949 3614 15291 53874 -67829 48221 -6923 -36715 41313 -21350 46044 81705
7010 81705 -2925 -64555 -6351 -43599 24823 37656 36475 -37196 66873 84019 -22388 34014
7022 34014 5392 -1752 25747 26153 20527 55700 -8767 2437 20820 -36020 -4108 42396 -6008
7035 -6008 -1043 16512 26074 -12142 -49916 47661 -32992 -18137 -8206 48556 -35024 28969 95961
7048 95961 30848 33464 -2737 -31156 70700 77037 -22753 -32350 28020 -11302 38153 24055
7060 24055 -54833 -9927 -39319 56464 11297 -63302 89175 -27496 35417 -69566 -69231 -17152
7072 -17152 43476 -35015 19127 3289 27015 -59388 35405 -47586 -31987 -7786 -8717 41165
7084 41165 33322 13065 -4773 51785 -47069 38904 -12057 -89828 -10141 -30587 -8867 -44263
7096 -44263 -1983 32138 21180 15046 44359 -6961 66901 -338 34227 -57782 51520 8300
7108 8300 9543 -40502 -22188 19264 36118 21598 11355 -5118 -26499 74086 21877 -13337
7120 -13337 15708 23080 -17403 -42720 -16980 2725 6711 3836 -9965 -14076 14350 -25637 -30998
7133 -30998 55663 14211 28562 24471 97238 11178 -58288 -118721 26319 1254 -28702 -31478
7145 -31478 82736 47574 -39338 -58017 -32686 -7739 -55914 6399 4488 50719 35467 -33151
7157 -33151 17706 -19971 -60488 -37020 35479 73778 -61732 62389 8573 -26092 4611
7168 4611 -53360 -19633 481 3974 37863 -4891 10566 3302 -20039 -56589 -93644 38154
7180 38154 -50676 36001 25522 7466 25738 -56382 -39401 -13072 34866 -12758 66280 30119
7192 30119 26085 -38757 9293 13786 40978 -59248 -97351 34752 -7798 68159 -14869 7568
7204 7568 5619 -44602 -1600 9441 72436 52704 10334 -13905 77387 -44880 -68244 -19777
7216 -19777 -2035 30632 65047 84472 -39063 -24834 -67947 -85645 -5654 -27748 -68939 38963
7228 38963 9819 48531 29125 -45471 -11940 -38585 7449 -39465 102331 90377 85775 -6185
7240 -6185 -43816 -69985 -86090 -78955 3130 2271 41272 71768 56855 53705 3906 -77966 -83312
7253 -83312 -46834 -6799 3265 59241 11707 12413 -35109 -111086 -59210 -2615 -20940 -33415
7265 -33415 123448 68958 37655 -24724 -99197 4199 -58496 29276 -75617 1264 -21832
7276 -21832 65041 4810 -32366 -55417 -95933 -24834 27550 -41463 102070 73770 4028 5381
7288 5381 -46610 -66709 -38094 -32266 28550 47229 39749 84299 8082 -37969 -62386 -13854
7300 -13854 52419 -14909 12620 -11335 32229 -6104 -78859 -113486 -43859 -27247 20499 -11190
7312 -11190 -38443 36086 39606 -19110 -26695 -49109 -46025 -36324 -7390 18058 -1616 9447 14615
7325 14615 -27264 33760 -21902 68609 13963 89332 -49335 56480 49517 -10934 -9803 -44858
7337 -44858 -12266 -25095 -46935 -80513 6374 7399 20655 33858 -2778 41175 60203 36637
7349 36637 19482 37646 -15025 17818 -67297 1321 -6368 82579 -13792 -9763 -45702 -85342
7361 -85342 79368 26647 8874 -30889 15305 -1389 -5750 -75727 -9935 39052 -24474 -17075
7373 -17075 6873 39966 -4413 -2319 40481 4686 -23618 68089 12584 13925 -31687 2860
7385 2860 -51597 -20671 -41766 -72018 -5176 23692 -15119 -14703 48050 -29154 3453 31304
7397 31304 -20000 15067 9403 -48604 7485 -17812 -52162 -11195 2384 23254 44969 -58369
7409 -58369 -30407 -71652 32482 40803 80289 44072 -1124 -65489 -25062 40053 74934 63404
7421 63404 16068 21744 74395 -5200 -49160 -9699 10440 8564 46798 -46436 82715 56635
7433 56635 -15082 14094 -7232 46611 -41445 -20030 48408 62323 -20453 -97614 64106 207
7445 207 -66411 -24618 27817 25834 2343 18580 -1536 8906 16033 -69077 10148 -4277 -26410
7458 -26410 49857 -6211 26652 -53714 -41955 -38156 -23948 -18423 -27292 -1360 74630 23351
7470 23351 -71906 -62572 -43604 59571 -59085 -2667 13193 46482 -3526 41735 -56052 49711
7482 49711 -14412 -86859 48446 30793 33828 -45984 13053 79113 10940 -47080 -47436 -2751
7494 -2751 50523 4272 -20724 52848 -13351 20243 -61604 -26507 44598 -9549 63980 -5677
7506 -5677 -39508 9794 -1186 -16589 -5480 28420 -34058 508 -8053 53211 -50635 -19357
7518 -19357 30836 46759 21996 10026 -23576 -30389 -17542 12311 12331 12668 43128 -57432 12496
7531 12496 -63799 -59109 11679 5247 -83998 -84521 44592 134 52971 69853 -32211 -16727
7543 -16727 4879 -17856 -30435 -52757 2756 -10807 -19720 19087 -73053 -22190 14518 -23739
7555 -23739 20514 89660 31817 77785 26703 18017 68868 -39950 34596 -516 14784 -50482
7567 -50482 -35259 -19651 -13324 -85001 -6717 -28162 45678 38591 -15805 -12550 -6926 7316 58763
7580 58763 37662 19380 3919 38053 20182 51020 36641 -50904 -28166 -8275 -24111 113728
7592 113728 14406 20577 17552 -15416 20138 -35609 -845 -266 28965 38243 23771 48252 72643
7605 72643 -4408 -23 2269 55821 -29804 35194 -7060 67842 91883 22022 -8907 -26716
7617 -26716 -66134 -99894 35845 -53032 -519 -28003 -12640 -16906 -8621 41773 -46987 -48799
7629 -48799 72181 9965 -48189 -6826 -1912 23850 -38060 -34411 -16144 -41329 34361 19647
7641 19647 5543 21040 43800 -66281 27998 79417 -26627 -15477 19093 -6673 49289
7652 49289 31017 -10869 -30178 -56295 -86292 -63749 -25394 -3264 27323 35385 -46178 -19998
7664 -19998 53556 -38881 23276 18597 667 59249 -83512 25335 184 4833 -33501 -12628
7676 -12628 39910 -35907 5309 494 -12873 -7445 -82039 4026 9463 3182 13990 42937 -66172
7689 -66172 16597 78911 46936 -27650 -10484 19902 -19790 38477 22968 40259 54361 44382
7701 44382 11851 -44684 10067 -49982 48939 -22858 22873 25624 15205 -41735 5074 -8501
7713 -8501 47213 -20225 13086 10199 -21473 13378 -37960 -18644 33614 66438 -6660 17292
7725 17292 44574 -48359 12205 -67152 22407 -10557 -30122 38064 32593 -6116 53141 69732
7737 69732 34356 24250 -26267 -95867 -38712 -49893 20264 5655 -11039 47042 3674 -57215
7749 -57215 -52618 36240 21191 53169 -36347 -6693 10008 -23847 -26605 -19310 37406 -5037
7761 -5037 -5640 -16991 -20010 -22987 -19147 5205 80283 -30670 -31048 26660 87031 9583 -54135
7774 -54135 29580 23196 43913 -13221 17155 75701 72011 50001 30677 17265 60278 -36328
7786 -36328 -60050 10560 18607 -12814 -9777 -3640 18854 -46614 -26883 -37439 52213 4863
7798 4863 11760 -45380 46581 -43785 -40299 48080 -14282 72179 9978 -815 -24526 25395
7810 25395 -15919 -59510 39471 5155 -90630 -94897 -40074 3021 19145 7432 -14797 35595
7822 35595 18829 -35517 -52596 26641 56899 28451 19255 10707 51136 -4515 40756 -15619
7834 -15619 12090 39575 -15908 -21461 30582 -431 -25490 -45492 73295 18430 -11714 -4576
7846 -4576 -35418 -85240 8426 21251 25621 29445 8575 -7924 -15461 73869 -12211 -8951 -17480
7859 -17480 -37274 1685 54349 -11503 -32821 -4602 10741 -35904 7482 1545 -53489 -23655
7871 -23655 -98738 -29916 22915 47310 45227 1463 -59139 -4489 14061 -28354 -16842 2805
7883 2805 34576 -15672 20095 -59614 2655 37582 -14858 3664 4254 -4617 21245 -58455 3136
7896 3136 12297 -19780 31500 7720 -1084 -1399 32352 -35197 -26102 -55016 6782 17626 18396
7909 18396 -31593 28422 22053 35463 27734 50341 -15338 -39657 -9038 20029 -12914 82288
7921 82288 31213 -52421 -8143 1988 -42643 26906 -31660 -31997 57678 20938 34557 -10367
7933 -10367 -27489 -49074 26112 900 -50006 59662 -83349 10684 39719 -10589 3550
7944 3550 -46403 6170 -1104 33359 -32977 29647 30854 -23314 -91050 12506 -32055 -29504
7956 -29504 35685 -11944 32930 17823 -32215 -62050 -17103 -15129 30991 -36575 16283 3156
7968 3156 59774 -9835 50763 -40256 -96822 2759 16182 -26689 82247 -16186 59716 -29633
7980 -29633 18563 -6006 34621 -6165 19193 56751 73671 21515 4998 -40224 -106532 14719
7992 14719 28922 53336 60213 45527 -45948 7167 40538 -16527 -31651 -46694 -9981 -4019
8004 -4019 -61015 13815 57167 518 -56593 -8175 19483 -12698 2081 78180 67488 111666
8016 111666 -16387 -56932 12815 -6346 -6174 -2147 -12711 26347 43315 15348 -3183 -32104
8028 -32104 86105 -29270 -24550 62727 54480 -42051 17391 -29194 27659 23550 -46597 13302
8040 13302 46837 25353 -51128 -2221 31493 6815 -58248 -19406 -55962 10047 34675 -61819
8052 -61819 32111 51211 -6973 -17327 -76407 7290 10519 -55078 -36429 61943 59697 -1435
8064 -1435 -39456 42677 -3054 -30666 48140 3251 88524 -77767 -123970 13625 21470 -30745
8076 -30745 -27642 -11538 97973 2170 4418 -49925 24596 -9541 -11958 -29964 -16809 -24507
8088 -24507 -37135 70798 74296 -2777 -22560 32616 16041 35035 -34776 86141 40507 -17681
8100 -17681 -46866 31370 47320 32642 52176 -3145 -15578 33205 -77842 -50539 -26088 -38527
8112 -38527 18235 42454 47001 9065 8496 4914 -60778 30310 39352 19082 30400 -35124 -44637
8125 -44637 9898 -30140 -28449 -35922 47525 -49113 22028 -2838 32844 -17278 -32890 -73169
8137 -73169 -32536 10444 -48021 5209 67352 16175 -19656 62483 -19684 13070 9993 -21512
8149 -21512 38534 2722 -34434 21670 18989 36881 -48093 103540 -16884 -16287 -13522 -19518
8161 -19518 5581 -23564 -10298 -60283 -31612 -19189 -13291 11181 1653 39337 13215 18245
8173 18245 1071 -14429 -21716 35349 -38177 73981 16768 -7710 22169 15737 -54527 33286
8185 33286 -41911 -5513 -66447 -9616 -63007 -42174 966 -22784 -44697 18359 22148 11286
8197 11286 51426 33595 30081 14537 -51110 -29582 -17501 47800 61473 15906 28621 11821
8209 11821 -11415 -49663 -937 -59355 -29038 -25409 40768 35529 30501 9719 21850 -38008
8221 -38008 32584 -37723 24798 57903 82208 34838 70183 92467 5481 18057 -68122 51121
8233 51121 6490 3445 33860 -40667 -43414 -40284 -15981 10830 18301 46215 29991 -42994 -26287
8246 -26287 18491 32459 28961 13412 1706 -20459 -25824 6120 -3288 -19392 -14129 5122 -47818
8259 -47818 48869 2390 8401 -25615 -25000 19950 -26309 7086 -4412 6232 2280 23508 16010
8272 16010 34667 -45932 -103968 55773 16013 42093 -36690 36557 37816 -8205 14483 5917
8284 5917 28736 9018 -53407 -52326 126011 15955 -2014 61733 3730 -15905 8275 73127
8296 73127 36831 17305 5805 -63148 -63219 31728 67408 -96395 -11005 16607 1756 -63622
8308 -63622 -11840 -7646 -33053 -18584 52203 116745 18032 3156 -6477 21804 -46010 -13830
8320 -13830 -14121 -7157 4751 10232 -21680 55415 5426 46223 4669 -28394 -57599 7036 49118
8333 49118 -13693 36499 62218 -3982 -82450 3153 29832 17329 -17336 -31750 85717 27989
8345 27989 30130 17267 45651 -62133 -32757 -23851 40750 52212 -66169 -7204 44200 52817
8357 52817 -58074 10506 102653 -63636 116304 45944 -33329 60297 -31172 -42171 -24730
8368 -24730 1325 16170 -4655 13890 17742 -3726 -32312 -39417 1949 -70702 40622 -6145
8380 -6145 26638 50064 10452 -34331 -32171 -3517 -66358 37661 -6661 25383 81152 -37964
8392 -37964 -31545 31218 24790 -23485 -1259 -4042 34010 -15103 -4860 -44607 -9975 -55260
8404 -55260 -60126 -22400 32311 10251 42176 87402 -8820 -40515 -60035 28858 -15347 19872
8416 19872 -9945 -16978 -35526 -19048 -94025 -111 12985 -54508 -36176 -14024 121038 44637
8428 44637 4138 -3007 -1323 4009 -8084 296 51487 42764 -21979 -27550 75306 66814 17028
8441 17028 -34410 1259 77569 -23781 2569 19943 -6883 15813 -40235 -60655 1425 -31426
8453 -31426 -22566 38069 4186 18100 -29332 -84925 31055 17003 -34658 16519 58636 44673
8465 44673 5324 46058 42218 -22997 24493 11200 14399 -28937 69784 -15602 48032 6235
8477 6235 1956 15111 20470 -47276 15983 -8177 42199 26756 55946 -13895 -26925 34717
8489 34717 35293 20019 -47081 45950 74760 21477 53733 20896 -60928 -47773 -26090 -9903
8501 -9903 23403 43206 15671 -15174 -31793 -49104 11011 11303 16104 8106 20732 -29296 -2737
8514 -2737 7642 -27061 -22788 -38561 14354 -6369 40216 31189 -14204 8371 37194 19385
8526 19385 -37661 -53851 64068 52361 2441 -83446 -16628 33801 2675 -13249 62286 -24111
8538 -24111 -7004 33107 382 49926 70550 -46893 -33986 67968 -42455 -23323 -35481
8549 -35481 -47517 12391 -59260 -33809 40653 3274 -57026 -18276 19453 -53927 29980 -2955
8561 -2955 57192 43591 -18165 -46725 18331 40846 2373 -32548 19711 35851 -84145 65790
8573 65790 5708 -392 86397 8908 -41396 19222 -1479 -68130 -88217 -23036 -71210 37949
8585 37949 -17111 20591 41104 17232 9702 -34282 8221 -65035 -175 -35058 62223 20598
8597 20598 -115631 -22208 -13894 15283 57530 -13035 13908 18784 -45357 18326 51161 -60362
8609 -60362 -25430 -15966 40900 48808 40911 5081 1762 -9657 327 -631 29518 55581 342
8622 342 349 25185 -583 22353 -46268 71062 8734 16636 -52552 -28454 81154 14221 -47444
8635 -47444 10451 -24926 32292 3885 -35530 -11822 20462 37658 -1101 -64459 58321 -15701
8647 -15701 -63420 -23913 22824 33873 -35100 -22946 -21297 -3850 -63767 -7995 20738 -27523
8659 -27523 46181 4488 -79562 -1101 -51244 -1662 38690 54490 -789 24751 20919 73504
8671 73504 -833 -50215 -45111 -66046 -31769 30703 27057 -20828 21125 -10591 -35867 -54706
8683 -54706 -16881 -68461 23920 24786 -24829 89862 1056 16259 -138 -42769 -40895 62471
8695 62471 31560 6585 591 77527 -40400 -24441 -39550 5062 33452 36599 -26553 30087
8707 30087 56213 44917 6176 7357 14049 16631 -50507 -50013 -5881 45137 37566 -7999 -1137
8720 -1137 -63420 -37937 -9695 25106 5164 -16209 87068 20580 -74549 -22809 11663 9811
8732 9811 -60546 35522 51020 88546 -23678 -8182 19341 -56384 -9522 -17217 -47087 -7042
8744 -7042 -22928 -42236 -5688 -20080 7277 6388 -4111 -54667 -69479 -62181 12491 -18066 -29740
8757 -29740 15293 7894 -38152 -34226 28555 -2331 32956 -25238 -63913 9130 -50736 -29873
8769 -29873 14708 33392 32157 -88453 60695 68936 -8883 77154 -19850 5156 -10918 -22239
8781 -22239 81073 1799 15404 17942 -26672 -59278 -11331 75714 -5833 -9364 64960 54998
8793 54998 54344 -14908 -23116 -21468 12038 5819 -10756 -31090 -43971 13781 -27639 -63349 -44339
8806 -44339 -38271 34174 6227 -59013 -18759 -82608 39365 11430 -14648 22564 1255 32770
8818 32770 -47779 -20613 -22432 -27686 43601 77323 722 -53867 -59083 -11816 -36133 -24735
8830 -24735 5842 16112 11013 -19880 -20442 -9418 21525 -14241 -3877 40786 -48911 -9813
8842 -9813 10489 21671 34781 -46339 -11027 31912 43844 -70301 -3515 28933 -18645 -53858
8854 -53858 6016 -11160 -56143 17681 -111048 35140 -43044 -12302 -1597 -12742 33811
8865 33811 -53651 -19174 64879 -24389 35951 44563 -11796 -22188 -7707 -18688 -16476 -17448 -82649
8878 -82649 -296 -25108 1747 -17486 -32756 1271 -9444 25225 35957 -183 17882 14934
8890 14934 -14337 -21779 -31485 19685 -1974 19567 -3403 78109 -53322 69007 -698 -13146
8902 -13146 34206 5428 -52885 -54334 -25368 73218 -33858 -18662 -4130 15401 46407 13535
8914 13535 10907 115443 25460 -85510 54682 29932 -27054 -49088 34036 13831 43828
8925 43828 -43835 29008 73454 58243 -57963 41861 -3345 9853 6977 -49898 -20106 26520
8937 26520 -7483 -32298 10213 -58608 -8909 -52090 37376 49023 -10096 -186 -18891 11099
8949 11099 -2458 9926 4913 32795 -88855 35952 -27432 -22781 19908 -40698 -36915 -22023
8961 -22023 41540 -8569 -20874 6222 98730 48484 -79907 -48345 -25811 26063 2331 -5870
8973 -5870 19381 18362 13362 2989 -8556 49216 77320 21143 28719 8210 33071 -611 39306
8986 39306 -20586 -65525 16745 10958 84 28969 16274 -32338 -25699 -31383 -19180 47744
8998 47744 -27294 32617 -15419 -3565 -20414 -77217 2927 -2387 -6036 11416 -45490 2807
9010 2807 4654 13327 -73880 -7818 -18750 -46976 43727 -43377 21293 1795 59919 -48316
9022 -48316 -10344 -44982 -387 31531 25422 22404 50878 26780 45956 -2261 -16555 -63490
9034 -63490 -49068 6058 -61561 -12446 6030 -38594 -11348 3625 -3593 -37828 -27349 -6567
9046 -6567 58187 -13212 -54145 18178 -39838 12841 6075 40665 -23562 -4130 -9883 19056
9058 19056 -89003 -18050 46148 -21080 4917 -27240 4177 -14535 -26182 24007 -8580 6805
9070 6805 17804 47949 74347 67008 -13710 28529 -11039 -23318 -9616 -5186 73911 36176
9082 36176 -48948 -9931 38479 -66701 -4611 -46213 -84823 32627 13596 10503 27913 -2480
9094 -2480 -46097 -30947 -39386 -71949 -10837 -2769 -45869 9798 31605 -29106 -41966 -39951 -42589
9107 -42589 -33029 73730 -24459 -27781 -13630 12767 -21341 -61768 -58827 -30574 -19999 64121
9119 64121 -21436 35674 46290 -42438 -82039 -87676 3711 2620 24545 -12222 -18543 7454
9131 7454 -22834 -27973 39368 1536 -11188 51350 -28131 55515 -9175 -78818 -45911 -50589
9143 -50589 -48049 -26132 -1784 53131 21377 -53707 -19111 -392 71231 -9139 -48168 -14709
9155 -14709 -5191 9456 30280 -611 29110 -24054 8023 -10241 -81618 43960 -4839 -24122
9167 -24122 -280 -22794 2128 -76225 76783 27736 39989 46463 29047 9678 50168 -28426
9179 -28426 -68362 1090 42543 -11133 30874 32415 5618 -901 4067 -37356 -43575 28076 39733
9192 39733 27510 47479 -42664 9879 -51525 -62501 16564 -88103 -87655 30722 46615 56793
9204 56793 43634 -12426 -15264 -48621 50230 61009 40907 39883 76873 20809 17105 -64358
9216 -64358 28734 -20963 -60780 10256 -5852 46119 -66186 25069 -10942 -21940 -27236 -38481
9228 -38481 38310 42338 -30564 49760 -57651 39507 39294 -45700 -22962 82151 15932 24430
9240 24430 3149 43497 27490 -30191 -1184 19152 18575 47855 65023 36845 -13574 -11556
9252 -11556 -67048 -44281 16492 17119 -2005 -46283 78873 84687 16377 -81745 -13448 3358
9264 3358 19184 -4811 34473 -48610 26393 -45734 69133 12455 -30000 -6416 14406 -16185
9276 -16185 -41989 43527 -9158 -44209 32857 -9471 -67754 21501 5339 25007 25002 8869 -16106
9289 -16106 66235 -8269 56814 118165 8694 -11051 -22904 -5683 -63099 -61247 -5156 -24790
9301 -24790 -15564 34143 -1572 -6409 -45609 34591 27365 31644 18515 32736 31087 31307 36992
9314 36992 -44604 -33079 2271 -22023 -8500 -7929 26135 33754 6989 -31707 -47704 12655
9326 12655 17355 26341 8600 987 -12045 27947 18183 20339 -55389 80367 24606 38566 22101
9339 22101 -51270 46738 51459 -20750 -61750 -25245 -35873 5073 45179 30127 -61 64500
9351 64500 4477 9779 -18363 60487 -23404 -35141 -231 3748 42586 -31443 5081 -12599
9363 -12599 -65179 4842 12197 -4042 12479 -23343 -15330 -29552 20290 14811 -31499 -11863
9375 -11863 24786 -14965 28845 33548 70292 -58028 5657 8928 -27451 -40286 29200 -19424
9387 -19424 -9980 35048 54999 79185 -13367 11879 -18146 -15873 -28995 -23963 34530 -3347
9399 -3347 -19665 -412 -11777 100558 -17503 -11502 27356 37969 8761 -50022 -4700 -53904
9411 -53904 -40824 -40128 64256 50642 54621 -38841 -59965 -46522 18834 30215 -23824 -22094
9423 -22094 9394 -24589 13308 45006 55202 -4194 -53552 -90989 22012 -30455 12637 22125
9435 22125 40434 73520 -39519 -8464 20402 47512 25476 -6339 19749 47768 -21425 2735
9447 2735 -16415 66950 24021 43393 23589 14665 37971 38880 -39508 32166 -8574 -9064 7314
9460 7314 19454 14853 -15888 -82238 14040 -16564 7183 32343 42189 59357 -44233 -32894
9472 -32894 25517 31418 39352 -27815 -55117 -6589 4704 -78813 29074 54339 48061 22016
9484 22016 24740 -2279 266 76045 -86671 7753 51054 38553 36897 -25856 -42939 51301
9496 51301 -66294 -18547 -77217 -35259 11660 -13818 68282 26475 -51235 -41346 491 -2084
9508 -2084 -1844 -1149 -5815 8346 94161 -24065 3335 -50199 -16262 -4650 -4410 42963 27607
9521 27607 -1903 -48519 -9667 15762 11368 -1431 -8258 -32973 5715 34844 54025 -2862
9533 -2862 13624 27475 -395 -33860 71248 -5350 -12428 51583 25000 -32221 -78835 -11633
9545 -11633 -5180 36179 -32829 64623 56754 12959 -1505 -23150 72119 -50789 43584 42834
9557 42834 -34032 -30746 -69260 -33258 36667 55062 -35691 15013 -8929 -3092 -31080 8643
9569 8643 60336 63692 -23700 -42766 28935 -28697 -13367 27656 -59364 -37614 40029 -19263
9581 -19263 72210 -13590 -62437 -24986 48438 21252 -10288 -32777 -2374 1217 -19956 -21037
9593 -21037 -18791 -946 -23179 47164 -11830 -43624 -62687 -7673 -54125 14074 -41853 63460
9605 63460 -53634 913 28121 -5811 -32045 -2070 44167 -3930 -11380 18434 5191 -12714
9617 -12714 33374 8481 33320 43021 -40057 14098 -6450 17530 42392 19612 -54895 15748
9629 15748 17921 -93535 -43732 9127 1012 23643 23230 15584 45881 -49486 -11547 890 -44173
9642 -44173 -58800 -66568 11397 7241 45233 5561 65166 22252 -9846 -14163 -54876 42996
9654 42996 -4194 41687 13906 -18002 -15100 -2231 -19629 34376 -65471 -35 -26570 -16291
9666 -16291 44249 3249 28214 23308 27148 8273 -14717 -33108 -2511 -54255 4317 -6459
9678 -6459 -89415 -25599 -35500 -56475 -91502 11589 31642 38450 -16983 -5630 -60421 -7579
9690 -7579 -38909 -48177 28646 61810 4271 -15769 15 38164 416 4730 2910 33533 38334
9703 38334 14677 -26007 -421 7078 36450 3305 20652 -42798 -44255 26474 10819 60459
9715 60459 40719 6551 -25010 80941 28173 -33076 -11724 -28039 2321 27587 -2321 51416
9727 51416 14795 5567 20628 -27018 -18749 -11549 -75093 27963 103689 53699 -14157 18829
9739 18829 -44136 -29269 -50571 -1149 48170 -24997 -1455 46468 -285 13525 -36446 9566
9751 9566 -24043 3077 26409 -84643 31981 -26482 -30619 -46148 58328 -52017 -2751
9762 -2751 -57636 22358 61440 -69513 19245 -17874 69659 52482 1975 50477 22855 -10903
9774 -10903 12653 10912 -588 -72328 -33662 -45864 20785 -28033 -40537 -45943 17015 39202
9786 39202 -46208 -47232 -12188 58318 -44943 40184 29767 -5422 -25705 -25559 -22735 67917
9798 67917 31019 -59390 -5679 79480 20872 -60015 13582 26668 -56490 -42293 -80470 2774
9810 2774 -30529 269 -49302 70497 22340 -4949 -7149 -39958 25770 -64685 -1167 -27709
9822 -27709 12890 18330 14493 24028 16215 13662 45142 -13176 20080 -18090 -6526 -5549 -43238
9835 -43238 10425 -44016 -24842 69788 34326 -6299 -4824 -22283 -27331 5366 -49697 7757
9847 7757 18520 -5328 13028 -28155 -15734 -48472 30094 33239 18299 -15708 9654 -26190
9859 -26190 47236 14319 -34599 -22847 -42657 -41198 50105 26384 91623 -19085 36231 -29125
9871 -29125 -53644 -80525 48340 -92828 64896 11622 13517 75922 37455 -67109 -72067
9882 -72067 -4797 -15981 -16628 -62326 -14753 -134408 8936 -612 11429 40822 22668 152
9894 152 -5527 9374 -51206 -14363 14164 -22559 8827 -5980 1386 16421 32257 8079 -40561
9907 -40561 -2475 -47042 -1198 22472 -23190 3761 36520 8986 48897 2249 28651 -50546
9919 -50546 35829 -52587 -10455 63337 -27488 17127 7970 23997 10639 -31821 -34137 -1216
9931 -1216 67715 7023 3762 -55201 -28631 -11432 -8761 -9085 -31594 71826 37188 46034 -30357
9944 -30357 -25703 27518 18907 -34187 -24470 -55073 33040 -48153 61543 92311 -19567 -16911
9956 -16911 -47177 -36917 14175 -10987 -25989 65894 17553 8316 -59727 13656 -106372 -86034
9968 -86034 -37368 28201 -3140 -22359 20624 294 23886 -49655 37360 10664 -7545 19165
9980 19165 -41503 -7306 -38265 6829 -23428 15151 -34985 54854 41504 -1606 8988 5220
9992 5220 -50012 -84785 60903 906 59802 -27180 50013 37377 -74290 27172 10190
10003 10190 -6270 -4861 35527 14125 -29991 24221 15861 -1375 80564 -11312 -33113 19788
10015 19788 56470 6624 -31060 59015 6955 15430 12069 -31742 -32664 52763 -38197 -70559
10027 -70559 -9744 -6381 -11707 17704 62334 82541 -8655 66911 -47992 -3918 41993 9302
10039 9302 -39204 -5110 18779 -23712 49885 -5193 30306 15684 33890 63740 39697 42985
10051 42985 -38814 11988 -19533 13251 7934 37014 -33616 34177 -24164 -65526 72059 17953
10063 17953 -14871 1874 29069 -85903 14306 80585 -57055 36658 -292 13275 -17512
10074 -17512 62316 15574 -80248 -2675 108394 -15856 -18261 -54112 -6233 -6079 -20008 2598
10086 2598 -10912 -68425 65215 63467 9360 -3364 -7096 41413 66399 -5034 -54752 15203
10098 15203 -41316 14985 60785 -64028 -47447 58615 -19676 23362 11213 17143 11763 -15297
10110 -15297 -24960 -49868 68319 -8479 37673 10968 29177 16859 -16187 -79468 -23695 -52875
10122 -52875 -58477 -19280 -10919 17351 42349 550 376 8112 9621 38477 -54793 23610 12204
10135 12204 -8249 -28259 -61832 48920 -14116 21387 -23667 -19868 -3864 -42058 27749 -53880
10147 -53880 -30655 -27548 48883 31016 45823 39627 -32650 9958 44152 17632 15716 779
10159 779 -19439 -28345 -71339 42624 108656 28553 -3446 4361 53793 57306 42214 -13648
10171 -13648 26557 41838 6391 -6519 -15672 -22985 42678 -15164 -16670 -29497 -52622 3817
10183 3817 -29303 -3076 -57166 3348 -9800 45616 23873 3613 -39456 -43229 -11095 5432
10195 5432 -87586 -50972 40417 38230 -23797 -6903 3499 -55791 7851 42752 78606 3571
10207 3571 -41526 5699 -2099 -12098 91934 -17228 18978 -13438 45252 10554 16129 50246
10219 50246 -13643 -3219 -18531 -11522 -35137 23969 11 5339 15837 1728 -14945 -17433
10231 -17433 -16034 12420 -43310 -8911 11715 74631 10973 -28170 -5050 -23203 8017 5076
10243 5076 30186 12472 -54411 -25719 -56438 -37342 -8854 9281 -405 -22186 8973 37495
10255 37495 -31909 -4363 58656 45275 -19089 7611 43205 -47994 -8065 -9676 17923 6902
10267 6902 -52005 -16848 16472 -6918 1378 39098 -1518 4853 -102630 -70186 18209 -38691
10279 -38691 17593 -39758 -34178 -9685 -72230 -43016 -880 16543 8096 41764 26959 10384
10291 10384 -35118 -89103 -30915 18588 -36577 -17455 23791 74701 15567 35996 26515 -21104
10303 -21104 23986 53634 -27156 -7288 -6116 43075 -45934 29009 -46248 -60041 -37924 19652
10315 19652 -21573 -10469 -596 -9026 76465 -56936 -75223 -11140 -27657 6657 -43121 27761
10327 27761 -1560 -17333 -20077 10658 97831 -42662 -22913 53968 15261 -2008 21442 -29822
10339 -29822 -8734 -5165 -124 12910 15441 52079 -5498 -66965 -5945 11785 -36175 33284
10351 33284 -64476 36496 -32375 -16735 20679 18779 -52450 -72828 12038 45047 21872 87609
10363 87609 -37331 77922 74311 17089 511 -20559 12364 -73898 25706 -47302 10731
10374 10731 18354 -4109 24771 68500 -2658 21783 -36527 34660 23992 39020 13769 52639
10386 52639 -2807 -8513 -27465 -9768 16905 -80803 -8044 -25340 -2934 7364 -12197 -4839
10398 -4839 -11251 -29782 33293 -7084 41179 7401 -3619 49782 -41815 14547 -86120 18836
10410 18836 2025 -34363 13073 29629 1410 -14309 43185 -44393 13059 -27452 79467
10421 79467 -61159 -9069 -47792 35498 1777 9472 -29965 30152 31655 -32055 -14963 40028
10433 40028 62207 -27591 9332 56441 -10810 6580 29237 -53821 -4008 -59882 -1412 -85934
10445 -85934 -15601 -27461 20777 17827 19200 51132 3106 43117 -24951 25256 39509 11140
10457 11140 -12681 16639 -22459 26797 -1731 -100796 3154 -76037 24944 -97499 -11040
10468 -11040 37776 -20327 -35624 13167 18846 -50173 -4561 21786 -8102 3338 -20101 35104
10480 35104 -55071 25597 -30815 10975 -47036 30369 -20037 438 26176 37798 27114 3306
10492 3306 25887 -55014 45270 -86613 -17768 3 76732 -22464 -33200 -8105 26881
10503 26881 28136 -2228 -9387 -862 -20059 -73365 -38128 -16798 16205 30388 34400 -38605
10515 -38605 794 -5145 10694 5851 37336 22473 -52362 -35948 -30286 -17167 -35700 -85086
10527 -85086 915 40034 -27069 21007 1410 16816 -29961 -46735 -18946 -25110 -21244 -21330 -3570
10540 -3570 12896 -47667 -31741 5729 -15969 36734 -12806 42401 20135 26123 10592 22055
10552 22055 23780 45314 -14509 -3976 878 32015 -11510 51949 -10880 78499 -45065 -51443
10564 -51443 -84503 -24847 -29872 -1383 -1386 78193 -23237 -3640 38200 -38106 -10930 -9700 65732
10577 65732 6250 6829 18344 -34772 -87486 54507 -2740 10820 13624 11944 4189 29812
10589 29812 36699 -23860 14828 16879 -6531 -43057 2593 54436 21844 17486 -20117 3016
10601 3016 985 -13614 46381 31330 10126 4762 -8011 -17410 -35770 -25791 -33642 31522 19066
10614 19066 32900 -3570 41963 11788 -38484 -26395 -30259 8162 267 -10737 -10917 25217
10626 25217 28212 -26815 -8862 5806 -49326 -34156 -23687 16317 -17194 -52408 -19075 57620
10638 57620 27320 -12567 -9712 31451 31743 50140 54350 49213 28171 -45422 1288 22633 -6020
10651 -6020 -66085 54497 31042 16236 -9502 14208 -7439 -43241 -36962 35384 71946 -10007
10663 -10007 54612 38462 54833 26749 -48155 26006 -220 22314 3946 79955 8736 37728
10675 37728 16729 -5101 30126 -8197 58382 22749 16266 22528 -14674 -14926 -114022 -11111
10687 -11111 -22156 -1565 -1981 16660 1094 66008 94446 -2159 -3800 -14791 17764 -17981
10699 -17981 10467 1094 -19800 -95508 -29787 -61030 -14900 -20301 608 -46734 37482 -17391
10711 -17391 -44384 -21009 -9882 4041 15744 23952 -1993 8205 56507 -41058 -25657 -62551
10723 -62551 -47952 -22376 -60451 1593 56603 10125 -53920 57193 -3418 -54724 -21685
10734 -21685 -67889 43535 9638 -28854 -72668 -6964 -19783 -35887 25060 25967 -40298 10550
10746 10550 -44729 7956 40045 25435 12072 -76319 -1623 34449 25095 -1812 12251 55976
10758 55976 64571 -8627 -14221 -22309 3577 10210 22773 -54028 54043 20750 -33693 15530
10770 15530 -117800 -28305 -3609 45812 9674 -4858 39469 54181 -3478 47339 23616
10781 23616 -5543 26990 -41573 -21192 -71531 -28619 5177 42099 46187 16508 -65739 -20118
10793 -20118 109 -6983 12693 -79219 -41703 50748 -8747 47689 -1994 -24211 32539 -11910
10805 -11910 -41971 22673 11950 27823 43022 -58941 -15210 2372 14206 35297 -65727
10816 -65727 -39888 8035 49548 682 -12612 -76357 -22006 75242 -46676 -15022 14181
10827 14181 5318 -74634 37626 54151 -14889 27644 58493 -24068 85749 85885 -47207 15899
10839 15899 48112 -1517 -35375 46344 12134 21171 -5072 1887 -25153 51739 -6551 -17896
10851 -17896 23675 27120 -28058 -3589 63121 -3919 18412 -10898 2640 54903 -5672 12025
10863 12025 21307 -27755 -40185 1042 -22761 51729 -41907 35328 -31592 37780 27394 -24071
10875 -24071 28848 5780 42090 2894 -10311 -34715 -27919 -14784 25079 -14031 40122 -11556
10887 -11556 -23735 8596 53158 35227 25814 -39588 78313 -26298 -38569 -84882 5942
10898 5942 32253 27862 -17175 -53420 -13319 -48495 -11878 -15944 -17888 -34502 -33687 7565 -16281
10911 -16281 -48041 -710 -17141 67703 -62158 30881 22401 -24727 -32701 -871 -63310 -33496
10923 -33496 -36707 -4843 8808 51909 -36448 -6096 53895 -17810 -997 15156 -22359 -42655
10935 -42655 26564 8631 36105 -51625 -3376 19234 -14397 18865 14916 24019 -40594 14006
10947 14006 -11690 -3127 -39583 -13945 -4205 11874 19198 3475 -63299 22842 21813 -47966
10959 -47966 28712 -21405 -86938 -55704 42078 1766 -61408 -7908 -38000 -32707 31178 2111
10971 2111 -73118 -1546 -8889 -18555 9549 -21812 22476 -72668 -58091 17431 -7397 1944
10983 1944 -23908 -13599 -31614 14929 -15082 -51810 44821 21554 17018 59794 -4454 52161
10995 52161 -16254 -43877 3034 -42601 23921 56098 -24750 -11601 -9712 19072 -1400 16101
11007 16101 54236 24386 -38168 41603 -4382 -41138 -5348 22012 -7584 -29426 30231 -48921
11019 -48921 8187 25979 -6686 10007 -26511 27944 -1890 48911 2733 9416 79673 32713
11031 32713 -21344 -29063 14183 -25466 -16165 -51507 33004 53259 -37471 -47328 44501 83450
11043 83450 27634 -29611 -21830 -14641 -62196 -41235 53463 40532 -10225 79172 -17824 52642
11055 52642 57667 19708 -643 -1594 -73849 -93724 -27001 -9164 -8247 -40576 -16064 -9 10360
11068 10360 -47859 31863 16896 31217 -25133 27782 79490 -37611 39368 -1485 30119
11079 30119 -69920 -9449 -1355 72661 58330 -2916 -40941 -56679 -54992 -56642 -67058 -30793
11091 -30793 104283 52311 2581 -2767 -36298 -28180 16657 -34311 51908 33761 24726 44224
11103 44224 24469 -34524 64740 -32397 25982 -36877 -14757 8143 60123 2832 9516 49838
11115 49838 -52999 19682 -17161 -12792 -14712 2586 18474 26412 51663 -76481 14079 -12995
11127 -12995 11895 20297 12350 10590 33818 -34086 -5813 -26458 -258 29632 82853 -7506
11139 -7506 -24466 17604 -67795 22229 48344 -14215 -93997 46746 -52224 -68101 -43 -44025
11151 -44025 -12916 56286 327 -78831 28310 46005 -59276 49578 53330 -19360 -53533
11162 -53533 9402 -2718 -35843 -60636 -5323 35436 1096 20188 -17280 20548 -30212 -1065
11174 -1065 10370 56096 -125909 36306 -711 47015 30660 -47476 -61264 11963 10276 -13813
11186 -13813 -4930 -49436 40188 -542 -63893 -35102 19731 -59949 -21445 14231 32349 14777
11198 14777 53490 22503 -22251 -44737 -21492 -39755 39744 -34728 34032 -39488 24875 45121
11210 45121 91824 -2720 -10763 -53460 16601 61657 -37466 14649 -34320 9090 -56477 -1389
11222 -1389 -54363 51604 -90455 -4015 190 -42265 -4640 -35287 -59032 -37891 -42054 -48642
11234 -48642 34215 -59453 -10846 -4236 2633 100609 -31854 -4142 30765 5020 2218 20349
11246 20349 52084 -2666 -48679 45754 -2257 -731 31835 -7688 -4442 15387 -39694 -52170
11258 -52170 18845 -25455 -13017 -40278 14307 20145 -83311 -35839 22159 -2104 128 16095
11270 16095 84555 -41490 -40825 -5921 25438 -47200 -6951 -8151 -18022 51076 -17595 1903
11282 1903 41636 35911 43800 33418 -46757 -7814 -26539 45862 -28591 -25540 -27600 60049 19323
11295 19323 19045 23611 14488 -51597 32434 19876 19008 -57513 -22621 22449 -8974 47522 16091
11308 16091 -12987 -75245 62455 -42240 -72537 -2168 -24911 37338 7504 -4289 -20364
11319 -20364 54235 -7487 26787 5982 -1439 52691 1851 -34402 -8848 -27498 16519 -29665
11331 -29665 14246 -61530 -16355 27717 200 17270 -27231 -13537 3461 -28318 33041 28074
11343 28074 -97928 68169 20013 27693 22130 10202 -47124 -37407 -37740 26867 19417 -1367
11355 -1367 22296 14235 -68740 -10116 -36772 -21768 -23688 -3474 24860 16884 -1065 6871 -34844
11368 -34844 -76682 -9495 -48939 39635 -18933 19193 -524 22149 26851 46880 1199 -8012
11380 -8012 -56919 -17341 43171 -22093 -29142 -2387 29663 -16695 12945 -41747 28527 -81167
11392 -81167 834 12728 43209 -54008 -59026 -69886 29851 -44292 2249 -10155 -14564 5251
11404 5251 11838 -3114 85589 57606 -53107 5082 -32199 -11738 -18339 46931 -11385 52360
11416 52360 26150 -60073 -5549 13571 -25243 27870 -58264 28051 -935 38210 -1608 30352
11428 30352 10213 -6707 -22005 42533 33163 -5600 26632 -1244 36442 38521 -41742 -12393
11440 -12393 -69599 62750 15327 -11396 49905 42311 13459 -12743 41795 -14088 -5608 -30266
11452 -30266 21196 39500 -23516 24248 -74423 1853 23852 -20651 -24133 -36426 -24028 17215
11464 17215 -22681 10405 -21140 -44139 -45540 64546 -1359 9629 -1737 -49602 33664 -25585
11476 -25585 -91940 54232 7382 21718 9380 -19563 -13022 -5968 23044 -39161 11561 25712
11488 25712 -14758 -33147 -23119 32878 -25431 12562 -8206 3990 -20690 79313 76313 24668
11500 24668 -39564 -17439 -1528 19369 25615 -63419 20600 -40516 35392 26368 -71522 -20794
11512 -20794 10044 30303 -14676 41975 19296 669 57561 56937 24284 -23345 5279 -41657
11524 -41657 6904 8676 15113 -15763 -32337 23875 10204 -5717 -22637 50484 31909 -89598
11536 -89598 -2790 16350 -38791 9080 -5875 5622 33324 51074 -38135 37253 -5216 55330
11548 55330 -26881 -12256 -40356 -24656 -3056 -46032 85033 -9376 91622 28094 -1815
11559 -1815 -1904 -45221 -5166 40954 -10243 -11920 -11282 43392 -33255 35709 41721 -70 -8062
11572 -8062 -17997 32848 16094 -22308 9108 -73504 643 1866 -51155 28294 76094 68956
11584 68956 64923 23218 27499 15852 981 -12155 -11807 9740 -1195 25476 30484 25416 -5985
11597 -5985 -42261 -27920 28860 13530 -41017 35992 58900 -3816 -4564 38997 -39055 -27603
11609 -27603 -37614 -3708 22559 65168 10862 60071 -23155 -21088 16660 740 -43227 -1251
11621 -1251 -32762 -55307 -48568 6228 -46489 82839 -40479 -32794 4463 -97 45602 43723
11633 43723 20259 -20079 -44754 20187 -82757 28688 11743 -91428 -109031 -21135 54372
11644 54372 30224 -13036 -30802 -634 5998 -16726 -43406 -3469 39872 13981 57790 1196
11656 1196 -37096 -24253 36440 50722 83973 -23433 28662 -47067 32130 49220 -29874 -7943
11668 -7943 -17619 -51390 -12795 16053 -10646 -9581 33452 47672 83 -61473 23311 8153
11680 8153 27408 -53245 5351 4730 19312 -2570 -67574 3545 13567 -17541 -11296 19974
11692 19974 -33691 18437 -70313 55230 19361 -2564 52942 -29446 36625 13007 20078 17305
11704 17305 41738 -31127 11751 -30660 3948 19054 -2325 66260 23807 -5748 -49117 -9102
11716 -9102 12539 -27688 32553 -27888 17822 33345 -5190 -24342 -37897 -47981 2585 24858
11728 24858 -4284 -21376 11826 39827 -7050 26271 -66438 -34479 16048 -12375 -51003 -26620
11740 -26620 22813 -43962 -14520 20712 -17955 -64368 2642 4186 83352 -2380 -1378 47002
11752 47002 -13808 3101 -36313 32869 75956 17326 48893 -4001 1612 -43135 -30224 -35114
11764 -35114 4752 -3706 -7165 24049 67041 82346 -26709 6191 61589 50004 -49048 -56013
11776 -56013 -17709 -45361 -15496 51752 25789 10788 -43977 -12132 26746 -22221 26624 15361
11788 15361 90718 41593 -3461 -12740 93494 -12437 -64456 28851 -34695 -62338 -28623
11799 -28623 -7498 -12542 74812 24856 -16230 -25822 16821 -6834 -23410 -12289 -19023 -5104
11811 -5104 56610 20789 -14699 -21728 26744 -40910 -4250 -53259 -6838 32418 67406 -22724
11823 -22724 -46638 -33034 -23751 26779 -17511 13185 -25947 -35414 -43592 -5630 -37346 34716
11835 34716 -79483 -21961 -15769 -20231 50384 1242 -39438 21556 1948 -18942 -29299 -40930
11847 -40930 -7377 -26461 9030 -3742 -7796 4843 -38336 61443 -49072 -19502 7556 13084
11859 13084 53090 -337 -34650 -69744 -26774 -17327 -16062 -13988 -183 19946 21655 -56380
11871 -56380 -16143 13519 -2834 14013 -1244 15215 16825 25577 27376 -23919 -45113 26353
11883 26353 2646 4051 111044 27963 -42512 5714 52115 9715 2914 44048 500 1811
11895 1811 38682 37461 27253 1641 -76697 -33755 -34182 7904 34417 -39528 18926 -16207
11907 -16207 -26493 -38033 7153 -72081 -43308 -23613 -36468 -32513 -2617 -27184 -2732 20398
11919 20398 -30725 4630 45867 25971 13313 -63597 -7575 56011 23876 -12817 -11801 -4948
11931 -4948 39224 -9225 7887 -25730 -17811 16178 -21984 64933 -35092 -14035 27098 -14539
11943 -14539 16938 47197 33447 -11034 -66889 28090 -35266 98000 36438 -52497 -10142
11954 -10142 -63309 9559 26955 -8301 31641 75205 -2197 12448 75244 -24406 -4922 -53297
11966 -53297 -66347 31495 23347 -6824 46211 -297 -2464 823 20728 -5980 1217 -12691
11978 -12691 7868 16710 37261 24642 -13557 -4329 9782 -2483 5178 -14235 4277 42754
11990 42754 49340 46519 50218 -4493 -9635 -63519 -72351 -6453 -78463 -29836 51650 28981 -36970
12003 -36970 28713 12021 -10372 -13813 36373 15437 60412 27545 3132 1258 37113 58034
12015 58034 -13938 -6685 -53109 2131 -24810 -5855 -28346 -3058 -12603 25721 13082 16496
12027 16496 -55092 -15659 -11127 -3563 -19797 -33838 58157 -15477 -55 1467 -16049 31209
12039 31209 21781 37665 -40755 -29023 -3134 -57049 -69087 -17766 -38517 -61065 -32964 14299
12051 14299 -14606 -70771 -14436 61655 -74995 -13786 -38769 13104 27386 29378 -39547 -13476
12063 -13476 13994 -28688 22745 8115 4469 -26783 21872 34788 -43531 -31987 -45926 27097
12075 27097 -5621 -12050 -54317 -48386 32117 56925 -9191 36147 13134 -28787 7502 -29603
12087 -29603 69340 -4747 690 -28851 18432 51778 -10493 -39184 -3977 -47194 40525 -7285
12099 -7285 69324 18863 25785 32460 48876 31077 -49385 -32552 -9147 27372 39235 35136
12111 35136 37293 58863 38155 40944 -703 -39986 17696 -21396 48166 36927 -29927 -23030
12123 -23030 43909 -237 49544 14217 -35154 -14102 899 -21564 10578 -97393 -46977
12134 -46977 20963 -59015 30626 -3447 30621 37319 -379 -23138 54762 -33714 39471 82185
12146 82185 -3879 -61764 -4450 13356 -3949 43172 -40046 -1895 -6112 18149 -34044 25687
12158 25687 -5313 -47246 5803 28928 -25345 -49677 40520 -17243 -44989 -40094 -37872 -29444
12170 -29444 -52414 71804 -19633 -41606 35149 5133 -9490 304 43639 15572 -8563 31542
12182 31542 -57423 -66372 -19325 -41440 -41073 -43303 -12238 19786 13811 43074 -56023 2091 18405
12195 18405 30218 66105 -152 -14386 861 75006 31550 24909 25685 -34189 113224 -8244
12207 -8244 8072 37245 227 6657 -13772 34472 -28110 8382 65668 31732 24713 -78187
12219 -78187 -3660 72920 7900 19590 8207 -137 52571 75181 -25902 16838 32295 1901
12231 1901 -58425 11699 -26656 18406 25800 -13499 -4280 30851 21824 20554 59312 64296 2530
12244 2530 -18526 60217 15939 22703 11215 -26051 10641 -62736 9778 62755 -68059 30268
12256 30268 8275 7363 -38311 -53271 -11341 77778 57550 -59139 -5980 871 38355 -20145
12268 -20145 -5940 55878 -6916 -51373 44351 -15938 -32064 14485 -39836 21967 12937 -16991
12280 -16991 -28810 -27128 -20084 7017 -30079 9340 -13851 -80500 -19955 -26246 -14850 18116
12292 18116 24460 -49760 -10434 29011 -13957 -23823 -12393 43856 6475 -15302 -102937 13268
12304 13268 -56269 -3184 41167 -4663 19763 12959 -10189 -40949 -26643 75777 -23128 2726
12316 2726 26640 -13706 7864 -12818 -28120 -25083 32976 54969 21467 64419 -26506 16912
12328 16912 44453 -14952 -23424 -4568 9358 45916 -27371 53569 24847 -13894 -40383 8954
12340 8954 19461 -25799 -12153 16321 4727 -37756 -51447 -55296 53430 -4535 -3432 22092
12352 22092 10693 26292 43345 -28611 -28286 71705 10707 -38112 10421 41219 7396 24576
12364 24576 18232 -1067 -57950 4804 32286 29660 10761 -29426 -22846 37045 -4601 39041
12376 39041 59940 72371 42723 62101 -48657 -59083 62261 -11331 25425 362 12952
12387 12952 48629 42140 24309 -56012 11431 23702 2417 -15332 44213 -64306 3507 -6428
12399 -6428 -7401 -14757 -29786 -15369 13533 -15229 8713 32353 -32003 -12521 -13896 26985 46550
12412 46550 -8995 1803 -23725 -32242 7427 50685 60340 -29111 57446 -5407 -67702 13415
12424 13415 80270 13603 -57408 -23773 -15567 -5721 -54973 26799 53057 75891 -60371 -27454
12436 -27454 -28357 -10183 -14912 3137 24237 -24630 -14902 -19122 -32280 33615 -35675 -43268 -3308
12449 -3308 -33975 -31678 7362 16528 87319 -7188 39179 -33528 -38996 -12551 45322 22862
12461 22862 -1757 -35532 -21207 -11442 -7135 2150 2420 41586 56382 18205 -20329 -33430 38912
12474 38912 46982 -44713 -3586 -12345 -6064 6600 -15759 46281 67408 32636 -12467 39265
12486 39265 -11468 -8742 23755 -29464 57723 -13459 23905 31013 606 -2614 -4838 31242
12498 31242 32400 52117 -9760 -35783 -64573 42879 4727 -44538 67899 -48833 -28483
$$ [...]
##END NTUPLES=NMR FID
##END=
