##TITLE=C13_LR-685A-AK2
 D2O, 23300 sc

 4.6.2020
##JCAMPDX= 6.0         $$ Bruker NMR JCAMP-DX V2.0
##DATA TYPE= NMR SPECTRUM
##DATA CLASS= NTUPLES
##ORIGIN= UXNMR, Bruker Analytische Messtechnik GmbH
##OWNER= root
$$ XWIN-NMR		Version 3.5
$$ Fri Jun  5 10:37:33 2020 Russian Standard Time (UT+4h)  she@DPX200
##.OBSERVE FREQUENCY= 50.327896
##.OBSERVE NUCLEUS= ^13C
##.ACQUISITION MODE= SIMULTANEOUS
##.ACQUISITION SCHEME= undefined
##.AVERAGES= 23300
##.DIGITISER RES= 17
##SPECTROMETER/DATA SYSTEM= spect
##.PULSE SEQUENCE= zgpg30
##.SOLVENT NAME= CDCl3
##.SHIFT REFERENCE= (INTERNAL, CDCl3, 0, 222.624)
##AUDIT TRAIL= $$ (NUMBER, WHEN, WHO, WHERE, WHAT)
$$ ##TITLE= Audit trail, XWIN-NMR		Version 3.5
$$ ##JCAMPDX= 5.01
$$ ##ORIGIN= Bruker BioSpin GmbH
$$ ##OWNER= she
$$ F:/spectra/data/she/nmr/c13/1/pdata/1/auditp.txt
$$ ##AUDIT TRAIL=  $$ (NUMBER, WHEN, WHO, WHERE, WHAT)
(   1,<2020-06-05 10:36:07.40 +0400>,<she>,<DPX200>,
      <created by zg, POWCHK disabled, PULCHK disabled
       terminated by command 'halt'
       configuration hash MD5:
       00 E9 B6 7A A2 85 ED C7 34 08 36 98 17 FE 4E 26
       data hash MD5: 32K
       20 96 92 3E C1 53 4A D4 DC 84 8D B0 A9 2B EB 39>)
(   2,<2020-06-05 10:36:13.81 +0400>,<she>,<DPX200>,
      <Start of raw data processing
       efp BC_mod = 2 LB = 1 FT_mod = 6 PKNL = 1 PHC0 = -227.4823 PHC1 = 22.80639 SI = 32K 
       data hash MD5: 32K
       8A 7A DC 67 DA 2F 51 86 A5 5F 26 17 9F 32 82 F9>)
(   3,<2020-06-05 10:36:16.87 +0400>,<she>,<DPX200>,
      <abs ABSG = 5 
       data hash MD5: 32K
       BE E1 EC C9 45 B5 A3 EA 14 04 7C 1D A7 8C EB 9B>)
(   4,<2020-06-05 10:36:44.90 +0400>,<she>,<DPX200>,
      <pk PHC0 = -2.687907 PHC1 = 2.400001 
       data hash MD5: 32K
       FF 9B 92 F1 C6 F8 2D 18 9B CE 02 1A 73 68 72 C6>)
$$ ##END=
$$ 
$$ hash MD5
$$ 42 50 B6 AF AC 05 62 D1 2C 11 FC 9D 98 F8 6D 02
##$RELAX= 
##$RELAX= 
##$RELAX= 
##$RELAX= 
##$RELAX= 
##$RELAX= 
##$RELAX= 
##$RELAX= 
$$ Bruker specific parameters
$$ --------------------------
##$DU= <F:/spectra>
##$EXPNO= 1
##$NAME= <c13>
##$PROCNO= 1
##$TYPE= <nmr>
##$USER= <she>
##$AMP= (0..31)
100 100 100 100 100 100 100 100 100 100 100 100 100 100 100 100 100 100 
100 100 100 100 100 100 100 100 100 100 100 100 100 100 
##$AQSEQ= 0
##$AQ_mod= 1
##$AUNM= <au_zg>
##$AUTOPOS= <>
##$BF1= 50.322709
##$BF2= 200.13
##$BF3= 50.322709
##$BF4= 500.13
##$BF5= 500.13
##$BF6= 500.13
##$BF7= 500.13
##$BF8= 500.13
##$BYTORDA= 1
##$CFDGTYP= 0
##$CFRGTYP= 5
##$CHEMSTR= <none>
##$CNST= (0..31)
1 1 145 1 1 1 1 1 1 1 1 1 1 1 1 1 1 1 1 1 1 1 1 1 1 1 1 1 1 1 1 1 
##$CPDPRG= <waltz16>
##$CPDPRG1= <>
##$CPDPRG2= <waltz16>
##$CPDPRG3= <>
##$CPDPRG4= <mlev>
##$CPDPRG5= <mlev>
##$CPDPRG6= <mlev>
##$CPDPRG7= <mlev>
##$CPDPRG8= <mlev>
##$CPDPRGB= <>
##$CPDPRGT= <>
##$D= (0..31)
0 2 0.00345 0 0 0 0 0 0 0 0 0.03 2e-05 3e-06 0 0 0 0 0 0 0 0 0 0 0 0 0 
0 0 0 0 0 
##$DATE= 1591259360
##$DBL= (0..7)
120 120 120 120 120 120 120 120 
##$DBP= (0..7)
150 150 150 150 150 150 150 150 
$$ [...]
##$SUBNAM4= <"">
##$SUBNAM5= <"">
##$SUBNAM6= <"">
##$SUBNAM7= <"">
##$SUBNAM8= <"">
##$SUBNAM9= <"">
##$SW= 239.972175391363
##$SWIBOX= (0..15)
0 1 3 0 0 0 0 0 0 0 0 0 0 0 0 0 
##$SW_h= 12077.2946859903
##$TD= 32768
##$TD0= 1
##$TE= 0
##$TE2= 300
##$TE3= 300
##$TEG= 300
##$TL= (0..7)
120 120 120 120 120 120 120 120 
##$TP= (0..7)
150 150 150 150 150 150 150 150 
##$TP07= 0
##$TPNAME0= <>
##$TPNAME1= <>
##$TPNAME2= <>
##$TPNAME3= <>
##$TPNAME4= <>
##$TPNAME5= <>
##$TPNAME6= <>
##$TPNAME7= <>
##$TPOAL= (0..7)
0.5 0.5 0.5 0.5 0.5 0.5 0.5 0.5 
##$TPOFFS= (0..7)
0 0 0 0 0 0 0 0 
##$TUNHIN= 0
##$TUNHOUT= 0
##$TUNXOUT= 0
##$USERA1= <user>
##$USERA2= <user>
##$USERA3= <user>
##$USERA4= <user>
##$USERA5= <user>
##$V9= 5
##$VALIST= <valist>
##$VCLIST= <CCCCCCCCCCCCCCC>
##$VD= 0
##$VDLIST= <DDDDDDDDDDDDDDD>
##$VPLIST= <PPPPPPPPPPPPPPP>
##$VTLIST= <TTTTTTTTTTTTTTT>
##$WBST= 1024
##$WBSW= 4
##$XGAIN= (0..3)
0 0 0 0 
##$XL= 0
##$YL= 0
##$YMAX_a= 123949377
##$YMIN_a= -31217759
##$ZGOPTNS= <>
##$ZL1= 120
##$ZL2= 120
##$ZL3= 120
##$ZL4= 120
##$ABSF1= 222.624
##$ABSF2= -17.3728
##$ABSG= 5
##$ABSL= 3
##$ALPHA= 0
##$AQORDER= 0
##$ASSFAC= 0
##$ASSFACI= 0
##$ASSFACX= 0
##$ASSWID= 0
##$AUNMP= <proc_1d>
##$AZFE= 0.1
##$AZFW= 0.5
##$BCFW= 0
##$BC_mod= 2
##$BYTORDP= 0
##$COROFFS= 0
##$CY= -3
##$DATMOD= 1
##$DC= 0
##$DFILT= <>
##$DTYPP= 0
##$F1P= 0
##$F2P= 0
##$FCOR= 0.5
##$FTSIZE= 32768
##$FT_mod= 6
##$GAMMA= 0
##$GB= 0
##$INTBC= 1
##$INTSCL= 4.134877e-10
##$ISEN= 128
##$LB= 1
##$LEV0= 0
##$LPBIN= 0
##$MAXI= 10000
##$MC2= 0
##$MEAN= 0
##$ME_mod= 0
##$MI= 0.1934396
##$NCOEF= 0
##$NC_proc= 1
##$NLEV= 6
##$NOISF1= 120.0001
##$NOISF2= 80.00006
##$NSP= 0
##$NTH_PI= 0
##$NZP= 0
##$OFFSET= 222.624
##$PC= 1.4
##$PHC0= -230.1702
##$PHC1= 25.20639
##$PH_mod= 1
##$PKNL= yes
##$PPARMOD= 0
##$PSCAL= 0
##$PSIGN= 0
##$REVERSE= no
##$SF= 50.3227315989248
##$SI= 32768
##$SIGF1= 140
##$SIGF2= 120
##$SINO= 11.81781
##$SIOLD= 32768
##$SREGLST= <13C.CDCl3>
##$SSB= 0
##$STSI= 32768
##$STSR= 0
##$SW_p= 12077.2946859903
##$SYMM= 0
##$S_DEV= 0
##$TDeff= 32768
##$TDoff= 0
##$TI= <>
##$TILT= no
##$TM1= 0
##$TM2= 0
##$TOPLEV= 0
##$USERP1= <user>
##$USERP2= <user>
##$USERP3= <user>
##$USERP4= <user>
##$USERP5= <user>
##$WDW= 1
##$XDIM= 32768
##$YMAX_p= 346805070
##$YMIN_p= -18436748
$$ End of Bruker specific parameters
$$ ---------------------------------
##NTUPLES= NMR SPECTRUM
##VAR_NAME=  FREQUENCY,     SPECTRUM/REAL,   SPECTRUM/IMAG
##SYMBOL=    X,             R,               I
##VAR_TYPE=  INDEPENDENT,   DEPENDENT,       DEPENDENT
##VAR_FORM=  AFFN,          ASDF,            ASDF
##VAR_DIM=   32768,         32768,           32768
##UNITS=     HZ,            ARBITRARY UNITS, ARBITRARY UNITS
##FACTOR=    0.368581032318806, 1,           1
##FIRST=     11203.0474431902, 0,            0
##LAST=      -874.247242800138, 0,           0
##MIN=       -874.247242800138, -18436748,   0
##MAX=       11203.0474431902, 346805070,    0
$$ Real data points
##PAGE= N=1
##DATA TABLE= (X++(R..R)), XYDATA
$$ [...]
8671A356536J51571Q5009n69372m69640P48353Q83390P96888l56489p13464l87547
$$ 1356536 1508107 1593116 1023744 554104 1302457 2185847 2982735 2626246 1912782 1525235
8661A525235p50064J64038L80421n5326l93869k09558l6339n74311o00629J09366
$$ 1525235 775171 939209 1319630 1264304 870435 660877 624538 50227 -550402 -441036
8651d41036O29051M02880J56762K86108K20464o9240m88209J72845P74326J67297
$$ -441036 188015 590895 747657 1033765 1254229 1184989 696780 869625 1643951 1811248
8641A811248j23086K01937P69191Q27254J262639K106703R20221j097713j602148
$$ 1811248 1688162 1890099 2659290 3486544 4749183 6855886 7776107 6678394 5076246
8632E076246j079205J0352O49496M30378P67409N71239L89191r23785n68677M4922
$$ 5076246 3997041 4007393 4656889 5087267 5854676 6425915 6815106 5891321 5322644 5367566
8622E367566m25513j95104p02812o42048N6586l72177j367317n59189Q46423R61872
$$ 5367566 4942053 4746949 4044137 3402089 3458675 3086498 1719181 1159992 2006415 2968287
8612B968287j81401o59933m49057o00492j243111m85142R70482J428080Q59009
$$ 2968287 2786886 2126953 1677896 1077404 -165707 -650849 319633 1747713 2606722
8603B606722k21247m22982K28608P76125J300764K26660j592571j757661m22305
$$ 2606722 2385475 1962493 2191101 2967226 4267990 4494650 2902079 1144418 722113
8594G22113N83280N06454O09407j528p85581k82073L20399j67122n59757k75401
$$ 722113 1305393 1811847 2421254 2419726 1634145 1352072 1672471 1505349 945592 670191
8584F70191N4442K68735R48152R53674K52151m52312r41296J94373L70244j29358
$$ 670191 724633 993368 1941520 2895194 3147345 2695033 1753737 1948110 2318354 2188996
8574B188996R34402J409054k81862l16161O86062J052170J459598K090230K304709
$$ 2188996 3123398 4532452 4250590 3934429 4620491 5672661 7132259 9222489 11527198
8565A1527198J306484q09620k153689k270904j538027r47432j19271k80455K13601
$$ 11527198 12833682 12024062 9870373 7599469 6061442 5114010 4994739 4714284 4927885
8556D927885O69313j83994j014485q18541l73476K8557j33219j091892q73278
$$ 4927885 5597198 5413204 4398719 3580178 3206702 3235259 3102040 2010148 1136870
8547A136870k09154L71343n39558l92680Q079j53183K2483K47606R84897P03703
$$ 1136870 927716 1299059 759501 366821 374900 221717 244200 491806 1476703 2180406
8537B180406L10043K32649L46676J170466M45696K10806l82229r62717p14406
$$ 2180406 2490449 2723098 3069774 4240240 4685936 4896742 4514513 3551796 2837390
8528B837390p4925O34621k99347p88168j038585j71508P86591J834Q8157M21237
$$ 2837390 2762465 3397086 3097739 2309571 1270986 1099478 1886069 1887903 1976060 2397297
8518B397297k21627j106595n97521M70915L9678o03316M4063l21007j291467j224562
$$ 2397297 2175670 1069075 471554 942469 982147 378831 422894 101887 -1189580 -2414142
8508b414142q23524k73951Q96422J602463P35698N62343P67441L85831N445L85395
$$ -2414142 -3237666 -3511617 -2615195 -1012732 -277034 285309 1052750 1438581 1444026 1829421
8498A829421k0887k72845M7731q9194P1923l04866j57139L46137l34538j100143
$$ 1829421 1808534 1535689 1583420 1494226 1566149 1261283 1104144 1450281 1115743 15600
8488A5600l24654J62093j85116N3476l43511l21184N25455L04730l68360k37298
$$ 15600 -309054 -146961 -332077 -278601 -622112 -943296 -417841 -113111 -481471 -718769
8478g18769K75001k74994r41576m45690n0210L15271Q67790Q49998k70828L47372
$$ -718769 -443768 -718762 -1660338 -2106028 -2156238 -1840967 -973177 -123179 -394007 -46635
8468d6635J39898j88482l74634m53675m35946K289o6149m90079o68251N33437
$$ -46635 93263 -95219 -469853 -923528 -1359474 -1357185 -1423334 -1913413 -2581664 -2048227
8458b048227Q16689J44644j52142k19952l4098j31256J047981P65168N97833p04728
$$ -2048227 -1231538 -1086894 -1239036 -1458988 -1493086 -1624342 -576361 188807 786640 81912
8448H1912j218108k31872m09445J0749L72709L22321M82385L13996M035N03166
$$ 81912 -1136196 -1368068 -1777513 -1766764 -1394055 -1071734 -589349 -275353 -271318 231848
8438B31848O31052M8195q57103j220944k46540O59052O06121N1432L94692J92979
$$ 231848 862900 911095 53992 -1166952 -1413492 -754440 -148319 -96887 297805 490784
8428D90784l71055J70226K82164l58880k70521j26623L13123J080880M14087j40962
$$ 490784 119729 289955 572119 213239 -57282 -183905 129218 1210098 1624185 1483223
8418A483223m41350k61621l6958J49655k40165o54317l97291R7845N13874J78203
$$ 1483223 1041873 780252 743294 892949 652784 -1533 -398824 -300979 212895 391098
8408C91098J70887l54125p01283q97692J72689J071057l36558j292836l54851
$$ 391098 561985 207860 -493423 -1391115 -1218426 -147369 -483927 -1776763 -2131614
8399b131614K05798J3787m86186K90003J225747Q81866J51856n65746j6173k71346
$$ -2131614 -1925816 -1912029 -2398215 -2108212 -882465 -599 151257 -414489 -430662 -702008
8389g02008r27318j01504L55075O00233N97748j80869n10251J71395L23279L407
$$ -702008 -1629326 -1730830 -1375755 -775522 -177774 -358643 -868894 -697499 -374220 -370813
8379c70813J19258K66028K65871j18140j45173J29488k01266k71755j89718o0022
$$ -370813 -251555 14473 280344 162204 17031 146519 -54747 -326502 -516220 -576242
8369e76242L66695k76057l05312m24117K75870Q32343J63258l15104j79399M75949
$$ -576242 -209547 -485604 -790916 -1215033 -939163 -106820 56438 -258666 -438065 37884
8359C7884J41178l56608l66460J22703N46900K50787L65736m73900o31768r7529
$$ 37884 179062 -177546 -544006 -421303 125597 376384 742120 268220 -363548 -461077
8349d61077q1532J65231J217099J095824Q0427M08380o5434p87753o26383l84285
$$ -461077 -542609 -377378 839721 1935545 2015972 2424352 2358918 1571165 944782 560497
8339E60497j48942j188337j400072J89808J122886M13091N67674J41060o84482
$$ 560497 411555 -776782 -2176854 -1987046 -864160 -451069 116605 257665 -426817
8330d26817j82151L29598P95463M27342J13493j42573o70302p38388n52816k48265
$$ -426817 -608968 -279370 516093 943435 1056928 914355 244053 -494335 -1047151 -1295416
8320a295416L62458m2698P8816N19476L67536n67272k34966M47769L64336J425656
$$ -1295416 -932958 -975656 -896840 -377364 -9828 -577100 -812066 -364297 39 1425695
8310A425695M73113j29735p2094J72754P41647K91442L1992r30317j373063p63679
$$ 1425695 1898808 1769073 1696979 1869733 2611380 2902822 2934814 2004497 631434 -132245
8300a32245j64374j86295j8068M29198j2515K80703J276224N19408m19930p01482
$$ -132245 -296619 -482914 -500982 -71784 -84299 196404 1472628 1992036 1572106 870624
8290H70624j094312j032821L5358Q80696O66337M63270N04208J34494J54503K77242
$$ 870624 -223688 -1256509 -1221151 -340455 325882 789152 1293360 1427854 1582357 1859599
8280A859599n55886r63095k45437r4928m3065L35943k66204J7755R13811J137066
$$ 1859599 1303713 340618 95181 253 -42812 293131 26927 44682 958493 2095559
8270B095559O72778n14941j638711j535385m39998L34662O73815M92102J85781
$$ 2095559 2768337 2253396 614685 -920700 -1360698 -1026036 -352221 139881 325662
8261C25662M52388R9525J46560l50813r41072J3913L61276n22080l50104O81353
$$ 325662 778050 877575 1024135 673322 -267750 -253837 107439 -414641 -764745 -83392
8251h3392N13668L51520J145998L10410n4084j183307j074471j10858K27514N41913
$$ -83392 430276 781796 1927794 2238204 2184120 1000813 -73658 -184516 42998 584911
8241E84911k5164k85772J78111j0253j013625M8994O96269Q1420l67904l10124
$$ 584911 559747 273975 452086 441833 -571792 -522798 173471 254891 -113013 -423137
8231d23137l12739j70793l21810K99735N89509M15342L4968N4736k649k18547
$$ -423137 -735876 -906669 -1228479 -928744 -339235 76107 111075 165811 163162 -55385
8221e5385J05766K76212l51138j79392O00907M17969l85351p38025j74790J226544
$$ -55385 50381 326593 -24545 -203937 396970 814939 429588 -308437 -483227 743317
8211G43317O90573r60616n52406O55381O6125n11717l10239J79732m24160k91464
$$ 743317 1433890 473274 -79132 576249 642374 130657 -179582 150 -424010 -715474
8201g15474m92186r86754n71019J0886M37078P82297J750130J540437L97840l65338
$$ -715474 -1207660 -2194414 -2765433 -2754547 -2317469 -1535172 214958 1755395 2153235 1787897
8191A787897o48343r74148q22596l46308M47255J301022Q18247R41j00331m22494
$$ 1787897 1139554 165406 -657190 -1003498 -556243 744779 1563026 1563967 1463636 1041142
8181A041142o39371m20740O48239J445213O29800j146114q62463K1870J87134
$$ 1041142 401771 -18969 629270 2074483 2704283 1558169 695706 717576 904710
8172I04710j53081j081902j163732m81841P35305R60052M32559K59499N37458
$$ 904710 751629 -330273 -1494005 -1975846 -1240541 -280489 152070 411569 949027
8163I49027r732L44498K24808l34396r3726k107m01734n25385o15292n57257n63306
$$ 949027 939295 1283793 1508601 1174205 1080479 1078372 676638 151253 -464039 -1021296 -1584602
8152a584602l47024j40566K43055Q87384K46223R5636J13611m64323m78107Q81585
$$ -1584602 -1931626 -2072192 -1829137 -941753 -695530 -599894 -486283 -950606 -1428713 -547128
8142e47128R07593r9342j97993q72753k9584O82567O66017L30615m46200q05508
$$ -547128 360465 261123 63130 -809623 -839207 -156640 509377 839992 393792 -411716
8132d11716N4844j2520p35739M31773J206386j62220n70721j48869j4444J50485
$$ -411716 -356872 -369392 -1105131 -673358 533028 370808 -199913 -348782 -363226 -212741
8122b12741l18926q51823m95506m52044o90072j38860Q38397R55416O00970J60267
$$ -212741 -531667 -1383490 -1878996 -2331040 -3021112 -3159972 -2321575 -1366159 -765189 -604922
8112f04922n9342j65418M18486M63808k42959r14290J95197R72638P81305J02409
$$ -604922 -664264 -829682 -411196 52612 -190347 -1104637 -909440 63198 844503 946912
8102I46912O05894l48557q88050j27853k4641L88499N00438L79940o860n61723
$$ 946912 1552806 1204249 316199 188346 163705 552204 1052642 1432582 1425722 863999
8092H63999l91989l5811J08816L26576m13379r28534j292844n86518J71596J56999
$$ 863999 472010 436199 545015 871591 458212 -470322 -1763166 -2349684 -2178088 -2021089
8082b021089R82387P71101k726L53387L82975p64188q43876N35717J249343J043594
$$ -2021089 -1038702 -267601 -270327 83060 466035 -298153 -1142029 -606312 643031 1686625
8072A686625M7474r38525q24263q54231o45683J41454K34347K84998N45859l39237
$$ 1686625 1734099 795574 -28689 -882920 -1528603 -1387149 -1152802 -867804 -321945 -661182
8062f61182k76325j25892j3622M69914J83569J294991J314619M57306r7607l10844
$$ -661182 -937507 -1063399 -1077021 -607107 -423538 871453 2186072 2643378 2545771 2234927
8052B234927L7660m47523j142462p58317o32219j95345L46396O84375J76562O22522
$$ 2234927 2272587 1825064 682602 -75715 -707934 -903279 -556883 127492 304054 926576
8042I26576Q70455l99320o67382j453j56094M03389K81160o87323k19644m72464
$$ 926576 1797031 1397711 730329 728876 572782 976171 1257331 570008 350364 -122100
8032a22100m35569J62962j26778k33213K6514O03307O44970N65832L23308M85629
$$ -122100 -557669 -394707 -521485 -754698 -728184 -124877 520093 1085925 1409233 1894862
8022A894862L24685l11526m16029K05978M27821o51825j153663l89106m50100
$$ 1894862 2219547 1908021 1491992 1697970 2125791 1473966 320303 -68803 -518903
8013e18903m67858m81037m63414L48652J180003o2652q62928n05009O85923J002271
$$ -518903 -986761 -1467798 -1931212 -1582560 -402557 -465209 -1328137 -1833146 -1147223 -144952
8003a44952J224481J158585P08439n63581j307573j264369r36379m2762M85551
$$ -144952 1079529 2238114 2946553 2382972 1075399 -188970 -1125349 -1168111 -682560
7994f82560Q89644Q48856M28202p46108j278651q73178N92851J106489M95055
$$ -682560 207084 1055940 1484142 738034 -540617 -1413795 -820944 285545 780600
7985G80600M09007m56662J52993O54134J069039J141553J036952J105082O23482
$$ 780600 1189607 732945 885938 1540072 2609111 3750664 4787616 5892698 6516180
7976F516180n60702j327701j399122j626936p72530L94485O55144n21006j601673
$$ 6516180 5955478 4627777 3228655 1601719 829189 1223674 1878818 1357812 -243861
7967b43861o47034P08143J014542l70669n77881j202853j319348l23157J76581
$$ -243861 -890895 -182752 831790 461121 -116760 -1319613 -2638961 -2962118 -2785537
7958b785537L97758R77007N66010m5367j80813P4216l1691J52273n0329K1340
$$ -2785537 -2387779 -1410772 -844762 -890129 -1070942 -996726 -1028417 -876144 -926473 -905133
7948i05133j63783P9797M5486m65354L21482j63478p72651J87116O77837Q57410
$$ -905133 -1068916 -989119 -943633 -1408987 -1087505 -1250983 -2023634 -1836518 -1158681 -301271
7938c01271P01286m17645j122538r17306j41780m31562m78882M07608R72946Q75420
$$ -301271 400015 -17630 -1140168 -2057474 -2199254 -2630816 -3109698 -2702090 -1729144 -853724
7928h53724O248l35306l71087l34812n05332J00729J385790J261169k49749n497
$$ -853724 -847476 -1182782 -1553869 -1888681 -2394013 -2293284 -907494 353675 103926 98429
7918I8429K00140l93696k40608L20355O4717j4209N16175r0882m06705l34716
$$ 98429 298569 -95127 -335735 -15380 49337 35128 551303 460421 53716 -281000
7908b81000L0182o9701O35041O72294j77483k5032L10050J373389P97893m03081
$$ -281000 -250818 -320519 314522 986816 809333 784301 1094351 2467740 3265633 2862552
7898B862552r33504o42442k05573l58894r7480O33542Q55080N06505L44995N9127
$$ 2862552 1929048 1286606 1081033 722139 624659 1258201 2113281 2619786 2964781 3023908
7888C023908n43074l09870O0730K68648L68297K74906n48491J07269o02893j623627
$$ 3023908 2480834 2170964 2231694 2500342 2868639 3143545 2595054 2702323 2099430 475803
7878D75803j108006j005640m85726k017O79907K25287J18829P90125R83507L35624
$$ 475803 -632203 -1637843 -2123569 -2125586 -1445679 -1220392 -1101563 -311438 672069 1007693
7868A007693o75776j104628L9678M31370M27607k20071n13219K14158K26680J54657
$$ 1007693 331917 -772711 -733033 -301663 125944 -94127 -607346 -393188 -166508 -11851
7858a1851O63504L41744k73389l1665N49590Q7677k9030n95897n34865m53443
$$ -11851 651653 993397 720008 688343 1237933 1325610 1296580 700683 165818 -287625
7848b87625n45257n31043l52303M56579J479151J091162K09852n48359k59383
$$ -287625 -832882 -1363925 -1716228 -1259649 219502 1310664 1520516 972157 712774
7839G12774N80662M43511j17441p5790M9881N09233P8124k55846k84023K65427
$$ 712774 1293436 1736947 1619506 1543716 1593597 2102830 2180954 1925108 1641085 1906512
7829A906512n98540j266982o21532n69748k46078L9591j4075K22336O24518j771
$$ 1906512 1307972 40990 -580542 -1150290 -1396368 -1356777 -1370852 -1148516 -523998 -525769
7819e25769j177682j47331M31469j07377j34482L47849P82535M82316m63263o39729
$$ -525769 -1703451 -1850782 -1419313 -1526690 -1661172 -1313323 -530788 -48472 -511735 -1151464
7809a151464r7469m22749P10610J152147j15134j04846j10002K93000P41097M27863
$$ -1151464 -1248933 -1671682 -961072 191075 75941 -28905 -138907 154093 895190 1323053
7799A323053j143445p54582K14711J27137K80571o6992o27160m17668M07610J26663
$$ 1323053 179608 -574974 -360263 -233126 47445 -19547 -646707 -1064375 -656765 -530102
7789e30102L13729J277291Q31862j4598P3283K46964J005461O59350Q040L19299
$$ -530102 -216373 1060918 1892780 1878182 1951465 2198429 3203890 3863240 3871280 4190579
7779D190579K26164L33610O4878J217287K598256K178645Q40298p75673k315857
$$ 4190579 4416743 4750353 4815231 6032518 8630774 10809419 11649717 10874044 8558187
7770H558187k602273k395172j644645r95525P65442Q99545n0488l35569q33368
$$ 8558187 5955914 3560742 1916097 920572 1686014 2585559 2535071 2199502 1366134
7761A366134n79791K11784m61641l66637L80964N85868K21794l98527k41968l20773
$$ 1366134 786343 998127 536486 169849 550813 1136681 1358475 959948 717980 397207
7751C97207o62222m44223j52327N33462K73361L11968L34304j284419j523482
$$ 397207 -265015 -709238 -861565 -328103 -54742 257226 591530 -692889 -2216371
7742b216371m00836P92915L65961l46199L32644K51656m16116M42424O29768L10574
$$ -2216371 -2617207 -1824292 -1458331 -1804530 -1471886 -1220230 -1636346 -1193922 -564154 -253580
7732b53580J128977Q66478J93794l70199q83913J67777K5831l20878m17225N28480
$$ -253580 875397 1741875 1935669 1565470 681557 849334 875165 554287 137062 665542
7722F65542Q70955M95056k1723l23050n48408n05916K52548M16508J43973l23723
$$ 665542 1536497 2031553 2009830 1686780 1138372 632456 885004 1301512 1445485 1121762
7712A121762M13939N77931O95660Q34607m33201q41183j243060o06927o5669Q7912
$$ 1121762 1535701 2113632 2809292 3643899 3210698 2369515 1126455 519528 453859 541771
7702E41771n5141K7121l43069N2107m0192j9982P74552M05022L37593M75611J031766
$$ 541771 486630 513751 170682 222789 182597 162615 937167 1342189 1679782 2155393 3187159
7691C187159M08549q65417O96881M90573q71755m1642M22226K98792l17983r65927
$$ 3187159 3595708 2730291 3427172 3917745 3045990 3004348 3426574 3725366 3407383 2441456
7681B441456Q0215N28381j46745j125817j161146l32512N78027J313742M84957
$$ 2441456 2521671 3050052 2903307 1777490 616344 283832 861859 2175601 2660558
7672B660558l08881p47174p12994q63140o41573M84877J151591M66343O4688o58759
$$ 2660558 2351677 1604503 891509 28369 -613204 -128327 1023264 1489607 1554295 895536
7662H95536l95447L6462l29059l88898K70051O76520L28597N9461K80143q8981
$$ 895536 500089 536551 207492 -181406 88645 765165 1093762 1153223 1433366 1344385
7652A344385o61606l3312o1984k08657N51580P98921M51836p35382j624921p36740
$$ 1344385 682779 649467 587483 378826 930406 1729327 2181163 1445781 -179140 -915880
7642i15880l76384k41597L89842M52820Q94927P68675l44277j26136J23770N63468
$$ -915880 -1292264 -1533861 -1144019 -691199 203728 972403 628126 501990 625760 1189228
7632A189228J445950L12427K43229l12310k59601K89149k31958o62237j042469
$$ 1189228 2635178 2947605 3190834 2878524 2618923 2908072 2676114 2013877 971408
7623I71408p60334l05540J86303R28427Q79903J64083M51523M46504m37214o06044
$$ 971408 211074 -94466 91837 1020264 1900167 2064250 2515773 2962277 2525063 1919019
7613A919019j018298p85058J061216J269121n74248j351555P8872J55409Q813
$$ 1919019 900721 115663 1176879 2446000 1871752 520197 599069 754478 763291
7604G63291M25935M9515M05048R62629o4919k20220j04819N01308N50240L77329
$$ 763291 1189226 1238741 1643789 2606418 2541499 2321279 2216460 2717768 3268008 3645337
7594C645337j34485m43901J67223k29205q36998l94702k35945p70966m00396N09284
$$ 3645337 3510852 3066951 3234174 3004969 2167971 1773269 1537324 766358 365962 875246
7584H75246R4274J84388L62852K33138K07492p0586l03664k71022n76912l28673
$$ 875246 969520 1153908 1516760 1749898 1957390 1886804 1583140 1312118 735206 406533
7574D06533k97161l13703Q35632R97940K78664j01680K93237K06200l92850l30538
$$ 406533 109372 -204331 631301 1629241 1907905 1806225 2099462 2305662 1912812 1582274
7564A582274j118289m24419M7899k43721o027J89926M88818K47243l1194P29663
$$ 1582274 463985 39566 87465 -156256 -162283 27643 516461 763704 732510 1462173
7554A462173J88307J12417q0987n68353J12502J79078q3867r8986l72600k02625
$$ 1462173 1650480 1762897 1681910 1113557 1226059 1405137 1321270 1222284 849684 647059
7544F47059M12923o0831l25796l44369j150327l36081J570245J191958N22002
$$ 647059 1059982 999151 673355 328986 -821341 -1157422 412823 1604781 2126783
7535B126783j3584L7561k99957l85978o86526m23072o75993Q8076M38252P74963
$$ 2126783 2113199 2150760 1850803 1464825 778299 355227 -320766 -232690 205562 980525
7525I80525O87889k16764p24013J15912O6819M81330Q00764O1133j384179j502356
$$ 980525 1668414 1451650 727637 843549 910368 1391698 2192462 2253595 869416 -632940
7515f32940p206O5405N62642L10345N81548N32292k09421n76642l28542K10570
$$ -632940 -640146 -574741 -12099 298246 879794 1412086 1202665 626023 297481 508051
7505E08051O98869j8291m92291m85532l57203K8552K60239P21031N58926K63661
$$ 508051 1206920 1188629 696338 210806 -146397 -117845 142394 863425 1422351 1686012
7495A686012O76696K58313m13071p16122l56916l53277p91855j555914j332191
$$ 1686012 2362708 2621021 2207950 1491828 1134912 781635 -10220 -1566134 -2898325
7486b898325m81396P96669J309286L50336l64174N88462O67710N69841j9340n74200
$$ -2898325 -3379721 -2583052 -1273766 -923430 -1287604 -699142 -31432 538409 519069 -55131
7476e5131o60060k02330P00857J66156k57575l32793L61422J52789o1643j15150
$$ -55131 -715191 -917521 -216664 -50508 -308083 -640876 -279454 -126665 -188308 -303458
7466c03458Q9248m8105o2783q8584l97095m58839M26956L1787M49421Q27187Q23605
$$ -303458 -214210 -262315 -325098 -413682 -810777 -1269616 -842660 -810873 -361452 465735 1289340
7455A289340K2465j87229J04043M45881J53130R97881N67740p14898n22300J73592
$$ 1289340 1311805 1124576 1228619 1674500 1827630 2825511 3393251 2678353 2156053 2329645
7445B329645n8721p29623j15610n93604o41085m27894l31612M41009R53665k08977
$$ 2329645 2270924 1541301 1425691 832087 191002 -236892 -568504 -127495 826170 617193
7435F17193l43239p75505j33509R95826l9073R4622J701969P77434p00403q93952
$$ 617193 273954 -501551 -635060 360766 321693 416315 2118284 2895718 2195315 1301363
7425A301363j24837k58638n66768l61249m4701m04131L02352K96350l77066q84911
$$ 1301363 1176526 917888 351120 -10129 -54830 -458961 -156609 139741 -237325 -1122236
7415a122236M66953O14715m74264q35665j75639J78573O38323P23958N22028J165676
$$ -1122236 -655283 -40568 -514832 -1350497 -1526136 -1347563 -709240 14718 536746 1702422
7405A702422P03817j69770j170472l16899Q22532M15636p87734r83368L25392
$$ 1702422 2406239 2236469 1065997 749098 1571630 1987266 1199532 216164 541556
7396E41556O59674n47990n12707m47k29177l81380o19322k35264M66201j21370
$$ 541556 1201230 653240 140533 140086 -89091 -470471 -1089793 -1325057 -858856 -980226
7386i80226m89637j00499k82681J4117m59171n97347J81977K2875l735O45183
$$ -980226 -1469863 -1570362 -1853043 -1838926 -2298097 -2895444 -2713467 -2690592 -2694327 -2049144
7376b049144L81038k5758R41715P41380K46023m08384m39918J97766J98161o58635
$$ -2049144 -1668106 -1693864 -752149 -10769 235254 -173130 -613048 -415282 -217121 -875756
7366h75756n01405L73566K85666J75629K75412q6384L82518O26406M98431M42321
$$ -875756 -1377161 -1003595 -717929 -542300 -266888 -353272 29246 655652 1154083 1596404
7356A596404j37850P8054p33432j027586J37530J305970N66939j46468j09064
$$ 1596404 1458554 1536608 803176 -224410 -86880 1219090 1786029 1639561 1530497
7347A530497M51788L98692l71303m90562j35748J16925K66562J47895J84571j8508
$$ 1530497 1982285 2380977 2009674 1519112 1383364 1500289 1766851 1914746 2099317 2080809
7337B080809n74183l92290l09499j98455k0391J103021Q44774m0736l00990K38527
$$ 2080809 1506626 1114336 804837 606382 585991 1689012 2533786 2493050 2192060 2430587
7327B430587N02933m72227j18388l1790r96256q36673l41561l962j48437k22810
$$ 2430587 2933520 2461293 2342905 2311115 1314859 478186 136625 132663 -15774 -238584
7317b38584N05056N07706j56009p3540L28359J28815M9068k09999p60466r34896
$$ -238584 266472 774178 618169 544629 872988 1001803 1050871 840872 80406 -854490
7307h54490n59713j81388L68122M58955N24295M18348j82580j61474L05160Q05668
$$ -854490 -1414203 -1595591 -1227469 -768514 -244219 174129 -8451 -169925 135235 940903
7297I40903l09593q97919j171232o04144N40917P77939K95966L81736K47663m76541
$$ 940903 631310 -266609 -1437841 -2041985 -1501068 -723129 -427163 -45427 202236 -274305
7287b74305l63004J48136N36053K72430J231Q82782J250976l9552r07001m66523
$$ -274305 -637309 -489173 46880 319310 320541 1203323 2454299 2414747 1507746 1041223
7277A041223O7825n28868r0238J143562Q61178L3421M11582k3814j258723q43596
$$ 1041223 1109048 580180 489942 1633504 2494682 2528103 2939685 2915871 1657148 813552
7267H13552r95220q48984m09530j82620M08959Q68754N78664q8545r9814J00312
$$ 813552 -181668 -1030652 -1440182 -1622802 -1213843 -345089 233575 145030 45216 145528
7257A45528L70745J151043J90721p21172K6712P60042R9005k75389k7987M50758
$$ 145528 516273 1667316 1858037 1136865 1163577 1923619 2022624 1747235 1719248 2170006
7247B170006R24256O76689K43526n77771j818280j180816J97627Q80575K03780
$$ 2170006 3094262 3770951 4014477 3436706 1618426 437610 635237 1515812 1719592
7238A719592l55774K05731q7881n79556m16815O79507Q38744k65871j008893p24184
$$ 1719592 1363818 1569549 1481668 902112 485297 1164804 2003548 1737677 728784 4600
7228D600J71289N32803J91773K22016M41940j34765q08677p93952k67691j72311
$$ 4600 175889 708692 900465 1122481 1564421 1429656 620979 -172973 -440664 -612975
7218f12975J47716N625r0060L62984q0936r6379j51205J98397K84707j91821O74196
$$ -612975 -465259 -459634 -549694 -186710 -267646 -364025 -515230 -316833 -32126 -223947 450249
7207D50249K07239l15040n60862l14469K8579J85567J80978O81916o7058j314793
$$ 450249 657488 342448 -218414 -532883 -504304 -318737 -137759 544157 477099 -837694
7197h37694n46070q0560j87803N26504Q60091n7557p3643K13396P71694L12253
$$ -837694 -1383764 -1464324 -1652127 -1125623 -265532 -323089 -396732 -183336 588358 900611
7187I00611J65525J218195N62533r30604j074532l62331J60248j00859J76195
$$ 900611 1066136 2284331 2846864 1916260 841728 479397 639645 538786 714981
7178G14981j07656m25766k09545o0279L53361L93378M03250o48795j304070L26138
$$ 714981 607325 181559 -27986 -88265 265096 658474 1061724 412929 -891141 -565003
7168e65003R87768j16547r67457n18738K3199J89562P33857J040662M66158k32881
$$ -565003 422765 306218 -661239 -1179977 -1156778 -967216 -233359 807303 1273461 1040580
7158A040580q55313j107580o18340O4105J147151J276527M07495m99835L16315
$$ 1040580 185267 -922313 -1540653 -1476548 -329397 947130 1354625 854790 1171105
7149A171105K24611j014486j054237m53930R69519M50177k54530k593j02225k73837
$$ 1171105 1395716 381230 -673007 -1126937 -157418 292759 38229 35636 -66589 -340426
7139c40426M81051N92394L61915Q69185R82003Q25478J03616n36483o46687k91776
$$ -340426 140625 733019 1094934 1964119 2946122 3771600 3875216 3338733 2692046 2400270
7129B400270j41904k63363o51751j234077n54309l69724p8396J02662K86576R73693
$$ 2400270 2258366 1995003 1343252 109175 -445134 -814858 -893254 -790592 -504016 469677
7119D69677J694048R73621J91245n50580r24942l71336o58646p85668j55919N33359
$$ 469677 2163725 3137346 3328591 2778011 1853069 1481733 823087 37419 -118500 414859
7109D14859P51137p3544l06601M76622n5294l83548j40547q90q03326l61542j37254
$$ 414859 1165996 1092452 785851 1262473 1207179 823631 683084 682194 -121132 -482674 -619928
7098f19928l08414J15210P28365J074109K57608j19517n98262j016462o67918
$$ -619928 -928342 -813132 -84767 989342 1246950 1127433 529171 -487291 -1155209
7089a155209Q54849J150488L12826o38483o55407j61570O31076J74440l74060
$$ -1155209 -300360 850128 1162954 524471 -130936 -292506 338570 513010 138950
7080A38950L36340J81603k82170m37390L9045p7949o86454r8603K72366O55515
$$ 138950 475290 656893 374723 -62667 -23622 -101571 -788025 -886628 -614262 41253
7070D1253P2155M5053N24412j70803m35822n21142k3763P15421L75073k13481
$$ 41253 113408 158461 682873 512070 76248 -444894 -468657 246764 621837 408356
7060D08356j51710M5544J32040J9398j29332K6642k33154M09149J250963N62882
$$ 408356 256646 302190 434230 453628 324296 350938 117784 526933 1777896 2340778
7050B340778N29641J6951q30772p62779j61443l56178N17893M96673k13523N149
$$ 2340778 2870419 2887370 2056598 1293819 1132376 776198 1294091 1790764 1577241 1582390
7040A582390K31304j73494n88762l61617K40505J96828n55707Q3648O34926K47135
$$ 1582390 1813694 1640200 1051438 689821 930326 1127154 571447 655095 1290021 1537156
7030A537156k26747j44410p7941n64016j38828l94926j416541p48987k75833M04456
$$ 1537156 1310409 1165999 1088058 524042 385214 -9712 -1426253 -2175240 -2451073 -2046617
7020b046617J285066Q52080k02526l27677k11998O2150n146O32149J110241N84439
$$ -2046617 -761551 90529 -111997 -439674 -651672 -589522 -594668 37481 1147722 1732161
7010A732161P5663j01610P17076J72920j289577j173211Q7768O82208r914p40717
$$ 1732161 1807824 1706214 2423290 2596210 1306633 133422 221190 903398 893484 152767
7000A52767k66256l15957l82844Q89267J46512m73788R84167J081091Q423M81486
$$ 152767 -113489 -429446 -812290 76977 223489 -250299 733868 1814959 1823382 2304868
6990B304868P02106m50111q99010r51207o87132p02538n85161m78995j78395k66360
$$ 2304868 3006974 2556863 1657853 706646 19514 -683024 -1268185 -1747180 -1925575 -2191935
6980b191935J14661Q61915L30827O61026N05276l05968m63663m58347j46525N91777
$$ -2191935 -2077274 -1215359 -884532 -223506 281770 -24198 -487861 -946208 -1092733 -500956
6970e00956J33793l37036N29030P08540Q08875L03480K40837N39952r86933q48829
$$ -500956 -367163 -704199 -175169 533371 1342246 1645726 1886563 2426515 1439582 590753
6960E90753P18985L10194o20801l52111l45036L90169R91454N75620N2765N1724
$$ 590753 1309738 1619932 999131 647020 301984 692153 1683607 2259227 2311992 2363716
6950B363716N58776k92814o06973J29910k92885n52279l95492l15008K20053K88856
$$ 2363716 2922492 2629678 2022705 2152615 1859730 1307451 911959 596951 817004 1105860
6940A105860p23366o67854j92687L07648N71553N79477R22538M09302o02659n44644
$$ 1105860 382494 -285360 -478047 -170399 401154 980631 1903169 2312471 1709812 1165168
6930A165168k53235q87918p95711o19485k73239J739523J299626K96482r6604
$$ 1165168 911933 24015 -771696 -1391181 -1664420 75103 1374729 1671211 1574607
6921A574607o63692J26605N1280k82689L05681J103438N65705J33697J69428Q03764
$$ 1574607 910915 1037520 1088800 806111 1111792 2215230 2780935 2914632 3084060 3887824
6911C887824L64698n41597j366068j136408r69133l94908r8746K50520m10028
$$ 3887824 4252522 3710925 2344857 1208449 239316 -155592 -254338 -3818 -413846
6902d13846m17387N71619O72994m05643p56343l14586K94868n5747q7440M83280
$$ -413846 -831233 -259614 413380 7737 -748606 -1063192 -768324 -824071 -911511 -428231
6892d28231R01626j5627n96625Q7872K33194K4661j3686o48467J9658Q44817N62804
$$ -428231 473395 457768 -138857 -50985 182209 206870 193184 -455283 -435625 409192 971996
6881I71996O30802k78830l2138J95447j08461j90195m4129m45669j02703o15575
$$ 971996 1602798 1323968 1291830 1487277 1378816 1188621 1144492 698823 596120 -19455
6871a9455j084626l26204K55779J273714P50893l3788n2414M60269Q26498K58214
$$ -19455 -1104081 -1430285 -1174506 99208 850101 816313 763899 1224168 2050666 2308880
6861B308880J63157j54974r84390r61077o57985L42L68665M48418j20187n47691
$$ 2308880 2472037 2317063 1332673 371596 -286389 -286047 82618 531036 410849 -136842
6851a36842J91403l64335n41372r87534r86846j95823J008798J182532j6041m05192
$$ -136842 54561 -309774 -851146 -1838680 -2825526 -3021349 -2012551 -830019 -846060 -1251252
6841a251252K01762K08910Q87002J865523J552427K39844j734688j335219m85136
$$ -1251252 -1049490 -840580 46422 1911945 3464372 3704216 1969528 634309 149173
6832A49173j298528l75335n13762m6497J278503K50427m79484n719L7713L85278
$$ 149173 -1149355 -1524690 -2038452 -2084949 -806446 -556019 -1035503 -1041222 -1003509 -618231
6822f18231P53347P03893O74580L07166j60555n76890m77096m80892K76152J69649
$$ -618231 135116 839009 1513589 1820755 1660200 1083310 606214 125322 401474 571123
6812E71123l45752l10327q7300Q38989J204374O93789j251346j458958n91330
$$ 571123 225371 -84956 -172256 666733 1871107 2564896 1313550 -145408 -736738
6803g36738K62503L41471M73538J98196n01085L49027l41102k94387L48050Q6399
$$ -736738 -474235 -132764 340774 538970 37885 386912 45810 -248577 99473 185872
6793A85872O3366N66451J149791K76649p41464p86108p40098p18622k82612O92035
$$ 185872 249238 815689 1965480 2242129 1500665 714557 -25541 -744163 -1026775 -334740
6783c34740M59978P5021j58383q79393l47909o7689j48633k35896J93355N92765
$$ -334740 125238 200259 41876 -837517 -1185426 -1253115 -1401748 -1637644 -1444289 -851524
6773h51524R93177M92746P38548O93113J17306j348227j613947q55066j65003
$$ -851524 141653 634399 1372947 2066060 2183366 835139 -778808 -1633874 -1798877
6764a798877l75566n38993M5992P64875Q51079r7000o27049J86246N50753P69684
$$ -1798877 -2174443 -2713436 -2667444 -1902569 -1051490 -1148490 -1775539 -1589293 -1038540 -268856
6754b68856L7113n88250m14602N51295k23317O6704Q70546L60301j58944o12822
$$ -268856 -231743 -819993 -1234595 -683300 -906617 -839913 30633 390934 231990 -380832
6744c80832k63897L12181j28216L6987P25719P16206J266409M35327o00143k19294
$$ -380832 -644729 -332548 -460764 -423777 301942 1018148 2284557 2719884 2119741 1900447
6734A900447j17815m7707L48936l90343j94036k39586k43920j0499q132j69252
$$ 1900447 1782632 1734925 2083861 1693518 1499482 1259896 1015976 1005477 997345 828093
6724H28093L31540O71810P78919l75297o88487l4873O35469Q5462o93901j87387
$$ 828093 1159633 1831443 2610362 2235065 1546578 1511705 2147174 2232636 1538735 1351348
6714A351348M32167N86371l5654p90689q25903m80272j63130N38308R49994N7827
$$ 1351348 1783515 2369886 2334232 1543543 717640 237368 74238 612546 1562540 1620367
6704A620367r75047l54008J027153J64702l62098m42366L7887q1592j0868m54859
$$ 1620367 645320 291312 1318465 1483167 1121069 678703 716590 634998 624130 169271
6694A69271J01121p80414j700347p04282P66889J756585R78726k95473N5489k9403
$$ 169271 270392 -510022 -2210369 -2914651 -2147762 -391177 587549 292076 347565 318162
6684C18162m9449L65081p6523j36167J109192M90527n14049j58876o91325r85941
$$ 318162 268713 633794 557271 421104 1530296 2020823 1506774 1347898 656573 -329368
6674c29368J63390O31155r4725J04263L4777J56154L11931j72775o99911n36718
$$ -329368 -165978 465177 370452 474715 509492 665646 977577 804802 104891 -431827
6664d31827m16673j155044k76671J296030P76356l30337m53527j36950l98134
$$ -431827 -848500 -2003544 -2280215 -984185 -207829 -538166 -991693 -1128643 -1526777
6655a526777q6086M60437M84661q7058p19182J98773Q74234J136955J200183J8783
$$ -1526777 -1612863 -1152426 -667765 -754823 -1474005 -1275232 -400998 735957 1936140 1954923
6645A954923q21393r03358l61883N25507J113642M91585n77608l46828k53492
$$ 1954923 1133530 230172 -131711 393796 1507438 1999023 1421415 1074587 821095
6636H21095p79837n28292L68151P88966Q31789J24912n73991m09847n24683N52941
$$ 821095 41258 -487034 -118883 670083 1501872 1626784 1052793 642946 118263 671204
6626F71204J014162N16538J86531l94904l61301J2684j47849n94737o20769L33439
$$ 671204 1685366 2201904 2388435 1993531 1632230 1644914 1497065 902328 281559 614998
6616F14998N7383l40820M6972l7131L02104Q92226M09322l6456p1192m39511j59803
$$ 614998 672381 331561 378533 341402 643506 1535732 1945054 1908598 1837406 1397895 1238092
6605A238092j13101j03666N6919L22526N16083J285960J520021o06426r32558
$$ 1238092 1124991 1021325 1078244 1400770 1916853 3202813 4722834 4116408 3183850
6596C183850m36583N50331L06252p69375n86678K621l55481p78614m15880O70880
$$ 3183850 2747267 3297598 3603850 2834475 2247797 2250418 1894937 1116323 700443 1371323
6586A371323J21216j033570j105353m26823L96360O64019N63512K73861K2592
$$ 1371323 1492539 458969 -646384 -1073207 -676847 -12828 550684 824545 847137
6577H47137N72773K5467j212400o70870N28179J025217O03614P75753O85199M55820
$$ 847137 1419910 1445377 232977 -437893 90286 1115503 1719117 2494870 3180069 3635889
6567C635889j99201r17409j206981n68185N72422J04275J84047q8441o88543Q19285
$$ 3635889 3436688 2519279 1312298 744113 1316535 1420810 1604857 1516416 827873 1647158
6557A647158M87872l13548k14223l49556j42015P8573O1225M29171O10430J2581
$$ 1647158 2135030 1821482 1607259 1257703 1115688 1194261 1255486 1684657 2295087 2307668
6547B307668j129084q88502J36641L81359M17797L99679N85529N96142J11822
$$ 2307668 1178584 290082 426723 808082 1225879 1625558 2211087 2807229 2919051
6538B919051L44749l47709j342803j453680p68781k1270l77248K02461N69258
$$ 2919051 3263800 2916091 1573288 119608 -649173 -670443 -1047691 -845230 -275972
6529b75972J222520J353398j61347l74321l55059l61613M47407J158785J37359
$$ -275972 946548 2299946 2138599 1764278 1409219 1047606 1495013 2653798 2791157
6520B791157o89083K85N15302K57819n03261l81256k98285O0564N47334N86646
$$ 2791157 2102074 2102359 2617661 2875480 2372219 1990963 1692678 1753242 2300576 2887222
6510B887222L6287j55366O73394l54131j053348l56022L08934k60637k86475M79630
$$ 2887222 2923509 2768143 3441537 3087406 2034058 1678036 1986970 1726333 1439858 1919488
6500A919488M67373n49881p21195L59500M10937n70321k16873J84724n5275m94385
$$ 1919488 2386861 1836980 1115785 1475285 1886222 1315901 1099028 1283752 1228477 734092
6490G34092j256434m94089J43812M35811j94237l23678L87224J168509P72752
$$ 734092 -522342 -1016431 -872619 -436808 -631045 -954723 -567499 601010 1373762
6481A373762m90266k70213M73002J48423J94035K35803p17234k40138N77487K75217
$$ 1373762 883496 613283 1086285 1234708 1428743 1664546 947312 707174 1284661 1559878
6471A559878l67458k89613j6503k15666n15425k49205J77247p6303j12867K8360
$$ 1559878 1192420 902807 886304 670638 155213 -93992 83255 6952 -105915 -77555
6461g7555r79362o26329P264O51168N38272M90072O25726O06796o11239j159704
$$ -77555 -1056917 -1683246 -1675982 -1024814 -486542 3530 629256 1236052 624813 -534891
6451e34891l51487P7896j15965O24441J002942L28697n79327p92010k4333M06304
$$ -534891 -886378 -808482 -924447 -300006 702936 1031633 452306 -339704 -364037 42267
6441D2267J62064m16871Q1213K34205p11138r25632J61095L64675L43749O38070
$$ 42267 204331 -212540 -131327 102878 -608260 -1533892 -1372797 -1008122 -664373 -26303
6431b6303Q75696k15847j063609j067802l87557R38364Q08733L47943j1235q0866
$$ -26303 849393 633546 -430063 -1497865 -1885422 -947058 -138325 209618 198383 117517
6421A17517q0149m73386m62154O36398J370513R67753J25189j702904j096790
$$ 117517 37368 -436018 -898172 -261774 1108739 2076492 2201681 498777 -598013
6412e98013M89479J448195N00502K08405P36675P19791j80809r62162j262624
$$ -598013 -108534 1339661 1840163 2048568 2785243 3505034 3324225 2362063 1099439
6403A099439j95613K06713N68043J69260j28211J95451l27326m78105L59351N57241
$$ 1099439 903826 1110539 1678582 1847842 1719631 1915082 1587756 1109651 1469002 2026243
6393B026243K52927K43955J09793l81683p41363q73753p95954R1567J220222K80777
$$ 2026243 2279170 2523125 2632918 2251235 1509872 636119 -159835 -68268 1151954 1432731
6383A432731l80566N40470N94118j18275l70602j58791j3499J7317P09770J205213
$$ 1432731 1052165 1592635 2186753 2068478 1697876 1539085 1525586 1542903 2252673 3457886
6373C457886J450661J153731J52949r48525j419745j109465q9035L91423M08854
$$ 3457886 4908547 6062278 6215227 5266702 3846957 2737492 2648457 3039880 3448734
6364C448734K49546J07151k13668k76464K84098M76937k26222o81723o08046l78144
$$ 3448734 3698280 3805431 3591763 3315299 3599397 4076334 3850112 3168389 2560343 2182199
6354B182199k76591n00464l30472J01552k6246q65737J08808P02245l27468j9869
$$ 2182199 1905608 1405144 1074672 1176224 1149978 284241 393049 1095294 767826 747957
6344G47957K91673k13035j37265N67887P59504L33571K81514j18603m35610o51072
$$ 747957 1039630 826595 689330 1257217 2016721 2350292 2631806 2513203 2077593 1426521
6334A426521o08380m05398j62344R50898J542240J124998N79493J006355J402235
$$ 1426521 818141 412743 250399 1201297 2743537 3868535 4448028 5454383 6856618
6325F856618P76294n55571r68154o90035j144801j988306j116023O42702N91136
$$ 6856618 7632912 7077341 6109187 5419152 4274351 2286045 1170022 1812724 2403860
6316B403860J053823K013683J521949N46723l53420q84074q08585j020789j109719
$$ 2403860 3457683 5471366 6993315 7540038 7186618 6302544 5493959 4473170 3363451
6307C363451l41559N59477l40792j228468p67742J15614L82420K67974P44189
$$ 3363451 3021892 3581369 3240577 2012109 1244367 1359981 1742401 2010375 2754564
6298B754564K47044j26778N44565j58752k55957n68505l93994n45020m93417R90921
$$ 2754564 3001608 2874830 3419395 3260643 3004686 2436181 2042187 1497167 1003750 1994671
6288A994671R73538l76104o14019j71951K25964L74812j1714n11452m88378P64905
$$ 1994671 2968209 2592105 1978086 1806135 2032099 2406911 2395197 1883745 1395367 2160272
6278B160272P08959M10298P06265L46603o93087j055829K80589P65659J19662
$$ 2160272 2869231 3279529 3985794 4332397 3639310 2583481 2864070 3629729 3749391
6269C749391p45926o63828J62439K96229L36122L76510k51765o76420m00258p50584
$$ 3749391 3003465 2339637 2502076 2798305 3134427 3510937 3259172 2582752 2182494 1431910
6259A431910k00952M65193J73941m907m5522J7789n84728P9868M82671k58085
$$ 1431910 1230958 1696151 1870092 1865185 1819663 1837452 1252724 1332592 1815263 1557178
6249A557178j92674N17527j29620N78982J184193J210064m72253O8793R05783
$$ 1557178 1364504 1882031 1752411 2331393 3515586 4725650 4253397 4322190 5227973
6240E227973M6880o87076k07827p73106j758332j188619N7104K35319K90980R58516
$$ 5227973 5274853 4587777 4379950 3606844 1848512 659893 716997 952316 1243296 2201812
6230B201812Q25438J42613l73220j103584j246556n39219n68219k53817P01691
$$ 2201812 3027250 3169863 2796643 1693059 446503 -92716 -660935 -914752 -213061
6221b13061M3166j225980P5389Q07196P72116O38000J026069N78638j02581p3596
$$ -213061 -169895 -1395875 -1320486 -513290 258826 896826 1922895 2501533 2398952 2325356
6211B325356m36314r70778o5400Q0624n88972n19454K02035p4111j109259q27419
$$ 2325356 1889042 918264 852864 933488 344516 -174938 27097 -47014 -1156273 -1983692
6201a983692J15888Q33323n8152k83230P4413J139620J360759K04152N43104M41053
$$ -1983692 -1867804 -1034481 -1092633 -1375863 -1301450 -161830 1198929 1403081 1946185 2387238
6191B387238k05524K55941R53151N36733p37760j666328m17495M81540K779m12603
$$ 2387238 2181714 2437655 3390806 3927539 3189779 1523451 1105956 1587496 1590275 1177672
6181A177672m21177l02173J13575M70946L0655L8641M55943Q87260J302937L43425
$$ 1177672 756495 454322 567897 1038843 1069498 1108139 1564082 2451342 3754279 4097704
6171D097704q20066o66209m12127r9732r8155j258155j062001R76230J289779
$$ 4097704 3277638 2611429 2199302 2099570 2001415 743260 -318741 657489 1947268
6162A947268K35120j81912J201141J720692m54892j215816n28187o95175o24540
$$ 1947268 2182388 2000476 3201617 4922309 4467417 3251601 2723414 2028239 1403699
6153A403699j016882m58894Q7661L40820O99923J106118R01349J8869l30421J25457
$$ 1403699 386817 -72077 15584 356404 1056327 2162445 3063794 3082663 2752242 2877699
6143B877699J79418J41824k86495j082771m44714j12621j93513j93286L94132
$$ 2877699 3057117 3198941 2912446 1829675 1384961 1272340 1078827 885541 1279673
6134A279673J23789j90052M50802J92015m03103N59469J568879K48894q58606
$$ 1279673 1403462 1213410 1664212 1856227 1453124 2012593 3581472 3830366 2971760
6125B971760p7460K0659l52815q8907K39002K40733K6794K46642L3815r05561
$$ 2971760 2894300 2914959 2562144 2473237 2712239 2952972 2979766 3226408 3260223 2354662
6115B354662l2291J020258J405191O72445l63331o04757J23483k87337p19913
$$ 2354662 2322371 3342629 4747820 5420265 5056934 4452177 4575660 4288323 3568410
6106C568410L39804R82475J81770r33042p53699o5887M1108O70806N38298L72069
$$ 3568410 3908214 4890689 5072459 4139417 3385718 3319831 3360939 4031745 4570043 4942112
6096D942112O18411j15711L88885J2479l13194O95133R51648n06713j106661k53759
$$ 4942112 5560523 5444812 5833697 5846176 5532982 6228115 7179763 6673050 5566389 5312630
6086E312630q8301M28553r5927q7999M38259n2896k95601N41589K43839j79881
$$ 5312630 5224329 5652882 5556955 5468956 5907215 5854319 5558718 6100307 6344146 6164265
6076F164265m20308J86148M59222P17283M68920r48552j273936J22639P30986
$$ 6164265 5743957 5930105 6389327 7106610 7575530 6626978 5353042 5475681 6206667
6067F206667R99171J001865K75322o19274n68174j34376M34845m7441k19387K31218
$$ 6206667 7205838 8207703 8483025 7863751 7295577 7161201 7596046 7548605 7329218 7560436
6057G560436m49261J01692J352204O16511P10026N34442P12233J409756O30322
$$ 7560436 7111175 7212867 8565071 9181582 9891608 10426050 11138283 12548039 13178361
6048A3178361J566061J337245l19363j67886M01844N95729J146237L184725L667506
$$ 13178361 14744422 16081667 15762304 15594418 15996262 16591991 17738228 20922953 24590459
6039B4590459M175803L592566K457063L151955M299166N404385O932380R141079
$$ 24590459 28766262 32358828 34815891 37967846 42267012 47671397 54603777 63744856
6031F3744856J2326531J8034074K5471891L5798213M1640655K5304973j1675138
$$ 63744856 76071387 94105461 119577352 155375565 197016220 222321193 210646055
6024B10646055l2261011k8026701j4833172k294555R334855K2343801K9918136
$$ 210646055 178385044 150358343 135525171 133230616 142565471 164909272 194827408
6017A94827408J6233809j9273284m1725852l8526774k8474173j9902052j3234497
$$ 194827408 211061217 191787933 150062081 111535307 83061134 63159082 49924585
6010D9924585q646988o478199l608883l094031l735831l984483l895819l121349
$$ 49924585 41277597 34799398 31190515 28096484 24360653 20376170 16480351 13359002
6002A3359002k244653j992776p14347k24559j185395m50496M47084J14357o35291
$$ 13359002 11114349 9121573 8407226 8182667 6997272 6546776 6993860 7108217 6472926
5993F472926m16309N87501K13498r77757r27039M16589J151729J160251J089804
$$ 6472926 6056617 6644118 6857616 5879859 4952820 5369409 6521138 7681389 8771193
5984H771193N98762J184347Q75896j16194K22007j97298o96825n91059j351088
$$ 8771193 9369955 10554302 11430198 11314004 11536011 11338713 10641888 10050829 8699741
5975H699741j657723o5018M32476M01030j38132r12290p93077p09704L3101n769
$$ 8699741 7042018 6977000 7409476 7810506 7672374 6760084 5967007 5257303 5290404 5284635
5965E284635m71782r0056K05224M71149q5719n81986r85364q47358j50331k66359
$$ 5284635 4812853 4722797 4928021 5399170 5313451 4731465 3746101 2898743 2748412 2482053
5955B482053l49171j49053O37993M83178Q237J36324P12635O69947m75918L1310
$$ 2482053 2132882 1983829 2621822 3105000 3113237 3249561 3962196 4632143 4156225 4187535
5945D187535N0765n95313o9075N95586P61256O84342N19774j36895q47504q75693
$$ 4187535 4238300 3642987 3573912 4169498 4930754 5615096 6134870 5997975 5150471 4274778
5935D274778m5864j72865k34659j12341j92010o63569r014R76747J10390k03318
$$ 4274778 4228914 4056049 3821390 3709049 3517039 2853470 2844456 3821203 3931593 3728275
5925C728275o1448p39609m19047K97357M22519L23700n08945q36746o44173o51675
$$ 3728275 3666827 2927218 2508171 2805528 3228047 3551747 3042802 2206056 1561883 910208
5915I10208M1129o3896k21999K65445O11768M46692R67741P44472L99647k34291
$$ 910208 951337 887441 665442 930887 1542655 1989347 2957088 3701560 4101207 3866916
5905C866916K414Q88652Q27430J45298n24851n04901m15791R2477m44116J77756
$$ 3866916 3869330 4757982 5585412 5730710 5205859 4700958 4285167 4377644 3933528 4111284
5895D111284O75308Q45622j16081m21721J38519M10755k70423l82037O25332P66529
$$ 4111284 4786592 5632214 5516133 5094412 5232931 5643686 5373263 4991226 5616558 6383087
5885F383087M69193P18431J193743J228747J101997K057153L150133K582053R4427
$$ 6383087 6852280 7570711 8764454 9993201 11095198 13152351 16302484 18884537 18978964
5876A8978964j952126l177924k458210j402311o94065n60731n88981j019279r56105
$$ 18978964 17026838 13848914 11390704 9988393 9294328 8733597 8144616 7125337 6169232
5867F169232J78237J490K79427M07004N9585J68460N56380N10256m38426r15580
$$ 6169232 6347469 6348959 6628386 7035390 7094975 7263435 7819815 8330071 7891645 6976065
5857F976065m28512p89387l49562o7035N94023R19125R96642N14075L85497L12146
$$ 6976065 6547553 5758166 5408604 5341569 5935592 6854717 7851359 8365434 8750931 9063077
5847I063077L4118L21328N92525J51858M78221J233978J395991J47347j15196
$$ 9063077 9097195 9418523 10011048 10162906 10641127 11875105 13271096 13418443 13303247
5838A3303247N32582O69507J223260J472382J517827K031737L174619M999256
$$ 13303247 13835829 14505336 15728596 17200978 18718805 20750542 23925161 28924417
5830B8924417N155508N393762P168650R163923J1557968J4730381J9234464K7444853
$$ 28924417 34079925 39473687 46642337 55806260 67364228 82094609 101329073 128773926
5822A28773926M0135374N4835530O3597458M6969859J2492923j6687761m9635604
$$ 128773926 168909300 223744830 287342288 334312147 346805070 330117309 280481705
5815B80481705o6357454n6664437m1079419k8139043j8642458j2175327p604264
$$ 280481705 214124251 157459814 116380395 88241352 69598894 57423567 49819303
5808D9819303n761001m904452l943747k917704j642070j146186r66302p96317
$$ 49819303 44058302 39153850 35210103 32292399 30650329 29504143 28537841 27741524
5800B7741524K48192K636884M520476N571740P356758R226352J2592455J8097593
$$ 27741524 27989716 30626600 35147076 40718816 48075574 57301926 69894381 87991974
5792H7991974K5068001L1555930L2298698J3843381j8410946l5636640l3156229
$$ 87991974 113059975 144615905 176914603 190757984 172347038 136710398 103554169
5785A03554169k4343917j6080663j1116608r016952p884710o124751m828846m213669
$$ 103554169 79210252 63129589 52012981 42996029 35111319 28986568 24157722 19944053
5777A9944053k743730r81569j309193k998784k743666n31507n15138j648965j242129
$$ 19944053 17200323 16218754 14909561 11910777 9167111 8635604 8120466 6471501 5229372
5768E229372K37475L83084J71325l22161j41965o47950r47940q00712j15496l36336
$$ 5229372 5466847 5849931 6021256 5699095 5557130 4909180 3961240 3160528 3045032 2708696
5758B708696o81701m70670l96073k22233J91641J66793N63665O19484K54443j34377
$$ 2708696 2026995 1556325 1160252 938019 1129660 1296453 1860118 2479602 2734045 2599668
5748B599668o87731k13423O07483Q39805J94494l69116o90525m27687m72898p84774
$$ 2599668 1911937 1698514 2305997 3145802 3340296 2971180 2280655 1852968 1380070 595296
5738E95296J52013L94551J13455J67470R49615m8008l60958k8856J51423j71211
$$ 595296 747309 1141860 1255315 1422785 2372400 2324392 1963434 1934578 2086001 1914790
5728A914790q92506j38713J050713N03593J81880p4384n84359o60412K32023L89705
$$ 1914790 1022284 883571 1934284 2437877 2619757 2545373 1961014 1300602 1532625 1922330
5718A922330N28324M07222l20253J4479p08290n11545P58590K16567n46931n09720
$$ 1922330 2450654 2857876 2537623 2552102 1843812 1332267 2090857 2307424 1760493 1250773
5708A250773l69237p05428n52483l70868N28785Q13004J39067L88681k10034J36288
$$ 1250773 881536 176108 -376375 -747243 -218458 594546 733613 1122294 912260 1048548
5698A048548N67640M58222J114129Q47201k45395J57832K54329j89631J11384
$$ 1048548 1616188 2074410 3188539 4035740 3790345 3948177 4202506 4012875 4124259
5689D124259Q99129P76322m17851k0393O65691m70575M6735J87042r83120j144541
$$ 4124259 5023388 5799710 5381859 5361466 6027157 5556582 5603317 5790359 4807239 3662698
5679C662698p92619R9055P84029P14837J285314Q72238L79361J41970l54306j088975
$$ 3662698 2870079 2969134 3753163 4468000 5753314 6625552 7004913 7146883 6792577 5703602
5669E703602n00425m18975q46327j40143O47474J141410L46906n57587n0438k59477
$$ 5703602 5203177 4784202 3937875 3797732 4445206 5586616 5933522 5375935 5325497 5066020
5659E066020k8192J547230J411592P21168L64582J685625K978844K543332J051906
$$ 5066020 5037828 6585058 7996650 8717818 9082400 10768025 13746869 16290201 17342107
5650A7342107J457684J976565J684806L573100N022839O599594R242841J2994351
$$ 17342107 18799791 20776356 22461162 26034262 31057101 37656695 46899536 59893887
5642E9893887J8113273K6827780L9925935M6697192K3330870k5040878m7084233
$$ 59893887 78007160 104834940 144760875 191458067 214788937 189748059 142663826
5635A42663826l9134781k6137937j6023058j0595326p318160m715850j153545
$$ 142663826 103529045 77391108 61368050 50772724 43454564 38738714 37585169
5628C7585169J538726K693794M969781P982326J2410621J8051268K6521014L9413896
$$ 37585169 39123895 41817689 46787470 54769796 67180417 85231685 111752699 151166595
5620A51166595M4800539J7975404l0613505m9007698l9132141k7149577j7956696
$$ 151166595 195967134 213942538 183329033 134321335 95189194 68039617 50082921
5613E0082921j1831027p250781m939129l542162j825643j757121j681548j015035
$$ 50082921 38251894 31001113 26061984 22519822 20694179 18937058 17255510 16240475
5605A6240475n49753J6983J440370J013131j948129l415730k608478k290265k119777
$$ 16240475 15690722 15707705 17148075 18161206 16213077 12797347 10188869 7898604 5778827
5596E778827j438783r50861l22985n0529N02277P08098o83203j342822O15316
$$ 5778827 4340044 3389183 3066198 3015669 3517946 4226044 3542841 2200019 2815335
5587B815335M12198J04398R92167P75955R4372M5078L71p32864q36498k67329
$$ 2815335 3227533 3331931 4324098 5100053 5194425 5239503 5239874 4507010 3670512 3403183
5577C403183J34795j83746k76767k60334L31035N86760P65625M65678K31109k10023
$$ 3403183 3537978 3354232 3077465 2817131 3148166 3734926 4500551 4966229 5197338 4987315
5567D987315J8276m8902j99194m75184j14260p62810j081184r3384M11051L59560
$$ 4987315 5005591 4956689 4757495 4282311 4168051 3405241 2324057 2230673 2641724 3001284
5557C001284L4383m9669O69296M86228l94933M93335J025760J074426K78607r17985
$$ 3001284 3035667 2985998 3655294 4141522 3746589 4239924 5265684 6340110 6618717 5700732
5547E700732J21271J223472J216697P55377L5802J99190N81447P30561J307588
$$ 5700732 5822003 7045475 8262172 9017549 9053351 9252541 9833988 10564549 11872137
5538A1872137J879423K022325K890637M022755N366659O754256Q557220J2595872
$$ 11872137 13751560 15773885 18664522 22687277 28053936 34808192 43365412 55961284
5530E5961284J6464661K2232759L0071457L5540853K6864791l611871l1179801
$$ 55961284 72425945 94658704 124730161 160271014 187135805 183523934 152344133
5523A52344133l6237510k8519602k0463614j4991233r653937p326714o066945
$$ 152344133 116106623 87587021 67123407 52132174 42478237 35151523 29084578
5516B9084578n342943m713561l550754l258557k639002j649361p66467n76329
$$ 29084578 23741635 19028074 15477320 12218763 9579761 7930400 7163933 6587604
5508F587604k20144j57003m10019r67523r14055j014015j38597O02101K57464
$$ 6587604 6367460 6210457 5800438 4832915 3918860 2904845 2766248 3368349 3625813
5499C625813j057378n42577J25427n42849p53502k6401J56825M29631N47480M41808
$$ 3625813 2568435 2025858 2151285 1608436 854934 828533 985358 1414989 1962469 2404277
5489B404277m0171o14459r02726j97733l20454m54859K41002N62538M30263J12117
$$ 2404277 2364106 1749647 846921 649188 328734 -126125 114877 677415 1107678 1219795
5479A219795p97306l17102M55513N28090Q24038j44216J4684r3363n08505l24242
$$ 1219795 422489 105387 560900 1088990 1913028 1768812 1783496 1690133 1181628 857386
5469H57386M3722q94116l66306Q3519j48046m35295o59042m68616j94895L19897
$$ 857386 901108 6992 -359314 -275795 -423841 -859136 -1518178 -1986794 -2181689 -1861792
5459a861792O55463L65115k53909k05356l67709n70651Q548O1096L58043J163336
$$ -1861792 -1206329 -841214 -1095123 -1300479 -1668188 -2238839 -2230291 -2169195 -1811152 -647816
5449f47816j09668l76948O1077M49037l38906p9671l80031l97681Q19165P92549
$$ -647816 -757484 -1134432 -1073355 -624318 -963224 -1042895 -1422926 -1820607 -1001442 -208893
5439b08893K19981Q6601m34238J68088J83454K96122N32700l26062o61412O245
$$ -208893 11088 97689 -336549 -168461 14993 311115 843815 517753 -143659 -137414
5429a37414N06849k23536l24856P44413j22986j614934o01495K92072J63580n31174
$$ -137414 369435 145899 -178957 565456 442470 -1172464 -1773959 -1481887 -1318307 -1849481
5419a849481j01870j50844N13381J669967N82585m8883n9436O28485L39646j44235
$$ -1849481 -1951351 -2102195 -1588814 81153 663738 614855 555419 1183904 1523550 1379315
5409A379315o1234J60928J77278K9915m17055j013003o22023J09990L9962n31028
$$ 1379315 1318081 1479009 1656287 1686202 1269147 256144 -365879 -255889 -215927 -746955
5399g46955J60007O23451K91988p69210q64684K70382P50206L68532K22382m83625
$$ -746955 -586948 36503 328491 -440719 -1305403 -1035021 -284815 83717 306099 -177526
5389a77526o84914k45486M52453R95202k89272q60529k11493O02009J76958n40528
$$ -177526 -862440 -1107926 -655473 339729 50457 -810072 -1021565 -419556 -242598 -783126
5379g83126n17207o0331M62073j9373J26178N55774J008553M65714n16687o45882
$$ -783126 -1300333 -1360664 -898591 -917964 -791786 -236012 772541 1238255 721568 75686
5369G5686j663686k26812N31792J83845L46420K971M67937P63799J012905N36971
$$ 75686 -1588000 -1814812 -1283020 -1099175 -752755 -749784 -281847 481952 1494857 2031828
5359B031828N07317l51995j387986q22219K07210L41729J44429k86330K25062
$$ 2031828 2539145 2187150 799164 -23055 184155 525884 670313 383983 609045
5350F09045R61103p3074j390765L60322O88484l02437L84279M99823L08998J97658
$$ 609045 1570148 1497074 106309 466631 1155115 852678 1236957 1736780 2045778 2243436
5340B243436o28987l15498j30171q02858r24282j160171r79289K88844O25488
$$ 2243436 1614449 1298951 1168780 365922 -558360 -1718531 -2697820 -2408976 -1783488
5331a783488L44424q67023m86092N66973L35932M52772K60715M04325J266794
$$ -1783488 -1439064 -2306087 -2792179 -2225206 -1889274 -1436502 -1175787 -771462 495332
5322D95332J283868Q62792K01843Q3542J3847r08821r92702m85352k76540q58068
$$ 495332 1779200 2641992 2843835 2927377 2941224 2032403 1039701 554349 277809 -580259
5312e80259j91872J99513L42732K3975o30477o94228l74530l84233l331M30678
$$ -580259 -772131 -572618 -229886 -205911 -836388 -1530616 -1905146 -2289379 -2292710 -1862032
5302a862032K3379k02279L35423J072681j07079j133847L63823P78049r5399N5405
$$ -1862032 -1838653 -2040932 -1705509 -632828 -739907 -1873754 -1509931 -731882 -827281 -771876
5292g71876N1667o71848r18807J084935J807859R97908M44108R31083Q58173q73437
$$ -771876 -720209 -1392057 -2310864 -1225929 581930 1579838 2023946 2955029 3813202 2939765
5282B939765j475351l02475j39070m09536L36052P43116J002814R8917q94769
$$ 2939765 1464414 1161939 1022869 613333 949385 1692501 2695315 2794232 1899463
5273A899463m93210n74128l09291L054j21304j24531p61109o48873k95985J84237
$$ 1899463 1406253 832125 522834 525888 404584 280053 -481056 -1129929 -1425914 -1241677
5263a241677K7707J02875P92567K18847n46911M15115N20055l02733r92959j561507
$$ -1241677 -1213970 -1111095 -318528 -99681 -646592 -231477 288578 -14155 -1007114 -2568621
5253b568621o62563O73326J455756N38853M5318k13353K02484O66621R59141P26503
$$ -2568621 -3231184 -2557858 -1102102 -563249 -517931 -731284 -528800 137821 1096962 1823465
5243A823465L3190n36683j92159J89540k174J33735p9607l92423n44298j087307
$$ 1823465 1856655 1319972 1127813 1317353 1315179 1448914 1369307 976884 432586 -654721
5233f54721j22259O21837P7620n97392r87025K37219Q79659R32603K86970p79215
$$ -654721 -776980 -155143 -77523 -674915 -1661940 -1424721 -545062 387541 674511 -104704
5223a04704k77203q04797r74706m51583L87500M79270M34072O67252N64511N38537
$$ -104704 -381907 -1186704 -2161410 -2612993 -2225493 -1746223 -1312151 -644899 -80388 458149
5213D58149m91298j53241m03693j120882q47323l20332N64124M13730l19433q82881
$$ 458149 -33149 -186390 -590083 -1710965 -2558288 -2878620 -2314496 -1900766 -2220199 -3103080
5203c103080q62509J75106J69216J541512J644456P56284n70677j127791j60525
$$ -3103080 -3965589 -3790483 -3621267 -2079755 -435299 320985 -249692 -1377483 -1538008
5194a538008L98164N16303j38442k54274L29644j69875p19715k15680N53640K73764
$$ -1538008 -1139844 -623541 -761983 -1016257 -686613 -856488 -1576203 -1791883 -1238243 -964479
5184i64479o29196q18315P8643K87603j00715N87185Q43705k06448L07877J098522
$$ -964479 -1593675 -2411990 -2333347 -2045744 -2146459 -1559274 -715569 -922017 -614140 484382
5174D84382J08354K83096O68273Q37142J99975m34766n68137o66145j238581j069629
$$ 484382 592736 875832 1544105 2381247 2581222 2146456 1578319 912174 -326407 -1396036
5164a396036o99815n9234K53663j17679Q8278P89928Q13737M87961K14178J90260
$$ -1396036 -2095851 -2155085 -1901422 -2019101 -1930823 -1140895 -327158 160803 374981 565241
5154E65241J74466k38038Q5588J59980p3348J68194L62261M04727k77168p74816
$$ 565241 739707 501669 587257 747237 673889 842083 1204344 1609071 1331903 557087
5144E57087j178830p95902K50538k21150j94249k51969j61458K03003R89400P39845
$$ 557087 -621743 -1417645 -1167107 -1388257 -1582506 -1834475 -1995933 -1792930 -803530 -63685
5134f3685K21168q8902l59426K95403Q65044J127107m8567p57737o93235r68673
$$ -63685 157483 68581 -290845 4558 869602 1996709 1948142 1190405 497170 -471503
5124d71503q2249M31649q40738j094972j91980J2164R2631L25080K15264J62149
$$ -471503 -553752 -122103 -962841 -2057813 -2249793 -2237629 -2144998 -1819918 -1604654 -1442505
5114a442505O61712J006849L11654L58383O98979j48483p01975m57843m52987
$$ -1442505 -780793 226056 537710 896093 1595072 1446589 744614 286771 -166216
5105a66216J56041J51958p74379m44156l60777n23376J71266k1667n42140N89574
$$ -166216 -10175 141783 -632596 -1076752 -1437529 -1960905 -1789639 -1811306 -2353446 -1763872
5095a763872J65630q67622n60397L16349M12330K89533K97281j07334o13212n76029
$$ -1763872 -1598242 -2465864 -3026261 -2709912 -2297582 -2008049 -1710768 -1818102 -2431314 -3007343
5085c007343l03393O4799k7724N25404M94197R64400P37138J09436K67961L98238
$$ -3007343 -3310736 -3245937 -3273661 -2748257 -2254060 -1289660 -552522 -443086 -175125 223113
5075B23113J53027k51188r15434p02093K42876L35333O11451O15509L59898m70549
$$ 223113 376140 124952 -790482 -1492575 -1249699 -914366 -302915 312594 672492 201943
5065B01943q10796r93257q53503p08787n36544l07514K27302J221551R18207L11185
$$ 201943 -608853 -1602110 -2455613 -3164400 -3700944 -4008458 -3781156 -2559605 -1641398 -1330213
5055a330213l97266q75829k69035J41527J052312O16741k21031l54849m77140
$$ -1330213 -1727479 -2603308 -2872343 -2730816 -1678504 -1061763 -1282794 -1637643 -2114783
5046b114783o67541q77116k48746K12358N12780L40862J44612O39297m0735J9713
$$ -2114783 -2782324 -3659440 -3908186 -3695828 -3183048 -2842186 -2697574 -2058277 -2099012 -2079299
5036b079299K87770M06081P07557m21380j208886M34831M54227l75890l75099
$$ -2079299 -1791529 -1385448 -677891 -1099271 -2308157 -1873326 -1419099 -1794989 -2170088
5027b170088k0764J73334m58637k29572P93464L95696l0466R44267K62633j57865
$$ -2170088 -2190852 -2017518 -2476155 -2705727 -1912263 -1516567 -1547033 -602766 -340133 -497998
5017d97998j9520K66531K42704k5741k55860O02691K66748j104845j032120j66150
$$ -497998 -517518 -250987 -8283 -34024 -289884 312807 579555 -525290 -1557410 -1723560
5007a723560j29538O72393J118782J492722p5936r42714p99987n14576j17628
$$ -1723560 -1853098 -1180705 -61923 1430799 1354863 412149 -387838 -902414 -1020042
4998a020042K93050N44857N36479L9439K71961k62195q5887J53368n07498l31604
$$ -1020042 -726992 -182135 354344 393783 665744 403549 317662 471030 -36468 -368072
4988c68072m02792q01333o54053R98755P90621J11780l86781k35046k8793O1423
$$ -368072 -770864 -1572197 -2226250 -1227495 -436874 -325094 -711875 -946921 -975714 -914291
4978i14291M9890n97824m141P67929k0194N62842P07015r49943q42826K06769
$$ -914291 -864401 -1462225 -1466366 -698437 -718631 -155789 551226 -398717 -1241543 -1034774
4968a034774M07331J57190j91793n04098J1925L15432j2993L59205l77066l51508
$$ -1034774 -627443 -470253 -662046 -1166144 -1154219 -838787 -851780 -492575 -869641 -1221149
4958a221149N29955P03347K89805L19909k30974r29898k10306L9364L71208J3727
$$ -1221149 -691194 12153 301958 621867 390893 -539005 -749311 -709947 -338739 -325012
4948c25012n94076N97366J65634j235606j066833k14297R62171O60084l04595
$$ -325012 -919088 -321722 -156088 -1391694 -2458527 -2672824 -1710653 -1050569 -1355164
4939a355164j66039M52830k27100K32712Q82372O27341P98729J17978n47076l98278
$$ -1355164 -1521203 -1068373 -1295473 -1062761 -180389 446952 1245681 1363659 816583 418305
4929D18305M2568L51734K03931Q0388K22069o52756k53946l72864j63966k38914
$$ 418305 460873 812607 1016538 1096926 1318995 666239 412293 39429 -124537 -363451
4919c63451K66926M79174N54464l65888j207197o94351P5813o8068l33590J76667
$$ -363451 -96525 382649 937113 571225 -635972 -1330323 -1254510 -1322578 -1656168 -1479501
4909a479501l26205p13564L3384P9617K26601K46749r6084l0087j09457o35625
$$ -1479501 -1805706 -2519270 -2485886 -2406269 -2179668 -1932919 -2029003 -2059090 -2168547 -2804172
4899b804172L8011k88641K03520o4893k88550M70132M45101K91840O10855Q76133
$$ -2804172 -2766161 -3054802 -2851282 -2916175 -3204725 -2734593 -2289492 -1997652 -1386797 -510664
4889e10664P30036Q5161J85088k07899j249475j37008L81440o17687n57347r6823
$$ -510664 219372 304533 489621 281722 -967753 -1104761 -723321 -1341008 -1898355 -1995178
4879a995178L61284J544614J212428M02004K09796q01108j692803l88812R67692
$$ -1995178 -1633894 -89280 1123148 1525152 1734948 933840 -758963 -1147775 -180083
4870a80083N85916m12168n19953l13267K5379q5829l75350l93942M44440Q83025
$$ -180083 405833 -6335 -526288 -839555 -814176 -900005 -1275355 -1669297 -1224857 -341832
4860c41832J3488k51762o9791P65367K55281m20551j081354l12646N33129k98862
$$ -341832 -328344 -580106 -649897 115470 370751 -49800 -1131154 -1443800 -910671 -1209533
4850a209533j38680Q01029J340352L47762l49028K11973k55704L92826P20980
$$ -1209533 -1348213 -547184 793168 1140930 791902 1003875 748171 1140997 1861977
4841A861977o71339p50409o86321M32622L51260q19348l59517M28330n2578n20049
$$ 1861977 1190638 440229 -246092 186530 537790 -281558 -641075 -212745 -265323 -785372
4831g85372N03425J321898Q05098M4685m55426O5228r0846o56361j313534o42479
$$ -785372 -281947 1039951 1845049 1889734 1434308 1499536 1408690 752329 -561205 -1203684
4821a203684N57120N51516K36034J030207P54061J60134R94149M58636J85541
$$ -1203684 -646564 -95048 140986 1171193 1925254 2085388 3079537 3538173 3723714
4812C723714M06248N6821L98565l67841n70914n51552j402332j818248o42011
$$ 3723714 4129962 4186783 4585348 4217507 3646593 3095041 1692709 -125539 -767550
4803g67550N62692K08108K06581P689J97501J18776l71261k94783J60200O4316
$$ -767550 -204858 3250 209831 217520 415021 533797 162536 -132247 27953 92269
4793I2269M36807O13800p79769j217920m65201r5340J71941Q46214Q20981L46114
$$ 92269 529076 1142876 363107 -854813 -1320014 -1415354 -1243413 -397199 423782 769896
4783G69896O5360N42413j64009o61697l94422k50304j14037M30995R09886L01494
$$ 769896 835256 1377669 1213660 551963 157541 -92763 -206800 224195 1134081 1435575
4773A435575q24239r52262n40428j28805J46528N29748N67366J61023m55984M5360
$$ 1435575 611336 -340926 -881354 -1010159 -863631 -333883 233483 394506 -61478 -16118
4763a6118K52808L19631J80368j235501q44536K87834N17678J17799K51255N72643
$$ -16118 236690 556321 736689 -498812 -1343348 -1055514 -537836 -420037 -168782 403861
4753D03861M8195l64296k85873J80434o1632m04499q72693o40811K11088J254108
$$ 403861 452056 87760 -198113 -17679 -79311 -483810 -1356503 -1997314 -1786226 -532118
4743e32118J175501M37115k38656n4870m74005l48987M24344N10691O28514P02120
$$ -532118 643383 1080498 841842 786972 312967 -36020 388324 899015 1527529 2229649
4733B229649m07287n46382J09086n23263j010792q42310o15661L82973N37309
$$ 2229649 1822362 1275980 1385066 861803 -148989 -991299 -1606960 -1223987 -686678
4724f86678M61784O90984J2743K6568O98118M67188K62156j04114j134074p48017
$$ -686678 -224894 466090 478833 505401 1203519 1670707 1932863 1828749 694675 -53342
4714e3342O2592m556O88395K29331p16052k11192m20940J72313k56824M54614
$$ -53342 9250 4694 693089 922420 206368 -4824 -425764 -253451 -510275 -55661
4704e5661L00018m05466k49117j46601J85044N94985j57247p28052m17294j63334
$$ -55661 244357 -161109 -410226 -556827 -371783 223202 65955 -662097 -1079391 -1242725
4694a242725l46696j61360Q6459j97321K16042J113923N83126p65578j063332
$$ -1242725 -1589421 -1750781 -1664322 -1861643 -1645601 -531678 51448 -714130 -1777462
4685a777462p7938Q09203l53807L38253J133734J4716p29382n88541j66760j458
$$ -1777462 -1855400 -1046197 -1400004 -1061751 71983 86699 -642683 -1231224 -1397984 -1399442
4675a399442M6054l22040K69196J420789J637438P03652M6630o39257r59904r85110
$$ -1399442 -1353388 -1675428 -1406232 14557 1651995 2355647 2402277 1763020 803116 -181994
4665a81994k84469n92094p90819K40294k11492l22650m09382K7152j98434j33861
$$ -181994 -466463 -1058557 -1849376 -1609082 -1820574 -2143224 -2552606 -2525454 -2723888 -2857749
4655b857749R76222Q75381K38360L5279J89115l78188j70369l2116O5823J77285
$$ -2857749 -1881527 -1006146 -767786 -732507 -543392 -921580 -1091949 -1124065 -1058242 -880957
4645h80957l94441q95775o71518R1415P54803N64271n7370n95259o81969k22418
$$ -880957 -1275398 -2171173 -2842691 -2751276 -1996473 -1432202 -1489572 -2084831 -2766800 -2989218
4635b989218Q08516J044214P07321M67702N54202K59956K11519j39328o73177
$$ -2989218 -2180702 -1136488 -429167 38535 592737 852693 1064212 924884 251707
4626B51707J70524J79180m00119k65238Q9372P0681K76592j62238o40110j040243
$$ 251707 422231 601411 201292 -63946 25426 96107 372699 210461 -429649 -1469892
4616a469892o9603J363483J181491P03394j94873q39736n15046j047420j11468
$$ -1469892 -1539495 -176012 1005479 1708873 1514000 674264 159218 -888202 -999670
4607i99670J164074J159182R9468j73131l3412j082887l14352Q5828m9776l26346
$$ -999670 164404 1323586 1423054 1249923 1216511 133624 -180728 -94900 -144676 -471022
4597d71022k31302Q0834o0878M25782P81105j2604n33915j96053l91575m85101
$$ -471022 -702324 -621490 -682368 -256586 524519 511915 -22000 -218053 -609628 -1094729
4587a094729n39680n33839K8117J069190R97483M25220M67529n1861q94139n92306
$$ -1094729 -1634409 -2168248 -2140131 -1070941 -73458 351762 819291 767430 -126709 -719015
4577g19015m50286J97696j76324n35205J68644k29131n13334m6769K65099R36954
$$ -719015 -1169301 -971605 -1147929 -1683134 -1514490 -1743621 -2256955 -2303724 -2038625 -1101671
4567a101671J456113M20792m2040o67570m82836L67193O97222K87902J27681k5801
$$ -1101671 354442 775234 733194 65624 -417212 -50019 647203 935105 1062786 1036985
4557A036985l78367o46536k78934L05436k2010o58059p64563k15222k5254L88935
$$ 1036985 658618 12082 -266852 38584 16574 -641485 -1406048 -1621270 -1646524 -1257589
4547a257589P71031N43095N06431N65376N05778j91895n43828l70196o66573j538566
$$ -1257589 -486558 56537 562968 1128344 1634122 1442227 898399 528203 -138370 -1676936
4537a676936j298140j05846Q80516J680688J546159N51961n3480m98200n03881
$$ -1676936 -2975076 -3080922 -2200406 -519718 1026441 1578402 1524922 1026722 522841
4528E22841l82099p90859j192642n00423M29735K37940j71434l58431J67498J08223
$$ 522841 140742 -650117 -1842759 -2343182 -1913447 -1675507 -1846941 -2205372 -2037874 -1929651
4518a929651k71941l27558Q6058K74415L35189J037738k39475j061877n47701
$$ -1929651 -2201592 -2529150 -2443092 -2168677 -1833488 -795750 -1035225 -2097102 -2644803
4509b644803m73296P74650J781353J060567m06370p38251p71652M75364J902607
$$ -2644803 -3118099 -2343449 -562096 498471 92101 -646150 -1417802 -942438 960169
4500I60169N42943p65951q60140o16718p97387J60409O65558L9131N81117Q11339
$$ 960169 1503112 737161 -122979 -739697 -1537084 -1376675 -711117 -671986 -90869 720470
4490G20470K89865M59468M57961J8768m43015m78241j54826o58453j000060q92067
$$ 720470 1010335 1469803 1927764 1946532 1503517 1025276 870450 211997 -788063 -1680130
4480a680130j8852R12050J004211P69988M79022k82153m77893o04060K24420R19599
$$ -1680130 -1698982 -786932 217279 987267 1466289 1184136 706243 102183 326603 1246202
4470A246202N46123M38247k53766o84275r21598r46586o99641o44684k36477P79419
$$ 1246202 1792325 2230572 1976806 1292531 370933 -575653 -1275294 -1919978 -2156455 -1377036
4460a377036Q32435P05957K22586o35590N2995L48446M91309n34928r68147o15089
$$ -1377036 -544601 161356 383942 -251648 -198653 149793 641102 106174 -861973 -1477062
4450a477062q74570j47035R04430J394643P71742n82120q15563M37118M97560
$$ -1477062 -2351632 -2498667 -1594237 -199594 572148 -9972 -825535 -388417 109143
4441A09143L2971J3979J83977j73465n11060k57847q3326Q4120l53514k00553
$$ 109143 142114 156093 340070 166605 -344455 -602302 -685628 -601508 -955022 -1155575
4431a155575M86038K85306l6047K8962J93861K85242o34697m75467K80331N28291
$$ -1155575 -669537 -384231 -420278 -391316 -197455 87787 -546910 -1022377 -742046 -213755
4421b13755J550137M35782p1058l17557j576704j319823o39035L0571R97974J054401
$$ -213755 1336382 1772164 1701106 1383549 -193155 -1512978 -2152013 -2121442 -1123468 -69067
4411f9067R68708K85805q07680j256664k35835L97167N20352l75163p21640m60863
$$ -69067 899641 1185446 377766 -878898 -1114733 -717566 -197214 -572377 -1294017 -1754880
4401a754880K67805R0607k25259N71364m10101n12522M36470J416736L67421o92399
$$ -1754880 -1487075 -1396468 -1621727 -1050363 -1460464 -1972986 -1536516 -119780 247641 -444758
4391d44758j20065p3863R3102Q07653n73241p05909J50731j90733N66624J124499
$$ -444758 -564823 -638686 -545584 262069 -311172 -1017081 -866350 -1057083 -490459 634040
4381F34040K38727r00619l16977L47893O90469N9724K8772N57349k04947k61893
$$ 634040 872767 -27852 -344829 3064 693533 753257 782029 1339378 1134431 872538
4371H72538j11028r88050j104694M57581K63306k26413J12037O41232J060150
$$ 872538 761510 -226540 -1331234 -873653 -610347 -836760 -724723 -83491 976659
4362I76659P85900k46697p05955r2729k51910n9926J072115J231871J099472K3805
$$ 976659 1762559 1515862 809907 717178 465268 405342 1477457 2709328 3808800 3832605
4352C832605q53854j226895l41395J10343k51604l72331p09481l32692K55366
$$ 3832605 2978751 1751856 1410461 1520804 1269200 896869 187388 -145304 110062
4343A10062M42276L2198q08175m92641j39220r9136J06329Q49328N07282n34329
$$ 110062 552338 584536 -223639 -716280 -855500 -954636 -848307 1021 508303 -26026
4333b6026j01230J45782N22671N50110k68704r23679K636K53107m21041q9848
$$ -26026 -127256 18526 541197 1091307 822603 -101076 -98440 154667 -266374 -356222
4323c56222l1540J07603N4363J67570R09260J122968L91332k04289o04720m84061
$$ -356222 -387762 -280159 -225796 -58226 851034 1974002 2365334 2161045 1556325 1072264
4313A072264o97648r47165k86051K97342k39129r30040J31417J011446P61828
$$ 1072264 374616 -572549 -858600 -561258 -800387 -1730427 -1599010 -587564 174264
4304A74264k61817l17853j00099m9806P9342p1764J43170O10907M25500j55541
$$ 174264 -87553 -405406 -505505 -555311 -475969 -547733 -404563 206344 631844 476303
4294D76303M27991K07546r37126k18120j37044q73035k18889P08295P78371l03049
$$ 476303 904294 1111840 174714 -43406 -180450 -1053485 -1272374 -564079 214292 -88757
4284h8757l39204K45271l66503M57280N07947l406k53452q32208o19497L71359
$$ -88757 -427961 -182690 -549193 -91913 416034 412628 159176 -673032 -1292529 -921170
4274i21170R25956k25971l66273l41264j87415k95671n34458N3212P08343P24379
$$ -921170 4786 -221185 -587458 -928722 -1116137 -1411808 -1946266 -1893054 -1184711 -460332
4264d60332N14676J030427N20567m64320l37210O2707l90227l81095J19497j23926
$$ -460332 54344 1084771 1605338 1141018 803808 866515 476288 95193 214690 90764
4254I0764m11068j48745K86339O53422N57663l56261l58410J10938M03951J09170
$$ 90764 -320304 -469049 -182710 470712 1028375 672114 313704 424642 828593 937763
4244I37763j95092n86413l13663J91818n13292j008332L57320Q40334k2387o9887
$$ 937763 742671 156258 -157405 34413 -478879 -1487211 -1129891 -289557 -311944 -381831
4234c81831M49782R13226R12121O42353L09483k42532j148519o01576N88848K3887
$$ -381831 67951 981177 1893298 2535651 2845134 2602602 1454083 852507 1441355 1465242
4224A465242o23351q90052o88582l03224K53791J77296n8141O7023q30894o26253
$$ 1465242 841891 -48161 -736743 -1039967 -786176 -608880 -667021 -599998 -1430892 -2057145
4214b057145m15815n14409M14218R98502J643250J13683q06211L93519J025589
$$ -2057145 -2472960 -2987369 -2573151 -1574649 68601 182284 -623927 -230408 795181
4205G95181O46557N60577Q9284k73393R4094j15240o55063j99297L77999J84370
$$ 795181 1441738 2002315 2091599 1818206 1912300 1797060 1141997 942700 1320699 1505069
4195A505069P2738J59917R2981k09070k06501o35491o25236k33393N13958o672
$$ 1505069 1577807 1737724 1830705 1621635 1415134 779643 154407 -78986 434972 428300
4185D28300J4486L23438K27475L27851j52309n92216O8017P41151O29019Q16331
$$ 428300 442786 766224 993699 1321550 1169241 577025 645042 1386193 2015212 2831543
4175B831543J253463J462654J621514J376433Q80966k27804k075189k494560j270200
$$ 2831543 4085006 5547660 7169174 8545607 9426573 9198769 7123580 4629020 3358820
4166C358820k60848l51738q87778j249547q59486n2699j60863n47529L24927J100331
$$ 3358820 3097972 2746234 1858456 608909 -250577 -303276 -464139 -1011668 -686741 413590
4156D13590Q76280N34665k78802j109952p59919l1705K05568J38182M5971N06406
$$ 413590 1289870 1824535 1545733 435781 -324138 -355843 -150275 -12093 33878 540284
4146E40284K20909O5929J010059P39722p69476q00844L6010j36359k46489l67777
$$ 540284 761193 827122 1837181 2576903 1807427 1006583 1042593 906234 659745 291968
4136B91968o26995o90919o64302K91002J235460R68219k54288p19764k37512O53851
$$ 291968 -335027 -1025946 -1690248 -1399246 -163786 804433 550145 -169619 -407131 246720
4126B46720j19780k33856M22423J112283O17464p81554p72162p71413j092523
$$ 246720 126940 -106916 315507 1427790 2045254 1263700 491538 -279875 -1372398
4117a372398p52012O25385J176799k851m1016j94012p72006l41194j72510Q1514
$$ -1372398 -2124410 -1499025 -322226 -325077 -366093 -560105 -1332111 -1673305 -1845815 -1764301
4107a764301J082286M444j45559k71504K28517K10068M28448P40225L47461L06081
$$ -1764301 -682015 -677571 -823130 -1094634 -866117 -656049 -227601 512624 860085 1166166
4097A166166k30769J54898k91808n52554k44678p42585m74261K66685J15660N11460
$$ 1166166 935397 1090295 798487 245933 1255 -741330 -1215591 -948906 -833246 -321786
4087c21786R56631Q45142J41357n99837o64255K47913N91738m6626q77645m75198
$$ -321786 634845 1479987 1621344 1021507 357252 605165 1196903 1150277 272632 -202566
4077b02566N1391K49966k51953l08129L24074k7493m82922j27865K45191j35424
$$ -202566 -151175 98791 -153162 -461291 -137217 -164710 -647632 -775497 -530306 -665730
4067f65730L00458P66552O1100n43307q19862j13622j34999M49986J163579L85619
$$ -665730 -365272 401280 462380 -80927 -900789 -1014411 -1149410 -699424 464155 849774
4057H49774K31647K6593K56656N86774J38166o84952n65945l8311M14077M70329
$$ 849774 1081421 1108014 1364670 1951444 2089610 1404658 838713 800402 1214479 1684808
4047A684808N19507q8707l96616m65429q58188m46471k31318P13722P20261k14763
$$ 1684808 2204315 2115608 1718992 1253563 395375 -51096 -282414 431308 1151569 936806
4037I36806k83433q48350q03977p88909k53186O46001J049703N37630q24661j442775
$$ 936806 653373 -194977 -998954 -1787863 -2041049 -1395048 -345345 192285 -632376 -2075151
4027b075151l48323N13332Q7760k47045J083151J007567k09720M63729P20477
$$ -2075151 -2423474 -1910142 -1822382 -2069427 -986276 21291 -188429 275300 995777
4018I95777k29906m75772p24120j266611j077398j22813j46061k60647O79213
$$ 995777 765871 290099 -434021 -1700632 -2778030 -2900843 -3046904 -3307551 -2628338
4009b628338J107416J513414J007402j64371j223217r92653m90639J65474L65607
$$ -2628338 -1520922 -7508 999894 835523 -387694 -1380347 -1870986 -1705512 -1339905
4000a339905L62976j89311P1665O83031Q56177R20638M01721n24433j38958L12204
$$ -1339905 -976929 -1166240 -1094575 -411544 444633 1365271 1766992 1242559 1103601 1415805
3990A415805L21848j13029p97744n61882M82493N58270K6452K70757R85772J150844
$$ 1415805 1737653 1624624 826880 264998 747491 1305761 1332213 1602970 2588742 3739586
3980C739586j04626j268475q69785K88556r4209n20482j86443M42577o0649p06124
$$ 3739586 3634960 2366485 1496700 1785256 1691047 1170565 984122 1426699 1366050 659926
3970F59926m66357m27350r94260o34425k2220J4834J02286n21553j07593M48025
$$ 659926 193569 -233781 -1228041 -1862466 -1884686 -1869852 -1767566 -2289119 -2396712 -1948687
3960a948687n25921q35158J62436N61402n9037L75174P08732Q16496k77646n38347
$$ -1948687 -2474608 -3309766 -3147330 -2585928 -2644965 -2269791 -1561059 -744563 -1022209 -1560556
3950a560556M85125M17126O42959L40266j06277q825n51572p09281n62218j23086
$$ -1560556 -1075431 -658305 -15346 324920 218643 209818 -341754 -1051035 -1613253 -1736339
3940a736339L8743Q50963J432385m8895p21175r56210m59618k66054M05116K26923
$$ -1736339 -1697596 -846633 585752 536857 -184318 -1140528 -1600146 -1866200 -1461084 -1234161
3930a234161o27210r96563k36628n93914n49516L07628Q29329J582504Q79152
$$ -1234161 -1861371 -2857934 -3094562 -3688476 -4237992 -3930364 -3101035 -1518531 -639379
3921f39379j2800r0075K03037P43168K72502j01962M00629O71662j39068j51391
$$ -639379 -652179 -742254 -539217 203951 476453 374491 775120 1446782 1307714 1156323
3911A156323K62452j83115j120359o21002j45332j46430N2572j9849J052666J95511
$$ 1156323 1418775 1235660 115301 -505701 -651033 -797463 -744891 -764740 287926 483437
3901D83437m54408J4968j65865j37614k0300j73404r385P31685P27684j43798
$$ 483437 29029 43997 -121868 -259482 -279782 -453186 -462571 269114 996798 853000
3891H53000j94442j19879J73918P00618J99274M49179o26769r59458k06339k87400
$$ 853000 658558 538679 712597 1413215 1612489 2061668 1434899 475441 269102 -18298
3881a8298n26924p29614k44550M75980Q62898N07596p03767p18705L757J11421
$$ -18298 -545222 -1274836 -1519386 -1043406 -180508 327088 -376679 -1095384 -1091627 -980206
3871i80206L94064N35965J50508k92030p87303R2221R19713K42782n79814Q0058
$$ -980206 -586142 -50177 100331 -191699 -979002 -886781 32932 275714 -304100 -224042
3861b24042K17066L42891J36404J76455k490q99799n50672M71339K73551L08814
$$ -224042 -6976 335915 472319 648774 646284 -253515 -804187 -332848 -59297 249517
3851B49517o17074q84563L32251Q94126M74278O8110o61710o08459m9579O51898
$$ 249517 -367557 -1252120 -919869 -25743 448535 516645 -145065 -753524 -803103 -151205
3841a51205O38563l71548l35311K9786p3427K23297q1121J10582M80990j64242
$$ -151205 487358 115810 -219501 -189715 -263142 -39845 -120966 -10384 470606 306364
3831C06364j07397L02440M96605m21224l72686n15106j409050j781448K90848
$$ 306364 198967 501407 998012 576788 204102 -311004 -1720054 -3501502 -3210654
3822c210654J377384J038068P76012J528492N72920j132268r77899K82984L83454
$$ -3210654 -1833270 -795202 -19190 1509302 2082222 949954 -27945 255039 638493
3813F38493j57032q14612j113204o3177L04226l13904p69743p84172L9218L45714
$$ 638493 481461 -333151 -1446355 -1509532 -1205306 -1519210 -2288953 -3073125 -3033907 -2688193
3803b688193J016294R15071n27842l24641O91428J047735J044206m97404p27179
$$ -2688193 -1671899 -756828 -1284670 -1609311 -917883 129852 1174058 676654 -50525
3794e0525l06807l13272K58173O89231R70085J64713j85566l63889n17137j006170
$$ -50525 -357332 -670604 -412431 276800 1246885 1411598 1226032 862143 345006 -661164
3784f61164m04079j23620l21939Q55790P54617J7272J82909n8901K3259Q9827
$$ -661164 -1065243 -1188863 -1510802 -655012 99605 116877 299786 240885 264144 353971
3774C53971l85771N31521L72116m24681o36670l00431K73930O98280n31461j401664
$$ 353971 -31800 499721 871837 447156 -189514 -489945 -216015 482265 -49196 -1450860
3764a450860l16541M19637J79314R1635P56702N24818j87983m4299q884k3574
$$ -1450860 -1767401 -1347764 -1168450 -1076815 -320113 204705 16722 -27577 -36461 -60035
3754f0035J98597K22096j4991k92208K87580Q17654K34096l49868K05434j86870
$$ -60035 138562 360658 345667 53459 341039 1158693 1392789 1042921 1248355 1061485
3744A061485q72315k56044J67539K81326j63003o3272l9406p94505n09970r1409
$$ 1061485 189170 -66874 100665 381991 218988 155716 116310 -678195 -1188165 -1279574
3734a279574O5697K96416Q99334O08161Q7524j009323r90229J46787L77686Q64837
$$ -1279574 -1213877 -917461 -18127 590034 677558 -331765 -1321994 -1175207 -797521 67316
3724F7316Q6126q83798j82263L06956q2831j73964Q00432P05881M26588j95734
$$ 67316 153442 -730356 -912619 -605663 -688494 -862458 -62026 643855 1070443 874709
3714H74709k71505P68428L36634m99120l62495L43845O84322m04707j127016o01891
$$ 874709 603204 1371632 1708266 1209146 846651 1190496 1874818 1470111 343095 -258796
3704b58796o80786l69356n40458j056566m95615L30774M22142P73211K26020j88477
$$ -258796 -939582 -1308938 -1849396 -2905962 -3401577 -3070803 -2648661 -1875450 -1649430 -1837907
3694a837907o71238k8374L81032R36357J266526N47703j26179J52678N86449P30890
$$ -1837907 -2509145 -2537519 -2156487 -1220130 46396 594099 467920 620598 1207047 1937937
3684A937937L03615o63243j090118n96234l12117m72218k90081l20160n2277K86067
$$ 1937937 2241552 1578309 488191 -108043 -420160 -892378 -1182459 -1502619 -1554896 -1268829
3674a268829N88867R79980K85842j050586r55787l46670p2563L33617L70126L26468
$$ -1268829 -679962 300018 585860 -464726 -1420513 -1767183 -1839746 -1506129 -1136003 -809535
3664h09535l79875q59319k1108J020743M39507m14258j251625q13088J48184J526144
$$ -809535 -1189410 -2048729 -2069837 -1049094 -609587 -1023845 -2275470 -3088558 -2940374 -1414230
3654a414230J130748k36496l72648k63311p6175L96991K61264J16724l43186q6283
$$ -1414230 -283482 -519978 -892626 -1155937 -1232112 -835121 -573857 -457133 -800319 -886602
3644h86602m09376m62067p9648K38702M88385J89060L29053M53168k87212O5159
$$ -886602 -1295978 -1758045 -1837693 -1598991 -1110606 -921546 -592493 -139325 -426537 -361378
3634c61378O12926j86737o13650j225480r84355L22971J328107R62906N70591
$$ -361378 251548 64811 -548839 -1774319 -2758674 -2435703 -1107596 -144690 425901
3625D25901L12075q61736n86031M44985p01104r31485l41113J46669P59807P44724
$$ 425901 737976 -123760 -709791 -264806 -965910 -1897395 -2238508 -2091839 -1332032 -587308
3615e87308K35527j25612p274r9235J27717L06957k697j3953m88062j80132n34
$$ -587308 -351781 -477393 -484667 -583902 -456185 -149228 -151925 -165878 -653940 -834072 -834606
3604h34606r4440o06321p11585L72302J373199Q72268j33193l63442j45890m8025
$$ -834606 -929046 -1535367 -2246952 -1874650 -501451 370817 237624 -125818 -271708 -319733
3594c19733l90153p55486K76844P50812l35124Q9817N76196O09681N25900o1409
$$ -319733 -709886 -1465372 -1188528 -437716 -772840 -683023 -106827 502854 1028754 967345
3584I67345J1270o44831r33066q64920J2272K01481l13225L17712K77760j09016
$$ 967345 978615 333784 -599282 -1464202 -1451930 -1250449 -1563674 -1245962 -968202 -1077218
3574a077218Q78422L22505o19682p19454j266117l07343J696392J044201K05573
$$ -1077218 -198796 123709 -495973 -1215427 -2481544 -2788887 -1092495 -48294 157279
3565A57279L71889l2579N8686P04755L96626k04015m60717p32701j37946O20305
$$ 157279 529168 496589 555275 1260030 1656656 1452641 991924 259223 121277 741582
3555G41582n66772p07648K55615K96206O2943k60798K62036P76689l32970j120336
$$ 741582 174810 -532838 -277223 18983 81926 -178872 83164 859853 526883 -593453
3545e93453K74650J076034N16234J46079j102625l97772n62772r07879p16551
$$ -593453 -318803 757231 1273465 1419544 316919 -80853 -643625 -1551504 -2268055
3536b268055j00557O45097P32184J018239N096o89573k31795k83791k08120P5513
$$ -2268055 -2368612 -1723515 -991331 26908 32004 -657569 -889364 -1173155 -1381275 -1305762
3526a305762O89870Q2607L27869R92883O37109N6441n68743j209932l60246K03273
$$ -1305762 -615892 -533285 -205416 787467 1424576 1481017 912274 -297658 -657904 -454631
3516d54631K48898R61053K61311M41777N17039L2181L0877L33516r87483o83537
$$ -454631 -205733 755320 1016631 1458408 1975447 2007628 2038505 2372021 1384538 701001
3506G01001P88631L85957n48606p2718Q0086N9700n80716q92189m90592M88559
$$ 701001 1489632 1875589 1326983 1254265 1334351 1394051 813335 -78854 -569446 -80887
3496h0887N92652O12952N04067J86779k71767l23403L37603M65301L54268q02888
$$ -80887 511765 1124717 1628784 1815563 1543796 1220393 1557996 2023297 2377565 1574677
3486A574677m05329J1324L7056p0398k74798N18867Q94826J91701j16618o21100
$$ 1574677 1169348 1180672 1217728 1147330 872532 1391399 2286225 2477926 2361308 1740208
3476A740208n88581o16976M4836J116576N38808l05590l40478k55054l31081M446
$$ 1740208 1151627 534651 579487 1696063 2234871 1929281 1588803 1333749 1002668 1007114
3466A007114m90192m74886j2797k73999n75362n59475r9446L79909O80892N28276
$$ 1007114 516922 42036 29239 -244760 -820122 -1379597 -1479043 -1099134 -418242 110034
3456A10034N53699J72680o11667r6791l6051N33032k9149j280457p16549N78693
$$ 110034 663733 836413 224746 127955 91904 624936 595787 -684670 -1401219 -822526
3446h22526J083792R43794N14861J01278j41759k26432J92748M58636m50558r69149
$$ -822526 261266 1205060 1719921 1821199 1679440 1453008 1645756 2104392 1653834 684685
3436F84685l50555m22019l83776p3061O940M01511M3533K5601L87588N26648M00855
$$ 684685 334130 -87889 -471665 -544726 -537786 -136275 -92742 -67141 320447 847095 1247950
3425A247950p0687l48582l62466J43093q55633j057448M22892Q27614K77968P9441
$$ 1247950 1177263 828681 466215 609308 -246325 -1303773 -880881 -53267 224701 304142
3415C04142L3657q9541k32669K84140Q38261N82887j64226l95982j020472m21038
$$ 304142 337799 248258 15589 299729 1137990 1720877 1556651 1160669 140197 -280841
3405b80841K9327N52330M15572p0852k57247k34527k95280j02234J39268M60538
$$ -280841 -251514 300816 716388 645536 388289 153762 -141518 -243752 -104484 356054
3395C56054R45731M90813j13537j086400p36027J24331L98555p20544q36608K20344
$$ 356054 1301785 1792598 1679061 592661 -143366 -19035 379520 -341024 -1177632 -957288
3385i57288K89639k68426n5911O58907P64940J166208L99738k61676j058106j051273
$$ -957288 -667649 -936075 -991986 -333079 431861 1598069 1997807 1736131 678025 -373248
3375c73248K50911J88614K46441K36940K02659j99420j527723j524908J54409
$$ -373248 -122337 66277 312718 549658 752317 552897 -974826 -2499734 -2345325
3366b345325r51188j036783j1741J111069J407426R28295M0859p73392o14684
$$ -2345325 -3296513 -4333296 -4345037 -3233968 -1826542 -898247 -857388 -1630780 -2245464
3357b245464J80926N35279K72992Q75882Q29146R56251L65164l12647q08439m23245
$$ -2245464 -2064538 -1529259 -1256267 -380385 448761 1405012 1770176 1457529 649090 225845
3347B25845L28720O6951p18327j074650o98611n56337m09026M79137J345058Q67693
$$ 225845 554565 621516 -96811 -1171461 -1870072 -2426409 -2835435 -2356298 -1011240 -143547
3337a43547p7699r09279k73764O31337K68646l66097m6343R1560L43867L29468
$$ -143547 -221246 -1130525 -1404289 -772952 -504306 -870403 -916746 -825186 -481319 -151851
3327a51851j04069p32092o26590k95728L47897P35037J164722Q40985K67710l92978
$$ -151851 -255920 -988012 -1614602 -1910330 -1562433 -827396 337326 1178311 1446021 1053043
3317A053043j72068K78971k12085l52815l07948k57132o56708q96863O38332J155667
$$ 1053043 880975 1159946 947861 595046 287098 29966 -626742 -1523605 -885273 270394
3307B70394L88582L14360J76440r6274k15971q37255j085501K6815P0604k59079
$$ 270394 658976 973336 1149776 1053502 837531 276 -1085225 -1058410 -987806 -1246885
3297a246885N5823J73932m63137k27893k0903M91919J184988j3198o30721l63657
$$ -1246885 -1191062 -1017130 -1480267 -1708160 -1729063 -1237144 -52156 -65354 -696075 -1059732
3287a059732k28346L79168M00346L69547k32915j00540k72317K27080n08216j107943
$$ -1059732 -1288078 -908910 -508564 -139017 -371932 -472472 -744789 -517709 -1025925 -2133868
3277b133868m13307J12146M86266M19208l46686k83930P1409K11827l0989o13335
$$ -2133868 -2547175 -2435029 -1948763 -1529555 -1876241 -2160171 -2088762 -1876935 -1907924 -2521259
3267b521259r4791P80631J951201J887139k75043r19256o54134M97749M3609r63859
$$ -2521259 -2616050 -1835419 115782 2002921 1727878 808622 154488 652237 695846 -268013
3257b68013p69754l50602J89608l69882J26106R52931O12578p72820k24056o3167
$$ -268013 -1037767 -1388369 -1198761 -1568643 -1442537 -489606 122972 -649848 -873904 -937071
3247i37071M85133P98709M39167J12488j145741m17602K01788K40301q50400p83344
$$ -937071 -451938 346771 785938 898426 -247315 -664917 -463129 -222828 -1073228 -1856572
3237a856572L1917P8167L61101k69119n3667j27656J47825K84713k0927j97208
$$ -1856572 -1824655 -1746488 -1385387 -1654506 -1708173 -1835829 -1688004 -1403291 -1424218 -1621426
3227a621426j64836k14513j2303L20690L69438M38905j11745m88127n80110K32621
$$ -1621426 -1786262 -2000775 -2013078 -1692388 -1322950 -884045 -995790 -1483917 -2064027 -1831406
3217a831406L67241J77026K56961J88508n3242L04966N39863k11587p67978J86126
$$ -1831406 -1464165 -1287139 -1030178 -841670 -894912 -589946 -50083 -261670 -1029648 -843522
3207h43522M17145m04225p57223j96023L67738K97137L85541J157410R06464j76895
$$ -843522 -426377 -830602 -1587825 -1783848 -1416110 -1118973 -733432 423978 1330442 1153547
3197A153547p79249j121342j272009q60041N81808P66425l25873j84234P44141
$$ 1153547 374298 -747044 -2019053 -2879094 -2297286 -1530861 -1856734 -2040968 -1296827
3188a296827K82577O13000O56114j79624o12866P17459J303543K17661p77528
$$ -1296827 -1014250 -401250 254864 75240 -537626 179833 1483376 1701037 923509
3179I23509j35914L01358j46009p41168o73985P6036N32079Q79619j32494k99000
$$ 923509 787595 1088953 942944 201776 -472209 -396173 135906 1015525 883031 584031
3169E84031K38308M02873m86664j343516o91663N35755O50711O78461k81512j176462
$$ 584031 822339 1225212 738548 -604968 -1296631 -760876 -110165 568296 286784 -889678
3159h89678q38333K43241P01177R447N57006P10202l02248r65476k28686k34541
$$ -889678 -1728011 -1484770 -783593 -774146 -217140 493062 190814 -774662 -1003348 -1237889
3149a237889K17414R8768K15269J189276M97482j251837j027542o0556R52906
$$ -1237889 -1020475 -921707 -706438 482838 980320 -271517 -1299059 -1359615 -406709
3140d06709O13163L17744p2101j31270m46411l31932m33946j13488l68416j96956
$$ -406709 206454 524198 452097 320827 -125584 -457516 -891462 -1004950 -1373366 -1570322
3130a570322O40054M42560L36975J54171k46146l42106k3060K277L72842Q28406
$$ -1570322 -930268 -487708 -150733 3438 -242708 -584814 -607874 -605597 -232755 595651
3120E95651N92046J30354L96851l58607j294648o87194j25195N89025L68141n69923
$$ 595651 1187697 1318051 1714902 1356295 61647 -625547 -750742 -161717 206424 -363499
3110c63499m39113o11188k45043P44441L20506J66204L6724k33144j20723M10215
$$ -363499 -802612 -1413800 -1658843 -914402 -593896 -427692 -390968 -624112 -744835 -334620
3100c34620Q32646K26598R98618P09114q39614j456832o56797o8050L31529M47609
$$ -334620 498026 724624 1723242 2432356 1592742 135910 -520887 -588937 -257408 190201
3090A90201J664347J196283o19978q43186j87738l94332l74910N14938M60281
$$ 190201 1854548 3050831 2430853 1587667 1399929 1005597 630687 1145625 1605906
3081A605906M71621N83868j54743l39935N93418J62282o04189j97173l14059r75454
$$ 1605906 2077527 2661395 2506652 2166717 2760135 2922417 2318228 2121055 1806996 831542
3071H31542j499474j057432L39515J109967P26920L85601n85790J7841K65789
$$ 831542 -667932 -1725364 -1385849 -275882 451038 836639 250849 268690 534479
3062E34479Q06502J105772P13352J37491q57452j091398j015832k57357J61141
$$ 534479 1340981 2446753 3160105 3297596 2440144 1348746 332914 75557 236698
3053B36698K75127n29930q2907m91046m29330N25545J77621k07625N08585R60144
$$ 236698 511825 -18105 -101012 -592058 -1021388 -495843 -318222 -525847 -17262 942882
3043I42882J036896M95373p77299p62439m71062k09231J53134M7277O92361O10759
$$ 942882 1979778 2475151 1697852 935413 464351 255120 408254 455531 1147892 1758651
3033A758651j01745n15493K71887R80594p58118o88324j28881O24798L86131n21469
$$ 1758651 1656906 1141413 1413300 2393894 1635776 947452 818571 1443369 1829500 1308031
3023A308031r65617j115749n95844L49452J157774R16487M31572l30958p82659
$$ 1308031 342414 -773335 -1369179 -1019727 138047 1054534 1486106 1155148 372489
3014C72489q93929k73027P67958N98465R27394L33686q94645q72434m47166j76820
$$ 372489 -521440 -794467 -26509 571956 1499350 1833036 938391 65957 -381209 -558029
3004e58029j07303k5249N61791R84424J83433l63895k88822J0253m33805o87949
$$ -558029 -665332 -690581 -128790 855634 1039067 675172 386350 396603 -37202 -725151
2994g25151l02550O09676Q55856k13019K14364N55338m86546l72907N11946P29371
$$ -725151 -1027701 -418025 437831 224812 439176 994514 507968 135061 647007 1376378
2984A376378n0459r83744n27688m49107j7556J49596J79925J8934o7202J73217
$$ 1376378 1325919 342175 -185513 -634620 -652176 -502580 -322655 -303721 -370923 -197706
2974a97706q93347r19329l06572J68754J06149P90698J119231R63615L74991q8000
$$ -197706 -1091053 -2010382 -2316954 -2148200 -2042051 -1251353 -132122 831493 1206484 1118484
2964A118484m79936J50873Q89344j97104o22929q00350o3643P55576m091j224958
$$ 1118484 638548 789421 1678765 1481661 858732 58382 -5261 750315 746224 -478734
$$ [...]
##END NTUPLES=NMR SPECTRUM
##END=
