##TITLE=C13_LR-684B-C2TFA
 CDCl3, 700 sc

 2.8.2019
##JCAMPDX= 6.0         $$ Bruker NMR JCAMP-DX V2.0
##DATA TYPE= NMR SPECTRUM
##DATA CLASS= NTUPLES
##ORIGIN= UXNMR, Bruker Analytische Messtechnik GmbH
##OWNER= root
$$ XWIN-NMR		Version 3.5
$$ Fri Aug  2 16:43:52 2019 Russian Standard Time (UT+4h)  she@DPX200
##.OBSERVE FREQUENCY= 50.327896
##.OBSERVE NUCLEUS= ^13C
##.ACQUISITION MODE= SIMULTANEOUS
##.ACQUISITION SCHEME= undefined
##.AVERAGES= 700
##.DIGITISER RES= 17
##SPECTROMETER/DATA SYSTEM= spect
##.PULSE SEQUENCE= zgpg30
##.SOLVENT NAME= DMSO
##.SHIFT REFERENCE= (INTERNAL, DMSO, 0, 222.624)
##AUDIT TRAIL= $$ (NUMBER, WHEN, WHO, WHERE, WHAT)
$$ ##TITLE= Audit trail, XWIN-NMR		Version 3.5
$$ ##JCAMPDX= 5.01
$$ ##ORIGIN= Bruker BioSpin GmbH
$$ ##OWNER= she
$$ F:/spectra/data/she/nmr/c13/1/pdata/1/auditp.txt
$$ ##AUDIT TRAIL=  $$ (NUMBER, WHEN, WHO, WHERE, WHAT)
(   1,<2019-08-02 16:42:44.87 +0400>,<she>,<DPX200>,
      <created by zg, POWCHK disabled, PULCHK disabled
       terminated by command 'halt'
       configuration hash MD5:
       00 E9 B6 7A A2 85 ED C7 34 08 36 98 17 FE 4E 26
       data hash MD5: 32K
       08 0C EA BA 3C 91 23 A7 92 9A 6A 2D 82 9F 37 DD>)
(   2,<2019-08-02 16:42:47.37 +0400>,<she>,<DPX200>,
      <Start of raw data processing
       efp BC_mod = 2 LB = 1 FT_mod = 6 PKNL = 1 PHC0 = -368.2499 PHC1 = 26.6064 SI = 32K 
       data hash MD5: 32K
       77 2D 15 CC 62 59 D3 70 77 31 F6 9D D2 01 DD 48>)
(   3,<2019-08-02 16:42:50.14 +0400>,<she>,<DPX200>,
      <abs ABSG = 5 
       data hash MD5: 32K
       4E 44 4A 7B 32 BE 2D 9F 9E 63 12 40 10 CE 06 C9>)
(   4,<2019-08-02 16:43:15.01 +0400>,<she>,<DPX200>,
      <pk PHC0 = -5.844373 PHC1 = 12 
       data hash MD5: 32K
       35 50 85 91 0B CC 05 68 B5 C0 98 46 E7 B9 AE 1B>)
(   5,<2019-08-02 16:43:18.25 +0400>,<she>,<DPX200>,
      <abs ABSG = 5 
       data hash MD5: 32K
       4B 04 61 D5 1E F4 EC 28 A1 A9 C7 6D BD 69 76 70>)
$$ ##END=
$$ 
$$ hash MD5
$$ 68 F1 58 01 49 2D 2C 55 44 E8 BE 6D 57 28 19 2F
##$RELAX= 
##$RELAX= 
##$RELAX= 
##$RELAX= 
##$RELAX= 
##$RELAX= 
##$RELAX= 
##$RELAX= 
$$ Bruker specific parameters
$$ --------------------------
##$DU= <F:/spectra>
##$EXPNO= 1
##$NAME= <c13>
##$PROCNO= 1
##$TYPE= <nmr>
##$USER= <she>
##$AMP= (0..31)
100 100 100 100 100 100 100 100 100 100 100 100 100 100 100 100 100 100 
100 100 100 100 100 100 100 100 100 100 100 100 100 100 
##$AQSEQ= 0
##$AQ_mod= 1
##$AUNM= <au_zg>
##$AUTOPOS= <>
##$BF1= 50.322709
##$BF2= 200.13
##$BF3= 50.322709
##$BF4= 500.13
##$BF5= 500.13
##$BF6= 500.13
##$BF7= 500.13
##$BF8= 500.13
##$BYTORDA= 1
##$CFDGTYP= 0
##$CFRGTYP= 5
##$CHEMSTR= <none>
##$CNST= (0..31)
1 1 145 1 1 1 1 1 1 1 1 1 1 1 1 1 1 1 1 1 1 1 1 1 1 1 1 1 1 1 1 1 
##$CPDPRG= <waltz16>
##$CPDPRG1= <>
##$CPDPRG2= <waltz16>
##$CPDPRG3= <>
##$CPDPRG4= <mlev>
##$CPDPRG5= <mlev>
##$CPDPRG6= <mlev>
##$CPDPRG7= <mlev>
##$CPDPRG8= <mlev>
##$CPDPRGB= <>
##$CPDPRGT= <>
##$D= (0..31)
$$ [...]
##$SUBNAM4= <"">
##$SUBNAM5= <"">
##$SUBNAM6= <"">
##$SUBNAM7= <"">
##$SUBNAM8= <"">
##$SUBNAM9= <"">
##$SW= 239.972175391363
##$SWIBOX= (0..15)
0 1 3 0 0 0 0 0 0 0 0 0 0 0 0 0 
##$SW_h= 12077.2946859903
##$TD= 32768
##$TD0= 1
##$TE= 0
##$TE2= 300
##$TE3= 300
##$TEG= 300
##$TL= (0..7)
120 120 120 120 120 120 120 120 
##$TP= (0..7)
150 150 150 150 150 150 150 150 
##$TP07= 0
##$TPNAME0= <>
##$TPNAME1= <>
##$TPNAME2= <>
##$TPNAME3= <>
##$TPNAME4= <>
##$TPNAME5= <>
##$TPNAME6= <>
##$TPNAME7= <>
##$TPOAL= (0..7)
0.5 0.5 0.5 0.5 0.5 0.5 0.5 0.5 
##$TPOFFS= (0..7)
0 0 0 0 0 0 0 0 
##$TUNHIN= 0
##$TUNHOUT= 0
##$TUNXOUT= 0
##$USERA1= <user>
##$USERA2= <user>
##$USERA3= <user>
##$USERA4= <user>
##$USERA5= <user>
##$V9= 5
##$VALIST= <valist>
##$VCLIST= <CCCCCCCCCCCCCCC>
##$VD= 0
##$VDLIST= <DDDDDDDDDDDDDDD>
##$VPLIST= <PPPPPPPPPPPPPPP>
##$VTLIST= <TTTTTTTTTTTTTTT>
##$WBST= 1024
##$WBSW= 4
##$XGAIN= (0..3)
0 0 0 0 
##$XL= 0
##$YL= 0
##$YMAX_a= 4469039
##$YMIN_a= -1165159
##$ZGOPTNS= <>
##$ZL1= 120
##$ZL2= 120
##$ZL3= 120
##$ZL4= 120
##$ABSF1= 222.624
##$ABSF2= -17.3728
##$ABSG= 5
##$ABSL= 3
##$ALPHA= 0
##$AQORDER= 0
##$ASSFAC= 0
##$ASSFACI= 0
##$ASSFACX= 0
##$ASSWID= 0
##$AUNMP= <proc_1d>
##$AZFE= 0.1
##$AZFW= 0.5
##$BCFW= 0
##$BC_mod= 2
##$BYTORDP= 0
##$COROFFS= 0
##$CY= -3
##$DATMOD= 1
##$DC= 0
##$DFILT= <>
##$DTYPP= 0
##$F1P= 0
##$F2P= 0
##$FCOR= 0.5
##$FTSIZE= 32768
##$FT_mod= 6
##$GAMMA= 0
##$GB= 0
##$INTBC= 1
##$INTSCL= 4.134877e-10
##$ISEN= 128
##$LB= 1
##$LEV0= 0
##$LPBIN= 0
##$MAXI= 10000
##$MC2= 0
##$MEAN= 0
##$ME_mod= 0
##$MI= 0.1934396
##$NCOEF= 0
##$NC_proc= -2
##$NLEV= 6
##$NOISF1= 120.0001
##$NOISF2= 80.00006
##$NSP= 0
##$NTH_PI= 0
##$NZP= 0
##$OFFSET= 222.624
##$PC= 1.4
##$PHC0= -374.0943
##$PHC1= 38.6064
##$PH_mod= 1
##$PKNL= yes
##$PPARMOD= 0
##$PSCAL= 0
##$PSIGN= 0
##$REVERSE= no
##$SF= 50.3227315989248
##$SI= 32768
##$SIGF1= 140
##$SIGF2= 120
##$SINO= 11.81781
##$SIOLD= 32768
##$SREGLST= <13C.CDCl3>
##$SSB= 0
##$STSI= 32768
##$STSR= 0
##$SW_p= 12077.2946859903
##$SYMM= 0
##$S_DEV= 0
##$TDeff= 32768
##$TDoff= 0
##$TI= <>
##$TILT= no
##$TM1= 0
##$TM2= 0
##$TOPLEV= 0
##$USERP1= <user>
##$USERP2= <user>
##$USERP3= <user>
##$USERP4= <user>
##$USERP5= <user>
##$WDW= 1
##$XDIM= 32768
##$YMAX_p= 266239059
##$YMIN_p= -6711354
$$ End of Bruker specific parameters
$$ ---------------------------------
##NTUPLES= NMR SPECTRUM
##VAR_NAME=  FREQUENCY,     SPECTRUM/REAL,   SPECTRUM/IMAG
##SYMBOL=    X,             R,               I
##VAR_TYPE=  INDEPENDENT,   DEPENDENT,       DEPENDENT
##VAR_FORM=  AFFN,          ASDF,            ASDF
##VAR_DIM=   32768,         32768,           32768
##UNITS=     HZ,            ARBITRARY UNITS, ARBITRARY UNITS
##FACTOR=    0.368581032318806, 1,           1
##FIRST=     11203.0474431902, 0,            0
##LAST=      -874.247242800138, 0,           0
##MIN=       -874.247242800138, -6711354,    0
##MAX=       11203.0474431902, 266239059,    0
$$ Real data points
##PAGE= N=1
##DATA TABLE= (X++(R..R)), XYDATA
$$ [...]
15729a294425M41414P5240M62604J64606O33388N64450J58344l92574r24178o06783
15719g17914j001839L2505Q98812j63542n83249R75065L24790j073527j624185
15710b933084p08231J78666R45425J507069K24147L40987o322q98430p16908N63372
15700a503309J56992r2302M25123l43373K65048J074607K266364N53784q53056
15691A949878q70620k74984j53537o10114j619744j138727l06083O75284L47961
15682b000686k90229r1803J94527N60161O5029P487J352197K90885m56202l55394
15672g24028j80283j04062Q09348O6436l11989O35604P70714J52865p69091m81940
15662a36426K38744p00287q24654M19257L59131J44200J01666R4658N10208n62482
$$ y = [-1294425, -853011, -777771, -315167, -150561, 482827, 1047277, 1205621, 813047, -111131, -717914, -1719753, -1687248, -788436, -951978, -1535227, -560162, -235372, -1308899, -2933084, -3641315, -3462649, -2517224, -1010155, -786008, -445021, -451343, -1349773, -2066681, -1503309, -1346317, -1438619, -1013496, -1356869, -1091821, -17214, 2249150, 2802934, 1949878, 1079258, 804274, 650737, 40623, -1579121, -2717848, -3023931, -2348647, -2000686, -2290915, -2382718, -2188191, -1628030, -1563001, -1555514, -203317, 87568, -368634, -724028, -904311, -1008373, -199025, -132589, -444578, 191026, 961740, 1114605, 345514, -136426, 102318, -597969, -1422623, -1003366, -644235, -500035, -398369, -303711, 206497, -355985]
15652c55985m20234P85700J012846o86769k95184N44361j5663k05449k17141o1345
15642H5137J146508K059181J507891L80408n34569k102889j774871n19278l37897
15633i0379q582M99485L64103p81585j014082k21220k39350k99841k05324L17590
15623a679185r27036r35238M57870R07950Q20541J130806J43088l61892M66451
15614B3355J81596j93378j15857l7357L85058m36483p81759q78279p45303M02851
15604b195556P96023J126118O7739J66453N6764o51194L59094K87366r00757m59773
15594a347723M94022P44462Q45584Q94350n46068n62055k17429m17422K20127
15585A07848L81091j002450r59486l30096L89079R35781J247985M84911m88610
$$ y = [-355985, -776219, 9481, 1022327, 335558, 40374, 584735, 569072, 363623, 146482, 85137, 1231645, 3290826, 4798717, 5179125, 4644556, 2541667, 766796, 247518, -90379, -98961, 400524, 764627, -16958, -1031040, -1252260, -1491610, -1791451, -1996775, -1679185, -2606221, -3541459, -3083589, -2175639, -1355098, -224292, -81204, -443096, 23355, 204951, 11573, -104284, -141641, 243417, -193066, -974825, -1853104, -2598407, -2195556, -1399533, -273415, -205676, -39223, 17541, -633653, -274559, 12807, -887950, -1347723, -853701, -109239, 736345, 1630695, 1084627, 522572, 305143, -112279, 107848, 488939, -513511, -1472997, -1803093, -1414014, -478233, 769752, 1254663, 766053]
15576G66053m39752N2868j198995j820942l93345J796366J593065L84874j045895
15567c05703j475397p3759j4080r50169j707357K12162K003126J297839L52270
15558f61068R9087L62328J72253K68261N89385J109299k11971k458960j908546
15549b639932J66905R24991J436494J266993o516j416525k68458k03326l99738
15540a139112k75658n81706K38201J278401P88547L45885p18377r50056m03721
15531a417596J246982K893251K60096k312768q44573J47940j306227j292018N69349
15522b055564J492904Q75248n17737m01321l41097m18117p21389L90470J97898
15513a498705k56710K64351K87428m6119o5094M58661j83975k03108J279977J036553
$$ y = [766053, 326301, 379169, -819826, -2640768, -3034113, -1237747, 355318, 740192, -305703, -1781100, -1854859, -1868939, -2819108, -4526465, -4314303, -2311177, -1013338, -661068, -561981, -199653, -27400, 240861, 830246, 1939545, 1727574, -731386, -2639932, -2473027, -1548036, -111542, 1155451, 1148935, -267590, -536048, -739374, -1139112, -1414770, -1996476, -1758275, -479874, 308673, 654558, -63819, -1013875, -1417596, -170614, 2722637, 2982733, 669965, -174608, -26668, -1332895, -2624913, -2055564, -562660, 312588, -205149, -606470, -947567, -1365684, -2087073, -1696603, -1498705, -1755415, -1491064, -1203636, -1249755, -1314849, -856188, -1040163, -1243271, 36706, 1073259]
15503A073259k02121j68170N97841J31397j544171q10206j94146J23780P20899
15494b71638L0556k46223P79922J554058O87608k50594p84123j66300n36924j952534
15484a156192j651931k32714J060593J124170j66646m35137M59402J025033M14141
15475D40719J270928O60669k53459J20589o9018l46920l51321j37939n528j111913
15465B16807j468516J67067R37459j56922j058409n05233J01157R87476K75057
15456e04057L42131P51586K21829j58594j137144j473998n226J289300N8178j55654
15446g71649P83956N8828M08589L0196J38916J06058J28623L4338O67239l02589
15436A282505j621570n58003K51080r54193m81440l947j202709J3960J706307
$$ y = [1073259, 871138, 702968, 1300809, 1432206, -111965, -922171, -1116317, -992537, -271638, -241082, -487305, 292617, 1846675, 2534283, 2283689, 1499566, 1333266, 796342, -1156192, -2808123, -3040837, -1980244, -856074, -1022720, -1457857, -998455, 26578, 440719, 1711647, 2372316, 2118857, 2239446, 2170428, 1823508, 1472187, 1334248, 1328720, 216807, -1251709, -1084642, -147183, -304105, -1362514, -1867747, -1766590, -779114, -504057, -161926, 589660, 811489, 652895, -484249, -1958247, -1963473, -674173, -615995, -771649, 12307, 71135, 479724, 509920, 648836, 754894, 883517, 917855, 1585094, 1282505, -339065, -897068, -645988, -1600181, -2081621, -2085568, -3288277, -3274317, -1568010]
15427a568010J502142N55594L21303p50474o68110L47591L62658K09086o16473
15418c04693O15597O83322n12235J34689L75220j509671k328019q06155M26172
15409c225773J083398k0262p96852j83238Q03191R33254N93666J184519o12020
15400b40117j139151O15568P79950K0912n16500N34755Q50688j75262j274586
15391e43743q08531k94758K64569M818j148032k17008J81035J73421J076634J022051
15381b89544J035506j73680j737381j660798J45943J1984q23521m64702O66226
15372c289967L078497K977307J50448j153020j159789j05371K33603l00426p48375
15363c17093K34060N34923j016687o04495j39712J14803J67306R2622J130626
$$ y = [-1568010, -65868, 489726, 811029, 60555, -607555, -259964, 102694, 311780, -304693, 310904, 994226, 481991, 616680, 991900, -517771, -2845790, -3651945, -3225773, -2142375, -2162637, -2959489, -3142727, -2339536, -1406282, -812616, 371903, -240117, -1379268, -763700, 16250, 37162, -479338, 55417, 906105, 730843, -543743, -1352274, -1647032, -1382463, -1377645, -2525677, -2742685, -2561650, -2388229, -1311595, -289544, 745962, 572282, -1165099, -2825897, -2679954, -2667970, -3491491, -3956193, -3289967, -211470, 2765837, 2916285, 1763265, 603476, 498105, 731708, 431282, -317093, -83033, 451890, -564797, -1169292, -1309004, -1194201, -1026895, -934273, 196353]
15354A96353K70399j303264K91777M61800K66121J472099J455776K6216j187390
15345A949887j577451n49205m14157j274935o46384R01140J584163J747333J219030
15336B939421j95579N11731Q65253m41830j077103j771711j910869p16948n60146
15327b357781k33420Q99231J175601J078079J004234p1161l2753M42656m25557
15318A479129j240389n60891P79297L76698p18869l10123P01080M78343j53855
15309H30420J88016M70517k3933P07384p56441j177805j290451o56122l36315
15300b044730l72505J15511M09369j072290p51148M57328Q31447N45156j102969
15291b984831r89013L07232Q41679J290499P19746J123923J049941N88008j95775
$$ y = [196353, 466752, -836512, -544735, -82935, 183186, 1655285, 3111061, 3137277, 1949887, 372436, -176769, -590926, -1865861, -2512245, -1611105, -26942, 1720391, 2939421, 2743842, 3255573, 4120826, 3678996, 2601893, 830182, -1080687, -1797635, -2357781, -2591201, -1691970, -516369, 561710, 1565944, 1494783, 1462030, 1904686, 1479129, 238740, -322151, 457146, 833844, 114975, -195148, 505932, 984275, 830420, 1018436, 1488953, 1465020, 2172404, 1415963, 238158, -1052293, -1708415, -2044730, -2417235, -2301724, -1892355, -2964645, -3715793, -3258465, -2427018, -1881862, -2984831, -3973844, -3666612, -2824933, -1534434, -814688, 309235, 1359176, 1947184, 1751409]
15282A751409n02588J70880L15653L70215k59436j210894j159985q78246L19708
15273a083284K41380m86606p3102J250383J613123L22667R44868K89252j615418
15264A403263k469010o72880N21598J211061M54885r3140M79925M51612m65506
15255H21808l58767q0830M88360J106054M84953p59288M01128J41185j210262
15246A034341j385523j170288n59178P44526L93649R75169J025874Q24154Q63966
15237B746690j07791j014141m14829n90981j586715K15583K12595m75883M8074
15228i67398j16896n49287p1297M95515O86245K61546N455O9270K14508J382257
15218A409918Q48302j51906k29021o03999n46064k27098m72297K63586k17203
$$ y = [1751409, 1248821, 1419701, 1735354, 2105569, 1846133, 635239, -524746, -1402992, -1083284, -841904, -1328510, -1401612, -151229, 1461894, 1784561, 2729429, 3018681, 1403263, -1065747, -1738627, -1217029, -5968, 448917, 355777, 835702, 1287314, 821808, 463041, 382211, 870571, 1976625, 2461578, 1702290, 2103418, 2244603, 1034341, -351182, -1521470, -2080648, -1336122, -942473, 32696, 1058570, 1882724, 2746690, 2638899, 1624758, 1209929, 618948, -967767, -752184, -539589, -1015472, -967398, -1084294, -1633581, -1704878, -1209363, -523118, -261572, -256117, -186847, 27661, 1409918, 2258220, 2106314, 1877293, 1273294, 727230, 500132, 27835, 291421, 74218]
15209G4218r31285p73392k02320K81958M77033q8635n46516M15433M81665o2560
15199h74401p11926q4335J21443N9896n70301j87234o3327j30708J431208J647187
15189F37502J019478M84423P6548j100490j321635l33028O39405J123799O60011
15180A886013l12364k15070k35533j353806j676519k40093J050074N1773l66355
15171a411880o330Q19560J087639J35356L38529q911j4691j80906o63771l7746
15161E6849L16356L96074J012755P76338K09322q18245k360592j734944n20520
15152b666607O4044R82679P34141J81418M79744p0592l54151k42948n91490R6413
15142a387349m15418r99012K82415J895016J973576Q57146J32509j150933k658233
$$ y = [74218, -857067, -1630459, -1832779, -1550821, -1073788, -1162423, -1708939, -1293506, -811841, -874401, -1586327, -1670662, -1549219, -1489323, -2059624, -2246858, -2310185, -2440893, -1009685, 637502, 1656980, 2141403, 2217951, 1117461, -204174, -537202, 102203, 1226002, 1886013, 1573649, 1358579, 1123046, -230760, -1907279, -2147372, -1097298, -1045525, -1411880, -1418210, -598650, 488989, 624345, 962874, 953963, 939272, 758366, 94595, 56849, 373205, 769279, 1782034, 2558372, 2767694, 1949449, -411143, -2146087, -2666607, -2602563, -1619884, -885743, -704325, -224581, -295173, -649324, -892272, -1483762, -1387349, -1802767, -2801779, -2519364, -624348, 1349228, 2206374, 2338883, 1187950, -1470283]
15133a470283j774476M71455R03248k70456o01664O78372J253682J028157N95514
15124H13549K84665p3079J138906N08941m16961o84102N02493J25000q6983j69140
15114A943289o48705q51685o38373l49994m96799l03149R83168j1070j84553M43990
15104a13881J31034J195694K47530j055395j158878o75549P42145Q19730q90900
15095g58470q99854K65256j00318k35039q3123n17998r3715M27735J15756q74019
15085b753789l08131J337725J096430p67742j583612q86641k44403R06667J040926
15076b162570M45909P2252J00564Q66327r49205p12299j01312q1003j2044m7744
15066b581125k11455N5529J89798J62439J62753M42792M23569J154889J840284
$$ y = [-1470283, -3244759, -2773304, -1870056, -2140512, -2742176, -2063804, -810122, 218035, 813549, 1098214, 1025135, 2164041, 2672982, 2256021, 1571919, 2074412, 2199412, 2112429, 1943289, 1294584, 442899, -195474, -545468, -1042267, -1345416, -362248, -373318, -557871, -113881, 17153, 1212847, 1460377, 404982, -753896, -1429445, -687300, 132430, -758470, -1658324, -1393068, -1493386, -1728425, -1811548, -2329546, -2423261, -1995526, -1879770, -2753789, -3061920, -1724195, -627765, -1395507, -2979119, -3865760, -4110163, -3203496, -2162570, -1716661, -1644409, -1543845, -677518, -1626723, -2339022, -2440334, -2521337, -2533381, -2581125, -2792580, -2737051, -2547253, -2384814, -2222061, -1779269, -1355700, -200811, 1639473]
15057A639473L31817o53709J01131J739925R43402r82711o84769o86924p13589
15048A034046J13859q4252p96152K91098R74609j03871j4162j63994J010065O07581
15038B868827l91410l09152N52425o4940q02521j098491j09243m4862m67925M10322
15028E43030J135183J017480l40002p49129q45479q04893o03126p18193j495286
15019b860415n39542M74554K60056K22345N69146P5475j8182p12669k20639P45963
15009b003908j91629k37578P04037O26028q0148J62686l20568p378N32794R07524
14999I1860m15630n88345k02972K52010P60366K71173q87928r87633m41456J34511
14989b014044m71452r29245O03512K69589n5230J034340J618357R99190n14005
$$ y = [1639473, 1971290, 1317581, 1418712, 3158637, 4102039, 3119328, 2434559, 1747635, 1034046, 1147905, 1063653, 267501, 558599, 1533208, 1429337, 1415175, 1251181, 2261246, 2868827, 2477417, 2168265, 2720690, 2655750, 1853229, 754738, 645495, 600633, 132708, 543030, 1678213, 2695693, 2355691, 1606562, 761083, -43810, -646936, -1365129, -2860415, -3399957, -2925403, -2665347, -2443002, -1873856, -1798381, -1816563, -2529232, -2749871, -2003908, -2195537, -2433115, -1729078, -1103050, -1183198, -1020512, -1341080, -1348458, -815664, 91860, -323770, -912115, -1115087, -863077, -102711, 168462, -719466, -1707099, -2148555, -2014044, -2485496, -3414741, -2811229, -2541640, -2596870, -1562530, 55827, 1055017, 541012]
14980E41012j271467l37335j13851P32579J107995o11802l75765N03478j29836
14971D5008q08321R07449l2945J68867J180423N36517O8113k49424K40006J015484
14961C071177M98616p9647j423245k132143o42004j5071R3835J85296J212909
14952G69723M63423j63185J87215J92067j007218j576890j390296o47353l15423
14943c487937L79842L9504J02923p1044L12784N63609L76380M84907l00493l27268
14933a926793l68469j14551J249510N11924M59583K86015o08179m62374k90551
14924a263885j181899o1299O84373N86202m02948o15361l67788J151732P03523
14915g67350j153147M80201J926526J084935J22452K67767r04852r00527O56012
$$ y = [541012, -730455, -1067790, -1181641, -449062, 658933, 47131, -328634, 174844, 45008, -763313, 144136, 111191, 280058, 1460481, 1996998, 2065111, 1815687, 2055693, 3071177, 3569793, 3490146, 2066901, -65242, -707246, -722317, -628482, -443186, 769723, 1233146, 1069961, 1257176, 1449243, 442025, -1134865, -2525161, -3172514, -3487937, -3108095, -3068591, -2965668, -3036712, -2723928, -2160319, -1783939, -1299032, -1599525, -1926793, -2295262, -2409813, -1160303, -648379, -188796, 97219, -510960, -973334, -1263885, -2445784, -2507083, -1822710, -1236508, -1639456, -2254817, -2622605, -1470873, -767350, -1920497, -1440296, 486230, 1571165, 1693617, 1961384, 1056532, 156005, 812017]
14906H12017K79342K79030O21353O19419Q33920q91412j344993l74806K23433
14897A057303J007841O85054o64276j680463j176897k60492N64333n2020j123651
14888a643268N608Q94531J529234Q84221j127251n97521K18764l87377m23119
14879f46178R89281J146457l35438n11373l35641n48711o92064r13901p55890
14870b603458N53173J107180L70564p30099j087624j95181J045247m6527q88855
14861b475580J34637Q59664N1639J96217N66785o0938p26110J29748J080253L57640
14851A13955k20155K1252L5450q27185l64636n31047N29745J428595L88783j151763
14841e77006p13567l5969J123908J396925R00479K35096r26482n31453k09133
$$ y = [812017, 1091359, 1370389, 1991742, 2611161, 3445081, 2553669, 1208676, 833870, 1057303, 2065144, 2750198, 2085922, 405459, -771438, -1031930, -467597, -519617, -1643268, -1637660, -743129, 786105, 1670326, 543075, -54446, 164318, -223059, -646178, 343103, 1489560, 1154122, 642749, 307108, -241603, -933667, -1847568, -2603458, -2050285, -943105, -572541, -1302640, -2390264, -2585445, -1540198, -1586725, -2475580, -2340943, -1481279, -1429640, -1233423, -666638, -727576, -1453686, -1323938, -243685, 113955, -106200, -84948, -49498, -876683, -1241319, -1772366, -1242621, 185974, 574757, -577006, -1290573, -1326542, -202634, 1194291, 2094770, 2329866, 1403384, 871931, 662798]
14832F62798j04253J45618P92405J03152n71346l7929O96190l13356q83354l46193
14822A43732j95028q23718k75652q4680m43866K167921K027483K39387m19109
14813B336470j427781r72456j046439q0545J210281J507424J11850r65212q7081
14804E86511J107499J408750J99317k83621r80661k87984q04844j361789o94435
14795a111257p65684L85714N52006k0095L25064M49253m49274N97064P80130j592616
14785h49695o76730r87039j509259J112829K248312J703418J456399l78146j037788
14776A082301n50433p08074q17178n47934J057018J026043M23978m26868q32562
14767b93709N63074M89564L30473O86661L90039P8338j216766j704312j152905
$$ y = [662798, 558545, 704163, 1496568, 1599720, 1028374, 990445, 1686635, 1373279, 489925, 143732, -51296, -875014, -1150666, -1235346, -1679212, 488709, 2516192, 2755579, 2336470, 908689, -63767, -1110206, -1190751, 19530, 1526954, 1638804, 673592, 586511, 1694010, 3102760, 3302077, 3018456, 2037795, 1749811, 944967, -416822, -1111257, -1876941, -1491227, -939221, -959316, -634252, -184999, -634273, -37209, 742921, -849695, -1526425, -2513464, -4022723, -2909894, -661582, 1041836, 2498235, 2120089, 1082301, 531868, -176206, -993384, -1541318, -484300, 541743, 965721, 538853, -293709, 269365, 758929, 1089402, 1776063, 2166102, 2244440, 1027674, -676638, -1829543]
14758a829543O83805O11276m31542j109552m82691N37701Q42302N5491j144672
14749b267425j035008r3635O76581J141629J75177n67052j105257j160272j087069
14740e322331k69605Q83052Q10271O10211J085458K94466N07769M66183J88743
14731g45783O43796J73233p86623o29589j778271j340103O01118J528183J001615
14722a332424o37604o51429O62434J451612J370912j48947j036747J45622j74957
14713c51528N83756R10004P15358j73991k59665q99953j40424J64639j130294
14704e82098m49469J513526K030540l63524k210357j413545N98876J031294N1
14695A55294O02383P8660j52382K22803O69039N61887l26141o26696M91034L94119
$$ y = [-1829543, -1145738, -534462, -966004, -2075556, -2558247, -2020546, -1178244, -1122753, -2267425, -3302433, -3396068, -2719487, -1577858, -1402681, -1969733, -3074990, -4235262, -5322331, -5591936, -4708884, -3898613, -3288402, -2202944, -1908478, -1400709, -934526, -745783, -101987, 71246, -715377, -1344966, -3123237, -4463340, -3862222, -2334039, -1332424, -1970028, -2621457, -1959023, -507411, 863501, 714554, -322193, -176571, -351528, 232228, 1142232, 1857590, 1683599, 1423934, 523981, 383557, 548196, -582098, -1031567, 481959, 2512499, 2148975, -61382, -1474927, -876051, 155243, 155294, 757677, 836337, 683955, 906758, 1575797, 2137684, 1811543, 1184847, 1675881, 2070000]
14685B070000L30630Q84319J24086j341561r43315j88066p49448n03571Q44465
14676E27539J118011L26397Q88498P09084L7956j453431j729693j015199P143
14667e83695K165230J173138L07635L50184J695831J971765O30981j752305k767491
14658C191273p73286r7373P46946p7340j215649j148753N2968M6488o0859O25912
14648A290327L08456k33397O3378O3188j379590j887405j374995o78355P1399
14639c756994P29380N90726M79735O00634P01849P44060l54045n38129m18405
14630a221189k8945K35341k42383k84603K83223K239844J611095j873611j871597
14621a152825M24967L71707k4485Q43061p46985j914631m22301N32921M36011
$$ y = [2070000, 2400630, 3284949, 3409035, 2067474, 1124159, 936093, 186645, -316926, 527539, 1645550, 1971947, 2860445, 3569529, 3607485, 2154054, 424361, -590838, -583695, 1581535, 2754673, 3062308, 3412492, 5108323, 7080088, 7711069, 5958764, 3191273, 2417987, 2320614, 3067560, 2990220, 1774571, 625818, 678786, 725274, 664415, 1290327, 1598783, 1365386, 1428764, 1491952, 112362, -1775043, -3150038, -3828393, -3756994, -3027614, -2436888, -1957153, -1356519, -654670, 89390, -264655, -802784, -1221189, -1250134, -1014793, -1257176, -1541779, -1258556, 981288, 2592383, 718772, -1152825, -727858, -356151, -380636, 462425, -284560, -2199191, -2621492, -2088571, -1652560]
14612a652560l83416l93927L99941N45608J84482k32582K98128J334379J424271
14603A524324J358124k52629m75345q56299j288156r40161J83617l98434p50566
14594a895525Q31867K272269J399582l92018N94344J62917j732897j927024j86406
14585h72891Q73045J56023q89403j00326R85895R23150J14445j405187j764532
14576a979781K03389N47762K05281J032170J025413J35699l2293p2447j108458
14567d3265j463665l72157J195630l6933j362529j374611L9310J745019O45663
14558a027538n17640l62508p06143j131728M72016P18787J292382J006923Q31159
14549E75710M62331o06780j559483o87870O58396J828046O04662j095056J14684
$$ y = [-1652560, -2035976, -2429903, -2029962, -1484354, -1299872, -1532454, -1234326, 100053, 1524324, 2882448, 2629819, 2154474, 1298175, 10019, -930142, -746525, -1144959, -1895525, -1063658, 1208611, 2608193, 2216175, 2810519, 2973436, 1240539, -686485, -872891, 154, 156177, -733226, -833552, 152343, 1075493, 1189938, -215249, -1979781, -1776392, -1228630, -1023349, 8821, 1034234, 1169933, 1137640, 1065193, -43265, -1506930, -1879087, -683457, -720390, -2082919, -3457530, -3418220, -1673201, -1027538, -1545178, -1907686, -2613829, -3745557, -3273541, -2554754, -1262372, -255449, 575710, 1038041, 431261, -1128222, -1816092, -1157696, 670350, 1275012, 179956, 294640]
14540B94640R37310l41278o11115J749095J396876l83249j216519l1922O29481
14531B423319q20661j283730m15212L166k62516K80153l96457p31324K80137o8420
14521i91545Q50725J006029k37336l22876k66818K83196p5321N29418k05859m79057
14511I0556K5222j25533q57411n07619M55870Q72324P2682j262711j235761R5317
14501b377064J75766M10491k85348P08172J069135l51786j807930p10672q7793
14492c257029J87007r4030N1988k67164O26580J903377J845353N53235m17477
14483A131840L08227K5834q01215k71154L32990p16661o10377M61801M16774R72036
14473A250095M59655p49407j732634o81689Q71296O6912j158124q21954O49677
$$ y = [294640, 1231950, 890672, 279557, 2028652, 3425528, 3042279, 1825760, 1793838, 2423319, 1602658, 318928, -96284, -93118, -355634, -75481, -471938, -1203262, -923125, -991545, -140820, 865209, 627873, 304997, 38179, 321375, 246054, 775472, 569613, 90556, 115778, -9755, -867166, -1374785, -918915, -46591, 26091, -1236620, -2472381, -2377064, -2201298, -1790807, -2076155, -1367983, -298848, -650634, -2458564, -3169236, -3257029, -3070022, -3164052, -3112064, -3379228, -2752648, -849271, 996082, 1549317, 1131840, 1440067, 1465901, 664686, 393532, 726522, 9861, -600516, -138715, 278059, 1250095, 1709750, 960343, -772291, -1453980, -582684, -515772, -1673896, -2495850, -1846173]
14464a846173o64448j166140m30184Q03586J414621J375304J074833N55292J94548
14455A311239P30575r11319p26579J67208O3964J06352M54436L86876M09139K93868
14445B285759l20372j711031p79803J00021K09382L43014j33687L74877M69090
14436H37250j174999j108074Q10725J231068j34836o37897l25127r87771o15949
14427b105610N03526l70814M33539K6349n68349J111424J532118K51312L9982
14418H53477n53585j593984j224104j65371m35617q41478M33286J659920J161333
14409g06123J04199o9478o3806j57961l2040L08939L47376n65444k86023J18917
14399a001444P76061J07710N09180K79201Q29093N2061r87096m01848j218061
$$ y = [-1846173, -2510621, -3676761, -4106945, -3303359, -1888738, -513434, 561399, 1116691, 1311239, 2041814, 1130495, 403916, 571124, 635088, 741440, 1195876, 1582752, 1991891, 2285759, 1965387, 254356, -525447, -425426, -216044, 126970, -6717, 368160, 837250, -337749, -1445823, -635098, 595970, 461134, -176763, -501890, -1489661, -2105610, -1602084, -1972898, -1539359, -1513010, -2081359, -969935, 562183, 813495, 853477, 299892, -1294092, -2518196, -2683567, -3119184, -3960662, -3527376, -1867456, -706123, -601924, -671402, -735208, -893169, -925209, -616270, -268894, -834338, -1120361, -1001444, -225383, -117673, 391507, 670708, 1499801, 1551862, 564766, 162918, -1055143]
14390a055143j034211o86940m9442M58164J214156J394299J123016p1109k257470
14381i64680k544345Q5302Q51011K72943n45710r68387O71321O5054n33270M48248
14371c162513K88237L53274J485762J429674L85929P65468J089366j309057k650576
14362a324436j439659K97199Q41700J710053J948077k34933j081852J46221J48083
14353A010453L03210J199418O84429r84319m88453k8482j581724q50366R5609
14344f40225K12665J204279R30205k82686k29053K37148K16538J107752Q42255
14335C598878n17392m23762l81661l70594j83974k63685J34624K34464k83681
14326A543217m59173r85363l40665Q87720J008954J244771j83363n72234K22174
$$ y = [-1055143, -2089354, -2776294, -2825736, -2367572, -1153416, 240883, 1363899, 1292790, -964680, -3509025, -3423723, -2572712, -2299769, -2845479, -3813866, -3142545, -3077491, -3610761, -3162513, -2874276, -2521002, -1035240, 394434, 780363, 1545831, 2635197, 1326140, -1324436, -2764095, -2466896, -1625196, 84857, 2032934, 1798001, 716149, 862370, 1010453, 1313663, 2513081, 3197510, 2213191, 1724738, 1696256, 114532, -735834, -640225, -427560, 776719, 1706924, 1424238, 1195185, 1432333, 1648871, 2756623, 3598878, 3081486, 2657724, 2276063, 1905469, 1721495, 1457810, 1592434, 1826898, 1543217, 1084044, 98681, -241984, 645736, 1654690, 2899461, 2716098, 2143864, 2366038]
14317B366038L12486n95905k87452k69332o41446m60535j11806P19357J381269
14308B412674L81636m06527M8734K38521R5041O1983n57517j655500j237092r53806
14298a571853m33558j99819J05339Q19667J111079P71123L71241L28956P53005
14289B055180M74230q70869q15995K00413n79943m77893p21228N96445P02581
14280E62921j289848j939393j036189O07273Q58645n35490j188750N97725J450279
14271a912827Q56463J765922P16809Q51948J634954R13630j55868j261216j867622
14262A542193j322155r24193j6758K58464k86129R05289J237780j66235j01211
14253A127045m05867J33836J079752L70392j100061j984538m17352J401969J444602
$$ y = [2366038, 2678524, 2082619, 1795167, 1525835, 884389, 423854, 312048, 1031405, 2412674, 2794310, 2387783, 2436517, 2675038, 2770079, 2832062, 2274545, 619045, -618047, -1571853, -2005411, -2205230, -2099891, -1280224, -169145, 601978, 973219, 1302175, 2055180, 2529410, 1658541, 842546, 1042959, 463016, -14877, -736105, -139660, 562921, -726927, -2666320, -3702509, -3095236, -2236591, -2772081, -3960831, -3363106, -1912827, -1056364, 709558, 1426367, 2278315, 3913269, 4826899, 4671031, 3409815, 1542193, 220038, -704155, -720913, -462449, -748578, 156711, 1394491, 1228256, 1127045, 721178, 855014, 1934766, 2305158, 1205097, -779441, -1196793, 205176, 1649778]
14244A649778P30562J16889k71526p11769j012338j477308j047123Q6413Q66629
14235a069793J141810M45195M27756Q2212j98813k96509n77833J05410M90902
14226E50337J351512K233483P74885j088987j819187o06111j66024o58848K67768
14217H38828L30879n27125o06992k25734o5506K08171P06398R07178K34408j105931
14207F94574o20706l09037j97641M56652P67646K44465R21542Q16472m17904p24920
14197A631143L02288j44028j95960k76901j31151O20113k32608j97966Q9587N31190
14187A995707n33737q58257L45056P14079N81352j83427j120563j52374N75323
14178A363159n61747k04939J093484M66258M08604Q42110P29445Q68672j19367
$$ y = [1649778, 2380340, 2497229, 2225703, 1513934, 501596, -975712, -2022835, -1936422, -1069793, 72017, 517212, 944968, 1027180, 828367, 531858, -45975, 59435, 550337, 1901849, 4135332, 4910217, 3821230, 2002043, 1395932, 1229908, 571060, 838828, 1169707, 642582, 35590, -190144, -255650, -47479, 658919, 1566097, 1800505, 694574, 73868, -235169, -432810, 23842, 791488, 1035953, 1957495, 2773967, 2356063, 1631143, 1933431, 1789403, 1593443, 1316542, 1185391, 1805504, 1572896, 1374930, 1464517, 1995707, 1461970, 603713, 948769, 1662848, 2244200, 2060773, 940210, 787836, 1363159, 801412, 596473, 1689957, 2156215, 2564819, 3406929, 4136374, 5005046, 4885679]
14169D885679j980790k351449o51000Q92529N20374j194797m96577J07662M99029
14160B30660m0586l56355m2180J6249N97753r51942o27266k34887q77545n55585
14150b841684N42194J649645J582691L93932j73989P62826N7138L16298M7825
14141B336876j663138r33287P41610J141284r747q59339k68329N70487m20959
14132F35458j60001p5294j70335j46426o68706j97258R6230P014K88088k45234
14122f36464q02824l1291p32718l68898M55547L21196K50079q02811j630939J7811
14112c961312O45131P42368J645954J219736Q7069n49856n78119K54955Q00901
14103C06827n17169j614j60583K85054R12316r54871j372744j143817N60892J170007
$$ y = [4885679, 2904889, 553440, -97560, 794969, 1315343, 120546, -376031, -268369, 230660, 190074, -166281, -208461, -192212, 405541, -546401, -1173667, -1408554, -2286099, -2841684, -2299490, -649845, 932846, 1326778, 1152789, 1915615, 1972753, 2289051, 2336876, 673738, -259549, 482061, 1623345, 1613598, 754259, 485930, 1056417, 635458, 475457, 400163, 229828, 83402, -585304, -782562, -686332, -679318, -391230, -636464, -1439288, -1470579, -2203297, -2572195, -2116648, -1795452, -1545373, -2348184, -3979123, -3961312, -3316181, -2573813, -927859, 291877, 378946, -170910, -749029, -494074, 306827, -210342, -211956, -372539, -87485, 824831, -130040, -1502784, -2646601, -2085709, -915702]
14093i15702J79173L24822k3767N55525L24646K29064N88419M43561O3034p84459
14083I84316l17819M00165J17533r84855j160317r4718J189396Q99768l94481
14074F38988K07222j98646n71547l10114l36343J50660P37002Q30945K35855q21041
14064E62981j225626n61826O71583J431488R89619M1799r81097n10841n16540
14055i8460l45247N84730l79343j13456O6517o70286K48929J161192m56024l21004
14045c22452J20633N79755m82109j412735n92169O82666L15528j45386L90282
14036h65987M62765k64978k271768j431457L2808P91425J946093J488453j07602
14027b20248N4703O17670n3504k91558M92878J232703k44769p68226n93292n85515
$$ y = [-915702, -736529, -411707, -435474, 120051, 444697, 673761, 1262180, 1705741, 1768775, 984316, 666497, 1066662, 1184195, 199340, -960977, -1055695, 133701, 1033469, 638988, 846210, 647564, 76017, -234097, -570440, -419780, 317222, 1148167, 1384022, 562981, -662645, -1224471, -552888, 878600, 1868219, 1910018, 928921, 418080, -98460, -443707, 141023, -238320, -351776, -285259, -955545, -706616, 454576, -1448, -322452, -201819, 377936, -104173, -1516908, -2109077, -1426411, -1110883, -1256269, -865987, -403222, -668200, -2939968, -4371425, -4338617, -3547192, -1601099, -112646, -220248, -165545, 452125, 398621, 107063, 599941, 1832644, 1587875, 819649, 226357, -359158]
14017c59158j7980m13916j81395r25955L88782Q93092j46768M41915L44320q65092
14007h42155p98333N7820K31678M20107J51026n8999P1350J033308J725862P41300
13997B732964P60300P7075o33371m53769l50104M00600j106760p40173J137868
13988A824630J08501r36822n86521n67344p83471r06155L50304N69550k52088
13979a179416r16512k81689N27967J114016L47488m11057p5596O13816J167858
13970I06875L01719l38741J13958K05913N87865J009658J2411q83618r75853j236283
13960b96096p39194k18513n26765L09718K12996n81131O4875L94591J105755J16347
13950a57417j002911O46803R51783J047519R2375j203516j321069k92831P45636
$$ y = [-359158, -377138, -791054, -972449, -1898404, -1509622, -616530, -763298, -321383, 22937, -842155, -1640488, -1582668, -1350990, -930883, -779857, -838856, -767506, 265802, 1991664, 2732964, 3493264, 3570339, 2936968, 2483199, 2133095, 2533695, 1426935, 686762, 1824630, 1933131, 996309, 409788, -157556, -941027, -1847182, -1496878, -927328, -1179416, -2095928, -2377617, -1849650, -735634, -388146, -799203, -874799, -260983, 906875, 1208594, 869853, 983811, 1189724, 1777589, 2787247, 2799658, 1916040, 940187, -296096, -1035290, -1253803, -1780568, -1470850, -1257854, -1838985, -1774110, -1379519, -273764, -157417, -1160328, -513525, 438258, 1485777, 1578152, 374636, -946433, -1239264, -493628]
13941d93628M85930N27656M57152k63622N6588L71494o18349q30630M9022J51125
13931a07262N35861K35501q13661j328990n62583J84121R33739N27770l64980
13922g60484p25829r55824Q6567O72633L75115Q56110J0879j167700o05394l51587
13912b565514l43614l82453J16167J132351J346151P70436O26883L2413j37923
13903E94897Q09908M18766j89852K63931K62736k54012j157338p72619J98212
13894A74629m37489r45662p64576o46583k41405N43058J37425q78422M2063J421146
13884a595816P97560K37898J9007O51587O65823k07702n86259O2183J50051r79129
13874g84797j037809l69227M03013k47765O80038J112202L3363p28084j000338
$$ y = [-493628, -7698, 519958, 977110, 713488, 770076, 1141570, 523221, -307409, -258387, -107262, 428599, 664100, -149561, -1478551, -2041134, -1857013, -923274, -395504, -760484, -1486313, -2442137, -2355570, -1682937, -1307822, -451712, -440833, -1608533, -2213927, -2565514, -2909128, -3291581, -3175414, -2043063, -696912, 73524, 700407, 732820, 594897, 1404805, 1823571, 1633719, 1897650, 2160386, 1906374, 749036, -23583, 174629, -262860, -1208522, -1973098, -2619681, -2861086, -2318028, -2180603, -3059025, -3016962, -1595816, -798256, -560358, -541351, 110236, 776059, 568357, -17902, 44281, 194332, -784797, -1822606, -2191833, -1788820, -2036585, -1356547, -244345, -210982, -939066, -1939404]
13865a939404M71335N51762J521385P24665j100356j553942j331899P30431J096139
13856h29884l73597j426569j659206o88198o62395l15368P92790J947418M71045
13847b743964p6504K88320o42752o43322k3038j74982l90484O65936J417096J048378
13837a275316J045972p19739j253463m49554M70871K14506L53913K71224Q32867
13828e08719J225312K72289L48137m7049j42654K00488r3937j352702n21576J760538
13818A140127P1725j530263j052291r22165p32798Q20291J013959M32020o79907
13809a439302m48333J057378J370133J374962R07620P4326K50261J144183J566446
13800E857674J197975j902179l103886k151701l24319J62739j584K12228m61100
$$ y = [-1939404, -1468069, -916307, 605078, 1329743, 229387, -1324555, -2656454, -1926023, -829884, -1203481, -2630050, -4289256, -4977454, -5639849, -5955217, -5162427, -3215009, -2743964, -2820468, -2532148, -3174900, -3818222, -3841260, -4016242, -4406726, -3740790, -2323694, -1275316, -229344, -949083, -2202546, -2652100, -2181229, -1966723, -1612810, -1341586, -508719, 716593, 988882, 1337019, 1289970, 1147316, 1347804, 1253867, -98835, -620411, 1140127, 1211852, -318411, -1370702, -2292867, -3025665, -2205374, -1191415, -759395, -1439302, -1887635, -830257, 539876, 1914838, 2822458, 2896784, 3147045, 4291228, 5857674, 7055649, 5153470, 2049584, -102117, -426436, -263697, -265281, -53053, -514153]
13791e14153j74414J34253o8895L03359k22950o03989j67291J033426R49941m44804
13781B24483j369343k69491J160796J94980j026611K29744Q55639l4131n53264
13772e87198m9668Q93093K43264J2022J43415o24851m78827O45891N66105l44771
13762D18475q6962Q83454K53883j269003m88197K19914o13701o12037k37766n98708
13752b130648m50083L07437J78646N15399O95709L83864N37208L78625j64881
13743B51276r37854o02890q4506o4974R04520J602415O69087M76819o00881q04967
13733H08045K23907O92012N8297J82426M23776q65919j957119j214346p39266
13724b388187P5265Q24035J80800j03049M97902l3532q52650P7814R28595Q45282
$$ y = [-514153, -688567, -554314, -623209, -319850, -542800, -1146789, -1314080, -280654, 669287, 224483, -1144860, -1414351, -253555, -58575, -1085186, -855442, 197, -33934, -587198, -636866, 256227, 499491, 511513, 654928, 30077, -448750, 197141, 763246, 418475, 331513, 1214967, 1468850, 199847, -288350, -68436, -682137, -1294174, -1531940, -2130648, -2580731, -2273294, -2094648, -1579249, -883540, -499676, 37532, 416157, 251276, -686578, -1289468, -1373974, -1438948, -534428, 1067987, 1737074, 2213893, 1613012, 808045, 1031952, 1723964, 1782261, 1964687, 2388463, 1522544, -434575, -1648921, -2388187, -2312922, -1488887, -1308087, -1411136, -913234, -946766, -1799416, -1721602, -793007, 52275]
13714E2275m33957r87348l73610N25892O10307O6639l79915J6060M00788m25529
13704i28398k52978j55422j194396m43633R39265J585870J001629P13468J625258
13695B890663J556365R14111M24024k93839j094733j777060j101362O50841P07866
13686B876876m76064n67648l78263q25927q73085k14524j19748K37132R58794
13677F17543O43315P3269p33813p76079o09440j79779J404792R47632j87431n60970
13667F39039K45357O66207J43768j1700k33019j82990l15086j23045k70826j085352
13657e27647o97431J32398J104050J256556R02177K40064k33781r09971r01933
13648C64482K45008M54558O33224P9960k89756l77210j513668j019773R5492J35825
$$ y = [52275, -381682, -1369030, -1742640, -1216748, -606441, -539802, -919717, -903657, -502869, -928398, -1181376, -1336798, -2531194, -2974827, -2035562, -449692, 551937, 1265405, 2890663, 4447028, 5361139, 5785163, 5491324, 4396591, 2619531, 1518169, 2169010, 2876876, 2400812, 1833164, 1454901, 628974, -244111, -458635, -578383, -341251, 617543, 1260858, 1334127, 600314, -175765, -785205, -964984, 439808, 1387440, 1200009, 639039, 884396, 1550603, 1694371, 1682671, 1449652, 1266662, 951576, 828531, 557705, -527647, -1225078, -1092680, 11370, 1267926, 2170103, 2410167, 2176386, 1266415, 364482, 609490, 1064048, 1697272, 1777232, 1487476, 1110266, -403402, -1423175, -1327683, -1191858]
13638a191858O056J64811O77683L90678J088146K421020J472085K34432j131406
13629D131647k055781r61069M78460l00883r83440l47455P88848Q22076j148709
13620D23694p45702r59546k66681N48176J637862N83948K60123l44353q26120
13611C11401r94739q05243K15760N47768p09577M6818P982R35615J166556L82108
13601A104449O9376K95760l94291k42091Q36383P24710j116j481198j397011l01631
13591g86660r5231l48823L86953J698882K212375L85202j710061r56859L63015
13582A148793j242206p38033K35499j54101q40081J60531O10611N9125q09929
13573a569791Q2931O49846O27000o56303j37943R59538N49394J86604O08055P27311
$$ y = [-1191858, -1185802, -1020991, -343308, 47370, 1135516, 3556536, 5028621, 5263053, 4131647, 2075866, 1114797, 1593257, 1292374, 308934, -38521, 750327, 1572403, 423694, -322008, -1281554, -1548235, -1000059, 637803, 1221751, 1481874, 1137521, 311401, -683338, -1488581, -1272821, -725053, -1434630, -1387812, -1379830, -444215, 722341, 1104449, 1173825, 1469585, 1075294, 833203, 1669586, 2394296, 2393180, 911982, -485029, -786660, -881891, -1230714, -843761, 855121, 3067496, 3452698, 1742637, 785778, 1148793, -93413, -831446, -595947, -750048, -1590129, -1429598, -818987, -759862, -1569791, -1486860, -837014, -210014, -866317, -1004260, -44722, 504672, 691276, 1299331, 2026642]
13563B026642n83465k08730N04411k04671j119084K74951k50371J51667J814821
13554B406171J00058j411077o47771j2682L97569J323000K94588o04943j204766
13545F40147k09191K72373k25013J20952K68576j44882L59691M24837M58078L07814
13535B273382p76920o23686K86164m85341j386659j026693R96728K200077L52485
13526A809537l78738J5965L69134K64304K39123l32509q34103J37919p54322j38441
13516C97869N69670k97544j06364K57114J86898r05701M42511k417j305604n36756
13506a300324L52651Q30679q896j109496q40120P15212M75739O10081L33127K5708
13496H4361n97626j662580j025211N5848m21887j18162J027632J224899P87035
$$ y = [2026642, 1443177, 1234447, 1738858, 1534187, 415103, 690054, 439683, 591350, 2406171, 2506229, 1095152, 447381, 434699, 832268, 2155268, 2449856, 1844913, 640147, 430956, 703329, 478316, 599268, 867844, 722962, 1082653, 1507490, 1965568, 2273382, 1496462, 872776, 1158940, 673599, -713060, -1739753, -743025, 1457052, 1809537, 1430799, 1446764, 1815898, 2080202, 2319325, 1986816, 1152713, 1290632, 536310, 397869, 967539, 669995, 563631, 820745, 1007643, 101942, 544453, 542036, -763568, -1300324, -947673, -116994, -125890, -1235386, -2075506, -1360294, -884555, -274474, 58653, 84361, -513265, -2175845, -3201056, -3145208, -3567095, -3685257, -2657625, -1432726, -645691]
13487f45691J54361n77456K8680n06941p43076N96541l57999j228527o0013N12665
13477b827456l17894P91518J719367J109177R0418r94851o22420J247227R07644
13468A102730j98583R7258l95383L69402L44704o02620j260161m92660L72213
13459f63100j11647m74614M74500L36833J38389J7347Q18500J140383M89808p34517
13449A431882j182985O5903P94136k57436n00745M38320j29735j68548M02723
13440H93515L38563J11731P96408Q94932l02941j233343n91863j042446r07135
13431a042579j90670L8023J13879O68587J209929J241858L1386o48842q95044
13422E26527L98188J036765o6460k34857l35393o67909M62527K5702p33775j122390
$$ y = [-645691, -491330, -1068786, -1040106, -1547047, -2290123, -1693582, -2051581, -3280108, -3340121, -2827456, -3145350, -2353832, -634465, 474712, 565130, -429721, -1052141, 195086, 1102730, 904147, 1001405, 606022, 975424, 1320128, 717508, -542653, -1035313, -663100, -774747, -1249361, -774861, -438028, -299639, -282292, 536208, 1676591, 2166399, 1431882, 248897, 314800, 1108936, 851500, 350755, 789075, 659340, 490792, 893515, 1232078, 1343809, 2140217, 3035149, 2732208, 1498865, 907002, -135444, -1042579, -1233249, -1195226, -1081347, -412760, 797169, 2039027, 2070413, 1421571, 526527, 924715, 1961480, 1895020, 1660163, 1324770, 656861, 1119388, 1145090, 411315, -711075]
13412g11075j340309n32146O982J12331P51150P00723O46824k04340k81165O58109
13402a92916K36047k70006K76348M82722J00388N65580N40853M34993K3729n61107
13392A636631o54477K30489K69065K26629j011437j688730m0158N92577K98196
13383a41215K14126Q33179J26714K78851R56339J012302o10393j412807j21128
13374A135968Q86193O14644q87717j559945p66913O30381J811193J598705j155065
13365B307444j974930j388915m6875K65596l43982J31721L91019M69828J0746
13356a78348N29206K54q19811R233O10354M08226M28601K56860q78504q53878
13346d87807N36452J571154N56189l09053j75825l36075K60900N15992j219341
$$ y = [-711075, -2051384, -2583530, -2576548, -2464217, -1713067, -1012344, -365520, -569860, -851025, -192916, 43131, -226875, 49473, 532195, 632583, 1198163, 1739016, 2174009, 2197738, 1636631, 982154, 1212643, 1481708, 1708337, 696900, -991830, -1031988, -439411, -141215, 72911, 906090, 1032804, 1311655, 2267994, 3280296, 2669903, 1257096, 1135968, 2022161, 2636805, 1749088, 189143, -577770, 52611, 1863804, 3462509, 2307444, 332514, -1056401, -1103276, -837680, -1181662, -1049941, -658922, -189094, -178348, 350858, 351112, -468699, -459466, 150888, 559114, 987715, 1244575, 366071, -487807, 48645, 1619799, 2175988, 1866935, 1691110, 1355035, 1615935, 2131927, 912586]
13337I12586j135787n91639r14581n42413P5315J350853J232240l10876n96508
13328e20810N5197R55955m94842o26616k46369M70483J740407M53135p49727j063960
13318b7147N41068J043579M00850q22185k404968j048907J103073K146478J523699
13309B455540P27479m80065o2444m66074j123057j348969j191820R4562J266119
13300a28729K233732J291869j163649j878824J37887j51639p72456r18009J47092
13291a202726R09718J036535P00592r03807j361397k69304J557574R13191j01216
13282A279160j341132j358647o97294r3336P23197M38455k54547L93364M29601
13273d81179j25847Q23416R95827R33927P9403j87737r64572p06603n68053M9600
$$ y = [912586, -223201, -814840, -1729421, -2271834, -2196519, -845666, 386574, 75698, -520810, -465613, 490342, -4500, -631116, -877485, -407002, 1333405, 1786540, 1036813, -27147, 513921, 1557500, 1958350, 1136165, -1268803, -2317710, -1214637, 931841, 2455540, 3183019, 2702954, 2640510, 2174436, 1051379, -297590, -1489410, -1394848, -128729, 2105003, 3396872, 2233223, 354399, 492286, 340647, -431809, -1349818, -1202726, -293008, 743527, 1444119, 540312, -821085, -1090389, 467185, 1380376, 1279160, -61972, -1420619, -2117913, -2211249, -1488052, -1049597, -1304144, -910780, -481179, -607026, 216390, 1212217, 2146144, 2225547, 2037810, 1073238, 366635, -201418, -151818]
13263a51818l78791k14729J006702J90423o68153M35567J358728J05114K15163
13254A898206M4895m13723j559353n69429k80064J42460O60937o85194q38917
13245a600182P7594L81076o8242p51350n66546k10764J44157J379856J412885
13236A98484J837271K077506Q60436r10945j458048j386265q09709j00138o03175
13227b94583K53847R26954j561984j668902J024918J591692j34011m85939m18439
13218g66447Q1593K39814m83648l78196q62763r4012O09481M75826J048637J025063
13208H95348M66314n14227k47741L44259K38812J45337k4169k02346P3440p16150
13198D58877k15366n67903r48932M36781N37600K82785N75922J262466m90166
$$ y = [-151818, -530609, -745338, 261364, 451787, -216366, 219201, 1577929, 1683043, 1898206, 1943101, 1529378, -29975, -599404, -879468, -737008, -76071, -761265, -1600182, -1522588, -1141512, -1209754, -1961104, -2527650, -2738414, -2594257, -1214401, 198484, 2035755, 4113261, 4973697, 4062752, 2604704, 1218439, 408730, 308592, -294583, -40736, 886218, -675766, -2344668, -1319750, 271942, 137931, -348008, -766447, -684854, -445040, -928688, -1306884, -2169647, -2263659, -1654178, -1178352, -129715, 895348, 1361662, 847435, 599694, 943953, 1182765, 1328102, 1303933, 1101587, 1175027, 458877, 243511, -324392, -1273324, -836543, -298943, -16158, 559764, 1822230, 1332064]
13189A332064j597569n4609N97149N071l27993j61471j59210n75624m71831p18496
13179b132519j058066n69153L60195N10691Q9652J935670J934810Q84177n2140
13170A903317q21331J69410m5331o53158N55311R33354l56347n35098J86172M00106
13160A736405J242189N8652j465387M79518J085935j75218q78012J31891k94181
13151A921792j054368j120886Q3637P36744J029431K89614j663924n54417J160911
13142H28534K46995l02770P61156l00196j032335N02669M53384l09976n88166
13133B59295J18328O80139N34362K51618P11960N87494q81361q35626j433676
13124g467k08712J577911Q70607J42333N96705j527j32174K04676j237814j500873
$$ y = [1332064, -265505, -320114, 277035, 282106, -45887, -207358, -366568, -942192, -1414023, -2132519, -3190585, -3759738, -3399543, -2888852, -2799200, -863530, 1071280, 1955457, 1903317, 1081986, 1251396, 1206065, 552907, 1108218, 2041572, 1685225, 1150127, 1336299, 1736405, 2978594, 3037246, 1571859, 2051377, 3137312, 2962094, 2084082, 2215973, 1921792, 867424, -253462, -169825, 566919, 1596350, 1885964, 222040, -332377, 828534, 1075529, 772759, 1533915, 1233719, 201384, 704053, 1157437, 847461, 259295, 377623, 1057762, 1592124, 1843742, 2555702, 3143196, 2261835, 1426209, -7467, -216179, 1361732, 2232339, 2374672, 2971377, 2969850, 2837676, 3042352, 1804538, 303665]
13114C03665o54514j013550q38096O54458N88019J4643L58578P79305J816749
13105B009257J292847j006964j244996m01887m94768r11693R27232J253787o3569
13096A359246K77036J111693N96818L1709l54677m01107n70785o23640q29463
13087E96830j201152k66309l2710P4314N77871J242156Q52497j251192k184283
13078a591978j024187M67195L43548J098551K44606J38542J551046P30020j40468
13069A816875j150931L27557J279288q72671j421647j003532l53083p113q4495
13060a469752k44696n3906j50525N89564K82006n86042J280576K323050J317945
13051C288220j080917p13205J36527O99835J052102o46313j176634N25590o42279
$$ y = [303665, -350849, -1364399, -2202495, -1548037, -960018, -945375, -586797, 192508, 2009257, 3302104, 2295140, 1050144, 648257, 153489, -758204, 169028, 1422815, 1359246, 1636282, 2747975, 3344793, 3376502, 3021825, 2620718, 2049933, 1426293, 596830, -604322, -870631, -903341, -829027, -251156, 991000, 1843497, 592305, -1591978, -2616165, -2148970, -1805422, -706871, -462265, -323723, 1227323, 1957343, 1816875, 665944, 993501, 2272789, 1400118, -21529, -1025061, -1378144, -1385257, -1469752, -1714448, -1768354, -1918879, -1329315, -1047309, -1633351, -352775, 1970275, 3288220, 2207303, 1494098, 1630625, 2330460, 3382562, 2736249, 1559615, 2085205, 1442926]
13042A442926k116346j788315k50469J538087Q23684l16621J27915J73153N80159
13033B14173K98799Q72866N73812m41487o35332m1976N06793J39810q46499n07789
13023A33170Q24340J750132L21038r7150Q39407N51315N5968N65696q88334q56255
13013C199327N09088N98981O22416j58042q01468j106309q35758J32666J108157
13004C269058M78174K14680j87341n28589o26417J365269J913985P63770q89241
12995E773348n94644j372339p56182M11496J312393K61022k11081J902102J956096
12986H682211J070781J088212J339706n1882q61609k50750P43280J678730K299210
12977A5737889K588310L411829L356871M677336N761986P028220R546019J2754662
$$ y = [1442926, -673420, -2461735, -2712204, -1174117, -350433, -667054, -539139, -365986, 214173, 512972, 1385838, 1959650, 1518163, 882831, 840855, 1347648, 1487458, 640959, 133170, 957510, 2707642, 3028680, 2931530, 3770937, 4322252, 4378220, 4943916, 4055582, 3199327, 3708415, 4307396, 4929812, 4771770, 3970302, 2863993, 2028235, 2160901, 3269058, 3747232, 3961912, 3774571, 3245982, 2619565, 3984834, 5898819, 6662589, 5773348, 5178704, 3806365, 3050183, 3461679, 4774072, 5035094, 4824013, 6726115, 8682211, 9752992, 10841204, 12180910, 12129028, 11267419, 11016669, 11759949, 13438679, 15737889, 18326199, 21738028, 25094899, 29772235, 35534221, 42562441, 52108460, 64863122]
12969F4863122J7153486K3156655L0882190M0114771M4097344L5494527R845624
12962B65607719k1547029m0404780m2775261l6474153k7235868j9971260j5642651
12955F1556717j2617771r894361o682488n911394l727858j191970k915136k658585
12947A5957154j48649M20518m08643p55482l55500j066493j244274m58906j451892
12938A0487833j891877j003041j444473j554037j044367p65157N82795J220193
12930D587869k90036m27625m81516o30923p17257j13269K55472j77466P82269
12921B787518K358933J271155m30454l47452J412149J661947J272611P2835k17371
12912I841871N30939k12491j228962j522306q13023R01369J998806J628916K232681
$$ y = [64863122, 82016608, 105173263, 136055453, 176170224, 220267568, 255762095, 265607719, 244060690, 203655910, 160880649, 124406496, 97170628, 77199368, 61556717, 48938946, 39044585, 32362097, 26450703, 22722845, 21530875, 18615739, 15957154, 15808505, 16229023, 15820380, 15064898, 14709398, 13642905, 12398631, 11939725, 10487833, 8595956, 7592915, 6148442, 4594405, 3550038, 2784881, 3367676, 4587869, 4297833, 3870208, 3388692, 2757769, 2040512, 1927243, 2182715, 2005249, 2787518, 5146451, 6417606, 5987152, 5639700, 7051849, 8713796, 9986407, 10059242, 9841871, 10372810, 10160319, 8931357, 7409051, 6596028, 7497397, 9496203, 11125119, 13357800]
12903A3357800J881549j120369k331484l86091R34891O29739J99316n74289m39486
12894A2151576k52035N29360P40565K164189K721234J847987K831407M703990
12886B7438273P305912Q661375J0576989J4631577K0309117K6916967L4499615
12879A50339825M2747292M4218544K8843134k079360l2057197m4330213m1165624
12872A46516401l3159708k5545375j9427800j4159217j0254351o968804n320843
12865C1680303m410842l899828l434353k879403j731896j408297j627657j317941
12857A0970086k62854P59903n78591j818354k29550O88347l26641o02126k203768
12848F396452k151491j355871n66954J147028Q41870L73471Q68203o52208r39296
$$ y = [13357800, 15239349, 14118980, 11787496, 11401405, 12336296, 12966035, 13165351, 12591062, 12151576, 11899541, 12428901, 13169466, 15333655, 18054889, 19902876, 22734283, 27438273, 34744185, 43405560, 53982549, 68614126, 88923243, 115840210, 150339825, 193087117, 237305661, 266148795, 264069435, 232012238, 187682025, 146516401, 113356693, 87811318, 68383518, 54224301, 43969950, 37001146, 31680303, 27269461, 23369633, 19935280, 17055877, 15323981, 13915684, 12288027, 10970086, 10707232, 11467135, 10888544, 9070190, 8840640, 9528987, 9202346, 8600220, 6396452, 4244961, 2889090, 2322136, 3469164, 4311034, 4684505, 5552708, 4900500, 3961204]
12839C961204k6180K36070r6928J69748m6940n13586P3973P80487K27970n33993
12829D231825l27871J81922P23968O57607l73760L66327P31568L70676J426951
12820G989213Q22238M26811l69724j115380l56087L61259M07568k5069Q60796
12811I001625K063897R78456J58868J204680K233315K561344L48212Q97447K338529
12802B1786373L013350L950326N492934N756257O885710J0726429J5041075K2174079
12794I4826533K9737218L6986912M3561341M0630589K0496466j1462862l6932410
12787B17843787m4645806l8917952k9642993k2170343j5972186j2035222r418064
12780D5041221p989624o265708m315949k879535k585976l508688l988678k856473
$$ y = [3961204, 3935024, 4171094, 4074166, 4243914, 4196974, 3683388, 3757361, 4537848, 4765818, 4231825, 3903954, 4085876, 4809844, 5467451, 5093691, 5460018, 6191586, 6562262, 7989213, 8811451, 9238262, 8868538, 7753158, 7397071, 7758330, 8165898, 8140829, 9001625, 11065522, 12043978, 12202846, 13407526, 15640841, 18202185, 18550397, 19447844, 21786373, 24799723, 28750049, 34242983, 39999240, 46884950, 57611379, 72652454, 94826533, 124563751, 161550663, 205112004, 245742593, 266239059, 254776197, 217843787, 173197981, 134280029, 104637036, 82466693, 66494507, 54459285, 45041221, 37051597, 30785889, 26469940, 23590405, 21004429, 17495741, 13507063, 10650590]
12772A0650590r33031q02507o00528n61014m66911r22904m7736n33256j744860
12763D037843j340106o90004J270647P50207J56134q1126j482131q98486J103726
12754B826704J17825r69955n87225j051833k57061O91253j63838Q87276J574570
12745C067716J240006m57534j209981k50666j479394j632604j24089L35511k46900
12736g57935R26667K079183Q25562r63636r70279j066484K58230N48697n51263
12727C28742l17239p43514m16031M55745P14277m78169o23300p16182q00746l00970
12717b897387O57700J230265L39535l22368k6111M29453J227006M08346r21160
12708A25279k54059J281292J374518N45621j696664j377774r34190r17846P86147
$$ y = [10650590, 9717559, 8915052, 8314524, 7753510, 7286599, 6363695, 6315959, 5782703, 4037843, 2697737, 2007733, 3278380, 4028587, 4184721, 4103595, 2621464, 1722978, 2826704, 2944529, 1974574, 1387349, 335516, 78455, 769708, 605870, 1493146, 3067716, 4307722, 3850188, 2640207, 2389541, 910147, -722457, -846546, -511035, -757935, 168732, 2247915, 3073477, 2109841, 1139562, 73078, 331308, 880005, 328742, 11503, -732011, -1148042, -692297, 21980, -456189, -1079489, -1795671, -2596417, -2897387, -2239687, -1009422, -669887, -992255, -1018366, -588913, 638093, 1046439, 125279, -128780, 1152512, 2527030, 3072651, 1375987, -1787, -935977, -1853823, -1067676]
12699a067676J018808J64510j61730n51736l2522P28496m051l5968M7069q56588
12689g51388N99192J124786N15224l91247m89689M24769n12489j472693m32022
12680a385557M05363m08461J397341J527431p73915j227556j594248p05322M46711
12671b318213J179894L94570j89867k1246N31921J302752R60369J255961O61046
12662C757187l69575j026375j186934l29631j04912r21441o56183J21322K26961
12653d89581O018o2387J13018m41719l28786L21180K47104J011932p3654j18353
12643A84772p34040k41202J115577M63056r68640m73566K8569M89619N32371N03396
12633H99912O16938Q56370n8419n51736N40222j93667o37056q50589k98094M71425
$$ y = [-1067676, -48868, 115642, -46088, -597824, -630346, 98150, 94099, 58131, 105200, -751388, -152196, 972590, 1487814, 1096567, 606878, 1031647, 519158, -953535, -1385557, -980194, -1388655, 8686, 1536117, 762202, -465354, -2059602, -2764924, -2318213, -1138319, -743749, -933616, -954862, -422941, 879811, 1840180, 3096141, 3757187, 3387612, 2361237, 1174303, 844672, 739760, -181681, -837864, -716542, -489581, -483563, -545950, -432932, -874651, -1203437, -882257, -635153, 376779, 303125, 184772, -549268, -790470, 325107, 788163, -180477, -654043, -625474, -135855, 396516, 899912, 1516850, 2373220, 2314801, 1763065, 2303287, 2109620, 1472564, 621975, 323881, 795306]
12623G95306J085877K9884j544798j210339L8340p17948q32780r68782O07304
12614b717936J721098Q84980O06404o97598r28481q78025o67253Q11395R11176
12605i54240O12813J411343O00036j928812k413499o44575J163361J577994l1351
12596f06930k7749L95708j05948q60291r51086l18245Q03426K24006p43912n33867
12586b724888O06056N71492P89099J586409k5083j094640k90317P12642J78119
12577C08889K28783M70668j58187q66812o46045k53124L0593k77026j78318J622117
12567B81538J676549P51319J041608J390408q2746j762273q91454N28747o74932
12558B258764r74130l96937k58811j215257n36865m2067J48356N57527j2873K15669
$$ y = [795306, 1881183, 1911067, 366269, -844070, -805730, -1523678, -2356458, -3325240, -2717936, -996838, -111858, 494546, -203052, -1131533, -2009558, -2676811, -1865416, -954240, -341427, 1069916, 1669952, -258860, -2672359, -3316934, -2153573, -575579, -606930, -634679, -238971, -344919, -1205210, -2156296, -2474541, -1671115, -1447109, -2191021, -2724888, -2118832, -1547340, -758241, 828168, 803085, -291555, -581872, 130770, 308889, 537672, 1008340, 850153, -16659, -662704, -915828, -885235, -1162261, -1340579, 281538, 1958087, 2709406, 3751014, 5141422, 5058676, 3296403, 2404949, 2933696, 2258764, 1284634, 887697, 628886, -586371, -1123236, -1165303, -1016947, -459420, -472293, -256624]
12548b56624L97989k41964n81083n02706o05249k19798M92279M56313l08799l23669
12538a693311Q31442J142625Q47328L65638q88761j209562L27124Q33524m46312
12529A09735Q19090J701791l135j327465j515935O66205J739967O34962j35360
12520B689855m25283j097313r16419k56975J63708O61563L13129q95802n5732
12511A80731J35820m89288Q40386J561711n2064j031048p881K60116o99825j138524
12501d39866j354594j460177Q6065O66661j18548N05522M66402m51486P96250
12492a303771J92615M13804k18202L55299k97367o20541J038800N92953J29468
12483B83058M41774R81594O65439L14014K28853m49609r47514j829395p18622
$$ y = [-256624, 141365, -100599, -681682, -1184388, -1789637, -2009435, -1517156, -1060843, -1369642, -1693311, -861869, 280756, 1128084, 1493722, 604961, -604601, -277477, 556047, 109735, 928825, 2630616, 2627481, 1300016, -215919, 450286, 2190253, 2825215, 2689855, 2264572, 1167259, 250840, -6135, 157573, 819136, 1132265, 236463, 180731, 316551, -172737, 667649, 2229360, 2177296, 1146248, 1138367, 1398483, 698658, -439866, -1794460, -3254637, -3168572, -2501911, -2620459, -2114937, -1648535, -2100021, -1303771, -1111156, -697352, -915554, -560255, -857622, -1478163, -439363, 153590, 283058, 724832, 1706426, 2371865, 2685879, 2914732, 2465123, 1517609, -311786, -1030408]
12474a030408M77955J029071Q74804l62024j779533p23167N41970q83563j013756
12465b868651J184906J251836N37032Q48295L41018j45153j97252q94941O45749
12456G02839R23685k7241m47939N25439K7250j293013j377465p73410l24416Q85902
12446a178369N20182o68257l74909k74922j57363K58786p65237j234456r5545
12437c970090l43866O48582J112737J34717P42409K90339j021841l10225J616093
12428a101145K233683L02620p04015n62192l97499j92051K54822L91775o7264
12419A58734J2131k90157j346612L7910J037118J710551J296506Q82739J06873
12410C605793l37091j390328j93243J922647O71247k52899r80638n73022J03816
$$ y = [-1030408, -552453, 476618, 1351422, 989398, -790135, -1513302, -971332, -1854895, -2868651, -1683745, -431909, 105123, 953418, 1294436, 1149283, 952031, 57090, 702839, 1626524, 1599283, 1151344, 1676783, 1704033, 411020, -966445, -1739855, -2064271, -1178369, -658187, -1326444, -1701353, -1976275, -2133638, -1874852, -2640089, -3874545, -3970090, -4313956, -3665374, -2552637, -2417920, -1675511, -1385172, -2407013, -2717238, -1101145, 1132538, 1435158, 731143, 168951, -228548, -420599, -165777, 225998, 158734, 170865, -119292, -1465904, -1427994, -390876, 1319675, 2616181, 3498920, 3605793, 3268702, 1878374, 1685131, 3607778, 4279025, 4026126, 3045488, 2472466, 2576282]
12401B576282j161682p07267J0969r3787m05273m54244o30929M33438J157219
12392G24726k24391p20414q22616j219987p59398K49771M06940N37229L08622
12383a519518J52573L66357N93135O79546k46031k66369N96041o18247j714891
12374a977404j072322p57004N72950J175527Q71520P04508J147277R07750J494923
12365C067725R94689q12944r77253N10068K51541j187263j832543q68648k65561
12356a120189m18531j02676J225324J233189M74280N06216q4204j49324J321445
12347B885530j87742m80022J65830k12129p63866m12986l5371p27082j126212
12338h94050J19653J026504M28104l33608L57692J408274n6729p22443P93895
$$ y = [2576282, 1414600, 707333, 718302, 624515, 219242, -235002, -865931, -432493, 724726, 500335, -220079, -1042695, -2262682, -3022080, -2772309, -2365369, -1828140, -1519518, -1366945, -1000588, -407453, 272093, 26062, -240307, 355734, -262513, -1977404, -3049726, -3806730, -3233780, -2058253, -1186733, -482225, 665052, 1572802, 3067725, 4062414, 3249470, 2272217, 2782285, 3033826, 1846563, 14020, -854628, -1120189, -1538720, -1641396, -416072, 817117, 1291397, 1797613, 1713409, 1564085, 2885530, 2697788, 2217766, 2383596, 2171467, 1407601, 994615, 959244, 232162, -894050, -774397, 252107, 680211, 346603, 704295, 2112569, 2055840, 1333397, 2127292]
12329B127292N41535j018436k63549K0362k62810j96186q357J98164j900359j013427
12319a775771o4636L63828P19087l32080n43615l75470p21528j30633L43030L27500
12309b190288o27039j752223j80499K27514j60774M94481J151547R09013k9028
12300b157296R54512Q82768M22753L04122k48225l04931j293522n48932J006418
12291i82333J355936N22985L24414o12184p8852M76725M85576M23957p68244j072398
12281G5582M85507K68066l68379o13313M86513O034j141119q19936m30839N17916
12271a533968R67220M40760m56495m91636O83960M28234K023K97555K57811N72443
12261A167907J834631O74682j293700q13002M37951n90744p11926k12185J38971
$$ y = [2127292, 2668827, 1650391, 1386842, 1407204, 1144394, 948208, 939851, 1138015, -762344, -1775771, -1840407, -1476579, -757492, -1089572, -1633187, -2008657, -2730185, -2860818, -2517788, -2190288, -2817327, -4569550, -4750049, -4522535, -4683309, -4188828, -3037281, -2128268, -2157296, -1202784, -320016, 102737, 406859, 158634, -146297, -1439819, -1988751, -982333, 373603, 896588, 1221002, 608818, 529966, 1006691, 1492267, 1916224, 1147980, 75582, 561089, 829155, 460776, -152537, 333976, 340010, -801109, -1621045, -2051884, -1533968, -566748, -125988, -582483, -1074119, -390159, 38075, 40098, 337653, 595464, 1167907, 3002538, 3677220, 2383520, 1570518, 2008469, 1417725, 705799, 493614, 632585]
12252F32585N65299J527160R32942j238051j826529q65450Q40100J311079j20270
12243A758865r40513L29515Q62452r5878K85891J504161P70589j280007j723201
12234A471874o63456L16435r4009R8726O41936O94090M1945l87794K33644p0935
12224B282456r12370N98895J009082l38404q75504o41667N0593j98705n84251
12215C90125q62029o57667k69460L03120Q7914r88017r83943M0236L64256Q21701
12205a753764M8815m47188J178076R34771o98192o83258L52166M27809k89923
12196i30688M4209N6908K8715n0252P9250k20085o05498j234209j177305k34314
12186d243269O74512K468106J958697R7808L46819k49300o23982q69287R4347
$$ y = [632585, 1197884, 2725044, 3657986, 2419935, 593406, -272044, 568056, 1879135, 1758865, 818352, 1147867, 2010319, 1914441, 2200332, 3704493, 4475082, 3195075, 1471874, 808418, 1124853, 1030844, 1129570, 1771506, 2465596, 2507541, 2119747, 2353391, 2282456, 1370086, 1968981, 2978063, 2639659, 1764155, 1122488, 1173081, 974376, 390125, -471904, -1129571, -1399031, -1095911, -1007997, -1996014, -2979957, -2939721, -2575465, -1753764, -1704949, -2152137, -974061, -39290, -737482, -1420740, -1068574, -640765, -930688, -886479, -829571, -800856, -851108, -771858, -991943, -1597441, -2831650, -4008955, -4243269, -3568757, -1100651, 858046, 955854, 1302673, 1053373, 429391, -439896, -345549]
12177c45549J379205R44063N59416M58182j163555j304833j026678J83523P06695
12168C90469J1205Q66231R95560k20331p68029j337992j862258J003141J953038
12159A031034J312378k86421l15355k12732Q26365j56515q50974q4304P75415
12150B038891J68981k09308K43475m41607r37600n98657l24626r80453p23919
12141a764823n94994J17023K130710K511744K86950p56843j450735j434948j55592
12132a111508K34571N11477L95663O32997n0314L04937J178988K79073j411097
12123I64787k172449q85770J164564R18879r9802r62447m51786k76312J072319
12114g28017J502581k73844r4032L53247q10140m63337k50357n06897n38844K04274
$$ y = [-345549, 1033656, 1977719, 2537135, 2995317, 1831762, 526929, -499749, -316226, 390469, 401674, 1267905, 2263465, 2043134, 1275105, -62887, -1925145, -922004, 1031034, 2343412, 2056991, 1741636, 1528904, 2355269, 2198754, 1347780, 1263476, 2038891, 2207872, 1998564, 2242039, 1800432, 862832, 264175, -60451, -1040904, -1764823, -2359817, -2242794, -112084, 2399660, 2686610, 1929767, 479032, -955916, -1111508, -876937, -365460, 30203, 663200, 612886, 917823, 2096811, 2375884, 964787, -1207662, -2093432, -928868, -9989, -109791, -1072238, -1524024, -1800336, -728017, 774564, 500720, 406688, 759935, -50205, -513542, -763899, -1270796, -1809640, -1605366]
12104a605366R24391L29357j043184l82608N83996m15931J75033k14232m01567
12095b050111k6657N80484R02078O45309K36365p58614n80152o45494j291240
12086b988032m53203l20849L5107L20180K21220K47895J683135J271314K27692
12077B44459k39870J74694l01491p88509O41035J795626J230279l87972j263424
12068A104827j10829J213082K97973j610426j082037j198343m41876L29100M97388
12059a001141O67047O47759P71493P02443J021931p59668j402272j015820K32939
12050a35289J447405Q95999n5011M37282J182116m18443o20482l37719m50120
12041A945738l73791N79947r8431p20076N91515Q46243o35099r14211m6341Q69962
$$ y = [-1605366, -680975, -351618, -1394802, -1777410, -1193414, -1609345, -1434312, -1648544, -2050111, -2076768, -1496284, -594206, 51103, 287468, -471146, -1051298, -1696792, -2988032, -3441235, -3762084, -3726977, -3406797, -3185577, -2937682, -1254547, 16767, 244459, 4589, 179283, -122208, -910717, -269682, 1525944, 2756223, 2368251, 1104827, 993998, 2207080, 2505053, 894627, -187410, -1385753, -1827629, -1498529, -1001141, -334094, 313665, 1085158, 1787601, 2809532, 2049864, 647592, -368228, -135289, 1312116, 2208115, 2153104, 2590386, 3772502, 3354059, 2733577, 2395858, 1945738, 1571947, 2151894, 2053463, 1333387, 1924902, 2771145, 2136046, 1221835, 1175494, 2045456]
12031B045456j51887m8869M27822p26144q92524r29423m58699l88875j043351
12022b166494o7399J018673Q30539n11170o63653J016396J480380N46013m9675
12013A433610l69951Q31660R01007K6578l39507l87923o22872j464711m05009
12004c97118N20752L01658J66968p4825J45439r5956P8623J241785P3162r36450
11994A024038K9133Q96296N96016p4880R48808J589245r84850j797265j277741
11985I48800M82333J257277L82202j127524q37618L03360J089847L98534o69028
11976B228183m09276r58284n98049M13011Q15593J689960n4966j601957n02787
11967A021428M91429l9426m96862K84724Q32845l52382j046482j78529J182865
$$ y = [2045456, 1893569, 1844700, 2272522, 1546378, 653854, -275569, -734268, -1123143, -2166494, -2233893, -1215220, -384681, -895851, -1559504, -543108, 937272, 1483285, 1433610, 1063659, 1895319, 2796326, 2822904, 2483397, 2095474, 1472602, 7891, -397118, 123634, 425292, 592260, 517435, 662874, 566918, 645541, 1887326, 1960488, 1024038, 1053171, 1949467, 2545483, 2470603, 3419411, 5008656, 4023806, 2226541, 948800, 1431133, 2688410, 3070612, 1943088, 1105470, 1408830, 2498677, 2897211, 2228183, 1818907, 860623, 262574, 675585, 1491178, 3181138, 3126172, 1524215, 1021428, 1512857, 1473431, 976569, 1261293, 2094138, 1741756, 695274, 516745, 1699610]
11958A699610J877968O84600j128455o87273q51524j020696P9678O69993J393679
11949B717580K6239q81754n42856N73746P07317J61539n27885o48623l74099r638
11939A201566m29245m13079M8002J97565m07985L5637J370490Q51578j732785
11930G21744j649668O6523k98162j71166k00697O67240j67310j051632M02334
11921a680794J144615J891496Q05442l72667m34251J88037K85523N27978J278144
11912C633523P2907n61780o37128l5851m43711j797857j322264L79748J087085
11903C74672M99599K51399r8456j116054r45549M34977K58353k74716k21448n40062
11893a377285j22429P40047n29917j056698J13115J282714O77814k9908N02139
$$ y = [1699610, 3577578, 4262178, 3133723, 2446450, 1594926, 574230, 653908, 1323901, 2717580, 2743819, 1862065, 1319209, 1892955, 2600272, 2761811, 2233926, 1585303, 1211204, 1201566, 772321, 359242, 407244, 604809, 196824, 232461, 1602951, 2454529, 721744, -927924, -861401, -1159563, -1330729, -1531426, -864186, -1031496, -2083128, -1680794, -536179, 1355317, 2160759, 1788092, 1353841, 1541878, 1827401, 2355379, 3633523, 3706430, 3144650, 2507522, 2471671, 2027960, 230103, -1092161, -712413, 374672, 874271, 1125670, 1027214, -88840, -1034389, -599412, -341059, -615775, -837223, -1377285, -1499714, -759667, -1289584, -2346282, -2233167, -950453, -272639, -302547, 199592]
11884A99592J67144m65102o0146M36280l5334J008692J597627J3134m12294k41461
11874B208132l89545l54719r57653q05764K03235N46243J133249J194142R70051
11865C747371l45451j518116q16203k17319n35671J8345j77720j523854o96081
11856b064699N92464O64707J160832R42351M46379j85871j416238o47455K87238
11847b20292J589497J607391N3134j860648k559621m04277P13639R5230Q46070
11838a39877N58478q58518j011689j825019j910228L1379K008996J136400K02225
11829a807853Q17980J660128J075548M55137j193978j361254l92885M95235P64259
11820E12317P53422J091556J28564j384586j354029o80430R3274K98690Q14500
$$ y = [199592, 366736, -98366, -158512, 277768, 242434, 1251126, 2848753, 2861887, 2449593, 2208132, 1818587, 1463868, 506215, -299549, -96314, 449929, 1583178, 2777320, 3747371, 3401920, 1883804, 1067601, 850282, 314611, 332956, 155236, -1368618, -2064699, -1472235, -807528, 353304, 1295655, 1742034, 1556163, 139925, -507530, -220292, 1369205, 2976596, 3029730, 1169082, -1390539, -1794816, -1081177, -985947, -139877, 418601, -439917, -1451606, -3276625, -5186853, -5155474, -3146478, -2010078, -1807853, -989873, 670255, 1745803, 2200940, 1006962, -354292, -747177, -251942, 512317, 1265739, 2357295, 2485859, 1101273, -252756, -933186, -839912, -541222, 273278]
11811B73278M33238o8571p90827O98812J427801M09571K56012j149102j281971
11802B08241n76290L62379L35555j44041L1139J636412J750040J145334L73365
11793E122134n82815j217844N27809J373800O70553p53026j612640j717329j197647
11784F12995N28434J307098k07876j777055j277763q15384j4596N31160O65100
11775d47887J369170P69309M72051r50041j253302o97711k39025K61960J40064
11766e75412l26752l16124M45066L03086P07376K75203l39578O57134j57608p01891
11756b9500m57162j35971l86441K93021J075429Q38880n58752j062108r4035n42452
11746a059091N37770J530744J425959O31084L99530Q9850j542046j622761j73017
$$ y = [273278, 706516, 637945, -152882, 545930, 1973731, 2383302, 2639314, 1490212, 208241, -368049, -5670, 329885, 185844, 216983, 1853395, 3603435, 4748769, 5122134, 4539319, 3321475, 3849284, 5223084, 5893637, 5140611, 3527971, 1810642, 612995, 1141429, 2448527, 2240651, 463596, -814167, -1629551, -1644147, -1112987, -447887, 921283, 1690592, 2162643, 1212602, -40700, -738411, -977436, -715476, -575412, -902164, -1218288, -773222, -470136, 237240, 512443, 172865, 829999, 672391, -29500, -486662, -622633, -1009074, -716053, 359376, 1198256, 639504, -422604, -516639, -1059091, -521321, 1009423, 2435382, 3066466, 3465996, 3555846, 2013800, 391039, 218022]
11737B18022j53278q24766K70780J778429J042966k61595J67749j420125r90677
11728a72495N21460K237159J694183j53031L00964j84002o79305l84326j139460
11719B041147j046941N59129R63340o21101j743841N2756J271003O93871j09668
11710B059695j37782m72834r39561m46278l57768p98340j60170J73580P1729k71579
11700a279308j034r7711L2983K05009R51844R85224o1189j252886j396681l71964
11690b285713J854905P90336j599722j032556P91059J58822K23557J183520J051697
11681A135905O55730l49379p96488r83906o23630M55113J005731J073914R59785
11672B532775m20730j604947j686510n67498k43256k07485K16561N64187K86601
$$ y = [218022, 64744, -760022, -489242, 1289187, 2332153, 2070558, 2238307, 818182, -172495, 348965, 2586124, 4280307, 4127276, 4428240, 4244238, 3564933, 3180607, 2041147, 994206, 1553335, 2516675, 1895574, 151733, 204489, 1475492, 2169363, 2059695, 1921913, 1449079, 509518, 63240, -294528, -1092868, -1253038, -1079458, -1007729, -1279308, -1280342, -1378053, -1345070, -1140061, -188217, 797007, 735818, -517068, -1913749, -2285713, -430808, 359528, -1240194, -2272750, -1481691, -1322869, -1099312, 84208, 1135905, 1791635, 1442256, 645768, -338138, -961768, -506655, 499076, 1572990, 2532775, 2112045, 507098, -1179412, -1746910, -1990166, -2197651, -1981090, -1416903, -1130302]
11663a130302o99269j127413L32737R41185L55503l9254k41337q78905o70285
11654c157340J02301O72776j30924J49662N65133J28057R58629J524964J399841
11645B213099Q22138o195p79458l48069m83112j392111q33457O14964J44348o18654
11635f66507K84419J07890J10267l10927M09231K30761j568232q48946M6360O22635
11625a583049M43429m49077n70342m88339J32368P33325L10292J61507q1509o03042
11615a994437K40144J80088O6075q65940j47619J334450J007833K44468n00622
11606d35560K33693J683108P22668r4281K62996k39981r13252q05025k16454K22118
11596D20030P67723j128138j332760k01666N11258n89031j182468N96732J039314
$$ y = [-1130302, -1829571, -2956984, -2624247, -1683062, -1327559, -1366813, -1608150, -2487055, -3157340, -3055039, -2382263, -2513187, -2363525, -1798392, -1670335, -711706, 813258, 2213099, 3035237, 3029042, 2249584, 1901515, 1418403, 26292, -807165, -192201, -47853, -666507, -382088, -274198, -163931, -474858, -65627, 165134, -1403098, -2252044, -2205684, -1583049, -1139620, -1588697, -2159039, -2647378, -2515010, -1781685, -1471393, -1309886, -1391395, -1994437, -1754293, -1574205, -1508130, -2374070, -2521689, -1187239, -179406, 65062, -435560, -201867, 1481241, 2203909, 2109628, 2372624, 2132643, 1219391, 414366, 197912, 420030, 1187753, 59615, -1273145, -1474811, -963553, -1552584, -2735052, -2138320, -1099006]
11587a099006R70913P1512p78688j286368j150550q35344j71767J843645K537745
11578A02092R32612L31446K96745o87205j218356j628389n38311R83718J223146
11569b02502K37368o60461j482001m24696O93024J119033J709276m13952o29526
11560e4437N00717k50241k95448j81835r32584l56873J171540N03430N23844N23192
11550A151305k25116j076759q86820j83195K47069J646179J749663J204259n75911
11541C050674j985326j674195p75067m8675m9885n19313n02021J058861N31778
11532i13169N60546L32631L44785J244378n22402j309594j265343j88289M79077
11523a237380L52932K01804N07009q2320k0426n90631q52833N57518J410220p1987
$$ y = [-1099006, -128093, -56581, -835269, -2121637, -3272187, -4107531, -4279298, -2435653, 102092, 1034704, 1366150, 1662895, 975690, -242666, -1871055, -2409366, -1425648, -202502, 34866, -625595, -2107596, -2532292, -1839268, -720235, 989041, 575089, -54437, 446280, 196039, -99409, -281244, -1213828, -1570701, -399161, 104269, 628113, 1151305, 926189, -150570, -1037390, -1220585, -973516, 672663, 2422326, 3626585, 3050674, 1065348, -608847, -1383914, -1432589, -1482474, -2001787, -2503808, -1444947, -913169, -352623, -19992, 324793, 1569171, 1046769, -262825, -1528168, -1716457, -1237380, -884448, -682644, -175635, -257955, -278381, -869012, -1721845, -1164327, 245893, 173906]
11513A73906j793223j265670n23787p6039J493171J980393J064958L4478r37701
11504A50486q84301L50421r9283L5770L86969L93817O89282L13945M95839R18478
11494B751423K92206q29963j021168p69202K38780P87575O30761J23190o43044
11485A560558j551409j428093K94975J585884L79804k04417k49216M48492m40727
11476C95851j119167L18499k53879j402851j076176q46380N94908J401721J52745
11467a834729q22894o00321k90833J99178N13767K53480L05122Q76216J904606
11458E03592J087867M24039k93109r73886j367284j975440o68532N13846J076619
11449a672288l52609m91296J068501O46635k80996o69006P36343J235634q8977
$$ y = [173906, -1619317, -2884987, -3408774, -3484813, -1991642, -11249, 1053709, 1088187, 150486, -733815, -383394, -482677, -446907, -59938, 333879, 1023161, 1337106, 1832945, 2751423, 3043629, 2213666, 1192498, 423296, 662076, 1449651, 2080412, 2203602, 1560558, 9149, -1418944, -1123969, 461915, 841719, 637302, 388086, 836578, 395851, -723316, -404817, -658696, -2061547, -3137723, -3984103, -3389195, -1987474, -1834729, -2657623, -3257944, -3548777, -3349599, -2835832, -2582352, -2277230, -1401014, 503592, 1591459, 2015498, 1722389, 748503, -618781, -2594221, -3262753, -2748907, -1672288, -2024897, -2516193, -1447692, -801057, -1082053, -1751059, -1014716, 220918, 131941]
11440A31941k17441j054699n04480Q87746J106080l84018j444982k90017P23522
11431a046348J340404J249776K46117o59405m86739k28825K68429J84928k7277
11422H41060J11056J58328j75968J14806j11790r27232l90135k1612L69567n44883
11412e76803m6670M66946k17688k71364k39916L35711Q36991P44003l78659o7023
11402E85528l6088l78855P6921O48699R44211j07378l32765K24748q24081n25697
11392B75243R31163M42018l38851j782066j263358M53052P81411R9180O02232
11383B00024j31839L41170Q29071o52902l86842J93995l3435k63068j06727L24642
11373C14089M24234q5757j02055L80438l74064n34494J18592K24817q5668K54612
$$ y = [131941, -85500, -1140199, -1644679, -756933, 349147, -34871, -1479853, -1769870, -1046348, 294056, 1543832, 1789949, 1130544, 643805, 414980, 683409, 868337, 841060, 952116, 1110444, 934476, 1049282, 937492, 10260, -379875, -401487, -31920, -576803, -623473, -156527, -374215, -645579, -885495, -549784, 287207, 1031210, 652551, 585528, 549440, 170585, 247506, 896205, 1840416, 1733038, 1400273, 1625021, 800940, 275243, 1206406, 1648424, 1309573, -472493, -1735851, -1282799, -501388, -402208, 200024, 68185, 409355, 1238426, 585524, 198682, 392677, 359242, 96174, -10553, 314089, 738323, 652566, 550511, 930949, 556885, 22391, 140983, 365800, 280132, 534744]
11363E34744p76343j009178J00186P5485P58274O36442n53656k49894K19164j23995
11353c88771n3078J49254J77590j11024l23020O79891O53587j50299l39220m86715
11343a91805o62160l0290K809j55942J76503N71160J607189J186348r81701q19369
11333G02742L85280N64309Q7191o14364O94782M23470p85689r31317m55431j5672
11323E5301m79518K48388P54007R8282l18653o36991O61921K40245j019325J67752
11313b28591O01977J7172j10195n35887j61082k51666j760190o37312j592m57012
11303c524378K28750O73010J48809R08525L62379k11564L82385p1224M4111J26039
11293i33158q41057o34156N39952J34898P0831m61180J223789J623672k58994
$$ y = [534744, -241599, -1250777, -1150591, -1075106, -316832, 319610, -234046, -483940, -264776, -388771, -441849, -292595, -115005, -226029, -549049, 130842, 784429, 634130, 294910, -191805, -853965, -884255, -881446, -1037388, -860885, -289725, 1317464, 2503812, 1522111, 702742, 1088022, 1652331, 1739522, 1125158, 1819940, 2243410, 1457721, 526404, 70973, 55301, -424217, -175829, 578178, 676460, 357807, -279184, 382737, 622982, -396343, -228591, 373386, 390558, 280363, -255524, -416606, -668272, -2428462, -3065774, -3067366, -3524378, -3295628, -2622618, -2473809, -1565284, -1202905, -1414469, -1032084, -1103308, -1059197, -933158, -1774215, -2408371, -1868419, -1733521, -1662690, -2123870, -900081, 723591, 464597]
11284D64597j564872j712475p20605k72283M97831R78477R12574J154432O61413
11275C99089r4365n86872K94611J341114o83171k247677n93231N32052N71190
11266a067260J407638J97027J36777l22751l07501P68684M84170r69669j408684
11257a081569j309627J07563J394409K73492R0101m96451j19813k10262m0746
11248a392903L20232J10462j53853K08274k79543k46782O38301L91485Q03303
11239C98976P36647j042465q27438q21822o93286P22634K746135K478899k96324
11230C401956m47556o95813j62618P08651n93874p62212n38682n07142l76713
11221B5997r74831J5632P21702L61010j22314m77545L35535J216085J75142j199506
$$ y = [464597, -1100275, -2812750, -3533355, -3805638, -3307807, -2329330, -1416756, -262324, 399089, 304724, -282148, 12463, 1353577, 670406, -1577271, -2170502, -1638450, -1067260, 340378, 537405, 674182, 351431, 43930, 812614, 1296784, 327115, -1081569, -2391196, -2283633, -889224, -615732, -525631, -1022082, -1141895, -1352157, -1392903, -1072671, -962209, -1116062, -907788, -1187331, -1434113, -795812, -404327, 398976, 1135623, 93158, -734280, -1556102, -2249388, -1526754, 1219381, 3698280, 3401956, 2954400, 2258587, 2095969, 2804620, 2210746, 1448534, 909852, 402710, 25997, -948834, -933202, -211500, 149510, 27196, -450349, -114814, 1101271, 1276413, 76907]
11211G6907P94912J213971J41336q57290j7133M6721r76051r14304J86393O06073
11201C01535J348423Q64863J089210Q49586O52530J63965j83499k66273j427419
11192C392921o91463k95068r06695j221488o02918m70280k02119L31762J089502
11183D24154P60738Q16950J11516j347853j369048m41162p91470p72869j94969
11174b804013R1791j07730N7438O94600J246023J618500L30684r38033j203361
11165a014101K98634L94819j62711l05287l9127K13699O93594J95556K39817k89673
11155B25220q9783k42257Q8972N18564O752l6170p25724k28298K4058l62468O6701
11144g54433J98762L48424N81270m10676J28355J763327J796014L67310l74134
$$ y = [76907, 871819, 2085790, 2227126, 1369836, 1352703, 1399424, 423373, -490931, -304538, 301535, 1649958, 2514821, 3604031, 4453617, 5106147, 5270112, 5086613, 4820340, 3392921, 2701458, 2406390, 1499695, 278207, -324711, -794991, -997110, -665348, 424154, 1184892, 2001842, 2113358, 765505, -603543, -1044705, -1836175, -2609044, -2804013, -2712222, -2819952, -2762514, -2067914, -821891, 796609, 1127293, 189260, -1014101, -715467, -320648, -483359, -788646, -827773, -614074, 79520, 275076, 514893, 225220, 135437, -106820, -17848, 500716, 507468, 471298, -254426, -482724, -458666, -821134, -754433, -555671, -207247, 374023, -36653, 91702, 1855029, 3651043, 4018353, 3644219]
11135C644219k80128O12415n73816o58264L53806K3400J040506J328065k71676
11126E218527j279382j690252j307428r37447l83931p32514n27736l79587l48516
11117b368266J68370L59222M36347M19525m25997p90060Q34043J601074Q50954
11108A085212J24213k95152Q44518L21319j630907m79437J96906K53446n31219
11099a11101m98691k11756l80133o04975N49302J282150J248463m1129j915502
11090f83372o46161N71789P31435m45000j326942p1894J602719J048521j097391
11081c16296o17500r79255l1427O52119j75137R41948J824227J180447M72724
11072B951850j39954k66273n89640j578110j116691N08740J405218J030609K86700
$$ y = [3644219, 3364091, 3976506, 3402690, 2744426, 3098232, 3121632, 4162138, 5490203, 5218527, 3939145, 2248893, 941465, 4018, -379913, -1112427, -1640163, -2019750, -2368266, -2199896, -1840674, -1404327, -984802, -1410799, -2200859, -1366816, 234258, 1085212, 1209425, 914273, 1758791, 2080110, 449203, -30234, 166672, 420118, -111101, -609792, -821548, -1201681, -1806656, -1257354, 24796, 1273259, 1232130, -683372, -1329533, -757744, -26309, -471309, -1798251, -1870145, -267426, 781095, -316296, -933796, -1913051, -1944478, -1292359, -1467496, -525548, 1298679, 2479126, 2951850, 2811896, 2545623, 1955983, 377873, -738818, -230078, 1175140, 2205749, 2492449]
11063B492449r12697j444264r90662N46453J230787L31156J276073Q48495J43329
11054C521119L7459j110000q25931k76924k31054o0077j225604j483260m61647
11045b115919P29358N21224m75938R76817R02196j38183k41493O8985R14861n03799
11035F38109j651674J53661J093317o32520j207023k24471K16598l28463q97984
11026b840450n69131p4071J073595J038720k30661N56582K407791K042682j36600
11017C268457r62706j230045j464209r92849O15166P86737j581513j012035P59382
11008a813615P16903M33150P48248o1452o33033j510633j343233n28358O23935
10999c368088O21809P23735o67510m48952J437898J232000j88629k11500L1249
$$ y = [2492449, 1579752, 135488, -855174, -308721, 922066, 1253222, 2529295, 3377790, 3521119, 3558578, 2448578, 1622647, 1345723, 1114669, 1054592, -171012, -1654272, -2115919, -1386561, -865337, -1341275, -364458, 537738, 399555, 158062, 227047, 1141908, 638109, -1013565, -859904, 233413, -399107, -1606130, -1830601, -1614003, -1942466, -2840450, -3409581, -3483652, -2410057, -1371337, -1601998, -1045416, 1362375, 3405057, 3268457, 2305751, 1075706, -388503, -1381352, -766186, 20551, -1560962, -2572997, -1813615, -1096712, -663562, 84686, 23234, -609799, -2120432, -3463665, -3992023, -3368088, -2746279, -2022544, -2690054, -3139006, -1701108, -469108, -657737, -869237, -837988]
10990h37988J085374K73234L67804K32446j087828j085325n88176k18374l31818
10981b190651J32043K85751M98685K17607k65743J28650M87686R73792k12165
10972E5655r99632k33095L21527Q57833J511222O94565J48123Q16925m8780q89876
10962B234467j707656m58493n1977p96675R6762L75132k6484K85121M7245j71166
10952a73724r52593p34204m7449r77929l4702J305574N60736Q76276J19470p02540
10942g61085K99000j14244Q5312Q2623j39567j90427M10072N98416k97568p95894
10932h23362K48704L37309n22736o15366P21170J853671Q78045k09679m46688
10923A421068l34991K75480n73506o31781P9117k30918m43086o57211j41784K39324
$$ y = [-837988, 247386, 520620, 888424, 1120870, 33042, -1052283, -1640459, -1858833, -2190651, -2058608, -1772857, -1274172, -1056565, -1322308, -1193658, -705972, 267820, 55655, -943977, -1177072, -855545, 2288, 1513510, 2208075, 2356198, 3173123, 3124343, 2234467, 526811, 68318, 16341, -780334, -683572, -308440, -334924, -49803, -2558, -173724, -1126317, -1860521, -1907970, -2885899, -2920601, -1615027, -1054291, -178015, -58545, -761085, -462085, -576329, -491017, -408394, -547961, -738388, -328316, 270100, -27468, -823362, -574658, -237349, -760085, -1375451, -654281, 1199390, 2077435, 1867756, 1421068, 1086077, 1361557, 788051, 156270, 235387, 4469, -438617, -1095828, -1237612, -998288]
10913i98288m00438K22542o03703n25905O09780O44631m10401p08169n70166P89124
10903a950993J329788N89877o69047m9956N99810p2170n86451L6228Q7535M5493
10893f39886M95001J46955p28203j073203N84956m82747m57279K0491m81729p99023
10883c414667o57724L55631J461767R34893J25396J163807Q40381K38661K48929
10874A297074J274903J887531J021237M51888r02116j205155j446821n42074l49388
10865A487079M29843O66914J71792J7577P4111J60261J069997K17897k366668
10856A928803j542995j76517O54568R95032O03227L15692O8117j046667j432124
10847C67136o71539Q64083J674152p95245J44922J62027k80117p60671p1521R38453
$$ y = [-998288, -1398726, -1176184, -1779887, -2305792, -1696012, -1051381, -1461782, -2169951, -2740117, -1950993, -621205, -31328, -700375, -750331, -150521, -222691, -809142, -772914, -685379, -639886, -144885, 2070, -726133, -1799336, -1214380, -1697127, -2154406, -2133915, -2615644, -3414667, -4072391, -3716760, -2254993, -1320100, -1194704, -30897, 809484, 1048145, 1297074, 2571977, 4459508, 5480745, 5932633, 5030517, 3825362, 2378541, 1836467, 1487079, 1916922, 2583836, 2755628, 2773205, 2847316, 3007577, 4077574, 4295471, 1928803, 385808, 209291, 863859, 1858891, 2462118, 2777810, 2845927, 1799260, 367136, -304403, 559680, 2233832, 1438587, 1583509, 1745536, 1465419, 704748, 633227, 1571680]
10837A571680L03118m85100r39794l78981J253213J088978m27208p80772J59536
10828A364670k98456J44436K250530J092829k93328p40740k98510N0479P79153
10819D051063k66559j168414o90384j072730m00493o47843p52846j208375j138788
10810c295369j70755Q93643R21048J43990R54939J635756L90871q28560r90185
10801c44622j76417N81653N56712K30218j073516j187983q80250N9189q8211K134271
10791a88956K183489j75790j142071m28980l24019j178624q59062q82256P28775
10782b267494K070008J876571L97486k28148m75267O060l91615k71677N4861J547
10772G72332P16300J053687J49888j38402j749043j777838J42010J304041O57481
$$ y = [1571680, 1874798, 1389698, 449904, 70923, 1324136, 2413114, 1985906, 1205134, 1364670, 1066214, 1210650, 3461180, 4554009, 4260681, 3519941, 3221431, 3271910, 4051063, 3784504, 2616090, 1925706, 852976, 452483, -195360, -948206, -2156581, -3295369, -3466124, -2572481, -1651433, -1507443, -552504, 1083252, 1474123, 645563, -344622, -521039, 60614, 617326, 847544, -225972, -1413955, -2294205, -2235016, -2323227, -188956, 1994533, 1818743, 676672, 247692, -76327, -1254951, -2114013, -2996269, -2267494, -197486, 1679085, 2076571, 1848423, 1373156, 1379216, 987601, 715924, 770785, 772332, 1488632, 2542319, 2692207, 2553805, 804762, -973076, -831066, 472975, 1130456]
10763A130456j282529r84248k73171N35334j46551j262913j314641j286198L8244
10754d846217J562053K419686R48275j30414Q33289l35008j039051j050060j209448
10745b846895O09656J172478j60381l73828J18737k26637K37359J569337J783940
10736A883766p6027l77348j28602J49114O33673R41864M49862O6538M57029j272792
10726B727077r66459l9215q82009j264608n13632L30561k39134m63890P3486j4624
10716a252447M54975l56777j164881p7511J041588L96302k73126j24433N53423
10707h02887O71765R14728J297938j98448j060436j07873N95182O15241j09329
10698A815881j120342j313835l7010P09026J35333o97286q76653p70743j258527
$$ y = [1130456, -152073, -1136321, -1409492, -874158, -1020709, -2283622, -3598263, -4884461, -4846217, -3284164, -864478, 83797, -46617, 786672, 451664, -587387, -1637447, -2846895, -2237239, -1064761, -1225142, -1598970, -1480233, -1706870, -1469511, 99826, 1883766, 1807739, 1430391, 1301789, 1450903, 2084576, 3026440, 3476302, 3542840, 3999869, 2727077, 1760618, 1721403, 839394, -425214, -938846, -608285, -847419, -1311309, -1237823, -1252447, -797472, -1154249, -2319130, -2396641, -1355053, -958751, -1231877, -1356310, -802887, -131122, 783606, 2081544, 1883096, 822660, 714787, 1309969, 1925210, 1815881, 695539, -618296, -655306, 53720, 189053, -508233, -1384886, -2155629, -3414156]
10689c414156R38626J381725L40620p94520r28945j290743j153999M55369Q37937
10680c628086P60823O88418L64060J071554J166673N17211J561745J98113j22526
10671B577985n89705r39062o45714j467988p66161J48367n9196J04059M26295
10662a211120M19322K1844K70042R67610J158656L5005q9680j29059J59056m60758
10652A140918k39986o167j365077j850478L40661J156903o19206M62259J126155
10643A45982P9001R1019L30748L53584N40624J47728j07747O46473M63455p12034
10633A978833r50548p1000m89996j495147q34368j762020k071547j80204Q96937
10624d979060Q90387J052207J091930J1366q94458L20975J009745O18282J23894
$$ y = [-3414156, -2475530, -1093805, -753185, -1547705, -2476650, -3767393, -4921392, -4466023, -3628086, -2867263, -2178845, -1814785, -743231, 423442, 940653, 2502398, 2700511, 2577985, 1988280, 1049218, 403504, -1064484, -1830645, -1682278, -1741474, -1637415, -1211120, -791798, -769954, -499912, 467698, 1626354, 1661359, 1571679, 1442620, 1601676, 1140918, 900932, 894765, -470312, -2320790, -1980129, -823226, -1442432, -980173, 145982, 224983, 316002, 646750, 1000334, 1540958, 1688686, 1580939, 2227412, 2690867, 1978833, 1028285, 957285, 467289, -1027858, -1862226, -3624246, -5695793, -5875997, -4979060, -4088673, -3036466, -1944536, -1933170, -2827628, -2506653, -1496908, -878626, -754732]
10615g54732R2287p75014j229100P70459J977185O17592k22079Q53663Q87909
10606B218170j24498k57654j93433j02164P1282p24800p19098R0533r55490r4633
10596g91785j8377j130883j223825j66020K34070J576490K240487J65261j124113
10587b38695r02924L43506J078579m69663k68402N46048K11607o38879j690255
10578b029078P38878P22668K2723M82984L6317P09698P35788n8293p04933j455846
10568g99094j221710O6099P63757K99572M08596Q35654M99479p97894j324861
10559a270402j49697O59769L37376K20435M57479R7673O7851J096335M13319p18415
10549A211723p27916o13344Q0178N43664j07512p45070m9947j19918P87935q1268
$$ y = [-754732, -662445, -1437459, -2666559, -1896100, 81085, 698677, 476598, 1330261, 2218170, 2093672, 1836018, 1642585, 1540421, 1611703, 886903, 167805, 258338, -697152, -791785, -810162, -1941045, -3164870, -3330890, -3096820, -1520330, 720157, 885418, -238695, -1141619, -798113, 280466, -189197, -457599, 88449, 300056, -338823, -2029078, -1290200, -567532, -544809, -61825, -25508, 684190, 1419978, 1361685, 656752, -799094, -2020804, -1954705, -1190948, -891376, -482780, 352874, 852353, 54459, -1270402, -1420099, -760330, -422954, -202519, 254960, 352633, 420484, 1516819, 1930138, 1211723, 483807, -129537, -49359, 494305, 386793, -358277, -408224, -528142, 259793, 178525]
10539A78525j007192K00917m04707j51371O3730J38123L00256n52230L93580J516575
10529F76206Q1965q74067o55192M98607J50659l61056N43990J234076L39280l11142
10519A323326J63208p67584n49270j88045j815274j621822J071109J735790J071633
10510D23071J525789M0839L72588L38023J29494L96036j330025j988201k850L08847
10500B13611K41444n2521J53657L12016n60680j43507k90881o12622J22741Q56103
10490B39361J64839J91019m69471p36802M2385K26948j01371M43714R56751L81182
10480A338555n48151o04274L87887k05162m83682o7533N70873N52087j0965J53119
10470A082754k15721N15114J221251M11604p75576j191305p03357J544779O32098
$$ y = [178525, -828667, -627750, -1032457, -1183828, -1120098, -981975, -681719, -1233949, -840369, 676206, 758171, -115896, -771088, -272481, -121822, -482878, 61112, 1295188, 1634468, 1323326, 1486534, 718950, 169680, -18365, -1833639, -3455461, -2384352, -648562, 423071, 1948860, 1989699, 2362287, 2700310, 2829804, 3225840, 1895815, -92386, -95236, 213611, 455055, 402534, 556191, 868207, 307527, 164020, -126861, -739483, -616742, 239361, 404200, 595219, 125748, -611054, -568669, -341721, -443092, 622, 957373, 1338555, 790404, 186130, 574017, 368855, -114827, -182360, 388513, 940600, 929635, 1082754, 867033, 1382147, 2603398, 3015002, 2239426, 1048121, 344764, 1889543, 2521641]
10461B521641j492560M66234J544676n16032r81236l01303P3200l27213j586760
10452e99353p57120n54988M39900J339600J339836M10875l15581n26529j214679
10443d38039j463551j133578L35645J144023R75713M23498N05151K023520P39776
10434C112158j263404j537739j41731M72839r18009j087434M80008J846336P15881
10425A678905r40296r34023l78980j233235q74449K59759M5195O43159J063261
10416f70704Q75791N7526k95462m2276l6091M90340J112123Q12081k07932m89027
10406A606369m77711M4018O3906o23097r01566q53465l90316L15151Q34329j44084
10396e26466j111106o17358M74840J181105Q05136O49226L47768O444l6569Q33603
$$ y = [2521641, 1029081, 1495315, 3039991, 2523959, 1542723, 1241420, 1314620, 987407, -599353, -1356473, -1911461, -1471561, -131961, 1207875, 1618750, 1303169, 776640, -438039, -1901590, -3035168, -2699523, -1555500, -579787, -156289, 348862, 2372382, 3112158, 1848754, 311015, 169284, 642123, -275886, -1363320, -883312, 963024, 1678905, 738609, -195414, -574394, -1807629, -2682078, -2422319, -2377124, -1733965, -670704, 205087, 262613, -32849, -75125, -111216, 379124, 1491247, 2303328, 2095396, 1606369, 1128658, 1172676, 1236582, 613485, -288081, -1141546, -1531862, -1216711, -382382, -526466, -1637572, -2254930, -1780090, -598985, 206151, 855377, 1203145, 1209589, 1173020, 2006623]
10386B006623m89453j864361j751262o73669l00263P9413O61950J215015J185357
10377F9350O21727N58563j082037j318582n1507l7094J55041R75016J116372j062710
10367e5861j319638j22825J210290J151771l93953j450584k54131O02219J35119
10358d97593r89828j83568R20540J658398K031219J39747k19231P22750P60255
10349D342689p71639j761468p60466l56873j190113n64140j75568k7297O6740
10340a198135L03647l50432r45625j083905J89470J001276N49389j73147l33268
10331b040730L61765Q71567Q14659O3740m49659L25640l1282r33364o31263N92751
10321a056176K89477l25206q6223J528473K169412L13805j131538j411753j799608
$$ y = [2006623, 1517170, -347191, -2098453, -2772122, -3072385, -2992972, -2331022, -1116007, 69350, 691077, 1249640, 167603, -1150979, -1202486, -1239580, -1084539, -109523, 1006849, -55861, -1375499, -1498324, -288034, 863737, 469784, -980800, -1234931, -632712, -497593, -1487421, -1670989, -750449, 907949, 2939168, 3078915, 2859684, 3582434, 4342689, 3571050, 1809582, 1049116, 692243, -497870, -1062010, -1237578, -1264875, -1198135, -894488, -1244920, -2190545, -3274450, -3084980, -2083704, -1534315, -1707462, -2040730, -1678965, -807398, 7261, 71001, -378658, -53018, -84300, -1017664, -1648927, -1056176, -766699, -1091905, -1178128, 350345, 2519757, 2833562, 1702024, 290271, -1509337]
10312a509337j800657o0884N35470J105757P30389R1727K80750N52265N18272
10303D43752M21975l92838j353833j156049p92946o394L24510K85147m72746r30988
10293c630410J309738J580719O84914R2667P5723J037393p02418j808474q06846
10284b166994l22703k22434L69734J043409Q77397K08390J309086O66140m99493
10275A262532l982o86678j388790l38175K069802J480369j214211j679251j182430
10266a680814q45418M44657J487943N35165k7470j82780j243011p18693P70258
10257a460163J022646N58882n42869R4484J115301J133510O3122j091451j111662
10248b18200j39444O57865K45376M96170P4479n48355j123030j498442k33931
$$ y = [-1509337, -3309994, -3370878, -2835408, -1729651, -999262, -907535, -626785, -74520, 443752, 865727, 472889, -880944, -2036993, -2829939, -2836333, -2511823, -2226676, -2699422, -3630410, -2320672, -739953, -55039, 37628, 113351, 1150744, 448326, -1360148, -2166994, -2489697, -2712131, -2342397, -1298988, -421591, -213201, 1095885, 1762025, 1262532, 1258550, 571872, -816918, -1155093, 914709, 2395078, 1180867, -498384, -1680814, -2526232, -2081575, -593632, -58467, -85937, -268717, -1511728, -2230421, -1460163, -437517, 121365, -421504, -327020, 788281, 1921791, 1984913, 893462, -218200, -357644, 300221, 545597, 1041767, 1116246, 567891, -555139, -2053581, -2287512]
10239b287512P68193J523823J28999j141953m98743L52586L63063J052732k20999
10230D0189j293709j693343j335223k30000m6202O25027J568085J716253N64461
10221h4462J6144j639427j594717J95184J892213J305199M99502J146285o01862
$$ y = [-2287512, -1519319, 4504, 133503, -1008450, -1507193, -1154607, -791544, 261188, 40189, -1253520, -2946863, -4282086, -4512086, -4558288, -3933261, -2365176, -648923, -84462, -68318, -1707745, -3302462, -3107278, -1215065, 90134, 589636, 1735921, 1134059]
$$ [...]
##END NTUPLES=NMR SPECTRUM
##END=
