##TITLE=C13_LR_683B-CS2
 DMSO-d6, 1600 sc

 4.3.2020
##JCAMPDX= 6.0         $$ Bruker NMR JCAMP-DX V2.0
##DATA TYPE= NMR SPECTRUM
##DATA CLASS= NTUPLES
##ORIGIN= UXNMR, Bruker Analytische Messtechnik GmbH
##OWNER= root
$$ XWIN-NMR		Version 3.5
$$ Wed Mar  4 16:29:03 2020 Russian Standard Time (UT+4h)  she@DPX200
##.OBSERVE FREQUENCY= 50.327896
##.OBSERVE NUCLEUS= ^13C
##.ACQUISITION MODE= SIMULTANEOUS
##.ACQUISITION SCHEME= undefined
##.AVERAGES= 1600
##.DIGITISER RES= 17
##SPECTROMETER/DATA SYSTEM= spect
##.PULSE SEQUENCE= zgpg30
##.SOLVENT NAME= D2O
##.SHIFT REFERENCE= (INTERNAL, D2O, 0, 222.624)
##AUDIT TRAIL= $$ (NUMBER, WHEN, WHO, WHERE, WHAT)
$$ ##TITLE= Audit trail, XWIN-NMR		Version 3.5
$$ ##JCAMPDX= 5.01
$$ ##ORIGIN= Bruker BioSpin GmbH
$$ ##OWNER= she
$$ F:/spectra/data/she/nmr/c13/1/pdata/1/auditp.txt
$$ ##AUDIT TRAIL=  $$ (NUMBER, WHEN, WHO, WHERE, WHAT)
(   1,<2020-03-04 16:28:00.29 +0400>,<she>,<DPX200>,
      <created by zg, POWCHK disabled, PULCHK disabled
       terminated by command 'halt'
       configuration hash MD5:
       00 E9 B6 7A A2 85 ED C7 34 08 36 98 17 FE 4E 26
       data hash MD5: 32K
       19 21 81 52 C8 55 1A 82 6C BB 72 F1 D5 86 AB 87>)
(   2,<2020-03-04 16:28:01.92 +0400>,<she>,<DPX200>,
      <Start of raw data processing
       efp BC_mod = 2 LB = 1 FT_mod = 6 PKNL = 1 PHC0 = -229.6162 PHC1 = 26.60638 SI = 32K 
       data hash MD5: 32K
       99 77 44 EB 49 4C 56 1F 0D 77 B0 0E 3D A6 BC F6>)
(   3,<2020-03-04 16:28:04.43 +0400>,<she>,<DPX200>,
      <abs ABSG = 5 
       data hash MD5: 32K
       3A DA 2E 60 DC A6 D9 F7 25 B3 82 EF D8 38 2D F1>)
(   4,<2020-03-04 16:28:32.17 +0400>,<she>,<DPX200>,
      <pk PHC0 = -5.130182 PHC1 = 6.999998 
       data hash MD5: 32K
       7A B0 32 D2 F5 1E 85 F4 39 BA 7D D3 4F 98 AB 7A>)
(   5,<2020-03-04 16:28:35.57 +0400>,<she>,<DPX200>,
      <abs ABSG = 5 
       data hash MD5: 32K
       BB 90 56 F9 DB 14 0F 4B AD 70 EC D0 E9 37 5C 53>)
$$ ##END=
$$ 
$$ hash MD5
$$ A7 D7 C3 91 37 82 81 1A 99 97 87 76 80 FC 30 DF
##$RELAX= 
##$RELAX= 
##$RELAX= 
##$RELAX= 
##$RELAX= 
##$RELAX= 
##$RELAX= 
##$RELAX= 
$$ Bruker specific parameters
$$ --------------------------
##$DU= <F:/spectra>
##$EXPNO= 1
##$NAME= <c13>
##$PROCNO= 1
##$TYPE= <nmr>
##$USER= <she>
##$AMP= (0..31)
100 100 100 100 100 100 100 100 100 100 100 100 100 100 100 100 100 100 
100 100 100 100 100 100 100 100 100 100 100 100 100 100 
##$AQSEQ= 0
##$AQ_mod= 1
##$AUNM= <au_zg>
##$AUTOPOS= <>
##$BF1= 50.322709
##$BF2= 200.13
##$BF3= 50.322709
##$BF4= 500.13
##$BF5= 500.13
##$BF6= 500.13
##$BF7= 500.13
##$BF8= 500.13
##$BYTORDA= 1
##$CFDGTYP= 0
##$CFRGTYP= 5
##$CHEMSTR= <none>
##$CNST= (0..31)
1 1 145 1 1 1 1 1 1 1 1 1 1 1 1 1 1 1 1 1 1 1 1 1 1 1 1 1 1 1 1 1 
##$CPDPRG= <waltz16>
##$CPDPRG1= <>
##$CPDPRG2= <waltz16>
##$CPDPRG3= <>
##$CPDPRG4= <mlev>
##$CPDPRG5= <mlev>
##$CPDPRG6= <mlev>
##$CPDPRG7= <mlev>
##$CPDPRG8= <mlev>
##$CPDPRGB= <>
##$CPDPRGT= <>
##$D= (0..31)
$$ [...]
##$SUBNAM4= <"">
##$SUBNAM5= <"">
##$SUBNAM6= <"">
##$SUBNAM7= <"">
##$SUBNAM8= <"">
##$SUBNAM9= <"">
##$SW= 239.972175391363
##$SWIBOX= (0..15)
0 1 3 0 0 0 0 0 0 0 0 0 0 0 0 0 
##$SW_h= 12077.2946859903
##$TD= 32768
##$TD0= 1
##$TE= 0
##$TE2= 300
##$TE3= 300
##$TEG= 300
##$TL= (0..7)
120 120 120 120 120 120 120 120 
##$TP= (0..7)
150 150 150 150 150 150 150 150 
##$TP07= 0
##$TPNAME0= <>
##$TPNAME1= <>
##$TPNAME2= <>
##$TPNAME3= <>
##$TPNAME4= <>
##$TPNAME5= <>
##$TPNAME6= <>
##$TPNAME7= <>
##$TPOAL= (0..7)
0.5 0.5 0.5 0.5 0.5 0.5 0.5 0.5 
##$TPOFFS= (0..7)
0 0 0 0 0 0 0 0 
##$TUNHIN= 0
##$TUNHOUT= 0
##$TUNXOUT= 0
##$USERA1= <user>
##$USERA2= <user>
##$USERA3= <user>
##$USERA4= <user>
##$USERA5= <user>
##$V9= 5
##$VALIST= <valist>
##$VCLIST= <CCCCCCCCCCCCCCC>
##$VD= 0
##$VDLIST= <DDDDDDDDDDDDDDD>
##$VPLIST= <PPPPPPPPPPPPPPP>
##$VTLIST= <TTTTTTTTTTTTTTT>
##$WBST= 1024
##$WBSW= 4
##$XGAIN= (0..3)
0 0 0 0 
##$XL= 0
##$YL= 0
##$YMAX_a= 9694909
##$YMIN_a= -8599373
##$ZGOPTNS= <>
##$ZL1= 120
##$ZL2= 120
##$ZL3= 120
##$ZL4= 120
##$ABSF1= 222.624
##$ABSF2= -17.3728
##$ABSG= 5
##$ABSL= 3
##$ALPHA= 0
##$AQORDER= 0
##$ASSFAC= 0
##$ASSFACI= 0
##$ASSFACX= 0
##$ASSWID= 0
##$AUNMP= <proc_1d>
##$AZFE= 0.1
##$AZFW= 0.5
##$BCFW= 0
##$BC_mod= 2
##$BYTORDP= 0
##$COROFFS= 0
##$CY= -3
##$DATMOD= 1
##$DC= 0
##$DFILT= <>
##$DTYPP= 0
##$F1P= 0
##$F2P= 0
##$FCOR= 0.5
##$FTSIZE= 32768
##$FT_mod= 6
##$GAMMA= 0
##$GB= 0
##$INTBC= 1
##$INTSCL= 4.134877e-10
##$ISEN= 128
##$LB= 1
##$LEV0= 0
##$LPBIN= 0
##$MAXI= 10000
##$MC2= 0
##$MEAN= 0
##$ME_mod= 0
##$MI= 0.1934396
##$NCOEF= 0
##$NC_proc= -1
##$NLEV= 6
##$NOISF1= 120.0001
##$NOISF2= 80.00006
##$NSP= 0
##$NTH_PI= 0
##$NZP= 0
##$OFFSET= 222.624
##$PC= 1.4
##$PHC0= -234.7464
##$PHC1= 33.60638
##$PH_mod= 1
##$PKNL= yes
##$PPARMOD= 0
##$PSCAL= 0
##$PSIGN= 0
##$REVERSE= no
##$SF= 50.3227315989248
##$SI= 32768
##$SIGF1= 140
##$SIGF2= 120
##$SINO= 11.81781
##$SIOLD= 32768
##$SREGLST= <13C.CDCl3>
##$SSB= 0
##$STSI= 32768
##$STSR= 0
##$SW_p= 12077.2946859903
##$SYMM= 0
##$S_DEV= 0
##$TDeff= 32768
##$TDoff= 0
##$TI= <>
##$TILT= no
##$TM1= 0
##$TM2= 0
##$TOPLEV= 0
##$USERP1= <user>
##$USERP2= <user>
##$USERP3= <user>
##$USERP4= <user>
##$USERP5= <user>
##$WDW= 1
##$XDIM= 32768
##$YMAX_p= 450561800
##$YMIN_p= -5249313
$$ End of Bruker specific parameters
$$ ---------------------------------
##NTUPLES= NMR SPECTRUM
##VAR_NAME=  FREQUENCY,     SPECTRUM/REAL,   SPECTRUM/IMAG
##SYMBOL=    X,             R,               I
##VAR_TYPE=  INDEPENDENT,   DEPENDENT,       DEPENDENT
##VAR_FORM=  AFFN,          ASDF,            ASDF
##VAR_DIM=   32768,         32768,           32768
##UNITS=     HZ,            ARBITRARY UNITS, ARBITRARY UNITS
##FACTOR=    0.368581032318806, 1,           1
##FIRST=     11203.0474431902, 0,            0
##LAST=      -874.247242800138, 0,           0
##MIN=       -874.247242800138, -5249313,    0
##MAX=       11203.0474431902, 450561800,    0
$$ Real data points
##PAGE= N=1
##DATA TABLE= (X++(R..R)), XYDATA
$$ [...]
10635F67482j34906p88308q60363K64035Q11491K82749l17714n14275k42049m3725
10625h75583L62917Q22546K37063q00164J6596l40194l95431N75801J25222m06421
10615f77648M70696l04428n83598N93608K84874o49251K68776N90032m24904p42712
10605a174555p3796N26730J20162j19073R3001J84802N44054J43544k62625O42297
10595F24541J345331R24896q12609j372263j15953N88316K9775o33472j089434
10586e10872j352308o90516K80491Q86659J167788R64124l78823n00583P73925
10577F39885K17175n07857p4671j89734p4100j20303j71608L07856J66061K03623
10567C96327L5821o03447o43655m88219L7657N49530o63664j288424n77944J81141
$$ plain form
10635 667482 532576 -255732 -1116095 -852060 -40569 242180 -75534 -589809 -831858 -875583
10625 -875583 -512666 309880 546943 -253221 -236625 -576819 -972250 -396449 -271227 -677648
10615 -677648 -206952 -511380 -1094978 -501370 -216496 -865747 -596971 -6939 -431843 -1174555
10605 -1174555 -1248351 -721621 -601459 -720532 -627531 -442729 101325 244869 -17756 624541
10595 624541 1969872 2894768 2082159 709896 593943 1182259 1212034 578562 -510872
10586 -510872 -1863180 -2553696 -2273205 -1386546 -218758 745366 366543 -134040 639885
10577 639885 857060 349203 274532 84798 10698 -109605 -281213 26643 192704 396327
10567 396327 432148 -171299 -814954 -1303173 -1265516 -715986 -1379650 -2668074 -3246018 -3064877
10557c064877N00052O53367Q05631N43607k51401p13028n53045p94438m04810
10548c278942k6589k89984L51412N3824N4414O35518J127117L83759l40484j88586
10538a518541p83423M3084J4201j53090Q84404N53057o8829j026810n45671J362433
10528a239185N81159l16271J43756L29841Q82203O21365o5769n38445n72867l49139
10518e23352k99926J60519P84237J408567J02343j584283m32233J14378M04859
10509A35109J538765N4833j036392r46040k81318L02699K84028l22005q19906
10500a090227q24733M9699J188102J692928O03166r35606o69474l12925m51128
10491g50198m12250M73162J205604J016805Q56494J08963m57266K253M30414o31529
$$ plain form
10557 -3064877 -2564825 -1911458 -1105827 -562220 -813621 -1526649 -2079694 -2874132 -3278942
10548 -3278942 -3305531 -3595515 -3244103 -3190279 -3135865 -2500347 -1373230 -989471 -1329955 -1518541
10538 -1518541 -2301964 -2258880 -2244679 -2397769 -1513365 -960308 -1029137 -2055947 -2601618 -1239185
10528 -1239185 -658026 -974297 -830541 -500700 381503 1002868 937099 398654 -174213 -523352
10518 -523352 -823278 -662759 121478 1530045 1632388 48105 -384128 -269750 135109
10509 135109 1673874 1728707 692315 -253725 -535043 -232344 51684 -270321 -1090227
10500 -1090227 -1914960 -1865261 -677159 1015769 1618935 683329 13855 -299070 -750198
10491 -750198 -1162448 -689286 516318 1533123 2389617 2498580 2041314 2043567 2473981 1842452
10481A842452r57241l04203K24188P88504l66815r85276l41305K29794O24872
10472G54970j68373o37939l81861l10229K46818L1089k14731M62919N54898k68262
10462F9299l99745j82788p80786n39699o7960J44135p6301L57029O33274j39470
10452i83012L85719Q2540J35666P0110n61725l72149O34511J217354P5956r24525
10442b39555n86011j09270J04859j1176k63621k40261j08316k29386j11545O14812
10432a179470O58995K33830O37511o2416J1724k9232l51566o53120o72566J72792
10422a233518P45667K51167j72810k90890J93712j65137o42675J04503J78640
10413a031341K03252O9163m56268j24279J353810J126236L78138k88710j92236
$$ plain form
10481 1842452 885211 581008 805196 1593700 1226885 241609 -99696 130098 754970
10472 754970 586597 -51342 -433203 -743432 -496614 -465525 -680256 -217337 337561 69299
10462 69299 -330446 -513234 -1294020 -1833719 -1901679 -1757544 -1833845 -1476816 -843542 -983012
10452 -983012 -597293 -514753 -379087 -308977 -870702 -1242851 -608340 609014 684970 -239555
10442 -239555 -825566 -934836 -829977 -841153 -1104774 -1345035 -1453351 -1682737 -1794282 -1179470
10432 -1179470 -520475 -286645 350866 288450 300174 270942 -80624 -733744 -1406310 -1233518
10422 -1233518 -487851 -236684 -409494 -700384 -506672 -671809 -1314484 -1209981 -1031341
10413 -1031341 -828089 -758926 -1215194 -1339473 14337 1140573 1518711 1230001 1037765
10404A037765j9617p51420o79485N4180P04319M88313L5378o07929j008075Q26907
10394H0336J190012j99403j070324k78914L82713P6465j72093o00411K08447J082967
10384F99795M47277j76791m71636j232820j1433J139331N75879o58782p71939
10375d61119N24883J150085P72311j13849o50757r13776j04080O49139J78346
10366A031183q04474M91447L68492K07956L37395J89268J38498N3406N47444l47179
10356B213436j025079p23079k06370m66167m62178J91807Q08896Q71809P3672
10347A276747n12217l52663K46523m9527p17915k0106J95493J62932R6495n15631
10337a89869j34677p08921k00358K98060M4716k47277K86450O31232K95653j30081
$$ plain form
10404 1037765 1018148 266728 -412757 -358577 345742 834055 869433 261504 -746571 80336
10394 80336 1270348 1070945 621 -278293 104420 180885 8792 -591619 -383172 699795
10384 699795 1147072 970281 498645 -734175 -745608 393723 969602 310820 -461119
10375 -461119 63764 1213849 1986160 1872311 1221554 307778 203698 852837 1031183
10366 1031183 226709 718156 1086648 1294604 1631999 1821267 1959765 2013171 2560615 2213436
10356 2213436 1188357 465278 258908 -207259 -669437 -477630 331266 1203075 1276747
10347 1276747 764530 411867 658390 608863 -109052 -129158 66335 229267 325762 -189869
10337 -189869 -324546 -1033467 -1233825 -935765 -891049 -1138326 -851876 -220644 75009 -55072
10327e5072j155169m12869J051131J058783j44905l71075k37308j89728M22759
10318c3453k29255q47537k48009n3136k02981O4740J286740J203803J14646n11984
10308E43574L31098L29909k14869q68927p42917j32630l7523j12845j3993k27285
10298a146408j23591m41738n02956R8690J183823J927364J220519Q12527k53426
10289B774804j582401j701546j037710l65250N46315J57313N87955J254196K10405
10280H44081m73624n62349J64667L85353N35967O02372l81672o07025p42205l63630
10270e98065n06628n33689M60599O67473J272932N32585o75145q23467n39539
10261g42944N21469L26766K7824K38366J40892r02146q30995J42292O84718L20234
$$ plain form
10327 -55072 -1210241 -1623110 -571979 486804 341899 -29176 -266484 -456212 -33453
10318 -33453 -262708 -1110245 -1358254 -1411390 -1614371 -1549631 -262891 940912 1055558 543574
10308 543574 874672 1204581 989712 120785 -622132 -754762 -792285 -905130 -919123 -1146408
10298 -1146408 -1269999 -1711737 -2214693 -2116003 -932180 995184 2215703 3028230 2774804
10289 2774804 1192403 -509143 -1546853 -1912103 -1365788 -1208475 -620520 633676 844081
10280 844081 370457 -191892 -27225 358128 894095 1496467 1114795 507770 -234435 -598065
10270 -598065 -1104693 -1638382 -1177783 -510310 762622 1295207 620062 -203405 -742944
10261 -742944 -221475 105291 133115 371481 512373 -389773 -1220768 -1078476 -393758 -73524
10251g3524j27117O01176N90291l07411p89975P31279R80049n8523k40330k04106
10241A101809n61244l26175k66574k48504k00346M07738J37258j41557M15302
10232C17707j17383j161351p46777L77645J397135J361715L67941K14698l32694
10223A678636n72254j11146P8468n73936r81542k97461J79807J38403j43753j16947
10213g21725j50215P33608J531287J108904J72696n88273n11518J73162J76105
10204A924031l26960j344147j720803j046379J58762J122492J295497m43472r79507
10195a360486K82099J76920j37854J57255O08150K90455O31840K36932n06672
10186C78639R6358r5182m35655m17353p80290j54553M19582L28055J41199R35717
$$ plain form
10251 -73524 -200641 400535 990826 683415 -106560 624719 1604768 1546245 1305915 1101809
10241 1101809 540565 214390 -52184 -300688 -501034 -93296 43962 -97595 317707
10232 317707 200324 -961027 -1707804 -1330159 66976 1428691 1796632 2011330 1678636
10223 1678636 1106382 995236 1073704 499768 -481774 -779235 -599428 -461025 -604778 -721725
10213 -721725 -871940 -138332 1392955 2501859 2674555 2086282 1574764 1747926 1924031
10204 1924031 1597071 252924 -1467879 -2514258 -2355496 -1233004 62493 -380979 -1360486
10195 -1360486 -1078387 -901467 -1039321 -882066 -273916 16539 648379 885311 378639
10186 378639 474997 379815 -55840 -473193 -1253483 -1408036 -988454 -660399 -519200 416517
10176D16517M93606N90474M06552L15470M71444q03412j331817r99346J39600
10167c00912n13762p52279k56079L96157P26157Q42351k8597n81460k11236M1023
10157f38637K97276J86878o77796p78112n7306Q06346R26830j8230r69872o58700
10147a581323J55866P26315O87270M46906J86999j10988m85739m11770j46139
10138e32603k91516p31857n60371j2070M13429J174027N88446K28382k9054k42115
10128D698J26486O53379O05147j24177m60129p39801k57015o97731q43289L17800
10118a414632M03991Q2047m59087m77220m09484J16022k14794m55782J17338M10002
10108b301599J041476J009790P57615J27576p35552j009768o71552N72171J304330
$$ plain form
10176 416517 910123 1500597 1907149 2222619 2694063 1890651 558834 -440512 -300912
10167 -300912 -814674 -1566953 -1823032 -1426875 -700718 141633 113036 -468424 -679660 -638637
10157 -638637 -341361 -154483 -832279 -1610391 -1667697 -861351 65479 47249 -922623 -1581323
10147 -1581323 -1425457 -699142 -11872 435034 622033 511045 25306 -386464 -532603
10138 -532603 -824119 -1555976 -2116347 -2128417 -1714988 -540961 47485 275867 246813 4698
10128 4698 131184 784563 1389710 1265533 805404 65603 -191412 -889143 -1732432 -1414632
10118 -1414632 -1010641 -928594 -1387681 -1864901 -2274385 -2158363 -2373157 -2828939 -2711601 -2301599
10108 -2301599 -1260123 -250333 507282 634858 -100694 -1110462 -1782014 -1209843 94487
10099I4487P49207k60323k63391L49968O86176j6406l98111l54225k35975M0074
10089C91481L3703K88503O81428O48978k04163k24951L51448n12642n59616N9165
10079I53334J98368O3735o04495l87553j87848l04588O41412J53840m20635o89630
10069e84060K87694J20918k87848q91501r06571P90447M41955l6089N75058J81280
10059c08717n0226l20153n45665k62756J80159O1538M6549k19605n26552j03295
10049b048723P88106p9750q12460n5259O81030R47812k35303q54916j93912R90454
10039h72921P28680J60791P40603L69771q24151j514882k50538O64939Q47497
10030D9789J069510J77858k05875o88254r97057l38181O32933P15850k3216k08817
$$ plain form
10099 94487 843694 583371 319980 669948 1356124 1339718 941607 587382 351407 391481
10089 391481 425184 713687 1395115 2044093 1839930 1614979 1966427 1453785 894169 953334
10079 953334 1151702 1215437 610942 223389 35541 -269047 372365 526205 105570 -584060
10069 -584060 -296366 -175448 -463296 -1354797 -2261368 -1470921 -1028966 -1065055 -489997 -308717
10059 -308717 -358943 -679096 -1224761 -1487517 -1307358 -1245820 -1199271 -1418876 -1945428 -2048723
10049 -2048723 -1260617 -1340367 -2152827 -2208086 -1527056 -579244 -814547 -1669463 -1863375 -872921
10039 -872921 -144241 16550 757153 1126924 302773 -1212109 -1462647 -797708 49789
10030 49789 1119299 1297157 1091282 403028 -594029 -932210 -299277 416573 393357 184540
10020A84540m02358j79639L58237P1004j76161p01464l80192l42630o92648J70484
10010b090827K07250m41958r3795J00670l9564j74692J79656Q70124M97492j56998
10000a142642N23987o20851j598420N39514J461922n9936o43186P1783M44347
9991a023482P1783N38032J20498l28360k15579J05240o62524o49907J59315P81195
9981a103789J106502K5686J65354K90131J4472j55328j25089j005364j075977
9972a863402j89635p81315k59060J78407O13028P63351L01840J87866n35206m90338
9962b074464l38170l44853J59438K62640N5060J42525R21624P72953J30345q3415
9952c96317n02380K15217K31879o09901m04781K16562l77839j39927k50608K55316
$$ plain form
10020 184540 -217818 -397457 -39220 31784 -144377 -845841 -1226033 -1568663 -2261311 -2090827
10010 -2090827 -1883577 -2325535 -2419330 -2318660 -2358224 -2532916 -2353260 -1483136 -985644 -1142642
10000 -1142642 -618655 -1239506 -2837926 -2298412 -836490 -896426 -1539612 -1467829 -1023482
9991 -1023482 -951699 -413667 -293169 -621529 -837108 -731868 -1394392 -2044299 -1884984 -1103789
9981 -1103789 2713 28399 193753 483884 498356 343028 217939 -787425 -1863402
9972 -1863402 -2053037 -2834352 -3093412 -2915005 -2301977 -1538626 -1236786 -1048920 -1584126 -2074464
9962 -2074464 -2412634 -2757487 -2598049 -2335409 -2280349 -2137824 -1216200 -443247 -312902 -396317
9952 -396317 -898697 -683480 -451601 -1061502 -1466283 -1249721 -1627560 -1767487 -2018095 -1762779
9942a762779M35628M66922N52161J711130K466612k3576j437620k76771p60836
9933A370871j590034j000109k70974M69417M41798l49012R4459J274543J247658
9924A688617j75169o25072k28960M55248M58507m92734k05400p08396j284641
9915a118000j25576J089105P30873p26300j095917j46507R37468o20600m78570
9906a554024R6101j53740j07118r6586n53163M45228M03836N07680J847921L19619
9896A155754J94092L71917n00384r00613o28642N54666J208172p4066m39853o32440
9886C08603p86042n5101N32454J76076n80382j62276Q73019L64011j53771q98201
9876c81610q14968l51245L27129M30116N59298M28595k42084N55473J38201j195724
$$ plain form
9942 -1762779 -1327151 -860229 -308068 1403062 3869674 3846098 2408478 2131707 1370871
9933 1370871 -219163 -1219272 -1490246 -1020829 -579031 -928043 -833584 440959 1688617
9924 1688617 1513448 888376 659416 1114664 1573171 1080437 875037 166641 -1118000
9915 -1118000 -1243576 -154471 576402 -149898 -1245815 -1392322 -454854 -1075454 -1554024
9906 -1554024 -1457923 -1611663 -1718781 -1815367 -2368530 -1923302 -1519466 -1011786 836135 1155754
9896 1155754 1349846 1721763 1221379 320766 -307876 246790 1454962 1380896 941043 308603
9886 308603 -477439 -532540 -86 175990 -404392 -566668 306351 670362 516591 -381610
9876 -381610 -1196578 -1547823 -1220694 -790578 -231280 197315 -44769 510704 648905 -546819
9866e46819l22246l34206k19618m79592p6120R07796N76065m43026p57340k15216
9856a910322J061572J203162J200438L54369p95981m80532n66913q76139k93595
9847a103941o59998r15037j14110M42267K03714J83063L42477J124105J067813
9838E70353M10735m81164r27649Q4143P66237M67089o32161j07507l22779p02321
9828h75024k43892n05903k31121L0959M93803P90875k32463j081182l96906J423404
9818h27450J118957J46731n31477j18490R7144J1396J61601o33921p60942n31823
9808a868274j3759l9816k9973M58144N92594J98468L39123J7029p25807o28727
9798a700998q6963Q43730K36097M76481J420077K32594j180851p17474k37893
$$ plain form
9866 -546819 -869065 -1203271 -1422889 -1902481 -1978601 -1070805 -494740 -937766 -1695106 -1910322
9856 -1910322 -848750 354412 1554850 1909219 1113238 632706 65793 -810346 -1103941
9847 -1103941 -1763939 -2678976 -2793086 -2350819 -2147105 -1964042 -1621565 -497460 570353
9838 570353 981088 499924 -427725 -343582 422655 889744 257583 150076 -172703 -875024
9828 -875024 -1118916 -1624819 -1855940 -1824981 -1331178 -540303 -772766 -1853948 -2250854 -827450
9818 -827450 291507 438238 -93239 -211729 -114585 -103189 58412 -575509 -1336451 -1868274
9808 -1868274 -1882033 -1921849 -1951822 -1493678 -901084 -702616 -363493 -346464 -1072271 -1700998
9798 -1700998 -1787961 -944231 -708134 -231653 1188424 1421018 240167 -477307 -715200
9789g15200L27591R11567J047415Q40389o18392j474082j387726j413682l10779
9780b792899O46786K20449j55501j4006L9882L45202j09426m4620j73812L42896
9770a695049L59683j63823J73832J13111j20634o18403J91178M46065J84337l79291
9760a508994l50414O4345k70477l18839k07782R7539k00918N83565N93289L74610
9750a144076K43255K96993j98735q41036J64300R45895O90270j123p64893j365706
9740a974856p40510k7106Q14579J004991R69935M98394J010234M10382n99367
9731A366676p99161j81925o51049j019494K31704R92206L38766m04229J81283
9722E4777K32581o25451r18931p04301l96691l46559j81337l03095P21666O90417
$$ plain form
9789 -715200 -387609 523958 1571373 2411762 1793370 319288 -1068438 -2482120 -2792899
9780 -2792899 -2146113 -1925664 -2081165 -2095171 -2055289 -1710087 -1819513 -1864133 -2037945 -1695049
9770 -1695049 -1335366 -1499189 -1325357 -1212246 -1332880 -1951283 -1760105 -1314040 -1129703 -1508994
9760 -1508994 -1859408 -1795063 -2065540 -2384379 -2592161 -2494622 -2695540 -2111975 -1518686 -1144076
9750 -1144076 -900821 -603828 -802563 -1643599 -1479299 -533404 156866 155743 -609150 -1974856
9740 -1974856 -2715366 -2742472 -1927893 -922902 47033 545427 1555661 1966043 1366676
9731 1366676 567515 385590 -265459 -1284953 -1053249 -61043 277723 -126506 54777
9722 54777 287358 -338093 -1257024 -1961325 -2358016 -2704575 -2885912 -3189007 -2467341 -1776924
9712a776924P36459P32723N3697P89365j12494j013093m94894j32405l78999J2811
9702a583754J197917J523726Q07165q66096j228967K8609K81224Q0679k58742
9693a8239m48276m87347J08988J29982l71575J03605L6639j64318M21337L70308
9683c18896J17092L66498K5898k95403J24512j85602k27607R43389R68110p96950
9673G21041o95586L09835N94285L61473M46251j56810l29709k15786k71256N08120
9663A271858M33685r51291p68667r64966q62127J22041L47987O86431J193494
9654E08445P31752l98972j296233o24081O81419M01726j376944j491937O54146
9645b210679J378549O69772J94474M07106o08179l44070N03080k0558k54930q18398
$$ plain form
9712 -1776924 -1040465 -307742 -254045 535320 422826 -590267 -1085161 -1217566 -1596565 -1583754
9702 -1583754 -385837 1137889 1945054 1078958 -150009 -121400 159824 240503 -18239
9693 -18239 -466515 -953862 -844874 -714892 -1086467 -982862 -946223 -1110541 -689204 -318896
9683 -318896 -201804 164694 190592 -104811 19701 -165901 -393508 549881 1517991 721041
9673 721041 25455 335290 929575 1291048 1737299 1580489 1250780 1034994 763738 1271858
9663 1271858 1705543 754252 -14415 -979381 -1841508 -1719467 -1371480 -685049 508445
9654 508445 1240197 841225 -455008 -1079089 -397670 4056 -1372888 -2864825 -2210679
9645 -2210679 -832130 -162358 32116 439222 -168957 -513027 -9947 -30505 -285435 -1103833
9635a103833j139859J98100P61199N07948N0666J95813l85572p00425Q3334J96401
9625a336228M29467K60564L13865R51642M37132L83081P64035l97089r64855j354565
9615e12951j647449l70149K28529N94429J052331p0949j57621j18430k24181n87594
9605a814035j02045j27917k86980O70339J036607O36099M95085l44370L212J294019
9595A460014K85766j214123j227017m18622L4803J16376M809K69975O19892K62256
9585A94129k051k74943j21474k70016K94021L52180k18602K29118Q77480O03518
9575A663360j04215l13297M32685M68961J08923l08435j313538n44029L8152P6132
9565B04699M1437n15343j250668j244654l81110L08587k37050K91605Q25957J66106
$$ plain form
9635 -1103833 -2243692 -2045592 -1284393 -776445 -725779 -529966 -915538 -1615963 -1532629 -1336228
9625 -1336228 -906761 -646197 -332332 619310 1056442 1439523 2203558 1806469 841614 -512951
9615 -512951 -2160400 -2530549 -2302020 -1707591 -655260 -726209 -883830 -1002260 -1226441 -1814035
9605 -1814035 -1916080 -2043997 -2330977 -1660638 -624031 12068 507153 162783 165995 1460014
9595 1460014 1745780 531657 -695360 -1113982 -1079179 -962803 -957994 -688019 -68127 194129
9585 194129 192078 -82865 -204339 -474355 -180334 171846 -46756 182362 1059842 1663360
9575 1663360 1559145 1245848 1678533 2147494 2256417 1947982 634444 90415 128567 204699
9565 204699 246136 -269207 -1519875 -2764529 -3145639 -2837052 -3074102 -2782497 -1956540 -1790434
9555a790434J49659J05182k71801O38448J068896j01603r68879K68493J418100
9546E16061J264949L27043p20926j887777p33799k59498m55390j82426M1457k47753
9536b338059m20130q6797M24622J088883J243458O78724l48064l03448O53307
9527E92496J553324P56798O06695J206462J7086r66588j678041q35674M96668
9518A749226k9533N02241L19172l14385p57292k88400L74009K67857m44786n70534
9508H07575n90876o33393p09670K44966Q29219Q213L17223M8420J70673O51129
9498A143479K92423j72925n15464j095209p59896L5536m48788o11334L85179N15794
9488a231205J65195n79366m52759N80836J026898O92433M51017o65502q89859
$$ plain form
9555 -1790434 -1640775 -1535593 -1807394 -1168946 -100050 -201653 -1170532 -902039 516061
9546 516061 1781010 2108053 1387127 -500650 -1234449 -1493947 -1949337 -2131763 -2090306 -2338059
9536 -2338059 -2758189 -2844986 -2420364 -1331481 -88023 590701 242637 -60811 592496
9527 592496 2145820 2902618 3509313 4715775 4732861 3766273 2088232 1252558 1749226
9518 1749226 1719693 2221934 2541106 2226721 1469429 1181029 1555038 1822895 1378109 807575
9508 807575 216699 -416694 -1126364 -881398 -52179 -43966 273257 321677 492350 1143479
9498 1143479 1435902 1262977 747513 -347696 -1107592 -1072056 -1520844 -2132178 -1746999 -1231205
9488 -1231205 -1066010 -1645376 -2098135 -1517299 -490401 202032 653049 -12453 -902312
9479i02312J60816J70201N2435N27793R65777k73530m30383j327951j401807l678
9469b462639M88003N84641N59473Q40916J73659R8682m67742l84690J018085M47165
9459H95553o55049L46240Q24623K89132r54756j679650l18068P23424M08408N9272
9449f0871M17587J95720K76028O09576M14755k18234Q7344n08945p86911J37217
9439E63266l84691p60276k94166l61952L82385N25708j88178K32424J202631Q72691
9429A789842m22381m48912P4905M58348M35088J54971j54246k31838m78078n47541
9419F30158o75206o60889J74250n33252n2030K49708J04121P83506N81267L93790
9409I95423O4721p02897m64391L72241M93499K71638p59668j292505j94695M93993
$$ plain form
9479 -902312 -741496 -571295 -518860 8933 974710 701180 270797 -1057154 -2458961 -2462639
9469 -2462639 -1974636 -1389995 -830522 10394 184053 282735 -185007 -569697 448388 895553
9459 895553 240504 586744 1411367 1700499 745743 -933907 -1251975 -528551 -120143 -60871
9449 -60871 356716 552436 828464 1438040 1852795 1634561 1721905 1212960 426049 563266
9439 563266 178575 -581701 -875867 -1237819 -855434 -329726 -517904 -285480 917151 1789842
9429 1789842 1367461 918549 993454 1451802 1886890 2041861 1887615 1655777 1177699 630158
9419 630158 -45048 -705937 -531687 -1064939 -1116969 -867261 -763140 20366 601633 995423
9409 995423 1060144 357247 -107144 265097 758596 1030234 270566 -1021939 -1216634 -722641
9399g22641J062350J274836K45892M17387o11009j555465r18317l27916m94340
9390a629223j03445O20179P97194o80837n57150j10591j073673r74943M42109
9381c270380R32986J081003J456004L98197M59189N16929k09443k15874K31139
9372A379750n0643o93545q68633l08758L70097N81514L09476j79848p67664k94769
9362e23023q630K10830P97799P84568k98743q66008m93473l8938q9498K41703
9352b83413P94130M85499j83622m46577l79557P8413k13587L76236N52614n21202
9342B58934J35634m12106n45170J47663K69487l6378P7021j15740J08833J03404
9332h418M276l14918M15549P73709m82961n98497J7420J260431Q28006q59783
$$ plain form
9399 -722641 339709 1614545 1860437 2277824 1666815 111350 -806967 -1134883 -1629223
9390 -1629223 -1732668 -1112489 -315295 -996132 -1553282 -1663873 -2737546 -3712489 -3270380
9381 -3270380 -2337394 -1256391 199613 597810 1056999 1573928 1364485 1148611 1379750
9372 1379750 1329107 635562 -233071 -541829 -171732 409782 719258 539410 -228254 -523023
9362 -523023 -531653 -320823 476976 1261544 962801 96793 -396680 -435618 -525116 -283413
9352 -283413 510717 996216 812594 366017 -13540 64873 -148714 227522 780136 258934
9342 258934 394568 -17538 -562708 -415045 -145558 -181936 -104915 -220655 -111822 -8418
9332 -8418 -4142 -319060 96489 870198 387237 -211260 -193840 1066591 1894597 1034814
9322A034814r80942m71587j475247r44661J00575Q48080R71614N01516k88657
9313g04495l82786m65495j7168o820n46252J07927R08144Q34262m07859J81574
9303d98968O59564j258757j042129j78679k23531K61777K06504k79199J17213
9294b236205P81472J033711N08329K62928k50421m47589L79050m98720m40017
9285i07462N89480J378083O52111k17255k1415n48300p92464n2168O27933m8818
9275F59725O64475K62681m17923R6971l138k6239j11045l71240j30509j75165
9265D48593j46880k20129r55611K36161Q71884L81473J78061P92168L20949K29606
9255B136275l59791j215148m24654M97648K47474J54505J03171l36680j406011
$$ plain form
9322 1034814 53872 -417715 -1892962 -2837623 -2737048 -1888968 -917354 -415838 -704495
9313 -704495 -1087281 -1552776 -1569944 -1576764 -2123016 -2015089 -1106945 -272683 -680542 -498968
9303 -498968 160596 -1098161 -2140290 -2318969 -2542500 -2280723 -2074219 -2353418 -2236205
9294 -2236205 -1454733 -421022 87307 350235 99814 -347775 31275 -467445 -907462
9285 -907462 -317982 1060101 1712212 1494957 1473542 925242 132778 80610 708543 659725
9275 659725 1324200 1586881 1168958 1265929 1262791 1236552 1125507 754267 623758 448593
9265 448593 301713 81584 -874027 -637866 234018 615491 793552 1585720 1906669 2136275
9255 2136275 1776484 561336 136682 634330 881804 1036309 1139480 802800 -603211
9246f03211o50524N82737L55745j26843q69842m6906R90839K60522L06836N27216
9236G26569L30533P95131J023124L65944l7025j97457o15457o17813P2507l11854
9226A534202r75994m78535J37545K22238q07878j40558O73374J03793l54738K29640
9216A43089K67239j67576k35261M0593k94506o36697j053349j348103m77453J03813
9206c658211J544959J350068J457153R56527j388663j380953j42770m03434J49245
9197a516079J103902N39275k24273n68513m6355O24013K02861p36039m90611N61652
9187e50167L15735p5299N30290R59441J89177K64409M9764q26488o84447o57332
9177d84917J70324l0731l34890r8954N17968P87467L35157J78647j80247N13417
$$ plain form
9246 -603211 -1253735 -670998 -315253 -442096 -1311938 -1358844 -368005 -107483 199353 726569
9236 726569 1057102 1852233 2875357 3241301 3204276 3006819 2391362 1773549 1846056 1534202
9226 1534202 558208 79673 217218 439456 -368422 -508980 164394 268187 -86551 143089
9216 143089 410328 242752 7491 48084 -246422 -883119 -1936468 -3284571 -3762024 -3658211
9206 -3658211 -2113252 -763184 693969 1650496 261833 -1119120 -1261890 -1665324 -1516079
9197 -1516079 -412177 127098 -97175 -665688 -712043 -88030 114831 -621208 -1111819 -550167
9187 -550167 -234432 -309731 220559 1180000 1369177 1633586 1683350 856862 172415 -484917
9177 -484917 -314593 -345324 -680214 -779168 -261200 526267 861424 1040071 859824 1373241
9167A373241N84984Q1598J00360R6974K30435O04422J356330R09411J4476P62861
9157F115092J510904Q55184K2195K54941J169990K221294J514100n27367j028738
9148A2107595j891374j860952j558779j793881j776933r20252n71791j76820K10214
9139A767027O48319L90692N69962K50034m07420q52648l10698l64671j43010k14544
9129A333043n93114j08885k76430q6409j77389l25801J087214J165987m30473
9120A587743k93225J27022m11740l42206L06472J97167m225J14705J0609o44267
9110F48055q67361P95405J177375M93231m05421m03007P93303L37895j45478r13085
9100A510912p38572O8316r1626o48055j79079K28914Q1214r75188p41413J82272
$$ plain form
9167 1373241 1958225 2039823 2140183 2237157 2467592 3072014 4428344 5337755 5352231 6115092
9157 6115092 7625996 8481180 8503375 8758316 9928306 12149600 13663700 13136333 12107595
9148 12107595 10216221 8355269 6796490 5002609 3225676 2305424 1733633 1556813 1767027
9139 1767027 2415346 2806038 3376000 3626034 3218614 2365966 2055268 1690597 1547587 1333043
9129 1333043 739929 631044 354614 268205 90816 -234985 852229 2018216 1587743
9120 1587743 1294518 1421540 1009800 667594 974066 1171233 1167008 1281713 1292322 648055
9110 648055 -219306 576099 1753474 2246705 1841284 1438277 2231580 2569475 2423997 1510912
9100 1510912 772340 840656 749030 100975 -78104 150810 232024 -743164 -1484577 -1302305
9090a302305N95315J16016r79744m72190J49233L27406R70519J94843L4163P76720
9080D09976j22551l83202k9053P07509J105283R07494L03288K42035j26188j280272
9070A734319j692656j606814o63872L9750n4460N64572O60191p74782l90347M73332
9060a710767P7082k00552j40838k59647L78775M27524P98801M45696N8400p4077
9050a99603n26579P258O16647R78416L04974j767540n92996L39824J19352Q13824
9040I3577J42024k15173m24109q00421k9673J72842o79096p49677K4175M47755
9030b017776O60190R87919L19356n2808J77675N92042M98635o6230k62522J48105
9020I84586L48537k27518k50602j49928M26575J69850J79033k23496l15212m59127
$$ plain form
9090 -1302305 -706990 -590974 -1570718 -2042908 -1893675 -1566269 -595750 -400907 -366744 409976
9080 409976 287425 -95777 -124830 582679 1687962 2595456 2898744 3140779 3014591 1734319
9070 1734319 41663 -1565151 -2229023 -2189273 -2243733 -1679161 -1018970 -1793752 -2184099 -1710767
9060 -1710767 -1633685 -1834237 -1975075 -2234722 -1855947 -1428423 -629622 -183926 -125526 -199603
9050 -199603 -726182 -718924 -102277 876139 1181113 -586427 -1179423 -839599 -720247 93577
9040 93577 235601 20428 -403681 -1204102 -1233775 -1060933 -1740029 -2489706 -2465531 -2017776
9030 -2017776 -1357586 -369667 -50311 -103119 74556 666598 1165233 1099003 836481 984586
9020 984586 1333123 1105605 855003 705075 1131650 1301500 1480533 1257037 941825 482698
9010D82698k26417m76026q06351l84250j22342K35025O20743O39227K02298P07451
9000H72056J773899N88742p56518j023669j245654j124734M1515N79593N10676
8991B15906J91939n5533r94365n00175N88884K68161M52317R57207N0652Q9572
8981A264565r9036j22311l48957r96719p89621n79198J96046L02846l65692n90970
8971b129047M14639R10126J019432J01966n55953k62565M98850Q27835m62938
8962C62345q09891j44030p93417p1319P89486P23744p86077k13991M77890m12072
8952h77332o19705k93145R3105L00346o1558j036754o61870J00448O6868P66723
8942b222874Q97191J57366j70415Q05514J3969L57806O66511L85619k10643L28087
$$ plain form
9010 482698 256281 -219745 -1026096 -1410346 -1532688 -1297663 -676920 -37693 164605 872056
9000 872056 2645955 3234697 2478179 1454510 208856 -915878 -874363 -294770 215906
8991 215906 407845 352312 -642053 -1142228 -553344 -285183 167134 1124341 1174993 1264565
8981 1264565 1165529 1043218 694261 -302458 -1092079 -1671277 -1475231 -1172385 -1538077 -2129047
8971 -2129047 -1714408 -804282 215150 317116 -238837 -501402 -2552 825283 362345
8962 362345 -447546 -591576 -1384993 -1456312 -666826 56918 -729159 -943150 -465260 -877332
8952 -877332 -1497037 -1790182 -1697077 -1396731 -1458289 -2495043 -3156913 -3056465 -2989597 -2222874
8942 -2222874 -1325683 -1168317 -1338732 -533218 -519249 -161443 505068 890687 680044 1008131
8932A008131P31392J56024k25805J72275n7330N32328k86143n25202Q5046n08704
8922A082012m32993k90554m8970l04956q31886P30179J402176P3316n71059P6738
8912H84003p41043p17075J04229M02539L78681m99083M04927J683974J279497
8903C180649N00567l64337n23156q29684j343266o646N4513l0989j09669M75591
8893A003573J288837O24940P12535L90411j220241k166214j604847N32308J020912
8884E82214J88363k87106m42855n02566j48079N52014P15951O71561L22928O34295
8874B286720M05049K30381N10494L91112J77141j26791M6994J109184K866307
8865G896591K683791K042975J215628J01954q48962o67259q38632j054287j268596
$$ plain form
8932 1008131 1739523 1895547 1669742 1842017 1784687 2317015 2030872 1505670 1590716 1082012
8922 1082012 649019 358465 309495 4539 -827347 -97168 1305008 1378324 807265 884003
8912 884003 142960 -574115 -469886 -67347 311334 -187749 217178 1901152 3180649
8903 3180649 3681216 3316879 2793723 1964039 620773 614127 668640 637651 527982 1003573
8893 1003573 2292410 2917350 3629885 4020296 2800055 633841 -971006 -438698 582214
8884 582214 770577 483471 40616 -461950 -610029 -58015 657936 1329497 1652425 2286720
8874 2286720 2691769 2922150 3432644 3823756 4000897 3874106 3921100 5030284 7896591
8865 7896591 10580382 12623357 13838985 13940939 13091977 12424718 11586086 10531799 9263203
8856I263203j387893j760023j067018o35213n98218p6855n24358o43680J34300
8847B704245J37847K41115m2890J08425M69315j048571j973129m64795O56972
8838G88534L8521Q28767J114252o0223o85826q28707q26242P0334R8837l54105
8828A84142l11921l83338P67052Q87869o11472o96081O37544M96352p40462p05024
8818d75339j068331l33614Q13710R1191J71166K22095R1766o83774j286352j327991
8808c785473o46228Q64848J226173N77854Q84967J094116N56557M0390M41994
8799A255198L37505n64303r16774o75306O24245j89843p19904p46795k3872O43700
8789i76149N78909m01463p70091M22413N36387n10747j468124n85768J417863
$$ plain form
8856 9263203 7875310 6115287 5048269 4413056 3814838 3737983 3213625 2569945 2704245
8847 2704245 2842092 3083207 3040317 3148742 3618057 2569486 596357 131562 788534
8838 788534 827055 1655822 2770074 2709851 2024025 1195318 369076 439410 538247 184142
8828 184142 -127779 -511117 255935 1143804 532332 -163749 473795 970147 229685 -475339
8818 -475339 -1543670 -1877284 -1063574 -972383 -801217 -579122 -487356 -1171130 -2457482 -3785473
8808 -3785473 -4431701 -3566853 -2340680 -1762826 -877859 216257 772814 813204 1255198
8799 1255198 1592703 1028400 111626 -563680 60565 -129278 -849182 -1595977 -1619849 -976149
8789 -976149 -397240 -798703 -1568794 -1146381 -609994 -1120741 -2588865 -3174633 -1756770
8780a756770J114226m85927N8098M46624n6480J129441R67769L40381o89729l68159
8770F99474M84235J19074K45228N13651n729j034137j208133n92486l42794m8938
8760a170555M32027M50991q7338q48584j074546j225537l08394M11471J436640
8751a983825J964776J70945r88996o9369j53761l79442l57119m04709O1489O50937
8741a489074J21139n70491j77590R99043R38406K72207L91920J79510l15908o10923
8731b61761q3775N85724O1679k54339l50231l70276M36043O73531n97378j288394
8721a449177n55767o85522k44550P59532N06820n10095M6197J071531J591694
8712E30663J018633m39955j016544k81126K43288q2308J00645o05708l76235L57098
$$ plain form
8780 -1756770 -642544 -1128471 -1070373 -623749 -680229 449212 1416981 1757362 1067633 699474
8770 699474 1183709 1302783 1548011 2061662 2055933 1021796 -186337 -778823 -1121617 -1170555
8760 -1170555 -738528 -287537 -374875 -1223459 -2298005 -3523542 -3831936 -3420465 -1983825
8751 -1983825 -19049 151896 -837100 -906469 -1060230 -1439672 -1796791 -2201500 -2140011 -1489074
8741 -1489074 -1367935 -1938426 -2116016 -1116973 -178567 93640 485560 665070 349162 -261761
8731 -261761 -345536 240188 301867 47528 -302703 -672979 -236936 436595 -160783 -1449177
8721 -1449177 -2004944 -2690466 -2935016 -2175484 -1668664 -2178759 -2132562 -1061031 530663
8712 530663 1549296 1109341 92797 -188329 54959 -27349 73296 -532412 -908647 -551549
8702e51549R75286N02913k77366o42286j081824l09120k03523o40323m86044m05818
8692c119654P5759M77598k90105Q1855N40049K03150O24644J015146P99866k40680
8682A67628J37653M25866o01313j288918j302500M58756L15042p47602q0202M76228
8672b039362R18409J053426K16275n27213m73072N76944L72040l44017K8956K32545
8662A4931J038694N53503J12983K09603J140881K74665n1751j71663J14722K04373
8652C440941j77440j096670j691714j590326o25214N55232J25941M84252O39031
8643F4033l41905n29216K62667M05784j09157l13016J279260m08775j169211P3830
8633g85706L67715J19928l15498j168192m52588Q41731K8821n30808N49077L01882
$$ plain form
8702 -551549 423737 926650 649284 6998 -1074826 -1383946 -1587469 -2227792 -2713836 -3119654
8692 -3119654 -3043895 -2566297 -2856402 -2774547 -2234498 -2031348 -1406704 -391558 408308 167628
8682 167628 305281 731147 129834 -1159084 -2461584 -2002828 -1687786 -2435388 -2515590 -2039362
8672 -2039362 -1120953 -67527 148748 -378465 -851537 -274593 97447 -246570 -217614 14931
8662 14931 1053625 1607128 1720111 1929714 3070595 3345260 3293509 3121846 3236568 3440941
8652 3440941 3263501 2166831 475117 -1115209 -1740423 -1185191 -1059250 -574998 64033
8643 64033 -277872 -807088 -544421 -138637 -247794 -560810 718450 309675 -859536 -785706
8633 -785706 -417991 -298063 -613561 -1781753 -2234341 -1392610 -1363789 -1894597 -1345520 -1043638
8623a043638l80382o77695l52638k84264N0883N97436L04257J239914O87511J04001
8613B45385K56490L56028n1170j19030l87763p20530k95920q50220m39909M70576
8603a536063O9170m30111j20205M69897p5235N35559K74257k34673k19409j64700
8593a431513K51900J013103N02538n70826l80535k70419k22281M58445M80611
8584a68977O91679O32877k86459k58803k36658Q2101j664q26954n90511O9311
8574h94058m2633M2659N85725J64065L74968j59783m94948K41085m01393m38292
8564a022605K21883K44114M75604K43327L31943m37244o11174O41447Q79842J57614
8554A124751J17040K27031j60547L36307K5838r62956j143552j677250o52818
$$ plain form
8623 -1043638 -1424020 -2101715 -2454353 -2738617 -2687734 -2090298 -1786041 -546127 141384 245385
8613 245385 501875 857903 806733 687703 299940 -420590 -716510 -1566730 -2006639 -1536063
8603 -1536063 -1466893 -1897004 -2017209 -1547312 -1622547 -1086988 -812731 -1047404 -1266813 -1431513
8593 -1431513 -1179613 -166510 336028 -234798 -615333 -885752 -1108033 -649588 -168977
8584 -168977 522702 1155579 869120 610317 373659 455760 454096 -372858 -963369 -894058
8574 -894058 -936691 -894032 -308307 -144242 230726 70943 -424005 -182920 -584313 -1022605
8564 -1022605 -800722 -556608 -81004 162323 494266 57022 -554152 87295 967137 1124751
8554 1124751 1241791 1468822 1308275 1644582 1670420 707464 -436088 -2113338 -2766156
8545b766156R97823J257466J49721k50552j10793r45004p25809N81027Q99335
8536i12942K80749P23705M43116m38416o85193j42783j33520m66647k89013J050537
8526e70407Q97268k37658m42446N15521k9742m53391l12039Q708P34729j62349
8516e1806J88143Q01396J76649j08572p56074k97283K99627M76461R88996Q51614
8506B569151N61488m66020j719621k020004o72276n33630R79368Q39457k10257
8497f72344O8682Q62248J324327O45519m96900j24365k84115j273622n48266N24985
8487B6149N1189r71415p52722j454K27728j78103J01722M5685m32038p12790l12202
8476b908251N45715n2556j29402L85824L79624L33403m2435k05579k05953k40733
$$ plain form
8545 -2766156 -1768333 -510867 -361146 -611698 -722491 -1667495 -2393304 -1812277 -912942
8536 -912942 -632193 91512 534628 96212 -588981 -731764 -865284 -1331931 -1620944 -570407
8526 -570407 326861 89203 -353243 162278 132536 -320855 -632894 -624186 110543 -51806
8516 -51806 136337 937733 1114382 1005810 249736 -47547 252080 728541 1717537 2569151
8506 2569151 3130639 2664619 944998 -1075006 -1747282 -2280912 -1301544 -462087 -672344
8497 -672344 -603662 258586 1582913 2228432 1731532 1607167 1323052 49430 -498836 26149
8487 26149 77338 -894077 -1646799 -1648253 -1420525 -1598628 -1496906 -1451221 -1883259 -2596049 -2908251
8476 -2908251 -2362536 -2415092 -2544494 -2158670 -1779046 -1445643 -1488078 -1693657 -1899610 -2140343
8466b140343k02530J50166J072294J203531L44330P4593j267682j322063K27612
8457a860092J027834J404025J010564n3712r08803j003863M1332J78035m17216
8448e81896q38828m511P70632J76820j034756P18849J456943O50865j00772n54031
8438F59315j82076n84662p27160M9696k08664m25556j24410K44087N64732K80389
8428d54309M90757K60812m94392j93438J60838N45603m6121j60970j74368j85936
8418b51524K21266K62005j16950M96972L81061q22881m25045L6722Q6303q02911
8408i34982n34836O83311P81950L0749j66268J20644l83162m48264m60662l13578
8398a625098m73352r1552L01674N39783M03185L90241P29054O04270L17435J047188
$$ plain form
8466 -2140343 -2342873 -2192707 -1120413 83118 427448 502041 -765641 -2087704 -1860092
8457 -1860092 -832258 571767 1582331 1528619 619816 -384047 -342715 -164680 -581896
8448 -581896 -1420724 -1425235 -654603 -477783 -1512539 -793690 663253 1314118 1213346 659315
8438 659315 477239 -107423 -834583 -784887 -993551 -1419107 -1543517 -1299430 -734698 -454309
8428 -454309 36448 297260 -197132 -390570 -229732 315871 269750 108780 -65588 -251524
8418 -251524 -30258 231747 114797 611769 992830 169949 -255096 -218374 -132071 -934982
8408 -934982 -1469818 -786507 -4557 26192 -140076 -19432 -402594 -850858 -1311520 -1625098
8398 -1625098 -2098450 -2190002 -1888328 -1348545 -945360 -555119 173935 778205 1095640 2142828
8388B142828j19011j162858l46657o89149m72808N14221K21353n03878n55131
8379i71090L60240Q25074M37959o23021j37879R71095J153726L32856p19098m72227
8369A157635l33438m37575l966L96318j20820n23905J04295J24197k697L907R7243
8358D61194n33913n99929q52014k62464O86293R71663k95762k99974J253154J97919
8348G26167j032576L48695Q84200J093003N71825p4444k6996m52465j913000j833957
8338a709548r18355p5267J443496J00418L0707P22814M34561k15567L3352L83825
8328B30436o9588o69123k16471p43786m04341K35122k43838L82616N87061P47091
8318a64821Q56621J27906k62824l47879m99433Q8111J01766k93855M96755Q42711
$$ plain form
8388 2142828 2023817 860959 514302 -174847 -647655 -133434 87919 -415959 -971090
8379 -971090 -610850 214224 652183 29162 -108717 862378 2016104 2348960 1629862 1157635
8369 1157635 824197 386622 382656 778974 658154 134249 238544 362741 360044 363951 461194
8358 461194 -72719 -672648 -1524662 -1787126 -1100833 -129170 -424932 -724906 528248 726167
8348 726167 -306409 42286 926486 2019489 2591314 2516870 2489874 2037409 124409 -1709548
8338 -1709548 -2627903 -2703170 -1259674 -1159256 -1128549 -405735 28826 -186741 -153389 230436
8328 230436 160848 -508275 -724746 -1468532 -1872873 -1637751 -1881589 -1498973 -911912 -164821
8318 -164821 691800 819706 556882 209003 -290430 -202319 -100553 -394408 102347 945058
8308I45058l06504k78182m42166k64556K91327o3099J47394l12911L43465J290803
8298A350629k50058j098790r9079R90043N71261l44917L57134k07783j217468
8289E0972l14174N46510j87258M9804J078594Q34959l10125o58914j164905m8122
8279a22659J391113K25585l11070L27635J17376k04491k11505p58749J70096J427981
8269B051312J03338q82538j287414n02994Q17822Q22367k41789o37284n44821
8260c02001K6160P62113R35986k56299l28221m09626p95657j022224m40719M43435
8250a387053J99672K63215J269914O34673j16580p11907n74022j60509L61802
8241b20795J298923R54755p15403o04385J4721L25361r1226l23216M68037J155620
$$ plain form
8308 945058 638554 360372 -81794 -346350 -55023 -118122 29272 -283639 59826 1350629
8298 1350629 1100571 1781 -97298 892745 1464006 1119089 1476223 1268440 50972
8289 50972 -263202 283308 96050 145854 1224448 2059407 1749282 1090368 -74537 -122659
8279 -122659 1268454 1494039 1182969 1510604 1627980 1423489 1211984 453235 623331 2051312
8269 2051312 2154650 1272112 -15302 -518296 299526 1121893 880104 242820 -302001
8260 -302001 -275841 486272 1422258 1165959 837738 428112 -367545 -1389769 -1830488 -1387053
8250 -1387053 -1187381 -924166 345748 980421 863841 151934 -422088 -582597 -220795
8241 -220795 1078128 2032883 1317480 713095 727816 1053177 961951 638735 1106772 2262392
8231B262392j75033p53520q55468q25766J79267J89737j11476L33658M4198M66434
8221G54423J023234O98903O85370N05212k27759m40436j246441q61877N66448
8212A457077o63415m90144j33157K40907N29959n74678n29673K01177O24976L05233
8202I68262L6233j54324n30861N51181J441629O22611m55774l44965j21109k52221
8192A760662J22946O21345N95584r74857j005212k52241M02420M59523O6532l30174
8182A466528o36096L46185R64888R64470J087207R85273k41330L78819j842q14324
8172D499778n60467m80798j013137j254125j63419P49993P22412l30601n18073
8163A651563j83041K67626N6891N9710m41279n76480Q94648M36586l13538j060690
$$ plain form
8231 2262392 2087359 1333839 478371 -347395 -168128 21609 -89867 243791 287989 754423
8221 754423 1777657 2476560 3161930 3667142 3439383 2998947 1752506 890629 1457077
8212 1457077 793662 303518 170361 411268 941227 366549 -163124 38053 663029 968262
8202 968262 1004495 850171 319310 870491 2312120 2934731 2478957 2133992 2012883 1760662
8192 1760662 1883608 2504953 3100537 2125680 1120468 868227 1270647 1730170 1796702 1466528
8182 1466528 830432 1176617 2141505 3105975 4193182 5178455 4937125 5315944 5314102 4499778
8172 4499778 3939311 3458513 2445376 1191251 1027832 1777825 2500237 2169636 1651563
8163 1651563 1468522 1736148 1793039 1852749 1411470 834990 1729638 2166224 1852686 791996
8153G91996j416139K24889J385314N96922k93077l89839O63809Q13373K62083
8144B639331L26578N9361m48843o70648m85020m82918N22837Q97489j7556o32921
8134A707690n52095k94121j117989j35092J154852K34000n9233l15888M34503
8125A056627R55297L11497q00098o93389J71650K77538j55064K83739J24221m39625
8115A092393j424583p89891N16437J56182K16279M34537J123084N22186M23875
8106B270499Q5546l23123m59947O7175K5357J1901q25825r84748N45017J600751
8096B012603J314356K29384R4653k21913r76799l31191m34507l84000P02606R80165
8086B985357m51676j06752P18658J17392j45674L16367N70244L42513m4729n99481
$$ plain form
8153 791996 -624143 -399254 986060 1582982 1289905 900066 1563875 2377248 2639331
8144 2639331 2965909 3025270 2576427 1905779 1420759 937841 1460678 2358167 2340611 1707690
8134 1707690 1155595 861474 -256515 -391607 763245 997245 938012 622124 1056627
8125 1056627 2011924 2323421 1523323 829934 1001584 1279122 1124058 1407797 1532018 1092393
8115 1092393 -332190 -1122081 -605644 -449462 -233183 201354 1324438 1846624 2270499
8106 2270499 2356045 2032922 1572975 1640150 1665507 1677408 851583 -133165 411852 2012603
8096 2012603 3326959 3556343 3650996 3429083 2452284 2121093 1686586 1302586 2005192 2985357
8086 2985357 2533681 2426929 3145587 3262979 3117305 3433672 4003916 4346429 4301700 3702219
8076C702219j146220l75014K06174J023259P29573k28443n83630N52617R45983
8067D826518j382462j086534l53844k70730m2233K13667L53388J59951J97953
8058B615674j82129j33721o02312j50181P99353K40205L97300l29538r66492r60100
8048G28059m88012J8747Q58072P15721O86918J99363P57839J281611N80966j11557
8038E227727j460414p69621P74241K48869l51069N12803K30770p26724n99663
8029C086919n46877j65644R46466J097744L63057q99367j80044j76240o70891
8020B855123k85633L45634K47551L74965J240365N20852j88491K57603P51504
8011F119473M98016L82176L67513N35172L60763J033920K94378j57617K191092
$$ plain form
8076 3702219 2555999 2180985 2387159 3410418 4139991 3911548 3327918 3880535 4826518
8067 4826518 3444056 2357522 2003678 1732948 1690715 1904382 2257770 2417721 2615674
8058 2615674 2433545 2299824 1697512 1547331 2346684 2586889 2984189 2654651 1688159 728059
8048 728059 240047 258794 1116866 1832587 2519505 2718868 3476707 4758318 5339284 5227727
8038 5227727 3767313 2997692 3771933 4020802 3669733 4182536 4413306 3686582 3086919
8029 3086919 2540042 2374398 3320864 4418608 4781665 3882298 3702254 3526014 2855123
8020 2855123 2569490 2915124 3162675 3537640 4778005 5298857 5110366 5367969 6119473
8011 6119473 6617489 6999665 7367178 7902350 8263113 9297033 9591411 9433794 11624886
8002A1624886K882725K077964K464759M274497O575249P563995P647260Q067274
7994E3178609P904102M943762M77303k573342m801019n916800o610721o150536
7986D0451358n029248m700502m171646l200518k616743j559512l41836l08992
7978A8522361o45814o57352j061157j223906j174113n13837n02842j002223J25210
7969A1866327J363398R05513J5248m68032j131967j136784Q542J55069L98597
7960A1975911M41563J050988J537746Q55346N70928J092767J783417R00171K40455
7951B0449292J087335K501459K642715L229602M342481M444920M792835P204818
7943E0695457J0590058J3464081J7068169K0848101K2606946K2297697J8693087
$$ plain form
8002 11624886 14507611 16585575 19050334 23324831 29900080 37464075 45111335 53178609
7994 53178609 61082711 66026473 66503776 63930434 59129415 53212615 46601894 40451358
7986 40451358 35422110 30721608 26549962 23349444 20732701 19173189 18831353 18522361
7978 18522361 17876547 17219195 16158038 14934132 13760019 13246182 12743340 11741117 11866327
7969 11866327 13229725 14135238 14150486 13682454 12550487 11413703 11422245 11577314 11975911
7960 11975911 12417474 13468462 15006208 15861554 16432482 17525249 19308666 20208837 20449292
7951 20449292 21536627 24038086 26680801 29910403 34252884 38697804 43490639 50695457
7943 50695457 61285515 74749596 91817765 112665866 135272812 157570509 176263596
7936A76263596J2158397M186378n420594j3412247j8319524j9438616j9079728
7929A16937662j7127800j5236552j2924026j0340845p660137n552136m064897
7922D4031269l212852k844768l054870k245658j063752r64837O3047N40731L43717
7913C1592027p16458j779738j401016j034005l35566q60827l01101Q1907j226264
7904B4018959j160967J51248R61591J100221P81793J004322R70265J045461J659871
7895C0532764K334109L476129M515431N806789O890891P652729J0569992J4511068
7887H6289902J8184651K2435755K7508221L3827736M0140211M4016782M2573662
7880C14976920L5973070K4333401P072108j1500119k7069447l7525817m0329879
$$ plain form
7936 176263596 188421993 192608371 187187777 173775530 155456006 136017390 116937662
7929 116937662 99809862 84573310 71649284 61308439 53648302 48096166 44031269
7922 44031269 40818417 37973649 34918779 32673121 31609369 30644532 30707579 31248310 31592027
7913 31592027 30875569 29095831 27694815 26660810 26325244 25464417 25163316 25245223 24018959
7904 24018959 22857992 23009240 23970831 25071052 25852845 26857167 27827432 28872893 30532764
7895 30532764 32866873 36343002 40858433 46665222 53556113 61208842 71778834 86289902
7887 86289902 104474553 126910308 154418529 188246265 228386476 272403258 314976920
7880 314976920 350949990 375283391 382355499 370855380 343785933 306260116 265930237
7873B65930237l9932175l7140379l0901837k4366388j9067686j5131394j1910096
7866H7480282r309014p727452o276614m965165k590840k960374k877236j320617
7858D9452970o60395j193374j928550k866799k796910j577641j666700k192813
7850C4569788j764801j189177m51646o90732j25214P87759Q70674M65417J064036
7841C3536104J708055K146810K994022L385082M126637M541462O491653R118583
7833F8048408J0667136J2102063J5197832J9653392K5286334L1865409L9017565
7826B21838139M6897405N2445254N1293151M2790715K7816928P480208j4445650
7819D36116150l3283894m4548788m8899299m8198310m3272277l5938131k9197365
$$ plain form
7873 265930237 225998062 188857683 157955846 133589458 114521772 99390378 87480282
7866 87480282 78171268 70443816 64167202 59202037 56611197 53650823 50773587 49452970
7858 49452970 48792575 47599201 45670651 42803852 40006942 38429301 36762601 34569788
7850 34569788 32804987 31615810 31164164 30473432 30348218 31135977 32006651 32472068 33536104
7841 33536104 35244159 37390969 40384991 43770073 47896710 52438172 58929825 68048408
7833 68048408 78715544 90817607 106015439 125668831 150955165 182820574 221838139
7826 221838139 268735544 321180798 372473949 415264664 443081592 450561800 436116150
7819 436116150 402832256 358283468 309384169 261185859 217913582 181975451 152778086
7812A52778086k2305336j7786048j4796216j2059412r887861q197030o539789
7805F1206394m463743l907559l498914k747429j039182n26545j675826k356021
7797D0991175k772174k270027j738174r73117j667469j764222l26121j29108n10230
7788B8840533n06094J087202J550520O02063J995545K382134J746779J643247
7780C9341929L454635M755453O037826O894682P452435J0234466J3915366J8378321
7772A10465113K1957643K6270742L3540350L9523681M2339734M2307637L6408102
7765C52813002K4167433O198820j3566710k9169071l9100407m2691468m0708404
7758B17943195l5614424l0108880k4059307j8830287j5529288j3492270j1209768
$$ plain form
7812 152778086 130472750 112686702 97890486 85831074 75943213 67746183 61206394
7805 61206394 56742651 52835092 49336178 46588749 45549567 45023022 43347196 40991175
7797 40991175 38219001 35948974 34210800 33237683 31570214 29805992 29479871 29350763 28840533
7788 28840533 28334439 29421641 30972161 31574224 33569769 35951903 37698682 39341929
7780 39341929 42796564 47552017 53589843 60484525 67936960 78171426 92086792 110465113
7772 110465113 132422756 158693498 192233848 231757529 274097263 316404900 352813002
7765 352813002 376980435 383179255 369612545 340443474 301343067 258651599 217943195
7758 217943195 182328771 152219891 128160584 109330297 93801009 80308739 69098971
7751F9098971q583135o469243n278243m596778l322003k555026j542061j635391
7743C5117091j861457j728703k256840k158049j466198j245836j299837j520530
7735B1579641p21214K46665n80348p10339R2365L55861J25265J26164M11866Q31640
7725B1757566J158064R80670K248002K626747K160353K507758L730789N370635
7717D2540584P538028Q759426J0607685J3497075J6880155J9112260K0427426
7710A39362639K0836764J8286348J0826678J964579o642065j4332257j9973305
7703A50329381k1646992k0060665j7415339j4903269j2227285r236847p552254
7696D7286730o886677n262501m677516l822576k992268k326538j567324j337553
$$ plain form
7751 69098971 60515836 54046593 48768350 44171572 40849569 38294543 36752482 35117091
7743 35117091 33255634 31526931 29270091 27112042 25645844 24400008 23100171 21579641
7735 21579641 20858427 21105092 20524744 19814405 19906770 20262631 20387896 20514060 20925926 21757566
7725 21757566 22915630 23896300 26144302 28771049 30931402 33439160 37169949 42540584
7717 42540584 50078612 58838038 69445723 82942798 99822953 118935213 139362639
7710 139362639 160199403 178485751 189312429 191277008 184634943 170302686 150329381
7703 150329381 128682389 108621724 91206385 76303116 64075831 54838984 47286730
7696 47286730 40400053 35137552 30460036 26637460 23645192 21318654 19751330 18413777
7688A8413777j441346p34292j84208j118621j460712j150721m87415m64719k44608
7679A1127135m13093K74173j16241q92994j36586K61016O7524j82939P9503k894
7669A0064604J60280M23068J75023q47259j150595J049563K502231J693251R88300
7660A5058466J723673L017384L583501M723854O222984O262385O763700O099571
7652E3455518M663211L579701Q04255j999458l939263o014208o476339o112113
7644C7961304o250402n901210m777249l448997j830582n18603j358479k883921
7636A0991861k926176j742031j097840j878757j578993n63544P55370J196635
7628C156525N87882m04561n81848m15645N53291q7775n02754j67938L68671J79624
$$ plain form
7688 18413777 16972431 16238139 16053931 14935310 13474598 12323877 11836462 11371743 11127135
7679 11127135 10714042 10988215 10871974 9978980 9842394 10103410 10170934 9987995 10067498 10064604
7669 10064604 10224884 10647952 10822975 9975716 8825121 9874684 12376915 14070166 15058466
7660 15058466 16782139 19799523 23383024 28106878 34329862 40592247 47355947 53455518
7652 53455518 58118729 61698430 62502685 60503227 56563964 50549756 44073417 37961304
7644 37961304 31710902 25809692 21032443 17583446 15752864 15234261 13875782 10991861
7636 10991861 8065685 6323654 5225814 3347057 1768064 1204520 1959890 3156525
7628 3156525 3744407 3339846 2757998 2342353 2895644 2807869 2305115 2137177 2505848 2685472
7618B685472p22918j5550Q60189O59758p28769o80501j59807M33847L88937m9483
7608B671175l34335o49022r26329l89018O61793N66895Q98626R96566o45790j767157
7598A083404n37569J55967R48339J47751o23009m26720m32500P24601J391877
7589B432141O61743k16369q85787o97622O86944R02253n81094j219024M19653
7580A502838N52336l14203j227316r69918k09304N57402O74439J057789Q14358
7571B438421M6709Q93558Q44283l67675j32871L54986j270069j875389l95674
7562E36279Q24990J74775j60392L29901J59570L29273m41140j174937l40880J9453
7552B56892k99549j54553j51652O35523O12599J124838J506266M92091k06954
$$ plain form
7618 2685472 1962554 1947004 2807193 3466951 2738182 2057681 1897874 2331721 2720658 2671175
7608 2671175 2336840 1687818 761489 372471 1034264 1601159 2499785 3496351 2850561 1083404
7598 1083404 545835 701802 1650141 1797892 1174883 748163 315663 1040264 2432141
7589 2432141 3093884 2877515 1991728 1294106 1981050 2883303 2302209 1083185 1502838
7580 1502838 2055174 1740971 513655 -456263 -665567 -108165 566274 1624063 2438421
7571 2438421 2485130 3378688 4222971 3855296 3722425 4077411 2807342 931953 536279
7562 536279 1361269 1536044 1375652 1705553 1865123 2194396 1753256 578319 237439 256892
7552 256892 -42657 -197210 -348862 286661 899260 2024098 3530364 4022455 3815501
7543C815501j026976j074935l89383l00521P0162J70386o963M94836L22550r51247
7533A123410o57079M80402J584128L09158j254259j172287m42231j01666l4886
7524a65310j06400J65868J80464N77728L74681j093488j652859j301167J193417
7515a827066J278883N72347R51706L78310p10273K0041J677187R02651J52732
7506C396518K73505m32040p66504p29488j117370o09521J58300j098485l99391
7497a324476J121802J350772P81843l86529n03453l25540K01467J753296J259272
7488C928454o25060j123348o03086m16659r60631j090527o9223J92181M58184
7479c09715J069336J679562J248450k29517j135504o04683M15091J08412j127030
$$ plain form
7543 3815501 2788525 1713590 1324207 1023686 1093848 1264234 1257271 1752107 2074657 1123410
7533 1123410 466331 946733 2530861 2840019 1585760 413473 -28758 -130424 -165310
7524 -165310 -271710 -105842 74622 652350 1027031 -66457 -1719316 -3020483 -1827066
7515 -1827066 -548183 24164 975870 1354180 643907 663948 2341135 3243786 3396518
7506 3396518 3670023 3237983 2471479 1741991 624621 15100 173400 -925085 -1324476
7497 -1324476 -202674 1148098 1929941 1543412 1039959 714419 915886 2669182 3928454
7488 3928454 3303394 2180046 1576960 1160301 199670 -890857 -960080 -767899 -309715
7479 -309715 759621 2439183 3687633 3458116 2322612 1717929 2133020 2241432 1114402
7470A114402j388926j021898j58175N49921O66134M37329J07974m83068j27663
7461c03970J330342J223751m75313j031325k28860l12310p59024m62883N03427
7452e16165M0737K66200o7378k05424L51628K54471J23019m62353m04335N33p84096
7441a403163j757189m57890P66452J069931O92927M60368J002818M26830q2956
7432G18128j77344N6730P5274j70757j38694r59191m70180R02570J059511J85086
7422A081133o24814l79716N47014N38589j179620o65418M5559M9872j70993j12652
7412h71046M69099O4737m66799o58378L14749O48766K27952J097464O74821l06987
7402A194378p5533N20844J71338L51452l1578l43129l50208j527437p24832R58354
$$ plain form
7470 1114402 -274524 -1296422 -1454597 -904676 -238542 198787 306761 -176307 -303970
7461 -303970 1026372 2250123 1774810 743485 514625 202315 -556709 -1019592 -516165
7452 -516165 -475428 -209228 -276606 -482030 -130402 124069 247088 -215265 -619600 -619067 -1403163
7441 -1403163 -3160352 -3618242 -2851790 -1781859 -1088932 -628564 374254 801084 718128
7432 718128 540784 597514 672788 502031 363337 -595854 -1066034 -163464 896047 1081133
7422 1081133 456319 76603 623617 1162206 -17414 -682832 -637273 -587401 -758394 -871046
7412 -871046 -401947 -337210 -804009 -1462387 -1147638 -498872 -270920 826544 1501365 1194378
7402 1194378 1118845 1639689 1811027 2162479 2130901 1787772 1437564 -89873 -814705 143649
7392A43649N61304l94357J93387L10472j63785K07397n4728j164439r04785k29140
7382a495025J14200O36404m91770k5014M16719j039502l17168J303595J977092
7373A079531Q59981l64299N63252N43636r7605L1062n3473j077595p37068K79752
7363A027174M32555r42865j328241K03265Q78200M94376m09987m70910K5389J30080
7353C9036N88961J905938P35103q09218j048070Q95590M69432n59064p00100o99395
7343H18213k16412n82265K17593J133929K87733j049241r32086J281l24430m05595
7333a051280j83330N63221O66846K39974r0253k89094M26910O45170O71835J221860
7323B821859l3371j080044n47406J11326j04205k57194j46369L67573Q66652M08029
$$ plain form
7392 143649 704953 310596 503983 814455 650670 858067 803339 -361100 -1265885 -1495025
7382 -1495025 -1380825 -744421 -1236191 -1261205 -844486 -1883988 -2201156 -897561 1079531
7373 1079531 1939512 1575213 2138465 2682101 2584496 2615558 2562085 1484490 747422 1027174
7363 1027174 1459729 516864 -811377 -608112 270088 764464 354477 -116433 -91044 39036
7353 39036 627997 2533935 3269038 2459820 1411750 2307340 2776772 2217708 1517608 818213
7343 818213 601801 19536 237129 1371058 1658791 609550 -322536 -321255 -645685 -1051280
7333 -1051280 -1234610 -671389 -4543 235431 145178 -143916 282994 928164 1599999 2821859
7323 2821859 2788488 1708444 1161038 1272364 1168159 910965 764596 1132169 1998821 2406850
7313B406850j72869p40578j006672J7146P35530J930715K177313N90347J74820
7304F112602N98961J710972K019642K455069J958340J908843J512475M80584O00090
7295A9357578J158376R15057l57643j563770j412120j547835m65722k48054k396204
7286A3439663k646487j337037q70737j008937j127006p75395m47309m9435j88168
7277D989152l53053r898k13066j697189o81366J178374P65785j12627q10115q15535
7267B240462k62480r1110k83455n56153j219951O5015M27805K42850M56510M05996
7257A425489J31143r07848r05839M22382J110949L44438p8305J23811N3497k96532
7247A423185m32124m04910r85143j34034Q56061J27831l51570q70517n69525L60634
$$ plain form
7313 2406850 2233981 1493403 486731 503877 1239407 3170122 5347435 5937782 6112602
7304 6112602 6711563 8422535 10442177 12897246 14855586 16764429 18276904 18757488 19357578
7295 19357578 20515954 21431011 21073368 19509598 18097478 16549643 16083921 15835867 13439663
7286 13439663 10793176 9456139 8585402 7576465 6449459 5674064 5226755 5177320 4989152
7277 4989152 4636099 4626201 4413135 2715946 2034580 3212954 3978739 3866112 3055997 2240462
7267 2240462 1977982 1886872 1603417 1047264 -172687 -107672 320133 562983 1019493 1425489
7257 1425489 1556632 648784 -257055 165327 1276276 1620714 1542409 1666220 1719717 1423185
7247 1423185 991061 586151 -398992 -533026 323035 450866 99296 -771221 -1340746 -980112
7237i80112N04247J81357n85208M22679Q64342O14788K72884j41306O17636K86410
7227B057717k98725q64529j46667Q22997L8156q04410o38869o177K68418o6930
7217C60981L08428l27033n92850j77590j31698L61484Q00070R47423m4213K39624
7207A744626L18181l41870n18222l15079m28215j517390j122933l53141L13964
7198b220079P69927R36985P52056m36236n96735O37205J152699N67749l44431
7189A219140M8140Q84405m23768j911454j204251K86535M82734j10571J45604
7180e83486l1882j21065k90869j85974n6409O5669J90900n20269n77658P19611
7170a391432N12148L47354L57593P45470O03117L86729j97963n49907j051011
$$ plain form
7237 -980112 -475865 -294508 -879716 -457037 407305 1022093 1294977 1153671 1771307 2057717
7227 2057717 1758992 894463 747796 1570793 1608949 804539 165670 159493 427911 360981
7217 360981 669409 342376 -250474 -428064 -559762 -198278 601792 1549215 1505002 1744626
7207 1744626 2062807 1720937 1202715 887636 459421 -1057969 -2180902 -2534043 -2220079
7198 -2220079 -1450152 -513167 238889 -197347 -794082 -156877 995822 1563571 1219140
7189 1219140 1267280 2151685 1727917 -183537 -1387788 -1101253 -618519 -729090 -583486
7180 -583486 -615368 -736433 -1027302 -1213276 -1269685 -1204016 -1013116 -1533385 -2111043 -1391432
7170 -1391432 -879284 -531930 -174337 571133 1174250 1560979 1363016 813109 -237902
7161b37902l500R64060j05388p86227m15854N75759k4866L7942J51004L57707
7151E12735k5873K17724K54457l52569j246917j687686j411672l167K73448M8310
7141c421210J283911J351730j42021j82489l80035o93248n21166J9239K93319
7132b391970J077021R71049m22716j75214L17859n59621o55210M00801L95020
7123a042981P2850J00334j85128J15225k12112n76628q64265l05735J156454J637750
7113a04236R37902n6548J23611L83902J11527r65778o94726J60415L34536k63560
7103c2955K04972N13605K29388J89938l83314q43623p45573m02510l02602P12777
7093h59897J181213K4415j315471j797843l85498N91667Q86114R25768l50107
$$ plain form
7161 -237902 -241402 722658 617270 -168957 -584811 -9052 -33918 4024 155028 512735
7151 512735 486862 704586 959043 606474 -640443 -2328129 -3739801 -3742968 -3469520 -3421210
7141 -3421210 -2137299 -785569 -927590 -1110079 -1490114 -2183362 -2704528 -2685289 -2391970
7132 -2391970 -1314949 -343900 -766616 -941830 -623971 -1183592 -1838802 -1438001 -1042981
7123 -1042981 -970131 -869797 -1054925 -939700 -1151812 -1728440 -2592705 -2898440 -1741986 -104236
7113 -104236 833666 777118 900729 1284631 1396158 430380 -264346 -103931 230605 -32955
7103 -32955 172017 685622 915010 1104948 721634 -121989 -867562 -1270072 -1572674 -859897
7093 -859897 321316 345731 -969740 -2767583 -3153081 -2561414 -1675300 -749532 -1099639
7084a099639j054724n44774O79600J084988O41409M64699L2142j4146l07367M66741
7074C48929O84443K68146p39268l08231J333010L09325M2256l86104k8594K43795
7064A767707o5885k39616q09664r69814j89515k78676r71083k02198P74704m85292
7054a669332k88388M65424L61081J201002P49800K28030K31097L69302L95106
7045B043122m50971n45498k81555j062408o02166O35036M29950N48505R11548
7036A625563M11348o36866q66787p40387j231163m90483O48526J101289J340774
7027A161814L56883L43683L13732n37615n0252N28710O19156K41108j054422o29619
7017A293178N64962N48570n56600l83836j11507J1501O10300O30477j69179m08908
$$ plain form
7084 -1099639 -2154363 -2699137 -2019537 -934549 -293140 171559 203701 189555 -117812 348929
7074 348929 1033372 1301518 562250 254019 1587029 1896354 1938610 1552506 1523912 1767707
7064 1767707 1701822 1462206 652542 -317272 -506787 -785463 -1756546 -1958744 -1184040 -1669332
7054 -1669332 -1957720 -1492296 -1131215 69787 819587 1047617 1278714 1648016 2043122
7045 2043122 1592151 1046653 765098 -297310 -899476 -264440 165510 714015 1625563
7036 1625563 2036911 1400045 533258 -207129 -1438292 -1928775 -1280249 -178960 1161814
7027 1161814 1518697 1862380 2176112 1638497 1588245 2116955 2736111 2977219 1922797 1293178
7017 1293178 1858140 2406710 1850110 1466274 1354767 1366268 1976568 2607045 2437866 2028958
7007B028958l65793Q2532L00759o53383j015811J96263Q54112O14848k85913l48514
6997A408058m67340k85161j61173n1949N55100K99603L3842m2m25236p17536n25054
6986c36888L31411J336542R23329j98842n33077m28898l14205r30998n33602K92818
6976c92410j25397L0388M60336O36122m02758k89899k74788n88963j90557l11635
6966a449561O92494J397299N12274q19706q82813m67970L39233J039176j0704
6957C49722M08049Q36366N84274k34647n40571j63458n07132q21172J82637J22753
6947B16821L99576J266704N62721l85306k45308r2422r78206o09769j04112j05930
6937g5231P05642O40258m90237j135756j582832q60172o58718q12543K13237J97369
$$ plain form
7007 2028958 1663165 1745697 2046456 1393073 377262 573525 1427637 2042485 1756572 1408058
6997 1408058 940718 655557 494384 442435 997535 1297138 1330980 1330938 905702 188166 -336888
6986 -336888 -5477 1331065 2254394 2055552 1522475 1093577 779372 -151626 -685228 -392410
6976 -392410 -517807 -487419 -27083 609039 206281 -83618 -358406 -947369 -1137926 -1449561
6966 -1449561 -757067 640232 1152506 332800 -550013 -1017983 -678750 360426 349722
6957 349722 757771 1594137 2178411 1943764 1403193 1239735 732603 -88569 94068 216821
6947 216821 616397 1883101 2445822 2060516 1815208 1722786 744580 134811 30699 -75231
6937 -75231 630411 1270669 780432 -355324 -1938156 -2798328 -3457046 -4269589 -4056352 -3858983
6927c858983P63873J156624Q36068O77022P33295m18072P7253M48265M56985R9889
6917I72219p71731j242578p95048r76247k14903J067278R60709N34630o4336j201283
6907a731290n19851K88118j79269L9238M08453M99614N04676J013056L8640k7213
6897C34172L25831j26550m0193r90710j264693K06802J183439l49538p24592m68251
6887a914283k81967j12156J57418K26097P58224J177514o2764l73792N67783M00621
6877E42695N24612l12059k97969n75542O586O99809L33905K66994O03947M70981
6867B263959k49814j085476j807043j123845J0050K54797J38943J18516M84666
6858i95247O01028J255782N49774j120238q30778l49821O3149k47304K34273O57778
$$ plain form
6927 -3858983 -3095110 -1938486 -1102418 -425396 307899 -110173 -32920 415345 872330 972219
6917 972219 200488 -1042090 -1837138 -2813385 -3028288 -1961010 -1000301 -465671 -530007 -1731290
6907 -1731290 -2251141 -1963023 -2142292 -2103054 -1694601 -1194987 -690311 322745 361385 334172
6897 334172 660003 533453 493260 -497450 -1762143 -1555341 -371902 -721440 -1446032 -1914283
6887 -1914283 -2196250 -2308406 -2150988 -1924891 -1166667 10847 -51917 -425709 142074 542695
6877 542695 1067307 755248 457279 -118263 -111677 588132 922037 1189031 1792978 2263959
6867 2263959 2014145 928669 -878374 -2002219 -1992169 -1737372 -1598429 -1479913 -995247
6858 -995247 -394219 861563 1411337 291099 -539679 -889500 -826351 -1073655 -839382 -181604
6848a81604J56532k52924L1704l49987k36628k3536Q07182Q32386R4433O11981
6838A489539O52983q39328j148729o4822P39060M03466M99N21029J152699J15833
6828C022229j547326r27925j53387n95393K72397M41448o94935j132661m82757
6819a798310R5154N75553J8678k19567Q19596M19183M8781M86998P8078r22709
6809c98565r2679P71743J052062Q02045k52231m10250l76622o58974j12598L60868
6799F84799k09190n3741M27842n16161m08455k22307m09966J128044J113448k45774
6789A288539q07121J24159o88630j291583l25354J41449O37119K41937P64285
6780H4800N02810o08612m02652n6966N08299Q12739j11087r65194J55203M13827
$$ plain form
6848 -181604 -25072 -277996 -246292 -596279 -832907 -856443 -49261 783125 877558 1489539
6838 1489539 2142522 1303194 154465 89643 828703 1232169 1232668 1753697 2906396 3022229
6828 3022229 1474903 546978 393591 -201802 70595 512043 -182892 -1315553 -1798310
6819 -1798310 -1703156 -1127603 -1108925 -1328492 -508896 -89713 -40932 446066 524144 -398565
6809 -398565 -491244 280499 1332561 2134606 1882375 1472125 1095503 436529 323931 684799
6799 684799 475609 421868 849710 333549 -74906 -297213 -707179 420865 1534313 1288539
6789 1288539 481418 605577 -83053 -1374636 -1699990 -1558541 -921422 -679485 84800
6780 84800 587610 -21002 -423654 -480620 27679 840418 729331 -235863 -80660 333167
6770C33167m01678m95461N07298j6965p88305r92042r36123M08519Q62520R95986
6760e23084J301272O05619o7643j92227p20703j014736o76080M38231Q49740j95869
6750a95480k35297n82591j239060j52725J376114M76358k14642q26634j86614
6741a780571o33996j01879N94627R30790J043720J002565J052441l92363q62588
6732H52746p75646N3803L81898k02514l88260n82019O13361P19545K22837k57098
6722F38653j005811p58220M08668K76459j55526J185699J554429L36078k67864
6713B212565n08298q73021n88163n18725k8620K30302N6323j792550j567385O7790
6703c309782P10593J024643J253782K89562m26944P02355K51229m80068J21577
$$ plain form
6770 333167 -68511 -563972 -56674 -73639 -861944 -1853986 -2790109 -2381590 -1519070 -523084
6760 -523084 778188 1383807 1316164 1123937 403234 -611502 -1287582 -849351 389 -195480
6750 -195480 -430777 -1013368 -2252428 -2405153 -1029039 -552681 -767323 -1593957 -1780571
6741 -1780571 -2414567 -2516446 -1921819 -991029 52691 1055256 2107697 1715334 852746
6732 852746 77100 130903 512801 310287 -77973 -659992 -46631 672914 895751 638653
6722 638653 -367158 -1125378 -716710 -440251 -595777 589922 2144351 2480429 2212565
6713 2212565 1704267 831246 243083 -275642 -304262 -73960 -17637 -1810187 -3377572 -3309782
6703 -3309782 -2599189 -1574546 -320764 -31202 -458146 244209 495438 15370 136947
6694A36947R96987N25346r64265r31090M6741l83644j91641J50734l2855K1507
6684f25233l51673l22369J151381J811137J433135Q6521m65429k37341l51757
6675B128372m13706l88064q23209j534464r81886o20452m04962M22281J38413
6666b477677o8716K77185K14739O94747L83971O90291J23459J09908M98576k66248
6656A80235p3728P34279K08715j60878l70430k24796k09273j40457j63100L88563
6646A69130O46376m63443p79358K065K14301M57780J003165N54726Q41923L39261
6636B985926j323631j388503l91764K18560O3761m83821P4346m03014j142622
6627a790762q37391M88827J262094k06377p07724J18742P22522P96028J239623
$$ plain form
6694 136947 1133934 1659280 695015 -236075 -189334 -572978 -764619 -613885 -646740 -625233
6684 -625233 -976906 -1299275 -147894 1663243 3096378 3182899 2717470 2480129 2128372
6675 2128372 1714666 1326602 503393 -1031071 -2012957 -2633409 -3038371 -2616090 -2477677
6666 -2477677 -2546393 -2269208 -2054469 -1359722 -975751 -285460 -162001 -52093 446483 180235
6656 180235 106507 840786 1049501 888623 518193 293397 84124 -56333 -219433 169130
6646 169130 815506 352063 -427295 -425230 -210929 246851 1250016 1804742 2646665 2985926
6636 2985926 1662295 273792 -117972 100588 164349 -319472 -245126 -648140 -1790762
6627 -1790762 -2628153 -2139326 -877232 -1083609 -1791333 -1672591 -950069 -154041 1085582
6618A085582R20571J17814K74319n7453p34259n05777o94469j047361r03507q15565
6608b360105J35151M94945J445741J462211J26482m01383r3745k48683p0986P92771
6598A282399K87435J2539M9004K10708o11527r50406l57517m74506k33968N33178
6588b52661J468441M43697n44088O14807L72976K59414J2831j482620j221158
6579c28361R675j89648j30256N81031Q74371L99590Q86997Q22645N99505K7120
6569C552669j185289j356610n58331L34893q9673q54823m45011L26106n72722
6560h48791q27025O79006P92331M77850r472L18954P40444N17141Q7240p74335
6550A153343o09657n86066q3125R00423R35381O67209K96155P30694P27171j65170
$$ plain form
6618 1085582 2006153 2123967 2398286 2340833 1606574 1100797 406328 -641033 -1544540 -2360105
6608 -2360105 -2224954 -1730009 -284268 1177943 1304425 903042 809297 560614 489628 1282399
6598 1282399 1569834 1582373 1631377 1842085 1230558 280152 -77365 -551871 -785839 -252661
6588 -252661 1215780 1659477 1115389 1730196 2103172 2362586 2375417 892797 -328361
6579 -328361 -318686 -508334 -638590 -57559 816812 1216402 2103399 2926044 3525549 3552669
6569 3552669 2367380 1010770 452439 787332 697659 -157164 -602175 -276069 -848791
6560 -848791 -1675816 -996810 -204479 273371 263899 582853 1323297 1840438 1927678 1153343
6550 1153343 543686 -42380 -125505 774918 1710299 2377508 2673663 3404357 4131528 3966358
6540C966358j437336j141787j110973r78271j43833M79246O2428j396103j483186
6531c183457j530405N29904K153477J180826k43429J59781L43773k35325p34258
6522a559113k6192N79787l72043l56913M63205j5761K28948M97616J069057L93925
6512I02516n91530m26232K19955L49228j64041k46295m27900j19019k04769l5776
6502g43863K87834M33904P82745Q79862k99489l72382k33919J60967M45111Q19151
6492B159921J534824N13940r38160k014179o22047O60708J68552N77825k30899
6483A810485l01692o69438p90950k41424n27342l40302L61495R37651R64464P41503
6473A944450N83199P36011J125620J08022j422182j436252m62025k57806p74899
$$ plain form
6540 3966358 2529022 1387235 276262 -702009 -845842 -366596 -304168 -1700271 -3183457
6531 -3183457 -4713862 -4183958 -2030481 -849655 -1093084 -933303 -589530 -824855 -1559113
6522 -1559113 -1585305 -1005518 -1377561 -1734474 -1271269 -1287030 -1058082 -560466 508591 902516
6512 902516 310986 -115246 104709 453937 289896 43601 -384299 -503318 -708087 -743863
6502 -743863 -456029 -22125 760620 1640482 1340993 968611 734692 895659 1340770 2159921
6492 2159921 3694745 4208685 3270525 1256346 634299 1295007 1463559 2041384 1810485
6483 1810485 1508793 839355 48405 -193019 -720361 -1060663 -699168 238483 1202947 1944450
6473 1944450 2527649 3263660 4389280 4497302 3075120 1638868 1176843 919037 144138
6464A44138o36433m0934M05377m24772r90578j57116O87984j58530n1910j56783
6454a379557k64867Q30115Q02342L55357k27913R464M36253P0917K63699j93676
6444G02134j089634q91086P4702R27664K06989J25830O71297p30905j084989n61928
6434a649926l71552J4538Q3571K05417P67503Q95384m14816o74770k31160L92464
6424i83347m53428n57362L42552N32750J94592Q20440M99879m3048n97879j26613
6414c71464R95363N18520o64954o8695P74215N39955j03170q28286j011650j08560
6404c28726P03788N83889O38878o93334j154015p19280l73065L39457R49105P02124
6394F48821J212247R09904k99028m16327k91133p78175j66862M70264l04166m76261
$$ plain form
6464 144138 -492295 -533229 -127852 -552624 -1543202 -1700318 -1012334 -1170864 -1222774 -1379557
6454 -1379557 -1644424 -814309 -11967 343390 115477 124941 561194 632111 895810 702134
6444 702134 -387500 -1278586 -1203884 -276220 -69231 56599 727896 -3009 -1087998 -1649926
6434 -1649926 -2021478 -2006940 -1923369 -1717952 -950449 -55065 -469881 -1144651 -1375811 -983347
6424 -983347 -1436775 -1994137 -1651585 -1118835 -924243 -103803 396076 353028 -244851 -371464
6414 -371464 623899 1142419 477465 408770 1182985 1722940 1619770 791484 -220166 -328726
6404 -328726 375062 958951 1597829 904495 -249520 -968800 -1341865 -1002408 -53303 648821
6394 648821 1861068 2770972 2471944 2055617 1764484 986309 819447 1289711 985545 509284
6384E09284M29221R7803r54325j337700L42720J625428P01653M13484k40165j227175
6374C60228j130291n04074k86191q48923j28649P08935J207204R59971O55825
6365I94035N52967J70806L71310N69050J5134j230721j155652j624920o04133
6356a942124L72202K90514N78218k78643j57796M04170J844382O66878n09909
6347A267892j041602m79839L63851N12140N80288M29517j00555m66919k65990
6338G98783m72539l52304j086571o79034J20273K93364m2166r9428K81428J017330
6328b20864J006273l93060j19653J040103L97991j006611q08915j44380R48746
6319F99630J208137k05357r42384j064141j16336J49194K3600j70470m92904k45770
$$ plain form
6384 509284 938505 1036308 81983 -1255717 -912997 712431 1414084 1827568 1587403 360228
6374 360228 -770063 -1274137 -1560328 -2409251 -2537900 -1828965 -621761 338210 994035
6365 994035 1547002 1717808 2089118 2658168 2673302 1442581 286929 -1337991 -1942124
6356 -1942124 -1569922 -1279408 -701190 -979833 -1137629 -733459 1110923 1777801 1267892
6347 1267892 226290 -253549 110302 622442 1202730 1632247 1531692 1064773 798783
6338 798783 326244 -26060 -1112631 -1791665 -1671392 -1378028 -1420194 -1519622 -1238194 -220864
6328 -220864 785409 392349 272696 1312799 1710790 704179 -104736 -249116 699630
6319 699630 1907767 1702410 760026 -304115 -420451 -271257 -247657 -418127 -911031 -1156801
6309a156801J97502o0672r24198l42396K17701j01269k67597j83761j4581k63694
6299b899766j13603O81587R56732Q06642P27463j70779j182983m01155Q04773
6290g91089O60043k3810l51525n57171J7096M10506P36429R76836L2034r96263
6280A13086j553751r79767m0547J189881J992262J461703M23119o93097q76192
6271A036697l84234k3987J78866O54737J85979m28627P44319J517189J126150
6262D607089m03116j294804l97655j488866j288516J59370p67654j748844k36315
6253b859311J391492R80196L67816k64600o96490k18300J289247N69659l59245
6244B00464k72771J79449m98256j312117J12808Q21889M44520O90702M37258l17471
$$ plain form
6309 -1156801 -959299 -1019971 -1944169 -2286565 -2068864 -2170133 -2437730 -2621491 -2636072 -2899766
6299 -2899766 -3013369 -2331782 -1375050 -568408 159055 -11724 -1194707 -1595862 -791089
6290 -791089 -131046 -154856 -506381 -1063552 -1046456 -635950 100479 1077315 1109349 113086
6280 113086 -1440665 -2420432 -2460979 -1271098 721164 2182867 2605986 1912889 1036697
6271 1036697 652463 628476 807342 1462079 1648058 1219431 1963750 3480939 4607089
6262 4607089 4203973 2909169 2511514 1022648 -265868 -106498 -874152 -2622996 -2859311
6253 -2859311 -1467819 -487623 -119807 -384407 -1080897 -1299197 -9950 559709 200464
6244 200464 -72307 107142 -391114 -1703231 -1590423 -768534 -324014 366688 803946 486475
6234D86475l12803j008541j351084Q5872m95664p39713K33430N53106N75256R95648
6224i78018J158288J353444J54899r40349j032548j034796K49260Q55223J171370
6215I56773P10934l03627k98550K27440K01306O34031L84765j190078j467111
6206a44117o02653K47964J188014M64821m94333j171225q54943K83384q0375j51118
6196a314581j82587p04561M733q1990Q14414J125140Q02162P35246q2705q25113
6186B90158o74075l54710l22857M27769O52427n79179n09864K63630L0610N00712
6176b75379L98905l13127p25459L80081R97448j65107K41484P06396P00143O54015
6166B599400J95652O10984l20234j229312p30896p44795R2081l08106j070263
$$ plain form
6234 486475 173672 -834869 -2185953 -2100081 -2595745 -3335458 -3102028 -2548922 -1973666 -978018
6224 -978018 180270 1533714 1688613 748264 -284284 -1319080 -1069820 -214597 956773
6215 956773 1667707 1364080 1065530 1292970 1494276 2128307 2513072 1322994 -144117
6206 -144117 -746770 -498806 689208 1154029 659696 -511529 -1366472 -1083088 -1163463 -1314581
6196 -1314581 -1497168 -2201729 -2196996 -2278986 -1464572 -339432 462730 1197976 1115271 290158
6186 290158 -383917 -738627 -1061484 -633715 18712 -560467 -1070331 -806701 -776091 -275379
6176 -275379 123526 -189601 -915060 -534979 462469 297362 538846 1245242 1945385 2599400
6166 2599400 2795052 3406036 3085802 1856490 1125594 380799 472880 164774 -905489
6157i05489r90789N28824J285291Q70116m33671p86625l45968j62180K21345J207274
6147D88128M98998k14572o8139M36633k10150r12218m92791l34141N32220J22594
6137a53438m17368Q9731m38764p30344k10049l31355j08599K81797L57064J38564
6127a522761J025793P74999M46571r8099o08857n6983l19601j207340n0677P08455
6117i08500K94611k69643p38605R4286Q46517L11850J5365M16342J275043J179322
6107B516588O51585j4595j321587j487094J08491P81746Q71887l92738j075477
6098F38806p44528j153414l04849L68131L18214Q40061Q10112O93496N97495l38748
6088A724776o93488m77207J55110P84068L94072r34978o38173K52155O9139r42892
$$ plain form
6157 -905489 -1896278 -1367454 -82163 787953 354282 -432343 -778311 -940491 -719146 488128
6147 488128 987126 772554 704415 1141048 930898 18680 -474111 -808252 -276032 -153438
6137 -153438 -570806 -481075 -919839 -1650183 -1860232 -2191587 -2300186 -2018389 -1661325 -1522761
6127 -1522761 -496968 278031 724602 626503 17646 -39337 -358938 -1566278 -1616955 -908500
6117 -908500 -613889 -883532 -1622137 -1527851 -681334 -369484 -354119 62223 1337266 2516588
6107 2516588 3168173 3153578 1831991 344897 453388 1235134 2107021 1714283 638806
6098 638806 -105722 -1259136 -1563985 -1195854 -877640 -37579 772533 1466029 2063524 1724776
6088 1724776 1031288 554081 709191 1493259 1887331 952353 314180 566335 635474 -307418
6078c07418m82792R87241P28117J54971O9028l70191q1740R2991k60928L67002
6068H96281K23143J37381p36591m87409L46808J001083O44800J63027J86145l5709
6058B338959O93563l33757j188906l80328K34783L43060P56970J149047N42228
6049D155619M81327j89263J1260N15071K559398L600526K938821K786907K624834
6040A9484500J717064j84114r88238q533J057127J064641M74437m91328k463940
6031A9661616l275700k866384k264491j447360j118436j659274j795253j82265
6023E052453k13413p62334k85623q20430q00464j030486n67585N78746J32324
6014A283188J35995O5589j56486J33355k65922o47831l27515M96874J89318o02851
$$ plain form
6078 -307418 -790210 197031 925148 1080119 1149147 778956 697216 790207 529279 896281
6068 896281 1119424 1256805 520214 32805 379613 1380696 2025496 2188523 2374668 2338959
6058 2338959 3032522 2698765 1509859 1129531 1364314 1707374 2464344 3613391 4155619
6049 4155619 4636946 4447683 4458943 4974014 7533412 11133938 14072759 16859666 19484500
6040 19484500 21201564 21017450 20029212 20020679 21077806 22142447 22616884 22125556 19661616
6031 19661616 16385916 13519532 11255041 9807681 8689245 7029971 5234718 5052453
6023 5052453 4839040 4076706 3791083 2970653 2170189 1139703 572118 1150864 1283188
6014 1283188 1419183 1484772 1328286 1461641 1195719 547888 220373 717247 906565 303714
6004C03714m59028j34419o13761m52616J68729m93385K78757J266249L91732K64196
5994E20168L90199o25920o89137k38470p0559K15321N68050k36338m56145Q73451
5984B50620R88312n37345q88979p39493l36473k31976N7491k16626n45706O43330
5974a556845R46112m27918q27597J98707N01975j60945k11110J341234O47135
5965D50748m08996L34293O01855K40691J13213k99539l88118r24208j564875j261110
5955c106046k71234K67996M53235J021282N83213K21132Q02827L11705N12102
5946G96212N10469L06508j82610o51576j76809k84517m35126m50109l21371m93136
5936a382065L78273M96167L06958J54173J05827J15774L40889P65888K02313o24853
$$ plain form
6004 303714 -155314 -289733 -903494 -1356110 -1187381 -1680766 -1402009 -135760 255972 520168
5994 520168 910367 284447 -404690 -643160 -713719 -498398 69652 -166686 -622831 250620
5984 250620 1238932 701587 -187392 -926885 -1263358 -1495334 -1437843 -1654469 -2200175 -1556845
5974 -1556845 -610733 -1038651 -1866248 -1667541 -1165566 -1326511 -1537621 -196387 450748
5965 450748 41752 376045 977900 1218591 1331804 1032265 644147 -280061 -1844936 -3106046
5955 -3106046 -3377280 -3109284 -2656049 -1634767 -1051554 -830422 -27595 284110 796212
5946 796212 1306681 1613189 1430579 779003 602194 317677 -117449 -567558 -888929 -1382065
5936 -1382065 -1003792 -507625 -200667 -46494 59333 175107 515996 1281884 1484197 859344
5926H59344o48252J24335n2983l67066m47214K55451L28368M07882Q25723Q48482
5916B134070N04281l86138m32048j26136M57444K45275L65012J00010m68232k76383
5906B117155p92618r32939m33841j05921l92110m87484J02420M68738J022634
5897E66034O63512J231896J432753K29715j091655j717740j767855M71720J902001
5888A920381J014592l63573l50485q6850N4679l75427n07681k17082l36835m87389
5878B64330L75292Q02800K85135k09802j350101j466952k06799l11907j0643N66862
5868a261785N5433J8788k66238K12326R0049M54036J530100Q18758J12014n8346
5858A705135k52708n66824l25446J56606N65509L39808P55040J30547J46164R39834
$$ plain form
5926 859344 211092 335427 282444 -84622 -531836 -276385 51983 459865 1285588 2134070
5916 2134070 2638351 2252213 1820165 1694029 2151473 2396748 2761760 2861770 2393538 2117155
5906 2117155 1324537 391598 -42243 -148164 -540274 -1027758 -925338 -456600 566034
5897 566034 1229546 2461442 3894195 4123910 3032255 1314515 -453340 18380 1920381
5888 1920381 2934973 2571400 2220915 2134065 2188744 1813317 1305636 1088554 751719 264330
5878 264330 639622 1442422 1727557 1517755 167654 -1299298 -1506097 -1818004 -1828647 -1261785
5868 -1261785 -1206352 -1187564 -1453802 -1241476 -1151427 -697391 832709 1651467 1763481 1705135
5858 1705135 1452427 885603 560157 716763 1282272 1622080 2377120 2507667 2653831 3593665
5848C593665K65541l38260K26987q93548k038728o36271O04358O67874p02136
5839G49482r99051q04376r57075j5043j74440k34597K26232M64795j61913J74065
5829a731921L36531k83245J54132L7364m77923Q0893J32297K12264L46472j19590
5819a312726N52744R46300J40253j33200O42828n66079p27820o07611q14213R0055
5809a789469P30614P43938Q06098L30196l63816k53588n44613n60665j10863N10994
5799e01174o27494m04306m74970n5546N15987M77202N99320P86424J77275m8246
5789D44472k4697K99620O16861J26723Q6078m51327k53739m69097P01564r0993
5779I85465k3422R49098N67744n98667l32066m78349m0599K35557l0917J77154
$$ plain form
5848 3593665 3859206 3520946 3747933 2854385 815657 179386 783744 1451618 749482
5839 749482 -249569 -1053945 -2011020 -2026063 -2200503 -2435100 -2208868 -1744073 -1905986 -1731921
5829 -1731921 -1395390 -1678635 -1524503 -1487139 -1965062 -1884169 -1751872 -1539608 -1193136 -1312726
5819 -1312726 -759982 186318 326571 193371 836199 270120 -457700 -1065311 -1879524 -1789469
5809 -1789469 -1058855 -314917 491181 821377 457561 203973 -340640 -901305 -1012168 -501174
5799 -501174 -1128668 -1532974 -2007944 -2063490 -1547503 -1070301 -470981 315443 492718 444472
5789 444472 419775 719395 1336256 1462979 1549057 1097730 843991 374894 1076458 985465
5779 985465 962043 1911141 2478885 1880218 1548152 1069803 1029204 1264761 1233844 1410998
5769A410998m76250r28466J16554K43099K11864M37588Q19023L15792k42639M03084
5759B310647N90725k19061p36451r51152n92973K53942j47825n58565r36554n99429
5749a586696k78699p63033k54676L42834J618029J804947J305566l26111r96798
5740H65363L179J60005M4235P30140P74546J070167N94347m77077n31879L26669
5730C559695N48946N6382l65423O45184K151382J710079J990535L086960L410378
5721A6794118K121272k79582k426725k390782j842419k196960k076575j110817
5713F591530j059734p24428o88636J07711k16054r18009J88603p1748K14494L73199
5703C796928L35930N64378j78834k74771N6340M35618J133371K250278K202935
$$ plain form
5769 1410998 934748 6282 122836 365935 577799 1015387 1834410 2150202 1907563 2310647
5759 2310647 2901372 2682311 1945860 994708 401735 655677 507852 -50713 -987267 -1586696
5749 -1586696 -1865395 -2628428 -2883104 -2540270 -922241 882706 2188272 1862161 865363
5740 865363 868542 1028547 1072782 1802922 2577468 3647635 4241982 3764905 3233026 3559695
5730 3559695 4108641 4165023 3799600 4444784 6596166 8306245 10296780 13383740 16794118
5721 16794118 18915390 18635808 16209083 13818301 11975882 9778922 7702347 6591530
5713 6591530 5531796 4807368 4118732 4226443 4010389 3092380 3280983 3209235 3423729 3796928
5703 3796928 4132858 4697236 4518402 4243631 4299971 4735589 5868960 8119238 10322173
5694A0322173J863216J905109K414756K068249J04903k615944k952439j732112
5686A1377911j565615j022321j255760j796260j238122p25075m94298q89748m30344
5677A960368N18939P85418J01735M20755K08883q91185l40529o06043q13996n02768
5667H41577J66155O91962J37989j075279n31772O73133L39595q0787j27591M35421
5657A470403L13644j73157r4595J96649j36629o14943k97071Q12215N15059j02238
5647A889337o5112q19642j039272j009824J48107J47491N7200L00025K66595J94577
5637F9482m38237J55503J113869P66373k17053m49925O70346J54962L99295O10995
5627B835610J22177Q43741J186266N66012N57363R51001J710202K625870L381052
$$ plain form
5694 10322173 12185389 14090498 16505254 18573503 18678406 16062462 13110023 11377911
5686 11377911 9812296 8789975 7534215 5737955 4499833 3774758 3280460 2390712 1960368
5677 1960368 2479307 3264725 3366460 3787215 3996098 3104913 2764384 2158341 1344345 841577
5667 841577 1007732 1699694 1837683 762404 230632 903765 1243360 1162573 1034982 1470403
5657 1470403 1784047 1610890 1516295 1712944 1576315 961372 664301 1476516 1991575 1889337
5647 1889337 1824225 1004583 -34689 -1044513 -896406 -748915 -691715 -391690 -125095 69482
5637 69482 -368755 -213252 900617 1666990 1449937 1000012 1670358 1825320 2224615 2835610
5627 2835610 2957787 3801528 4987794 5553806 6111169 7062170 8772372 11398242 14779294
5618A4779294M731474O390141P725043Q836070N317096l048514q319863q351714
5610B8059027o510521n000816l469848j496352q57180j416595k014132j447927
5602E845656k61381M35856j34358n19386j548911j900690k30004N45899J27797
5593B360478m64669k53630J337805J430244p41592j519507o38530N11027n93580
5584A428046r67098K09879l60921m92177O495N84244L74014L52987J78024n79022
5574G34471k34366n39739R8108K97560m2913J55810R7332j013102q05795M90762
5564g61872P72128J199976N16083j41647K65755J219l93596r49060r61015m47723
5554h99752k80095J06112J48447J30364P78226O04340j02533o14195J86479P73747
$$ plain form
5618 14779294 19510768 25900909 33625952 42462022 47779118 44730604 36410741 28059027
5610 28059027 21548506 16547690 13077842 11581490 10724310 9307715 7293583 5845656
5602 5845656 5584275 6020131 5885773 5366387 3817476 1916786 1686782 2232681 2360478
5593 2360478 1895809 1642179 2979984 4410228 3668636 2149129 1510599 2021626 1428046
5584 1428046 460948 670827 309906 -182271 -175776 408468 782482 1135469 1313493 734471
5574 734471 500105 -39634 58474 356034 313121 468931 566263 -446839 -1252634 -761872
5564 -761872 10256 1210232 1726315 1584668 1850423 1851642 1458046 508986 -452029 -899752
5554 -899752 -1179847 -1073735 -925288 -794924 -16698 587642 485109 -129086 57393 831140
5544H31140l00398j636639r71512L88515J944643K312497L50138j692621l63108
5535H62655L38603l26631q79043o48259N10038J408613R80914O27838R12397J43408
5525C930533o45289j224257j557758j585895p37786J44440O40864J243860M94667
5516G03379M96842K06304n73680j21180Q83680P03005M96864J452321J616273
5507E863808J544899K185216K399234K453862J918934N42653j467913k744654
5499A2696039k435716k198023j360565o69044o21228j076289l78611O55785M44957
5490E057305o82381j335923q26709m09727P17201J528712K63624k67105j89941
5481C855056n55208q01304j376403m08446N79593K58487n51166j52833o0012n29281
$$ plain form
5544 831140 530742 -1105897 -2077409 -1688894 255749 2568246 2918384 1225763 862655
5535 862655 1201258 874627 -4416 -652675 -142637 1265976 2246890 2874728 3787125 3930533
5525 3930533 3285244 2060987 503229 -1082666 -1820452 -1676012 -1035148 208712 703379
5516 703379 1200221 1406525 832845 711665 1595345 2298350 2795214 4247535 5863808
5507 5863808 7408707 9593923 11993157 14447019 16365953 16908606 15440693 12696039
5499 12696039 10260323 8062300 6701735 6032691 5411463 4335174 3956563 4612348 5057305
5490 5057305 4374924 3039001 2212292 1802565 2519766 4048478 4312102 4044997 3855056
5481 3855056 3299848 2498544 1122141 713695 1293288 1551775 1000609 847776 787764 258483
5471B58483k1617N08768l76854n86336k97658j0834Q53414R43491M1796k54144
5461A058509p5884k09025m21699J22528K01524r26971p82966L23294l56880m73924
5451a541494K04467M01754O87321j71300m51461J72033K81310n05502m26096O00521
5441g48447J62241m62823n461m55347n65051L07938M96805j91085O36875L4569
5431g89786J76834K93037l35782p78007k95419K4692j24853J180581J140889P6947
5421E69133k55316l54956n07013L14339O81425J82954L11230l9061m29182l08543
5411A65010j96659p01475p13242k73523l73406J18275j00199l25924r98640n13881
5401c913664p5095J099743J411014J92470k62714o79034o8289N84742N91987K25769
$$ plain form
5471 258483 236866 745634 368780 -217556 -515214 -526048 327366 1270857 1312653 1058509
5461 1058509 982625 773600 351901 474429 675953 -251018 -1033984 -710690 -1067570 -1541494
5451 -1541494 -1337027 -935273 -247952 -419252 -870713 -698680 -417370 -922872 -1348968 -748447
5441 -748447 -586206 -1049029 -1054490 -1509837 -2074888 -1766950 -1270145 -1461230 -824355 -789786
5431 -789786 -612952 -319915 -655697 -1433704 -1729123 -1704431 -1829284 -648703 492186 569133
5421 569133 313817 -41139 -548152 -233813 447612 630566 941796 902735 473553 165010
5411 165010 -31649 -733124 -1446366 -1719889 -2093295 -1975020 -2075219 -2401143 -3399783 -3913664
5401 -3913664 -3988759 -2889016 -1478002 -1285532 -1548246 -2227280 -2295569 -1710827 -1118840 -893071
5391h93071l26358r16448Q195J134902M83193L34901L0460j220548l72509L65083
5381a372200J228292J415746K6522n88086n07853k83917R83638P70639j18723
5372A554058l07169j35362r2809O9751M17478J067654L21530j049624n57143m85036
5362H03328j15198L60778K1393l10708p09161m31537l90876j22084K91543L36165
5352b66357m9623J01467N77563p35628j207457j278244k53044Q46346K08722o98521
5342b754776l38148J021330J240560L89268L09211n34241j065230p98072q19788
5333c349886O8019P78150K87221k5290j7039N85422J137339R42774P93576m1091
5323A159195N6390j4555k8082P4528p1851j83033K26391l25358o19720J83911
$$ plain form
5391 -893071 -1219429 -2135877 -2127682 -992780 -509587 -174686 -144226 -1364774 -1737283 -1372200
5381 -1372200 -143908 1271838 1298360 710274 202421 -81496 902142 1672781 1554058
5372 1554058 1246889 1111527 1018718 1088469 1505947 2573601 2895131 1845507 1288364 803328
5362 803328 688130 1048908 1070301 759593 50432 -381105 -771981 -894065 -602522 -266357
5352 -266357 -315980 -214513 363050 -372578 -1580035 -2858279 -3111323 -2264977 -2056255 -2754776
5342 -2754776 -3092924 -2071594 -831034 -441766 -132555 -666796 -1732026 -2530098 -3349886
5333 -3349886 -3281867 -2503717 -2216496 -2241786 -2258825 -1673403 -536064 406710 1200286 1159195
5323 1159195 1215585 1201030 1172948 1247476 1175625 992592 1218983 893625 273905 457816
5313D57816P7928j02131J099877Q08982l07927l01025P2444O55870J61437o94349
5303A928922j185855J90360O8851J23733J90724k29998N1213L76840L12625O25724
5293B453139P52331K10079j43455J10451P04346L58499M6613J54069N0802P5448
5283D772322l37324o06185Q19407J380373J098470K228128L189033K695284J907827
5274A7147335L845736O995267Q564589O604306N84186m897982o711247n292888
5266B6839302l531338k381297j937249k68872J327329P75882P86176p43663k986036
5257A7880234k982972k475721j708353p67516j4593p63374j285685j907942p08962
5248E265116M50954j65656r39438l62674J37198l51605Q3273j14357j029841l36472
$$ plain form
5313 457816 535744 433613 1533490 2342472 2034545 1733520 1805964 2461834 2623271 1928922
5303 1928922 743067 933427 1002278 1126011 1316735 1086737 1137950 1514790 1827415 2453139
5293 2453139 3205470 3415549 3272094 3382545 4086891 4445390 4492003 4646072 4696874 4772322
5283 4772322 4434998 3828813 4648220 6028593 7127063 9355191 12544224 15239508 17147335
5274 17147335 20993071 27988338 36552927 43157233 43741419 38843437 32132190 26839302
5266 26839302 23307964 20926667 18989418 18720546 20047875 20823757 21609933 20866270 17880234
5257 17880234 14897262 12421541 10713188 9945672 9931079 9167705 7882020 5974078 5265116
5248 5265116 5716070 5550414 4610976 4248302 4385500 4033895 4117168 4002811 2972970 2636498
5238B636498Q37865J450977k47278r66098r20206m70447M83537J051540R005o73047
5228C192346q35010l73958J15011P14577L90040j086818j71190L5899j378091
5219F02806j355404K93670J000162P64858O72840K14529r11172o79221L34831
5210I37899L95745p41776n1171Q50689P70259N3660J97539l01040p39735M4108
5200A416177M6011o79440J21077n20926q54933p53915o3808Q75477J410116J256169
5190B252005N6185j455103j068515k60471J2890j61350Q72603J269669J116360
5181B634273J058085m36168o97343q06714q2875N79484L17155j208305j231166
5172A26426n30035K89316K17781l5893q8487K89765Q84407n2303J91774j6069
$$ plain form
5238 2636498 3474363 4925340 4678062 3711964 2791758 2321311 2804848 3856388 3865393 3192346
5228 3192346 2357336 1983378 2098389 2812966 3203006 2116188 1944998 1980897 602806
5219 602806 -752598 -458928 541234 1306092 1978932 2193461 1282289 603068 937899
5210 937899 1333644 591868 540697 1391386 2161645 2215305 2412844 2111804 1372069 1416177
5200 1416177 1462188 782748 903825 382899 -472034 -1225949 -1289757 -414280 995836 2252005
5190 2252005 2308190 853087 -215428 -475899 -463009 -624359 248244 1517913 2634273
5181 2634273 3692358 3256190 2558847 1752133 1669258 2248742 2565897 1357592 126426
5172 126426 -403609 -114293 103488 67595 -20892 268873 1153280 1100977 1292751 1276682
5162A276682j314221j495613K99402J410345O77566r3500j018909j024986P0588
5153a212646n0801o34797l94291L32309J84456L12388K40143j52085J39188L00722
5143i35414N20282M15607P11173Q15176n4782l22032M87221l77681r27092o80320
5133c47862n2937J049652J19260j010242n43375m42124k17570L53341N90236O3475
5123d38146K02480l89232j51699R38351J234944J225878l2073j007528j116980
5114D65995o93438j74294k94829O52635R67419K1217L92732r54739q84247O12898
5104A11349J134925J458081P21491n88627j696323j941059j030099l24379P61426
5095a393215J792112J094956J67121m29351N7283l05705l91633K2302P1551j86458
$$ plain form
5162 1276682 -37539 -1533152 -1233750 176595 854161 760661 -258248 -1283234 -1212646
5153 -1212646 -1263447 -1898244 -2292535 -1960226 -1775770 -1463382 -1223239 -1375324 -1236136 -935414
5143 -935414 -415132 475 711648 1526824 1472042 1150010 1637231 1259550 332458 -347862
5133 -347862 -400799 648853 768113 -242129 -785504 -1227628 -1445198 -1091857 -501621 -438146
5123 -438146 -235666 -624898 -776597 161754 1396698 2622576 2590503 1582975 465995
5114 465995 -227443 -401737 -696566 -43931 923488 944705 1337437 382698 -501549 111349
5104 111349 1246274 2704355 3425846 2837219 1140896 -800163 -1830262 -2154641 -1393215
5095 -1393215 398897 1493853 1660974 1231623 1288906 983201 591568 613870 685421 498963
5085D98963m57024j8375L99214P11148M60439q05222j338861j82472J49928k07127
5075g89389K10317n684k03252n28320q9918N43772J89024p15713k00388J354515
5065b35036L70379j386635j257685q55984M760N66046J078464J640929J78106
5056A03344J52430M0964o37045k98775Q18856K34962q51428n6597o45447j701267
5046b840003k85248N29692O87507N97707N28550Q84955N91170l04064q75874L45532
5036a40076N33615P75135o52285j082823N61217L64863r80052j545030P08228
5027a457208J231685K94923j59388l50724p93474l92417P51780P82147L85675
$$ plain form
5085 498963 41939 23564 422778 1133926 1594365 789143 -549718 -732190 -582262 -789389
5075 -789389 -579072 -584756 -788008 -1316328 -1406246 -862474 -673450 -1389163 -1589551 -235036
5065 -235036 135343 -1251292 -2508977 -3364961 -3360201 -2794155 -1715691 -74762 103344
5056 103344 255774 296738 -340307 -639082 179774 414736 -436692 -493289 -1138736 -2840003
5046 -2840003 -3125251 -2595559 -1908052 -1310345 -781795 103160 694330 390266 -485608 -140076
5036 -140076 393539 1168674 516389 -566434 -5217 359646 -620406 -2165436 -1457208
5027 -1457208 -225523 69400 -89988 -440712 -1234186 -1626603 -874823 -92676 292999
$$ [...]
##END NTUPLES=NMR SPECTRUM
##END=
