##TITLE=C13_LR-683B-C2-TFA
 CDCl3+TFA, 800 sc

 30.7.2019
##JCAMPDX= 6.0         $$ Bruker NMR JCAMP-DX V2.0
##DATA TYPE= NMR SPECTRUM
##DATA CLASS= NTUPLES
##ORIGIN= UXNMR, Bruker Analytische Messtechnik GmbH
##OWNER= root
$$ XWIN-NMR		Version 3.5
$$ Tue Jul 30 16:24:13 2019 Russian Standard Time (UT+4h)  she@DPX200
##.OBSERVE FREQUENCY= 50.327896
##.OBSERVE NUCLEUS= ^13C
##.ACQUISITION MODE= SIMULTANEOUS
##.ACQUISITION SCHEME= undefined
##.AVERAGES= 800
##.DIGITISER RES= 17
##SPECTROMETER/DATA SYSTEM= spect
##.PULSE SEQUENCE= zgpg30
##.SOLVENT NAME= CDCl3
##.SHIFT REFERENCE= (INTERNAL, CDCl3, 0, 225.252)
##AUDIT TRAIL= $$ (NUMBER, WHEN, WHO, WHERE, WHAT)
$$ ##TITLE= Audit trail, XWIN-NMR		Version 3.5
$$ ##JCAMPDX= 5.01
$$ ##ORIGIN= Bruker BioSpin GmbH
$$ ##OWNER= she
$$ F:/spectra/data/she/nmr/c13/1/pdata/1/auditp.txt
$$ ##AUDIT TRAIL=  $$ (NUMBER, WHEN, WHO, WHERE, WHAT)
(   1,<2019-07-30 16:22:56.64 +0400>,<she>,<DPX200>,
      <created by zg, POWCHK disabled, PULCHK disabled
       terminated by command 'halt'
       configuration hash MD5:
       00 E9 B6 7A A2 85 ED C7 34 08 36 98 17 FE 4E 26
       data hash MD5: 32K
       EE 86 F5 9C 5A 76 20 58 61 CF EE F2 09 76 3A 0D>)
(   2,<2019-07-30 16:22:58.75 +0400>,<she>,<DPX200>,
      <Start of raw data processing
       efp BC_mod = 2 LB = 1 FT_mod = 6 PKNL = 1 PHC0 = -366.1155 PHC1 = 17.80641 SI = 32K 
       data hash MD5: 32K
       A4 B7 9F E9 BA A7 E5 BE 3B 09 25 AE FD C7 0F 4C>)
(   3,<2019-07-30 16:23:01.81 +0400>,<she>,<DPX200>,
      <abs ABSG = 5 
       data hash MD5: 32K
       F0 04 BE 82 A2 F7 90 31 41 2B AA 79 FB 5B D5 37>)
(   4,<2019-07-30 16:23:33.14 +0400>,<she>,<DPX200>,
      <abs ABSG = 5 
       data hash MD5: 32K
       05 F5 A7 59 54 E3 97 10 1C 25 E8 CA E2 F6 F8 4B>)
(   5,<2019-07-30 16:23:44.57 +0400>,<she>,<DPX200>,
      <pk PHC0 = -16.36588 PHC1 = 24.6 
       data hash MD5: 32K
       04 7E 44 2B 9E F9 25 D6 6A 6D 5B 02 ED D8 3D 1D>)
(   6,<2019-07-30 16:23:47.60 +0400>,<she>,<DPX200>,
      <abs ABSG = 5 
       data hash MD5: 32K
       77 D8 BD 78 69 DC 1A 20 C0 E8 CB 50 23 1A 05 4A>)
$$ ##END=
$$ 
$$ hash MD5
$$ F0 5B F5 A1 20 DA ED 96 DB 8E AF D1 3C 61 A9 5D
##$RELAX= 
##$RELAX= 
##$RELAX= 
##$RELAX= 
##$RELAX= 
##$RELAX= 
##$RELAX= 
##$RELAX= 
$$ Bruker specific parameters
$$ --------------------------
##$DU= <F:/spectra>
##$EXPNO= 1
##$NAME= <c13>
##$PROCNO= 1
##$TYPE= <nmr>
##$USER= <she>
##$AMP= (0..31)
100 100 100 100 100 100 100 100 100 100 100 100 100 100 100 100 100 100 
100 100 100 100 100 100 100 100 100 100 100 100 100 100 
##$AQSEQ= 0
##$AQ_mod= 1
##$AUNM= <au_zg>
##$AUTOPOS= <>
##$BF1= 50.322709
##$BF2= 200.13
##$BF3= 50.322709
##$BF4= 500.13
##$BF5= 500.13
##$BF6= 500.13
##$BF7= 500.13
##$BF8= 500.13
##$BYTORDA= 1
##$CFDGTYP= 0
##$CFRGTYP= 5
##$CHEMSTR= <none>
##$CNST= (0..31)
1 1 145 1 1 1 1 1 1 1 1 1 1 1 1 1 1 1 1 1 1 1 1 1 1 1 1 1 1 1 1 1 
##$CPDPRG= <waltz16>
##$CPDPRG1= <>
##$CPDPRG2= <waltz16>
##$CPDPRG3= <>
##$CPDPRG4= <mlev>
$$ [...]
##$SUBNAM4= <"">
##$SUBNAM5= <"">
##$SUBNAM6= <"">
##$SUBNAM7= <"">
##$SUBNAM8= <"">
##$SUBNAM9= <"">
##$SW= 239.972175391363
##$SWIBOX= (0..15)
0 1 3 0 0 0 0 0 0 0 0 0 0 0 0 0 
##$SW_h= 12077.2946859903
##$TD= 32768
##$TD0= 1
##$TE= 0
##$TE2= 300
##$TE3= 300
##$TEG= 300
##$TL= (0..7)
120 120 120 120 120 120 120 120 
##$TP= (0..7)
150 150 150 150 150 150 150 150 
##$TP07= 0
##$TPNAME0= <>
##$TPNAME1= <>
##$TPNAME2= <>
##$TPNAME3= <>
##$TPNAME4= <>
##$TPNAME5= <>
##$TPNAME6= <>
##$TPNAME7= <>
##$TPOAL= (0..7)
0.5 0.5 0.5 0.5 0.5 0.5 0.5 0.5 
##$TPOFFS= (0..7)
0 0 0 0 0 0 0 0 
##$TUNHIN= 0
##$TUNHOUT= 0
##$TUNXOUT= 0
##$USERA1= <user>
##$USERA2= <user>
##$USERA3= <user>
##$USERA4= <user>
##$USERA5= <user>
##$V9= 5
##$VALIST= <valist>
##$VCLIST= <CCCCCCCCCCCCCCC>
##$VD= 0
##$VDLIST= <DDDDDDDDDDDDDDD>
##$VPLIST= <PPPPPPPPPPPPPPP>
##$VTLIST= <TTTTTTTTTTTTTTT>
##$WBST= 1024
##$WBSW= 4
##$XGAIN= (0..3)
0 0 0 0 
##$XL= 0
##$YL= 0
##$YMAX_a= 5167292
##$YMIN_a= -2631909
##$ZGOPTNS= <>
##$ZL1= 120
##$ZL2= 120
##$ZL3= 120
##$ZL4= 120
##$ABSF1= 225.2522
##$ABSF2= -14.74524
##$ABSG= 5
##$ABSL= 3
##$ALPHA= 0
##$AQORDER= 0
##$ASSFAC= 0
##$ASSFACI= 0
##$ASSFACX= 0
##$ASSWID= 0
##$AUNMP= <proc_1d>
##$AZFE= 0.1
##$AZFW= 0.5
##$BCFW= 0
##$BC_mod= 2
##$BYTORDP= 0
##$COROFFS= 0
##$CY= -3
##$DATMOD= 1
##$DC= 0
##$DFILT= <>
##$DTYPP= 0
##$F1P= 0
##$F2P= 0
##$FCOR= 0.5
##$FTSIZE= 32768
##$FT_mod= 6
##$GAMMA= 0
##$GB= 0
##$INTBC= 1
##$INTSCL= 4.134877e-10
##$ISEN= 128
##$LB= 1
##$LEV0= 0
##$LPBIN= 0
##$MAXI= 10000
##$MC2= 0
##$MEAN= 0
##$ME_mod= 0
##$MI= 0.1934396
##$NCOEF= 0
##$NC_proc= -2
##$NLEV= 6
##$NOISF1= 120.0001
##$NOISF2= 80.00006
##$NSP= 0
##$NTH_PI= 0
##$NZP= 0
##$OFFSET= 225.2522
##$PC= 1.4
##$PHC0= -382.4814
##$PHC1= 42.40641
##$PH_mod= 1
##$PKNL= yes
##$PPARMOD= 0
##$PSCAL= 0
##$PSIGN= 0
##$REVERSE= no
##$SF= 50.3225993700027
##$SI= 32768
##$SIGF1= 140
##$SIGF2= 120
##$SINO= 11.81781
##$SIOLD= 32768
##$SREGLST= <13C.CDCl3>
##$SSB= 0
##$STSI= 32768
##$STSR= 0
##$SW_p= 12077.2946859903
##$SYMM= 0
##$S_DEV= 0
##$TDeff= 32768
##$TDoff= 0
##$TI= <>
##$TILT= no
##$TM1= 0
##$TM2= 0
##$TOPLEV= 0
##$USERP1= <user>
##$USERP2= <user>
##$USERP3= <user>
##$USERP4= <user>
##$USERP5= <user>
##$WDW= 1
##$XDIM= 32768
##$YMAX_p= 306348222
##$YMIN_p= -8309793
$$ End of Bruker specific parameters
$$ ---------------------------------
##NTUPLES= NMR SPECTRUM
##VAR_NAME=  FREQUENCY,     SPECTRUM/REAL,   SPECTRUM/IMAG
##SYMBOL=    X,             R,               I
##VAR_TYPE=  INDEPENDENT,   DEPENDENT,       DEPENDENT
##VAR_FORM=  AFFN,          ASDF,            ASDF
##VAR_DIM=   32768,         32768,           32768
##UNITS=     HZ,            ARBITRARY UNITS, ARBITRARY UNITS
##FACTOR=    0.368581032318806, 1,           1
##FIRST=     11335.2760802109, 0,            0
##LAST=      -742.018605779436, 0,           0
##MIN=       -742.018605779436, -8309793,    0
##MAX=       11335.2760802109, 306348222,    0
$$ Real data points
##PAGE= N=1
##DATA TABLE= (X++(R..R)), XYDATA
$$ [...]
17676 -2708180 -2240220 -1111079 1143484 2191620 2252464 1087651 -854670 -1924493 -1655483
17667 -1655483 -1031626 -393786 -169677 192096 -188412 -262224 135638 578077 765100 1093583
17657 1093583 2189368 1190702 -707193 -454314 826944 2940341 4021830 3692962 2581305
17648 2581305 1417666 755900 788137 2590684 4675577 4490297 3382877 3227042 3245981
17639 3245981 3149089 2666793 2284052 1963944 1652725 1383200 2553785 3163971 2683928
17630 2683928 870787 28060 647313 1736992 2483831 3464057 3201528 2608647 2763761
17621 2763761 3308787 3448438 1536258 -1413613 -1769348 -711074 110925 814622 585688
17612 585688 -254562 100637 1065285 1303318 704773 498175 1250985 1582481 2025393 2744485
17602 2744485 3125610 3026192 2382430 2203767 2925485 3820644 4760701 5005614 6042193
17593 6042193 6958681 7774107 9698630 11991208 13537752 14589226 16107846 18610330
17585 18610330 21881027 25267971 27366567 29707035 32488940 33082053 32040777 29952537
17577 29952537 26558649 22771446 18550977 14846744 12931445 12212700 11849486 11244373
17569 11244373 8687011 6649137 6267183 6757047 7587720 7624897 7256527 7252119 7128516
17560 7128516 5938599 4244570 3242760 2280768 2272870 2344296 1869403 2130180 1496986
17551 1496986 97203 -176641 -63915 587359 725701 1519940 1470844 1133420 1475577
17542 1475577 423470 -679809 203658 1729859 1573318 -275851 -1059308 -491518 108398
17533 108398 73212 627909 1751805 2008016 1894126 1131653 473605 -960906 -1880093
17524 -1880093 -1208269 820248 2444466 2805037 1633196 -236663 -1130959 -834638 -443692
17515 -443692 507599 460980 -406703 -1462033 -3035286 -5161749 -5158824 -3736811 -2693090
17506 -2693090 -2018436 -1926564 -186145 1867211 1943844 271119 -1844919 -2484689 -2053059
17497 -2053059 -537683 715389 1185141 1684624 1818966 591336 -263091 323805 1190045
17488 1190045 2649367 4082902 4845674 3789030 3127038 2762318 1440034 589500 -217561
17479 -217561 -120668 124136 485909 1624612 1756698 1226430 570242 -353646 -1514936
17470 -1514936 -1205869 -1121161 -1641560 -1980390 -1048894 539478 424499 83557 -1272998
17461 -1272998 -1576879 -1147067 -782105 -806682 -1308382 -1832595 -2369159 -2569010 -1507869
17452 -1507869 -1481175 -2096338 -768020 1973971 2322474 2464159 3066873 2566590 2294702
17443 2294702 3266548 3982683 2737197 1130152 -715012 -1231767 -612895 839227 1073742
17434 1073742 1141744 1249557 -91949 -2026417 -3489484 -4233867 -4584970 -4398218 -4401642
17425 -4401642 -3662368 -2402097 -2141604 -2379724 -2439969 -2736086 -3057674 -2853205 -2264036
17416 -2264036 -2092752 -2506533 -2467413 -2522521 -2075691 -1305224 -754184 -917514 -1091289 -903032
17406 -903032 -782396 -959071 -1237190 -957309 714973 2461693 2982785 2316633 2129400
17397 2129400 883488 -146877 622642 315289 -1654335 -2534474 -581535 1485437 422565
17388 422565 -571970 -741966 -1336245 -1269154 -340405 346729 -156951 -1033452 -1877441 -1872768
17378 -1872768 -922436 -1316072 -2707420 -3238617 -2762067 -1261971 -897695 -1785852 -3321641
17369 -3321641 -3728799 -3354225 -2751391 -956690 -952395 -1352539 -404221 -13245 330582 -530869
17359 -530869 -2020234 -2880869 -2388140 -1519180 -1545883 -1286749 103430 382894 18704
17350 18704 803868 1882191 2145831 1724022 1130084 479320 -91660 48447 -657279 -428131
17340 -428131 -474559 -981179 -195086 773919 1975102 2276399 1170629 -378199 -2057345
17331 -2057345 -2442579 -2244579 -2821904 -3968678 -4288659 -3585140 -3074795 -1761053 -441060
17322 -441060 894430 949061 389126 672211 1460075 2412256 4835094 5852449 5150709
17313 5150709 3409916 2514338 2895286 2281711 990982 478634 966794 1492081 1224072
17304 1224072 -544170 -2332469 -2820090 -1378086 -131603 -151737 -1143798 -2052670 -2042724
17295 -2042724 -2249851 -3251124 -3495956 -2956970 -2641588 -3890814 -4996751 -4476195 -4014811
17286 -4014811 -4133246 -4432120 -4765919 -3948107 -2863543 -2368327 -1936268 -1432033 -1850259
17277 -1850259 -2419755 -1497602 -838473 -822206 -275195 332463 316716 -127900 8765 1468368
17267 1468368 1793676 1256297 573186 194428 1400339 1404202 -154377 -934131 -340404
17258 -340404 304806 939639 1754728 2324095 2276205 2023064 1727676 1920022 2523127 3370045
17248 3370045 4307890 3291743 1638240 724722 -471181 -737459 -133959 -666240 -1457699
17239 -1457699 -2823521 -4181715 -4051924 -2465789 -1269631 -1037070 -1436055 -1093029 -2194033
17230 -2194033 -3737667 -3139653 -1776837 -571973 880399 966717 -1547395 -2341051 -1709186
17221 -1709186 -1375403 84758 1249088 815785 -2020397 -3316846 -2274822 -632032
17213 -632032 892961 2740804 3488368 2704204 694576 -1569414 -1815013 -584766 1087458
17204 1087458 2241319 2382017 3198355 3928047 4177796 3253942 1592984 590605 450884
17195 450884 -89223 -427233 -863203 -1503835 -1948765 -3258526 -4013670 -3361932 -3068996
17186 -3068996 -3830255 -3434437 -2588962 -2084310 -2630362 -1993813 -824328 -236701 161047
17177 161047 329597 377026 -890205 -2313548 -3474470 -2957043 -993122 -535159 -1283645
17168 -1283645 -1564166 287072 1566468 1259696 933333 742653 -505477 -1561954 -1615014
17159 -1615014 -2300113 -2593936 -203233 1873868 643286 -1062825 -484675 49995 -507089
17150 -507089 -285144 -755991 -833836 -340151 546776 1850975 2527854 3897524 4238269
17141 4238269 2302960 144341 -308740 -657652 -311189 116629 -299887 -683437 320003
17132 320003 724992 -247519 -732746 -1723116 -2075892 -2564824 -2184988 -778404 821059
17123 821059 2699500 3097167 2220023 1098613 -8456 -1230777 -2133690 -2134615 -850975
17114 -850975 -157183 -86901 -75821 -1514154 -2794815 -2285144 -2301058 -2690876 -2572986 -1123059
17104 -1123059 -9209 1148157 1650285 -332304 -2541163 -3329078 -2401705 -1321896 -329634
17095 -329634 1332250 2487891 1637287 -670309 -1089370 -1342311 -2729999 -3178237 -3668499
17086 -3668499 -2969250 -1897573 -520971 2018301 3816230 2653567 -420514 -625668
17078 -625668 632785 1126834 50154 -835076 436235 572151 -123777 -34264 -345072
17069 -345072 -512712 101998 411003 522770 482250 144333 214360 -849338 -2104297 -2317931
17059 -2317931 -1829316 -1327199 -689275 97787 817155 397163 672915 536405 174121
17050 174121 -331468 -2014029 -3258821 -2616973 -949464 520560 973965 543352 1013927
17041 1013927 1306467 770103 251316 648657 1789404 1378919 70460 -500789 -548501
17032 -548501 -698143 -831085 -1686739 -3201819 -3811719 -2926851 -1767637 -1582948 -1175138
17023 -1175138 -1130995 -1464007 -1919184 -3491255 -4737490 -3663572 -1923279 -639229 226038
17014 226038 1027757 1068476 1121332 1372375 1702514 2340733 1724429 1415029 1457548 833269
17004 833269 278147 -313183 -1445419 -2265850 -2350055 -1721109 157448 721636 -6563
16995 -6563 -515577 -729888 -117183 623463 556187 538963 1118068 1680228 1603006 1368280
16985 1368280 1179884 1269596 1332488 564417 114053 -548620 -716946 56775 484305 -822297
16975 -822297 -3071339 -2371739 -1386207 -1259812 -1230388 -1458820 -2493529 -2491814 806375 3310660
16965 3310660 3004602 2183676 603414 -523799 -1006001 -1662872 -1828816 -624686 49338
16956 49338 605504 1222394 1250712 537977 45828 -841500 -1532637 242355 2040229 1538359
16946 1538359 1324628 533087 -1203432 -2290809 -1492261 -580335 -974868 -765057 366304
16937 366304 1797810 2463507 1778067 1121998 739507 -770675 -1500054 -1979723 -3040722
16928 -3040722 -2001970 -384558 61205 183677 -1173673 -2704242 -1688785 -313969
16920 -313969 -181873 -623742 42514 896036 989602 365665 -582372 128258 186785 -971625
16910 -971625 -1147657 -899022 -529182 -651778 -1257245 -853755 -834446 -765064 234190 277807
16900 277807 -529507 -394012 -627136 -1195038 -974303 -914755 -271136 554637 478005 325741
16890 325741 -572986 -435777 1161207 1694538 678384 -590052 -1451006 -1503737 -568415
16881 -568415 -507856 -1809669 -3168960 -3372638 -2373947 -504655 972058 1241468 1592179
16872 1592179 1969797 3111742 3195774 3042959 3203709 2574356 1460287 -300458 -1727584
16863 -1727584 -3228304 -3319750 -1396244 827931 2248735 3104970 3378740 4420330 4273369
16854 4273369 1654218 -206791 -41502 -59744 -459118 -645482 -1284201 -2455547 -1902732
16845 -1902732 241439 1963137 2469377 2039086 740662 704435 516167 387622 692378
16836 692378 202477 -713061 45099 1173177 175299 -1059511 -1874980 -1873937 -1132525 9683
16826 9683 1624073 2627839 3310773 4830138 5988987 6632599 7207022 7074364 7248607
16817 7248607 6937629 5239299 5288689 6757949 10078919 12559183 12543533 11611985 11301508
16808 11301508 12025697 12953688 13619017 13905785 13281324 12081278 10596233 8746460 7313144
16799 7313144 5898540 3546219 1073223 -432901 -1045266 -1634291 -1989304 -2224424 -1639281
16790 -1639281 -706244 473200 1028381 1091476 1503719 991104 882741 458149 544746 880000
16780 880000 749529 1250892 244584 -1245086 -1921576 -1958050 -1970125 -1386754 -1819699 -1175023
16770 -1175023 13837 -572803 -2140206 -2877866 -1819668 202532 1744805 1311572 -166708
16761 -166708 -149389 724694 1510398 1706797 1033772 1767061 3601653 4228638 1916648
16752 1916648 -601110 -868207 -969757 -492856 414834 1041852 1871621 1979634 1656821
16743 1656821 1649426 1759747 2302276 1638071 -195946 -695004 -1680624 -3833383 -4272584
16734 -4272584 -3970012 -4107233 -3908448 -2901945 -2282430 -362942 2077597 2977631 1817856
16725 1817856 244363 5042 515249 842528 -971331 -3249677 -3901669 -3179778 -2411713
16716 -2411713 -2491222 -3469438 -3961703 -4013609 -4513677 -4492507 -3875249 -2716536 -1651045 -707282
16706 -707282 -96015 731769 867424 -547781 -1877303 -2340110 -1536033 -314454 -365462
16697 -365462 -815684 -932816 -1603015 -1374893 -739139 187621 237987 -704055 -1950031 -2920083
16687 -2920083 -2851331 -2043400 -1581822 -272712 1225476 2026506 2269831 1916912 1329132
16678 1329132 775870 427444 474231 27564 -1434066 -1567642 -1515912 -2246446 -1853962 -673031
16668 -673031 -1013468 -1235789 69296 146955 -937756 -1778205 -1507167 -1168940 -574232
16659 -574232 368077 404880 341826 2325707 3449026 2552640 2185244 1501374 1914146 2825257
16649 2825257 3035659 1750776 -376781 -408163 -305998 -804590 -828155 -1545521 -1423890
16640 -1423890 217364 1583975 2472396 3529655 4200462 3690626 2872148 1788776 490802
16631 490802 -389613 -273447 304665 210888 -437493 -694920 -850639 -755070 -531244 -331740
16621 -331740 -77985 564590 -225312 -985638 -1301944 -1490222 -2651383 -4200633 -4156963
16612 -4156963 -4243109 -3488764 -2609909 -2347157 -1410129 -456933 861110 1884553 1953425
16603 1953425 719963 -118156 1075140 2726568 2852446 599073 -1120180 -1824946 -1536122
16594 -1536122 -482329 724885 1920546 1422891 97031 -1040642 -1288728 -1100598 -1027239
16585 -1027239 54262 698403 1196680 760092 -86110 -89735 -143468 -724994 -1357893 -1300539
16575 -1300539 -985273 -1508021 -1414956 -1165437 -1166252 -559168 325736 768865 -435412 -2762540
16565 -2762540 -3940641 -2979696 -1884357 -2576100 -2796695 -1952601 -878648 -277044 1003173
16556 1003173 2370594 2233956 1349319 -674949 -1324004 -1401116 -487523 1110205 3166358
16547 3166358 3774292 2704263 2517458 2781344 2741687 2284884 1075247 -377159 -833633
16538 -833633 -1271188 -1176415 -137294 1786493 2720328 1915996 1741333 1257750 514575
16529 514575 44737 107828 1412506 2045436 -390417 -2644204 -1753813 -62759 583019
16520 583019 215365 -361324 -1027046 -457333 -444194 -1242513 66582 1613245 819031
16511 819031 -995757 -1012688 370439 615696 460463 489760 429656 -192595 -429497 -755441
16501 -755441 -833099 -1182611 -1663208 -1678433 -2360181 -2048645 -745581 1093363 2397469
16492 2397469 2165081 1678690 1860541 1526660 1431861 2166692 1789673 633433 -843195
16483 -843195 -692212 1425790 2653014 2407739 1773031 2355553 1548610 -308168 400489
16474 400489 1648202 2711877 3216270 2506884 1566916 452596 -1009382 -1663970 -1454882
16465 -1454882 -476961 563618 425415 172014 -182624 868132 2150844 1233522 685521
16456 685521 732680 1000238 1227829 739251 700293 1700600 1851553 903010 371832 -650793
16446 -650793 -2064805 -2254732 -1414796 -236410 -407443 -1050540 -867299 -79151 1019419
16437 1019419 1853496 1561519 1191254 1590749 2189599 2699836 2548424 2397449 3012447
16428 3012447 3101773 2136615 249511 -934974 -1456038 -1813043 -1845997 -1128480 591675
16419 591675 1696446 1858006 1917002 1341774 353864 -43651 -255429 -587915 -1110638 -856770
16409 -856770 -436593 282417 939581 985460 1580254 2004149 1463371 679310 770423 2556510
16399 2556510 2981346 1671904 -40894 -494672 -508187 -531985 -176475 -513133 -193463
16390 -193463 698502 306879 -693775 -413061 1078528 966556 345238 915455 909056 735644
16380 735644 1976568 2804363 2675867 1710637 880372 646379 -397615 -992961 346908
16371 346908 711435 126372 -85829 267573 1452011 1569775 476972 -49290 238821
16362 238821 719567 2155757 1758379 125004 549128 2063101 1264092 -1151987 -2639486
16353 -2639486 -2560174 -1045913 -747198 -1339200 -949391 -62891 1345544 1875110 1116450
16344 1116450 290906 649824 1526631 659173 -691790 -1400406 -1694918 -2763942 -3224937
16335 -3224937 -1909483 -476816 929059 1227055 -874429 -2736702 -3165936 -2916677 -2691376
16326 -2691376 -2629597 -2207678 -2412070 -739588 1358672 1030766 -1314724 -3191509 -2579278
16317 -2579278 -1557494 -1482270 -1293898 -35608 2175728 2551813 1109021 -53842 -723488
16308 -723488 -467261 872946 659638 -976173 -2205005 -2233083 -1635839 -1047109 -281225
16299 -281225 553055 1152948 2274399 3295322 3294782 2877137 2200155 1789988 1183627 790074
16289 790074 772572 630300 765912 693279 234715 96732 240344 515143 1225681 1443120
16279 1443120 1201154 1688914 1205093 1693372 3750218 3869948 3196221 2992845 1019863
16270 1019863 -714887 -807105 26407 903136 2626990 3523374 2970843 1109392 -636357
16261 -636357 -599727 -628895 -563062 -109624 625379 1561587 1633452 1407187 1831837 2088654
16251 2088654 2047806 1385165 816015 1708385 2272066 3074079 3554361 2696461 2112148 918204
16241 918204 -1101767 -1552005 -692415 -244004 -481704 -609092 -1080075 -1138440 826383
16232 826383 2115360 1175075 140304 -1351573 -2243068 -1202832 -486574 -912121 -156997
16223 -156997 1047808 1251236 637001 70800 472416 1321617 213158 -1251183 -738551
16214 -738551 -1261843 -1262181 -336371 127035 -63069 -587504 -1331416 -2248168 -2589687 -1724787
16204 -1724787 -873121 -1067569 -613820 869284 1568953 876526 818381 -24878 -832738
16195 -832738 -511103 276769 731899 1249536 2139042 2171015 1395920 524817 -698652 -1574216
16185 -1574216 -607599 341364 1792956 2848576 1797024 1028269 1226878 1235883 921937
16176 921937 -897591 -2648804 -2788377 -1320135 -386074 -1292558 -2260285 -3129052 -2853941
16167 -2853941 -918531 37776 697090 1197994 1984914 2226493 1226596 -601585 -1368063
16158 -1368063 -342777 -589549 84568 1333321 36745 -1907691 -2093927 -1078600 -1285246
16149 -1285246 -2453257 -3006119 -1354323 608113 1616245 1316202 1215422 976364 3170
16140 3170 -859535 -1740914 -2788046 -3107231 -2187807 -1743740 -1261286 253190 -282853 -1208332
16130 -1208332 -1170488 -1095830 -189574 -34327 -783874 -1855454 -2301839 -1456984 -11628
16121 -11628 854961 1809840 2302442 2104020 2468792 2179799 1354405 354377 564325 1531862
16111 1531862 2514892 1992712 302940 -1058019 -1486562 -132180 955792 1534774 2439216
16102 2439216 3086431 2786144 1616056 159393 -820246 -1007723 -207898 1431772 2909197
16093 2909197 2574548 1475778 -162721 -2394198 -2343139 -570274 -582202 149339 855288
16084 855288 1425041 1848923 2371888 1942919 496157 83310 1329123 3028503 2959562
16075 2959562 1880259 1177616 810420 809253 949812 -806 -1095373 -1617054 -102454
16066 -102454 1375252 1858653 1763589 1314580 687664 1502910 2284421 458966 -1186187
16057 -1186187 -1016905 318117 2031633 3632786 3362522 2375904 2495534 3416141 3887630
16048 3887630 3027604 1994858 1406851 480185 20020 547570 715378 1232678 847658
16039 847658 58190 -1200037 -2893394 -4044365 -3462793 -3276546 -3008501 -3337116 -2651282
16030 -2651282 -785472 -432112 -899906 29298 2102431 3626727 3215091 2889159 3356248
16021 3356248 2803385 3619833 4566119 3874596 2692712 2825201 2634148 1783500 882345
16012 882345 929483 873647 921896 701632 -389572 227797 793173 136513 -270445 549368
16002 549368 1135661 -194780 -913167 -868618 -1756417 -3315621 -3532054 -2104327 -657648
15993 -657648 9300 243922 -1250 -1417212 -1711427 -955203 -1185351 -924086 -233897
15984 -233897 402721 1025316 806308 494 75301 -176152 -296875 165619 1030806 1780679
15974 1780679 2820891 2697188 2027454 451763 -1803279 -2098244 -806741 -94557 68344
15965 68344 -1494039 -3657516 -4020461 -3107360 -1012275 -145672 -854421 -2924405 -4909536
15956 -4909536 -4774441 -3513983 -2196148 -483776 1030543 1571425 2058479 1849876 914217
15947 914217 -260865 -908062 -695066 -46829 951349 1421817 -28477 -1749802 -2591036
15938 -2591036 -2662282 -2207159 -722234 607575 1204358 1692144 1964566 938754 -349415
15929 -349415 -978500 -1806471 -3377428 -3642252 -2841702 -2437942 -2143752 -1217879 -1635942
15920 -1635942 -2695711 -3539472 -2721342 -802516 -295688 15089 555044 2061371 2630015
15911 2630015 1815135 324786 -684798 -27967 2077535 2525865 1283436 655576 84942
15902 84942 -250133 -344578 -1160810 -1160936 351285 1648946 2468899 2763466 2817818 2988274
15892 2988274 1610314 140416 -65212 1742065 2510291 1442896 473813 -897737 -3216340
15883 -3216340 -3731622 -3010664 -1943513 -1468095 -2645029 -3139662 -2326304 -908513 621284
15874 621284 606092 -61822 -505048 -754586 -876223 -1131387 -356832 448745 894796 743448
15864 743448 57012 -247630 -840692 -1151690 -322339 -25275 -225810 -511248 -1605449
15855 -1605449 -789761 859740 1139868 1721570 2089380 772503 -618053 255940 129695
15846 129695 -157408 -53476 1241030 3351316 4528666 4119577 2388285 1019181 1196785
15837 1196785 1064674 86490 102643 534650 -294649 -982243 -253862 1216893 2280650
15828 2280650 2160082 2263960 2430747 3467084 4169323 2708465 775013 -250852 -1528661
15819 -1528661 -3139171 -2760787 -1268635 -174805 345709 659195 1374854 1516538 566523
15810 566523 -526376 -1529678 -2103976 -2271281 -2442760 -1272961 892824 2419523 2392609
15801 2392609 743815 -760392 -2588018 -3408050 -2460739 -1782492 -1603594 -1448712 -956341
15792 -956341 -370171 -136873 -84613 545348 1435124 2557847 2637375 2315337 1770474 690521
15782 690521 617802 1761563 1704215 1727165 1994249 1561966 -283583 -1429572 -582066 79579
15772 79579 -426046 224228 761072 1275557 1134215 -559154 -1897103 -3747630 -4641022
15763 -4641022 -4192215 -3050089 -2146245 -2041758 -1547818 -709936 628665 1724744 1718139
15754 1718139 1102099 -181868 -530705 174459 357531 1063903 915949 -745356 -2746632
15745 -2746632 -3625492 -3239365 -2261417 -1403425 -1631514 -1659222 -977937 891306 2857670
15736 2857670 2969692 2230940 2388292 3535551 4875662 3139499 216416 -497726 -1733592
15727 -1733592 -3126164 -3823075 -2832639 -623325 75913 -322669 -1148256 -489640 463925
15718 463925 538382 637268 -36053 -358073 -190354 -279160 -251773 -2004553 -4547249 -5194013
15708 -5194013 -4661941 -3222572 -2524148 -1039312 288346 87510 114007 1005368 1878300
15699 1878300 2469928 3607674 3440264 4097298 4731762 3185591 2340605 1548744 183213
15690 183213 -669934 -1598498 -3276954 -3149036 -1179862 -222683 732526 2303860 2757545
15681 2757545 2551816 2686112 2489357 2090974 1407774 69473 -1035682 -391849 889337
15672 889337 1569879 1400906 492316 -988555 -2649924 -2937875 -2087211 -2123710 -2124069 -1456553
15662 -1456553 -39045 586438 37656 287006 305050 -238571 -1027266 -1041493 -170717 298107
15652 298107 262566 -899241 -1257005 -975460 -978004 -1419199 -1817898 -2084366 -1729324 -667759
15642 -667759 -410145 -1324145 -1831569 -81427 2082587 3092230 2746142 1933645 1614246
15633 1614246 1107768 206763 -382203 24621 611862 1719049 3388998 3882864 2910245
15624 2910245 2277635 1715538 1481818 1653209 891946 180389 217847 303084 973984 1515400
15614 1515400 634050 -1188847 -493453 1641535 1707281 968779 1159390 890997 41009
15605 41009 -428203 -803241 -1667009 -2086698 -1066854 561220 598338 778095 1664630 3318960
15595 3318960 3440929 2481969 1628173 1084624 614001 -469780 -398136 151683 -43882
15586 -43882 -148653 165825 197421 369383 -19240 -1496240 -1603614 -219366 15027 -348808
15576 -348808 -915991 -814530 -759969 -300386 -139154 -680699 -327386 -687767 -1058279 -259411
15566 -259411 432237 1753290 2807330 1914302 395959 -691005 -1568401 -1536224 -643655
15557 -643655 -98371 -179915 -1186791 -1771863 -2256843 -2503721 -1991694 -520783 519314
15548 519314 -112722 -818625 -1452172 -1495331 -1568521 -1067068 -569080 -33124 1444669 1791670
15538 1791670 749814 236893 671981 1816058 1880249 1402358 78864 -1705796 -2288067
15529 -2288067 -2352915 -1737670 522510 1949200 1956665 1826997 1369955 214115 -433021
15520 -433021 -585766 65868 953708 1771088 1867601 2342288 2818558 4211954 4667549 3445503
15510 3445503 1938073 1263299 913437 -112557 -1380406 -2010926 -1923794 -2328881 -4063533
15501 -4063533 -4604157 -2701796 -760983 -469024 -250126 620184 863926 21701 -135337
15492 -135337 277210 137250 64564 1826439 3624700 3935686 3118191 1193867 301361
15483 301361 346738 1218583 1864953 1576259 781017 -560473 -192986 384555 -197688 -1427173
15473 -1427173 -1852928 -3390317 -4833735 -4549671 -3129599 -1544620 414834 1707170
15465 1707170 2024949 2960660 2561694 1526439 1409037 2243842 1927134 1326205 1509926
15456 1509926 2107011 2604200 3314497 4257013 3927217 3346345 3338956 1436922 -603704
15447 -603704 -689694 -87747 -595482 -1023465 -620644 -150290 689326 1335083 251573 118969
15437 118969 773812 725441 -1050348 -2737409 -3824508 -4154898 -4006049 -3922293 -3770219
15428 -3770219 -3045274 -1613307 -992165 -947185 303507 1575343 1992207 2407931 2692941
15419 2692941 1768500 1054540 535234 -448745 -974856 -1743184 -2199361 -2332828 -3787953
15410 -3787953 -5201711 -4099305 -1516543 430004 632420 590364 972447 1650365 616841
15401 616841 -288531 -476958 -1073279 -1665073 -2067185 -1724391 -1857245 -2816340 -2386299 -1469575
15391 -1469575 -1368033 -860753 333043 730278 -204893 -1021577 -1730245 -1686931 -1668713 -1242036
15381 -1242036 -792644 -746962 -713863 -238821 -416133 -1016687 -1386641 -592292 -401766 464657
15371 464657 501161 507875 633542 604150 477723 1217917 2397548 2096295 1245579 390014
15361 390014 598132 755279 409135 540311 -107240 -1368891 -1073024 505677 1192241
15352 1192241 264628 -933205 -1587671 -2642969 -2630560 -867647 1369706 2387074 1833786
15343 1833786 1692647 2517721 4011217 4057878 1915466 151631 221349 481195 -443350
15334 -443350 -987232 -1095850 -2578611 -4275645 -3815002 -2549433 -1622083 -1023475 672361
15325 672361 2917970 4449728 4296924 3059441 2139112 2221548 2624520 1675773 436625
15316 436625 593975 462694 655955 1081540 1757259 2653446 2869510 2223328 1063461
15307 1063461 949494 2126526 2193549 1198927 1337619 1205599 957360 497983 98987
15298 98987 237575 506080 1334466 1676784 2470251 3896317 4346193 4994999 4381235 2356771
15288 2356771 919517 553031 -70033 -617080 -946910 -1067736 -924228 -2177577 -3587647
15279 -3587647 -3754870 -4032770 -3744382 -3085156 -2085959 -1069972 -44908 1070664 2558011
15270 2558011 3932697 3280392 1843491 1698204 1468719 1346048 2083490 2930582 2872326
15261 2872326 2424708 1656645 254565 -453375 -801383 -917031 -879198 -398230 632183
15252 632183 412967 -427006 -1908106 -3585194 -2879710 -690134 668415 336058 -121322
15243 -121322 109741 286949 338929 381437 647175 1002014 463676 -451837 -340358 1081968
15233 1081968 2112272 1840352 1472668 789133 260102 246559 1472652 1733089 -655849
15224 -655849 -2891711 -2674638 -1817814 -1897812 -2061789 -1820378 -2311092 -2530801 -1947799 -757712
15214 -757712 -817054 -203087 -125659 -170364 -255655 -722619 -662404 -1116445 -2087065 -1700631
15204 -1700631 -1078479 -1418802 -1684308 -1773151 -681495 -191090 -1362502 -2487450 -1988783
15195 -1988783 -366012 282769 -224634 -702224 -486998 -1087668 -1646949 -777626 1483969
15186 1483969 1991211 214041 -574492 -508126 -1350117 -1089391 -653805 -585116 345150 744057
15176 744057 -200325 -1071542 -1763855 -1784934 -1481882 206239 2193601 2061436 856569
15167 856569 509505 1435933 1734235 1801894 2015682 1766890 569956 -682118 -1822549
15158 -1822549 -2495956 -3617722 -4489181 -5337839 -6478383 -5718864 -3763656 -3627136 -3203349
15149 -3203349 -1024663 600028 1266508 1796404 2474724 1332217 -1919 -130781 -761848
15140 -761848 -213561 -159606 -321219 698094 1595291 1972929 1961249 1495601 1459437 2657479
15130 2657479 3934564 3692182 2571271 1824679 1803831 1780778 1882263 1978480 1544655 1458357
15120 1458357 1471497 2065069 1970299 1687198 2278944 1738333 143674 -569582 -1347414 -2059438
15110 -2059438 -1467921 -518148 -1256511 -467652 404977 524166 1657353 1993492 1808255
15101 1808255 1005545 -74489 -83587 1355935 1717824 849231 1041218 1019899 -45444
15092 -45444 -1533928 -2675422 -2580069 -2254752 -1736227 -1282321 -1095409 -109315 1256911
15083 1256911 1489664 581971 -356582 -1364994 -1790504 -678311 202213 -231070 -675572
15074 -675572 444963 1973660 3318875 1577348 128271 -608600 -1066083 -1943522 -2869832
15065 -2869832 -2382595 -2821009 -3234253 -3354469 -3800834 -3490756 -2737351 -2542608 -3378127
15056 -3378127 -2895885 -1647669 -1320604 -1762281 -2459039 -2154258 -642838 -50904 -309909
15047 -309909 318484 202443 -386708 -2691 -155250 -202438 -25719 632772 1601407 2442575
15037 2442575 1370397 -265642 -525125 655927 1592354 1547992 1239652 1813588 794697
15028 794697 -104293 614934 1275706 1755538 1268521 -176150 -1481636 -875551 -392960
15019 -392960 -780230 -1847385 -2351085 -3363234 -3000809 -1113869 -554671 -1296826 -1967941
15010 -1967941 -1785873 -937313 327421 934787 412039 115801 200714 263827 284683 305808
15000 305808 316055 110028 883702 2473987 1376315 -668787 -1610492 -1900065 -1874033
14991 -1874033 -1851576 -1880556 -807360 723396 1583268 1286296 1291392 2432441 3769797
14982 3769797 3429703 2461817 2481303 1462091 -1168895 -1127997 -893296 -802996 74529 810194
14972 810194 1490406 1564108 2344107 2624963 986716 1169603 2649662 1514919 -767918
14963 -767918 -2620037 -3096349 -1519293 336307 298013 -412251 -676600 -323479 565596
14954 565596 271123 -991321 -1539236 -1465739 -1588355 -2444283 -2186308 -330133 1725945
14945 1725945 1277844 -393503 -1216099 -115159 1845321 3008163 2265059 997596 -185062
14936 -185062 -50152 752532 1352356 1634353 1341728 257608 -1028024 -1422445 -324861
14927 -324861 1968574 2202737 -165912 -1465741 -700287 -401911 -1576908 -1995443 -1299760
14918 -1299760 -1421566 -1862797 -1412067 -1681556 -1773811 -1244616 -1630474 -1333935 -1306376 -1674927
14908 -1674927 -1913060 -1098489 1213793 2128779 1664972 267473 -984119 -1221773 -1516725
14899 -1516725 -2559811 -3601078 -1837981 283257 743086 -50326 -359324 -59943 824421
14890 824421 1281513 492855 940592 1059893 257265 64088 -901879 -1699371 -883985 551636
14880 551636 537187 329435 902554 2693632 2699584 2135940 2873139 2626116 1859144 729581
14870 729581 55075 802078 958658 1035247 700204 836122 973889 -252426 278162 1246556
14860 1246556 1392503 738453 75399 -118542 505209 775164 -182186 -750925 799839
14851 799839 3050535 5078724 6440124 5822179 2788424 852427 -586368 -1955336
14843 -1955336 -1602110 -348234 167176 173754 404561 -379807 -650654 -1308391 -2854241
14834 -2854241 -2695526 -3120934 -3192691 -2412982 -1804227 -820223 35787 432442 1400531 1302280
14824 1302280 551528 1195012 1882715 1956929 1169907 -310890 -2056478 -2243749 -821754
14815 -821754 -304156 -1246026 -1405035 -1047867 -390627 117584 -560563 -314158 -896814 -1236484
14805 -1236484 -1271657 -1702354 -1968732 -1516918 -481601 -129776 -89669 889577 1501429 619723
14795 619723 -257097 -451415 -327956 106939 539496 465050 -54097 -697305 -1243241 -437032
14785 -437032 -415934 -162712 2266036 3884461 3237122 1737936 1420239 1160651 -49792
14776 -49792 -673761 -43516 -170175 -897978 -284540 372323 -81850 681323 2165374 1512709
14766 1512709 -178780 -1452994 -1539547 404150 2076666 1595980 -116106 -488997 -102441
14757 -102441 1373351 1785359 1464469 1393959 1323601 993518 1386892 1513810 952537 191582
14747 191582 -767338 -1158180 -1805089 -2320876 -1887200 -1809652 231313 878278 1046435 186462
14737 186462 -1125585 -1110324 -443718 -37376 -1020027 -1152982 -178029 1073577 958113
14728 958113 915143 1351638 2110896 2633512 1866503 1739825 1675626 1842036 1775360 423518
14718 423518 -150650 -770306 -241518 1839903 2085806 540278 -1483772 -3031285 -3492859
14709 -3492859 -2033175 -212028 498494 667534 1721194 2040129 1375652 1406281 960365
14700 960365 1418452 1870267 1695490 1447023 976688 1172903 1170442 513388 108026 -250879
14690 -250879 -929668 -884020 -805518 -544830 -400372 -339064 150785 563184 1324096 1911955
14680 1911955 1286698 390675 1238397 795818 -83888 -545957 -149829 1658237 2393389
14671 2393389 1584976 2043236 3547479 4489149 3029093 1663354 1301983 1851811 966893
14662 966893 -1080041 -1876904 -1530476 -1218483 -773136 -71599 -164465 219734 -60 -555221
14652 -555221 -677258 179816 1011360 905258 -199641 -1472469 -2255466 -2461189 -3341287
14643 -3341287 -3071988 -1552906 -318051 78841 43070 485582 120350 282324 1054486
14634 1054486 2231892 2446725 1259794 914241 1601017 1205620 73016 -570525 14139
14625 14139 1467238 1179663 -472008 -1008622 -1396338 -1863741 -1494141 -1478486 -1542614 -951801
14615 -951801 526310 147666 -1231996 -1972514 -2543333 -2642907 -2334584 -2057372 -395017
14606 -395017 1710413 2758653 2072259 1828049 1698257 1358029 753536 246256 60437
14597 60437 164939 292512 -6151 -534753 -1536096 -1289780 -48978 968028 1862044
14588 1862044 1162147 -498621 -655358 183324 1348422 2729457 3387958 3016464 2512465
14579 2512465 2109920 2443117 1865675 794809 -916771 -340071 938634 86891 -1422536
14570 -1422536 -1212417 -695530 -1621208 -2732800 -2470254 -1521631 -174182 -86721 -379478
14561 -379478 -1772005 -2830902 -3047500 -2697538 -1771281 -1977622 -243584 1199282 265300
14552 265300 -1574599 -1235725 -1363968 -2307723 -2953445 -4351445 -4925882 -3972357 -2584765
14543 -2584765 -1476661 -1395805 -2124913 -2485393 -2464705 -2533049 -2667852 -1445818 -229552
14534 -229552 296242 588110 171825 -225323 -6321 612163 -45862 -773130 -2659705
14525 -2659705 -4035396 -3068598 -1524718 -778820 -80592 676788 1599582 2268905 2372669
14516 2372669 2831880 3305341 4039210 5028843 4383655 2976397 2235666 1031729 -47159
14507 -47159 -491224 -945255 -1379035 -563820 69115 315660 -812903 -1506243 -1185876 -2879060
14497 -2879060 -3949691 -2411841 -81641 674406 46891 116403 -7550 -86665 187938
14488 187938 742952 1186408 1426564 1555139 1752151 2663635 2717152 2788504 2831532 1675920
14478 1675920 186997 -1017504 -580064 485441 1031059 -69617 -1812265 -2331023 -2050677
14469 -2050677 -761289 954575 2541598 2791547 1469151 716614 908237 -260208 -1590117
14460 -1590117 -2103237 -2139446 -1801887 -1044197 -292359 -1244413 -1185484 -1297066 -532787 -1063117
14450 -1063117 -1420024 -614415 -49518 445380 282995 -79691 -642122 -1259510 -1393309
14441 -1393309 -360527 803210 554777 -974147 -1642641 -842587 245160 -91350 -1021336
14432 -1021336 -1367753 -1371750 -1718199 -1972645 -1324874 -1294623 -984859 -99484 448438 518268
14422 518268 -689126 -957304 -761561 -491097 532305 1152675 1517171 1448535 1118756
14413 1118756 2019611 3709561 4876963 3762660 2180457 1870633 2182559 1017316 -58067
14404 -58067 -543987 -1474047 -1875007 -1799418 -1113625 -1243249 -2042530 -2566192 -2509223 -1442564
14394 -1442564 -1086244 -2492251 -1939836 -713802 -1698138 -3103491 -4192974 -4147045 -3402673
14385 -3402673 -2900021 -2086308 -764382 332790 1065245 397873 -568124 -385556 -266124
14376 -266124 -768845 -822344 -660123 -400919 -1278153 -2482070 -3390503 -2480564 -1285191
14367 -1285191 -1943282 -2507633 -2264975 -2241001 -1526632 -494516 -139648 -232144 -1015259 -977577
14357 -977577 -551182 -1676769 -2623757 -2959411 -4199002 -4204853 -2260481 -1083220 -1295145
14348 -1295145 -1041373 -268122 288487 1139095 993628 -980092 -2173089 -1975525 -2793831
14339 -2793831 -4029792 -3867901 -2491250 -139964 1114472 802007 431661 745925 1664500
14330 1664500 2582485 696153 -1736890 -1549078 -927273 -2034910 -2704384 -2210267 -1301390
14321 -1301390 -242851 -415409 -633575 -1057636 -897274 30188 -220013 -1364392 -2762839
14312 -2762839 -3790018 -3027984 -2388867 -2287769 -415121 1132393 729016 -99804 -1481543
14303 -1481543 -2753909 -4022064 -4508569 -4366376 -3682221 -2870703 -2695242 -2316159 -2246369
14294 -2246369 -2668545 -3779181 -3467097 -2530391 -2574144 -2404079 -1989672 -1679514 -1518877
14285 -1518877 -2411164 -3241058 -4030856 -3601800 -2858173 -3430708 -3463088 -2932429 -2301278 -612364
14275 -612364 1844149 2262078 862941 -727 36416 -792823 -1111342 -779388 -1234705
14266 -1234705 -1678369 -1268323 -752453 -817107 -1611701 -2661127 -3312373 -3414075 -3088179
14257 -3088179 -3022742 -2471952 -1201297 340530 1040320 320598 1669529 2541553 1926811
14248 1926811 1388979 2496103 5213892 6170345 4449128 1327538 -451265 -328004 974336
14239 974336 1632629 1949866 2476689 4324451 4648283 2784321 1553035 1299378 625621
14230 625621 618632 1639920 2931004 2896468 1323370 -428060 -888465 -1520824 -899798
14221 -899798 79534 75282 635406 1654342 955488 -603737 -2609218 -3120580 -461675
14212 -461675 1435579 1515838 -166807 -2077249 -1844128 -260228 298269 450961 165490
14203 165490 -660219 -1701023 -2027647 -337449 2416539 3236918 2218511 1617390 1428877
14194 1428877 1426881 2190354 2812416 4447959 4973359 3827844 2518384 1316326 1647811
14185 1647811 2918894 2412933 2434112 2302921 1365298 953362 1301448 711321 433448
14176 433448 201507 311136 920003 38988 -1634922 -2206873 -580656 250708 -265687
14167 -265687 -196148 -65841 -341604 -776828 804306 2291600 1233991 24123 -575125
14158 -575125 -736822 -589740 -208172 -8569 257057 100755 1230611 2099295 916611
14149 916611 196610 -997189 -2462342 -2083079 -745750 59204 86816 -1408462 -3582433
14140 -3582433 -3601580 -3182326 -3328325 -3047010 -2994696 -2647198 -1895016 -2248401 -2553873 -2299464
14130 -2299464 -2407250 -2286861 -1789367 -2000657 -2299939 -3683665 -4237104 -4226442 -4674885
14121 -4674885 -4898129 -4014686 -3469303 -3498314 -2840792 -2183904 -1436173 -1650841 -2457291 -3060063
14111 -3060063 -3275822 -3645112 -3457557 -2145370 -863962 -313219 -360307 -696973 -500078
14102 -500078 19815 783056 719308 112418 178771 276423 75340 -879870 -1599096 -2455514
14092 -2455514 -2445620 -1668227 18156 306279 -390035 -594049 -85058 1641976 1466845
14083 1466845 522523 1069402 2304525 1468183 53673 -259733 -149301 81521 914521
14074 914521 1850201 1594809 1080941 -601639 -1585501 -606521 411046 271427 -229855
14065 -229855 265289 -49462 -932674 -1053461 -449959 -593021 74720 735577 933864 558403
14055 558403 281957 512820 674663 637779 -205697 -216265 1255411 3198273 2399710 644202
14045 644202 364648 -734954 -1050232 -738778 -1916549 -2701647 -2208973 -973341 -337034
14036 -337034 361304 644677 -13635 -482136 494329 962135 505344 1110965 1150487 917657
14026 917657 357627 -39507 307789 879385 1512667 2963029 3782618 3067922 1835385
14017 1835385 2336815 2255156 710914 -154388 -276756 567464 1802890 2930824 2579587
14008 2579587 1613916 2044924 2825192 2450117 2035314 592671 -722995 -2044516 -2250933
13999 -2250933 -1182100 645326 2016997 2489368 2227316 1462128 829154 865263 1457106
13990 1457106 1356347 -338451 -1574600 -1154817 -239497 866769 1567089 1798397 1863041
13981 1863041 2218276 2105499 2078940 1608044 511674 -623378 -240755 611751 444856
13972 444856 -415126 -906998 -2197026 -2416573 -2514273 -2714660 -2511845 -528205 1138826
13963 1138826 735636 -815070 -1522866 -845851 -578116 -1463634 -2853620 -3095138 -2500335
13954 -2500335 -2236654 -1191364 571375 2174645 916940 -2448365 -3464604 -2714711
13946 -2714711 -3121936 -4401814 -4813539 -3518357 -2129853 -1611985 -838967 -1075076 -1690018
13937 -1690018 -1293878 -647741 -2247091 -3417366 -2464746 -581923 1190525 1162215 898097
13928 898097 521037 -66457 110924 978734 2071894 3179914 2942943 1910532 1429161
13919 1429161 773037 580766 -900927 -1522303 -981508 343522 1341355 1224581 1248932
13910 1248932 1711775 1629544 869583 232508 -592053 -1062059 -1205045 -2074849 -2385594 -1098359
13900 -1098359 364763 923372 419577 688705 1305791 964425 -105575 -1136001 -248689
13891 -248689 484639 1567457 2845483 2528630 2163000 2007339 879206 51991 -236343
13882 -236343 802511 869351 125630 -968525 -2049376 -2593565 -2836139 -3290982 -3202207
13873 -3202207 -1327302 585499 2473830 3020568 2951172 1327791 -373121 -876465 -1741600
13864 -1741600 -1868324 -1734962 -2705567 -2789336 -550244 1111070 1781228 2179052 1940956
13855 1940956 1202823 1467278 1974846 1680148 391732 -1215361 -1496081 -751254 99124
13846 99124 1486213 2185252 1913630 1040140 327954 -25169 1439647 3635088 4943835
13837 4943835 5568458 5511605 5053718 4600917 2556698 757868 1330697 2121460 1186029
13828 1186029 340690 -186951 -156815 37720 -652790 -1856055 -2293194 -1753757 -2134933
13819 -2134933 -3297525 -4785337 -5574736 -5541101 -4129025 -2850884 -1773144 -1034004 -333453
13810 -333453 -325323 -446049 -218513 338746 -187964 -784305 -298063 172327 987668 1002905
13800 1002905 21061 161904 561712 644849 -615330 -1169648 -982871 -1447987 -1517410 -204882
13790 -204882 147063 -268675 -95468 67088 -316155 -224266 -1324014 -2003422 -361982
13781 -361982 634456 -544117 -2549474 -2619952 -2170611 -2189639 -3499707 -4769125 -3986556
13772 -3986556 -2476192 -2567920 -2971085 -1686005 -1659797 -1900795 -979901 -494849 -589237 -608099
13762 -608099 -235827 -206103 -626715 -1718353 -1683745 -1973656 -2413213 -2190694 -2140240 -1723283
13752 -1723283 -1030649 166221 524738 -80739 -487799 -1723180 -3304791 -3040291 -3034125
13743 -3034125 -3796444 -3925504 -2490123 -1023387 -154619 356607 468852 -378053 -921829
13734 -921829 -724609 20283 348408 1125361 1475773 680172 316088 606814 1506070 2397494
13724 2397494 2147115 1165999 1648606 2275511 2452746 3184047 4001033 3123799 1958478
13715 1958478 2021122 3255100 3762400 2474084 643132 -1084310 -2873128 -2409804 -628384
13706 -628384 305107 607498 557056 590059 621488 -209187 -468548 -1514928 -2952971 -4212161
13696 -4212161 -4818016 -5195758 -4969329 -4847285 -4559125 -3253366 -3443226 -4483195 -5235843
13687 -5235843 -4934796 -3929128 -2859061 -890845 1535 -814687 -874201 627473 1961019
13678 1961019 2912698 3174501 2307449 1246510 475197 399568 17149 -319060 -643236
13669 -643236 -1708087 -1310209 -625305 -861738 -1072463 -1363548 -1632710 -1148592 -837198
13660 -837198 -1047837 -1024039 -502923 -618065 111805 981951 191688 -896688 -563436 -306111
13650 -306111 -1217782 -1307348 -1221057 -2444476 -3204167 -3389049 -3900541 -3554494 -3415388 -2590998
13640 -2590998 -1287915 -1019908 -1215612 -1439255 -2297436 -1415134 979910 1947388 1742723
13631 1742723 522651 -752579 289397 1930331 1815958 -313537 -437301 1135905
13623 1135905 2318396 2678232 2615650 3031318 2786795 1657692 665514 -1747332 -2573847
13614 -2573847 369868 2672354 2687449 2755610 1554929 921173 1311827 1815199 1825732
13605 1825732 1969053 2581071 2611307 2866472 2734793 1698741 1181590 904329 -159332
13596 -159332 -668485 -690710 833353 1789203 575039 -1445468 -2361353 -2595165 -2276431
13587 -2276431 -2194132 -2312184 -1657653 -200906 22156 -1369292 -2357466 -1520530 -13461
13578 -13461 -79211 -1127138 -2670100 -3822862 -4719757 -3703226 -1752834 -202017 632045
13569 632045 765724 823728 850804 924873 1044026 1247373 12842 -821632 -325131 -670223
13559 -670223 -195079 -1105179 -2005570 -1170141 -340477 -525338 -2961947 -3977942 -2524553
13550 -2524553 -1493375 -815791 357484 1918733 2723027 2768282 3048915 2865983 2575126
13541 2575126 3329649 3368040 2485935 1408316 272392 1005978 1449377 1384884 1678112
13532 1678112 424320 -1478553 -1383454 116788 1124514 1028766 -218339 -837529 -917030
13523 -917030 230529 1177646 2191671 3466988 2439353 1486146 1252164 1216893 676300
13514 676300 489364 1084141 1253949 1780438 2382113 2249783 1409676 125975 -878614
13505 -878614 -1196842 -1606240 -1692250 -1535728 -993300 -765359 -1084970 -1490539 -1645723 -1413271
13495 -1413271 -1158003 -899583 -21540 1069024 1363209 544668 -985953 -1422050 -896469
13486 -896469 -591030 -305622 38154 59694 713737 1778069 1158946 -1496776 -2747475
13477 -2747475 -2743097 -1178462 698270 132466 -1776054 -2198754 -2467744 -2630971 -2341436
13468 -2341436 -1346195 -503906 -131396 -1159358 -1735667 -1644275 -363310 239228 -657683
13459 -657683 -1245996 -1091838 -487018 -569651 -432422 245784 771078 286912 19301 231196
13449 231196 644023 -150971 -1184490 -1241534 -1201964 -1440252 -2123218 -1574786 -125620 708320
13439 708320 1307592 1152729 236563 -89706 -876457 -1259697 47684 1155175 -25004
13430 -25004 -628551 -473854 227921 262342 -1046151 -1036179 214643 2251797 4159312 3757200
13420 3757200 1543072 -723692 -1739587 -318758 158354 -565379 -540499 -224303 -1035560
13411 -1035560 -1043038 -1359537 -1279500 -1091671 -377798 478294 682398 1614078 3424179 4811861
13401 4811861 4424740 3866455 3013229 1775775 1503814 1762892 1698004 72663 -847960
13392 -847960 -455158 -522441 -647435 -75733 -87037 318837 2011739 3516898 4694350
13383 4694350 4620254 2646783 584337 458039 1117305 1486825 1480749 1684993 1897631 1821139
13373 1821139 1403493 1932475 3698660 4053509 3046046 1947420 1586572 1389992 1987108
13364 1987108 3422589 3813454 2291725 1405487 1376250 1108609 1316626 2466306 3648024
13355 3648024 3635786 2203443 1910861 2571389 2119233 2048807 2467426 2017902 1706120 2953624
13345 2953624 3683688 3167528 878232 -547576 -759618 -883542 -860988 -167794 1067278
13336 1067278 2057351 1261348 296654 -313013 -944933 -1207412 -1792937 -2007715 -1430778
13327 -1430778 -734250 -669021 4594 667319 916038 1979617 3388317 2624898 1128326
13318 1128326 -710194 -1103104 -118967 -473562 -1654791 -2881482 -3593493 -1448607 916174
13309 916174 1500752 1904512 1974236 1223336 612563 684724 485194 468085 996306 1118676
13299 1118676 2089780 3516383 4286649 4774817 3494859 1694300 524148 74925 498743
13290 498743 1491137 2181213 2132285 2350832 2569228 1861389 999853 753833 2652635 3329327
13280 3329327 1752128 1329354 602384 -242474 770013 958466 434843 703162 525105
13271 525105 -419376 -445407 -294823 -988100 -2209822 -2998980 -1508326 158998 220247
13262 220247 33859 804179 1127319 -747339 -880467 653017 2762012 3444880 2521573
13253 2521573 1552859 559309 559825 1530024 2143234 1727541 846330 257843 811608 2342669
13243 2342669 3719376 4347055 3582306 1845777 1322743 2168873 2065830 796243 979773
13234 979773 1606528 1504919 884892 842604 964126 981427 836708 593227 104647 -284204
13224 -284204 671046 2223516 2943433 3109926 2884007 2733866 2586961 2206939 2871737
13215 2871737 3506596 4481775 3529603 2644762 2436964 2222089 2299738 2201828 2260993 1753387
13205 1753387 1204911 199686 -468334 61159 373926 -954412 -1052354 313657 1578798
13196 1578798 2932285 4016908 4368293 4135077 2522117 1578092 1595033 2093740 2078986
13187 2078986 1786616 2635599 4056686 4384329 2650600 2437399 3819787 3407123 1837184
13178 1837184 788916 176438 -549143 -1174316 -2246966 -2813485 -2399984 -1477216 -144550
13169 -144550 769815 228399 -922822 -1872129 -1215985 172070 93395 -5621 -32920 977550
13159 977550 2288007 3517555 4213171 3851696 2513890 879508 15781 124931 213655
13150 213655 903730 1812726 1715099 533427 -736333 -1391448 -1718456 -1615318 -429996
13141 -429996 1883880 2533482 353883 -2345125 -3094350 -2229653 -1517788 -1348083 -453037
13132 -453037 533216 1342891 1541976 475747 -169954 1010127 1578301 -33531 -825572
13123 -825572 1214285 2781548 1885002 566660 23794 285311 -120471 -790993 -1026084
13114 -1026084 -169063 438152 1093968 2082691 1961355 2125738 2340413 1878520 1252598
13105 1252598 939653 2057565 2619967 2015682 1363117 717548 318062 254785 486774
13096 486774 498798 1131823 2350331 1807980 917610 1223025 -449188 -1162011 -403081
13087 -403081 472055 1688112 1950292 1665296 2128907 2899293 2627133 1584057 1616980
13078 1616980 1550958 1223997 1842129 2891605 1563929 -472534 -1064492 -650841 228069
13069 228069 480199 182753 311454 1244198 2274122 3596793 4367045 3976855 3699932
13060 3699932 3620587 3022078 2636755 2628479 1342156 345681 345937 -689259 -1318054 -816739
13050 -816739 -1492882 -1633505 -341402 523628 945193 1451689 1307322 1214045 1501263 2334550
13040 2334550 4241285 5316535 5626985 4583132 2439049 1697338 1628695 1965440 3149533
13031 3149533 3712205 4317163 4609245 3737537 2880489 3058393 4182833 5265890 4837863
13022 4837863 3503474 3407618 3088133 1515124 -102388 -9887 674455 812742 1853936
13013 1853936 3017921 3366371 3075849 2566912 3441612 3674594 3752170 4237832 5201084
13004 5201084 5490372 4983142 4702289 4900299 4245079 2668374 1609498 2305934 2851653
12995 2851653 3601891 4396441 3609767 3687952 4366396 5436542 7607178 9886554 11181608
12986 11181608 11985386 12625325 13447727 13524306 13982849 15504719 18307960 18389644 17597479
12977 17597479 17981066 19636154 22290742 24610246 28388525 34220207 40361564 47064127
12969 47064127 55881448 69008478 88360209 115137338 150203544 195185096 247381867
12962 247381867 291704936 306348222 284332481 239535653 191051394 149819832 116110709
12955 116110709 89822087 70537276 56472847 45277169 36571557 31370495 27851015
12948 27851015 24576101 21444245 18095142 15180938 13542755 12263543 11391763 11189713
12940 11189713 11516417 11939390 12007509 9834838 7108042 6542696 6873823 7654925 8708746
12931 8708746 8934796 8116174 8012353 7791365 7942237 8094843 6948638 5926329 5214602
12922 5214602 5950820 7000942 6479244 6644656 7960135 7588494 6752489 6100483 5033881
12913 5033881 5803814 7306229 7132100 5457722 3993938 5305020 7048631 9115972
12905 9115972 12408432 15895509 17742032 17374328 16205681 14352792 13538283 13563649 13028726
12896 13028726 12560352 12339459 13456264 14169126 14639083 15432638 17300083 19256916 20949941
12887 20949941 23296344 27358138 32966381 39240995 48566800 60940214 75484779 96024025
12879 96024025 124936776 163030642 210759437 262631537 301806269 305952361 272073857
12872 272073857 221195040 172770816 132650898 102352741 80108499 64222502 53196286
12865 53196286 44422014 37775821 32349962 27211263 22502293 18639485 15738167 13649782
12857 13649782 12337441 11305930 10442527 8986027 8588450 9239280 8247976 7338935 7747711
12848 7747711 8254305 7913376 7841594 7429124 7137422 6739947 6286512 5850585 5808369 4568599
12838 4568599 2157523 2092014 2349677 2733865 4623922 5144642 4173954 3789569 3807144
12829 3807144 4085870 4290336 4753332 4678750 4059559 3340963 2826257 1778387 1443462
12820 1443462 2140292 2245355 2468532 3520592 4441851 5362580 5946086 6695476 7166073
12811 7166073 7730700 9247759 10227049 11112194 11607751 12474147 12803786 14176602 17034071
12802 17034071 20800237 24222951 26113087 28900822 34093705 41547516 51062344 62677439
12794 62677439 78051863 100424637 132047015 173984701 224779344 274043012 302241013
12787 302241013 294109150 254319790 203958745 158945634 123833807 96884862 77630658
12780 77630658 63077342 50888959 41479485 34894857 30180201 26739309 24194975 20796912
12772 20796912 17041316 14278470 12709627 11462092 9032944 8611323 8656210 8564821 8487204
12763 8487204 7010183 6625021 6401313 5325304 4347044 4250851 4761477 4820384 4908366 4824988
12753 4824988 3711277 2010845 1128131 1837130 1508133 375719 203716 -180274 -1040176
12744 -1040176 -1996361 -2629415 -2120314 -603384 675510 1693247 1745269 2571747 3541406
12735 3541406 2630613 1385029 1760533 2275032 2487589 1993978 1149901 -418129 -1877130
12726 -1877130 -2248465 -1173617 -20098 849193 1161218 602844 240293 1468133 2010331
12717 2010331 258595 -1441984 -2126245 -3105532 -3637260 -3054855 -1950377 -546004 386771
12708 386771 847123 1637824 1886275 959923 711129 1527271 2395682 3429418 2978879
12699 2978879 2952217 2444169 2472914 3600586 2717429 404550 -1052183 -1336610 -1386089
12690 -1386089 -1134904 -15583 792215 1716580 1885685 -355496 -1488773 -1322363 620017
12681 620017 3355488 3049648 1052940 897019 1095730 1771597 1177164 -381775 -178264
12672 -178264 613220 126922 -1173891 -1004196 -846905 -166377 288006 628461 1170237
12663 1170237 1415890 3237846 3533179 2602834 800767 -945433 -1383414 -1185794 -1202717
12654 -1202717 -2592177 -3668354 -2948441 -1703963 -922053 -1335974 -402519 517102 -548772
12645 -548772 -1311189 -1406033 -1447058 -779048 -299913 -140907 -185905 -185932 692869 1067886 160655
12634 160655 338032 1001407 1451760 1111217 156998 -192617 858595 1578644 502221
12625 502221 -750010 -414126 -196935 -620476 -621430 -70724 -388337 5214 1339693 1994068
12615 1994068 1658241 -2445 -594921 -849491 -1048963 64081 229350 -269164 -373084
12606 -373084 583829 503446 274625 2068193 2547910 1725240 1476186 765986 1056337 2186968
12596 2186968 3559856 3732912 2374823 1154353 984806 1620848 1742056 1578245 555434
12587 555434 -978711 -2443344 -2977021 -1967827 -233904 933030 180308 -1620389 -2315487
12578 -2315487 -2222104 -1336177 36024 494279 973970 1495577 1872600 2787988 2192713
12569 2192713 1783384 1583254 986058 207640 -228791 338870 1156946 1915772 1375163
12560 1375163 86449 -657997 -562997 222868 148840 42893 1052824 2718075 2752328
12551 2752328 2369721 2477382 2329746 2139651 1847306 1627348 2301545 1903370 1645722
12542 1645722 2221919 2111415 1797357 796167 870950 2130095 3317334 2521588 365213
12533 365213 -796955 -1432548 -1359453 -353797 604575 1475190 1272989 -244535 -789559
12524 -789559 37854 923659 959826 211081 118174 -142684 -153452 99969 -269441 93
12514 93 1112910 889808 -112476 -1558313 -2753893 -2666572 -1006832 456199 354757
12505 354757 395812 1500764 2547438 1758975 408433 239956 753996 1180884 1501710
12496 1501710 1685272 1842257 1540069 712994 -173048 -116917 725509 1429463 703359 -427104
12486 -427104 -1301455 -2005889 -1867351 -1294700 -937931 330189 1254768 731675 -151079
12477 -151079 -701563 -1488974 -1862082 -1386699 -1523704 -843003 -578728 -703086 -1211141 -1253959
12467 -1253959 -481323 -745647 -548735 -212555 -652632 140717 915906 1099877 749783
12458 749783 269961 -393610 -911224 -761820 -922923 -371326 113869 1440259 2520429
12449 2520429 2806809 2805666 3079639 2505433 1110828 1087681 1779067 1895303 1442856 1496091
12439 1496091 1900089 1065743 -363364 46584 550420 537689 589948 1076356 2683248
12430 2683248 4294662 5109304 5810849 5007152 3589287 2921264 3313278 2862579 2773647
12421 2773647 2925816 2437147 2538412 2867206 2035428 610899 34434 729927 1161527
12412 1161527 -269886 -1725497 -1837843 -2136660 -1840450 -801084 223090 742745 1315378
12403 1315378 1091317 373971 421162 795817 1512698 398833 -848955 -1492520 -3082042
12394 -3082042 -4076838 -2995260 -1770279 -651321 -167011 303785 1309858 944869 305464
12385 305464 294650 -444647 -1197141 -1642928 -1873087 -2901714 -2861989 -1791479 -752338
12376 -752338 -886279 -1391398 -1391984 -1597715 -718095 1052421 1428694 946972 1167110 1719626
12366 1719626 2366106 3051714 3146148 2975694 3064303 2430806 1462641 1209232 560879 -76583
12356 -76583 -834160 -2406129 -3333990 -3376716 -2124670 -926264 -673903 -306376 -237525 364028
12346 364028 769323 689378 314272 142881 -872361 -1838405 -2236473 -1793739 -557440
12337 -557440 -261468 57980 1069630 2122160 2243651 240471 -908813 104735 1078557
12328 1078557 1401765 636953 -382790 -196252 260336 729648 1323012 1985207 2137171
12319 2137171 1620882 2262083 3740791 4611948 4135230 2270513 502525 60883 1058074
12310 1058074 1388213 1063877 467561 -785705 -1988069 -2984785 -3397160 -2405166 -2007597
12301 -2007597 -3519321 -3518646 -2732850 -2304612 -2259810 -1728865 -2138533 -2812708 -3411293 -3550631
12291 -3550631 -3471878 -2684377 -1131185 -252004 347120 553007 697221 6313 -1422134
12282 -1422134 -2189284 -2005207 -2220478 -2217557 -2331770 -2639191 -3926780 -4290375 -2481729
12273 -2481729 227627 793368 -28028 -1039648 -2462173 -2945932 -3077833 -2547433 -2203899
12264 -2203899 -1759330 -1509914 -600231 -347032 -218307 457102 531663 -262103 -248006 940867
12254 940867 922305 492878 590218 384861 -128938 -490632 -220635 -525426 -1084991 -1172957
12244 -1172957 -648383 -663426 -537084 -132100 1152818 1372372 -393289 -1242399 -1485123
12235 -1485123 -1331727 -1176397 -691306 -126015 -1189027 -1342278 1076881 1836623 2126925
12226 2126925 2360323 1848184 723579 858251 1996262 1275893 -659822 -1380115 20457
12217 20457 1432198 1587019 664032 420212 1306297 2987891 3234114 2115614 1377579
12208 1377579 -843575 -2187829 -2329210 -1516866 -1051560 -2993113 -4232522 -3952573 -4106277
12199 -4106277 -3534808 -2228661 -1035224 -158422 -306832 -512995 -247853 -281081 -1042633
12190 -1042633 -2445400 -2280316 -1530330 -1588937 -1634931 -1669381 -1576106 -804799 -38953 582125
12180 582125 1869324 2149171 104551 -806537 -816849 -750929 628073 1884147 2313114
12171 2313114 647606 -359805 -1017823 -1403604 -935605 -145723 47862 1042521 1418349
12162 1418349 1612393 3014297 3118967 1977336 1092477 1250127 1504799 495459 299792
12153 299792 529098 916761 362331 -659475 -2092993 -3570947 -3377641 -2637259 -2645517
12144 -2645517 -3089599 -3225392 -2588660 -800188 636167 1395691 1618186 1796597 474739
12135 474739 -324320 615112 2173080 3034657 3034690 1023680 -243060 -1173574 -1463011 -620495
12125 -620495 1128900 3176123 4344594 5031253 3404368 1241173 292260 117764 747525
12116 747525 38233 -1585138 -1770599 -1167417 -758125 -1078888 -726104 465397 508104
12107 508104 -195333 -751358 403060 1831968 1340789 -389593 -1523564 -794341 188983
12098 188983 407283 179132 -681235 405082 1903302 1765088 266956 -1465515 -2414331
12089 -2414331 -2582606 -1638397 -644095 92101 -604574 -2245500 -3479722 -4106140 -3804871
12080 -3804871 -2587148 -2697819 -3792454 -3727483 -1723865 -708577 -77239 1434132 1844368
12071 1844368 1122497 289752 -701634 -440852 831982 1709297 1713200 2420533 3077197 2419293
12061 2419293 1181344 154635 -918674 -1367193 -1236251 -1726365 -1679395 -1251596 -1569684
12052 -1569684 -1190827 -728787 -1350256 -961541 -521078 -2108007 -2998822 -2071461 -594632
12043 -594632 -298329 -619851 -1504136 -1665201 -517653 920686 2649384 2921614 649432
12034 649432 -1302800 -2050629 -2304369 -2587940 -2664177 -2293338 -2075786 -2268858 -1264506
12025 -1264506 -1304697 -1957599 -1880214 -1749454 415155 1846848 2341817 2207180 1062691
12016 1062691 612919 -17688 -1874639 -2615406 -2319477 -2026749 -2333662 -2697958 -2522496
12007 -2522496 -2784027 -2995753 -2966888 -2737193 -2052322 -2556290 -2542765 -1265047 796342
11998 796342 1990441 2117273 1511698 -70085 -410395 -2122639 -3700914 -4621650 -5501024
11989 -5501024 -5081592 -3923011 -2968045 -1162186 -907121 -1264284 -275884 -141104 44540
11980 44540 1883985 2646267 1815455 1118634 1346582 1147110 513958 157280 -636528 -2257403
11970 -2257403 -3265309 -2533358 -1415757 -736298 -1582467 -1707318 -1743186 -2528394 -2787079
11961 -2787079 -2256089 -1690362 -1819996 -3583535 -5517483 -5008569 -2887730 -807460 336808
11952 336808 628154 681938 269060 222624 675479 1086208 684580 -192910 -733459 -589063
11942 -589063 798055 2471167 1904029 1259369 1572521 2070914 1010605 528614 868530
11933 868530 837169 883749 1369298 1184275 733575 356786 -1124423 -2677787 -2945844 -2955106
11923 -2955106 -2458717 -1379019 -817080 475519 1176824 1290314 1727137 2341560 2439200
11914 2439200 1779878 1245080 2031357 2720442 2784422 2090082 460152 64607 -6521 -711570
11904 -711570 -230157 99034 -223993 -360629 286026 1054543 599656 -206722 -495913 -216691
11894 -216691 2120790 5095510 7162779 8589483 9395790 9784285 9381088 8629801 6924950
11885 6924950 6155951 6425808 5707480 3653652 2166472 1207553 1239678 1125724 1184285
11876 1184285 1323281 1637438 1311896 1421571 1473501 1620524 2178753 2743032 2859934 2800678
11866 2800678 2574230 2652297 1944816 698278 733003 1127801 1065967 757928 941665 275362
11856 275362 -1055842 -2262139 -3566181 -3825258 -2801283 -1936144 -1802172 -1675348 -1137561
11847 -1137561 -1356354 -668583 902764 1043761 159608 -1104157 -3328935 -4377394 -3945496
11838 -3945496 -3026480 -1528117 -232564 -143541 -834598 -7633 821075 430528 421591 38534
11828 38534 737181 2269070 2104190 1211367 -27248 -308242 -214075 -323304 -721929 -1052296
11818 -1052296 -1148954 -1058098 -380997 -882679 -2545830 -2252314 -610978 -786784 -1752279
11809 -1752279 -2136348 -2288554 -1557292 -1719856 -1843054 -478902 665382 1452852 1506222
11800 1506222 1621291 78885 -2456571 -3615690 -2903068 -2023155 -626411 1536241 3041257
11791 3041257 4160928 5271317 7907629 12077010 16720327 18730023 16951692 13256355
11783 13256355 9926840 7232456 5432390 4633885 5116972 6390113 6098394 4480185
11775 4480185 3323883 1946939 538030 177258 691138 1425507 1281089 314491 -371961
11766 -371961 1045380 1772768 647022 271794 937177 1661741 2549428 2687659 1423980
11757 1423980 -387923 -1169329 -2067073 -2417108 -1781088 -891759 -1827521 -2319779 -1319344
11748 -1319344 -820824 -1201361 -1609742 -1670873 -2594174 -2477614 -2549237 -3210849 -2718874 -2666537
11738 -2666537 -2927250 -2716898 -2809190 -2388568 -825949 309851 144010 514832 1092193
11729 1092193 161092 -648726 223739 1991895 3055876 1983637 1428228 989841 -169084
11720 -169084 -962888 -2191543 -2301721 -2247616 -1932584 -54682 2041155 1440875 910276
11711 910276 460687 803703 1243627 839350 -432733 -1812903 -2667192 -3173928 -2289692
11702 -2289692 -1649344 -1694312 -1368656 -988120 -1332810 -1578409 -1414610 -631506 8126 -272828
11692 -272828 -1660523 -2476746 -2343963 -2061322 -690237 266648 730032 961833 1699153
11683 1699153 1951146 914375 -856054 -1635495 -1416962 145653 2070018 3275757 3190535
11674 3190535 2545041 690919 -1167988 -1501604 -1365210 -651199 323595 1601921 2465298
11665 2465298 2769215 1488285 845302 526175 -721010 -1411663 -1454163 -588464 -149452
11656 -149452 213530 1425022 2585321 2581981 2099789 1606249 1948212 2067849 1135621 -202135
11646 -202135 -844424 -564037 -856586 -947458 -1658212 -3170563 -3097635 -1129648 485245
11637 485245 1481007 668815 -919224 -2301010 -3447124 -3815150 -2678609 -1303736 -942987
11628 -942987 -1313009 -2083511 -2741032 -2894222 -1982067 -655269 -1597392 -1539990 -589550 -301973
11618 -301973 701432 2046467 1827597 579078 -575828 -793902 -941920 -1322713 -565872
11609 -565872 56650 -654071 -1690370 -2472194 -2216867 -1403081 -1600305 -2888210 -4352598
11600 -4352598 -4028385 -4174454 -3393269 -839053 171373 11276 233937 278167 -192956
11591 -192956 8362 59157 -1987256 -3356299 -2417836 -1665575 -1278788 -217310 -152710
11582 -152710 58880 826498 1367714 2224794 2385488 2354081 2037632 1545284 -254537 -2025279
11572 -2025279 -1500194 -1032683 -605886 35936 520624 542126 -525961 -1715969 -1757080
11563 -1757080 -254840 1892672 2951896 2854806 2068171 1411204 361330 -564722 -1126222
11554 -1126222 -1471458 -2557133 -3300856 -2562682 -1849651 -1669635 -2269919 -3001707 -3024663
11545 -3024663 -1834227 -18258 1260212 1060050 394351 591880 855297 -321911 -847172
11536 -847172 -1831819 -2960699 -2241939 -562372 -308326 -487171 -647641 -480612 508135
11527 508135 1617909 1684785 1765589 1880570 1520716 776857 -361573 -751864 109705 1574613
11517 1574613 1667782 507446 -1665305 -2678134 -2435411 -2338339 -2291413 -557411 985410
11508 985410 1172277 954683 -44263 -591891 -95821 -1087158 -2046034 -2097524 -2558047 -958165
11498 -958165 1109852 1135039 -132674 -962056 -1237831 -399830 893685 528729 -769596
11489 -769596 -1473708 -1139978 -1177789 -1686575 -3039354 -2587302 -1260520 -1028139 -1586734
11480 -1586734 -2141919 -1859281 -1499737 -1145651 -877783 -33405 1316339 2160047 2208779
11471 2208779 1275900 350115 -457406 -939053 -788801 -449583 -576195 -1201677 -859555
11462 -859555 -1065082 -1434716 -1234659 -768988 -844345 42675 430873 574518 -45726 -416303
11452 -416303 -362964 571011 704391 -404168 -652803 -310248 291166 1517914 1479936 444123
11442 444123 -411137 -371642 158057 1347577 2209145 899121 -2121706 -3510142 -3269816
11433 -3269816 -3449053 -3928406 -4110081 -4230841 -4613765 -4499791 -3729246 -2430769 -2145466
11424 -2145466 -2126533 -2327815 -2494477 -1948580 -1648258 -1185636 -181 238898 453681
11415 453681 1067064 1944802 2067539 1830665 1420918 683277 938992 2984773 4046626
11406 4046626 3699063 3437456 2849252 1387393 1362370 2796592 2874987 2429336 2913118
11397 2913118 2710131 3021831 2843557 1539427 -185179 -1496785 -1283715 -769572 -106975
11388 -106975 1095277 1623225 1833090 2210356 1072031 -1125133 -1219873 -687756 -1381092
11379 -1381092 -1207097 67206 818127 635643 867993 128775 -1387459 -1006216 -865989
11370 -865989 -564036 319984 373637 -470599 -2714503 -3603788 -2921238 -2947812 -2788150 -668555
11360 -668555 1091308 1757389 2275389 3341356 3264492 3094094 2892706 2784875 4148052
11351 4148052 4430070 3994132 3234401 1795381 1193465 1314493 1452345 945910 42133
11342 42133 -193237 1030036 1498541 1379455 1585436 1140193 213205 -1329562 -1510030
11333 -1510030 -538523 -1038142 -1711228 -1953990 -895418 91792 1266224 2259537 2203986
11324 2203986 2329995 2416798 2543062 2633541 1032224 -1041386 -610187 433962 -126874
11315 -126874 -1333711 -1313908 -121997 246559 -967166 -3170867 -4305569 -3752191 -2014436
11306 -2014436 -601795 -126478 -188915 -625042 -955595 -893389 -268033 63889 118173 -417470
11296 -417470 -980034 -237591 415304 64719 -720459 -526087 -452371 -991983 2389 1069307
11286 1069307 1883871 1711472 2054702 1915258 1588720 2223891 2971361 2334292 1589786
11277 1589786 800620 1236791 512928 -782264 -534685 -53574 337281 -222698 -1797863
11268 -1797863 -2323474 -1973177 -1091441 663493 2548108 3761960 3815514 2505895 1315029
11259 1315029 879723 479378 -94576 -1199092 -1995050 -2377197 -2151351 -2286736 -2256818
11250 -2256818 -1240444 -1189861 -888568 -839987 -2189610 -1349059 131777 452260 679666
11241 679666 -445036 -1486646 -1050583 -783488 -1570583 -2457317 -2863492 -2097050 -771025
11232 -771025 -401529 -609350 -646719 -904971 -1426454 -1160480 216370 2607960 2984591
11223 2984591 625866 279252 1220818 2423235 3574526 3622206 2032306 604139 201576
11214 201576 706733 1802096 2036053 743457 -1116744 -1636951 -1732803 -1692225 -1549258
11205 -1549258 -2392584 -2312131 -1475781 -181759 1913221 2415772 2247479 2572576 2217417
11196 2217417 985282 -915751 -1040508 -589269 -234960 1297223 2058780 1043714 -541738
11187 -541738 350942 3170450 3468778 2464709 2121475 1591394 1214635 1025026 1274244
11178 1274244 1338964 2987362 4804083 5654555 4626881 3477124 3206382 2310809 -427556
11169 -427556 -2501911 -3303436 -3268058 -1800264 -245326 -650601 -1102852 254908 969691
11160 969691 1776258 1831895 -400407 -1620912 -839201 78161 -860078 -945956 169131
11151 169131 -243947 -930989 -710487 -372461 -617583 -2082597 -2523547 -1619727 -679894
11142 -679894 -866966 -1237351 -368584 -162203 -712554 431419 330322 -1209302 -1633889
11133 -1633889 -967512 1396090 2516135 1929238 282712 -553193 -980391 -1308991 -880397
11124 -880397 -1145567 -806778 488144 708407 -659021 -975305 -119208 78347 -56085
11115 -56085 490236 75757 -926825 -905587 99654 992239 438583 73057 283734 -402434
11105 -402434 -41310 1164423 592904 -497009 -1037570 -934623 -907370 -167375 347202
11096 347202 -231648 490964 2507437 3852935 4269347 3437221 2339976 1479003 553880
11087 553880 716098 1511125 1556787 638469 -68890 -329567 -768549 -854717 -836144 -1058571
11077 -1058571 -491930 -138326 54854 955417 1418414 1720730 502762 -1208816 -1562805
11068 -1562805 -1301082 -2907036 -3955579 -2451277 -734580 130960 577690 1598961 2479573
11059 2479573 3519921 4407484 3942060 4011182 4245720 3135878 1083496 290211 1881251
11050 1881251 4458608 5168791 5114067 3856777 1889866 570972 -912819 -1564646 -1257019
11041 -1257019 -1965223 -2784188 -2949666 -3022121 -3046360 -4108715 -4402911 -3137891 -2598325
11032 -2598325 -1743325 -315616 1000077 2500629 2868352 1784829 912002 353392 -129916
11023 -129916 364547 -207523 -2077675 -2445547 -698798 659816 344067 -732455 -475989
11014 -475989 -1119768 -2582543 -3033438 -3166428 -3474243 -3899281 -3790517 -2674175 -764894
11005 -764894 -42686 209538 1287459 1999895 1846247 83055 -2005637 -2942983 -2100732
10996 -2100732 -1020769 -70062 932194 1916220 2397193 2602582 1513753 147087 -1257662
10987 -1257662 -163110 787975 296943 124418 -346275 -1520277 -3576619 -4539351 -2889595
10978 -2889595 -834786 1011964 828424 -343240 -74923 185395 1494622 2629788 2690897
10969 2690897 1953835 998103 1008373 1610348 1817843 1481338 609183 -128302 -193799 -225746
10959 -225746 -1726408 -1898783 -172516 658310 668501 395961 493274 1550793 2843383
10950 2843383 3047821 2166442 1704217 625148 -344667 -1007048 -912023 378110 1164579
10941 1164579 1564114 1955396 1713700 1067235 712726 -257900 -1317700 -696542 638778
10932 638778 865710 -95885 -1586434 -2908202 -2152158 -862115 816259 1981350 2476794
10923 2476794 2065638 951410 1118913 2244531 2618880 3274031 2747019 2319654 2678299
10914 2678299 2768423 4286918 4768150 3939688 3085648 2100479 1245753 1288260 1847504 1513908
10904 1513908 842113 442588 404569 531036 783858 821860 694549 683143 86551 -427449
10894 -427449 576769 817728 793633 1371566 1702048 -175207 -2433624 -2164445 -1287399
10885 -1287399 -1056362 -1984047 -1645177 -1234848 -1353220 -1366399 -1480828 -629426 320218 585264
10875 585264 612189 1020394 1812094 2236782 2471308 2669068 3258316 3055054 3466293 2783868
10865 2783868 1989752 1335612 919137 1957339 3040548 3142770 2252343 766399 -252412
10856 -252412 -278515 688482 1783297 1093912 -242379 -1979932 -2588208 -956777 -622322
10847 -622322 -1529955 -1786958 -1760868 -1490318 -410341 398871 680780 636860 340112 571680
10837 571680 1007231 886066 319702 189425 402723 408355 497371 1794224 2868634 3274401
10827 3274401 1663034 -376813 69166 1664096 1597126 612932 304543 -444167 -124373
10818 -124373 376218 -236050 -621404 -734166 -621518 284241 531482 731520 1407362 1507166
10808 1507166 1612956 1206661 842597 -175098 -856745 -595738 -1102720 -1438401 -227335
10799 -227335 792281 718417 -23734 283305 -572895 -1701454 143113 1789829 2141104
10790 2141104 2996476 3323144 2146844 825219 -153958 498643 663024 -815169 -1125446
10781 -1125446 -541723 907793 1169593 293176 -574522 -1147068 -2132200 -2176111 -1955778
10772 -1955778 -2350408 -2076879 -1474141 -1241309 -1535036 -1923774 -1407348 -534352 -80684
10763 -80684 130750 238836 478333 929592 808353 1276705 2064576 1852545 2581782 2855645
10753 2855645 2993612 1944111 1343992 2319591 2148465 1690154 803327 -151931 37314
10744 37314 1200423 2020791 2815872 3640208 1914471 -227647 -1183337 -1877855 -2405151
10735 -2405151 -2702933 -2522911 -1893450 -1834051 -2371060 -2982417 -2498655 -1288835 -57103
10726 -57103 335507 1214781 3377621 3926535 2814240 1397585 106442 23387 826729
10717 826729 577043 -606751 -1497924 -2567999 -2873851 -1859196 -1333500 -1417761 -837356
10708 -837356 215741 130297 -549232 -842908 -1054556 -818002 -991501 -695045 -940083 -957955
10698 -957955 -543616 -940118 -1579278 -3242740 -4285578 -4029584 -5036771 -5194149 -3371520
10689 -3371520 -2089437 -1423086 -313970 923514 1338797 442146 -911636 -1124227 -1511227
10680 -1511227 -2174971 -2558670 -2333350 -1125929 -1507080 -3760219 -4845386 -3894706 -2606811
10671 -2606811 -2444732 -891669 -53664 -1352259 -3406609 -5239314 -4747326 -3584155 -1365857
10662 -1365857 794634 1942723 2125160 1255588 233064 -1130953 -1924666 -2554482 -2940728
10653 -2940728 -3731325 -4183712 -3452276 -3516126 -3575629 -3294094 -1999936 -1388818 -1708053 -1491583
10643 -1491583 -1551441 -2010083 -2828938 -2882748 -1640204 -639042 -212023 -1047807 -1174648
10634 -1174648 -810474 -670247 -1528113 -1877060 -984215 -364918 -476828 -204912 248795
10625 248795 1408304 3020750 3609520 3356275 2155302 783244 -1314768 -1795183 -318160
10616 -318160 127620 -524979 737018 2127880 1998595 2500775 4311452 5310260 2706162
10607 2706162 -599221 -1101996 40591 425763 195651 -10058 -502654 -1123106 -1159762
10598 -1159762 61965 992747 1211446 991464 748685 315811 -292999 -1840330 -2317766
10589 -2317766 -1798577 -1970267 -2794832 -3007963 -1532837 -718787 -1573159 -1739805 -1139888
10580 -1139888 -586369 -1050204 -2210971 -1622566 442040 1489994 1690639 1759129 2346846
10571 2346846 2278781 2640879 2074990 84832 -528887 -753396 -811109 -415389 -204656 -604359
10561 -604359 -861850 658553 2452700 3183007 3211166 3175052 3144045 3562920 2621545 1274867
10551 1274867 1183996 1333004 -147419 -1021248 -1299613 -1509098 -807868 -545585 -798095
10542 -798095 -774713 -1420190 -2031965 -1468327 -727314 -583698 -845963 -831571 -556587 664134
10532 664134 1311048 677744 200061 -3320 555215 938101 1289769 1987512 1934786 1055926
10522 1055926 715382 8889 82495 289708 452944 195343 -1527233 -1719021 -513190
10513 -513190 712136 1545791 1280062 760969 345776 -255391 -540195 -1096993 -1388492
10504 -1388492 -778296 -517279 -662830 -1259543 -759426 -47442 -1104113 -1274702 -534984
10495 -534984 220712 999710 1511758 1777822 3105179 3716355 2565781 855968 -202459
10486 -202459 -734161 -886040 -619158 99098 916419 1009563 -716974 -2205240 -1992426
10477 -1992426 -1671324 -2248629 -2091071 -571561 -284869 -396764 29860 1168689 2191587
10468 2191587 2479529 1221536 -309819 -1316325 -1256401 -652600 -1001572 -1115579 -2154894
10459 -2154894 -3814616 -5023957 -3778543 -1791443 373738 2287823 3579664 3656183
10451 3656183 3169148 2452267 1532681 1471502 2424581 3167689 3050280 2173299 1956052 1578233
10441 1578233 1684002 3016906 3854782 3034751 1430006 2635589 3879037 3962787 2812574
10432 2812574 1467597 1723102 1329343 1141146 1845423 3502748 3563597 3714658 3592075
10423 3592075 2144897 1276876 702357 312476 199504 493569 1236481 1155362 305956
10414 305956 571715 1219104 638585 -18536 355639 -544699 -1714982 -1141311 -720453
10405 -720453 -833310 -354488 1157415 3311311 3483095 2001596 1237058 1319779 789752
10396 789752 346407 -102783 787 998732 968193 257037 -224228 290408 1814437 2661155
10386 2661155 1786059 1208391 909984 1976885 2558019 2555854 1968154 893313 381856
10377 381856 -194010 -139329 -38190 -119624 -339619 -1258975 -2673830 -2994773 -2146752 -1511186
10367 -1511186 -1396512 -1073147 10281 -241468 -1693795 -1528149 -916001 -886262 -333259
10358 -333259 533855 861848 1143790 1394605 1983891 3210409 4238513 4453708 3712910
10349 3712910 2553418 3093758 3903267 4218877 4627561 4205078 3708130 3053942 2817047
10340 2817047 3730095 3855981 2869684 3060198 2826559 2704271 2247829 418463 147677
10331 147677 1376962 1809401 1319881 -29130 -1183493 -1833478 -1980405 -1376673 265140
10322 265140 864196 1157865 1373529 2435295 4474033 5388870 5137979 4066316 2651761
10313 2651761 1272114 1607268 2536401 2140767 442903 -1745496 -2530490 -1763511 -1539758
10304 -1539758 -729883 -71447 -246145 -129166 329702 780424 430813 -538524 -1295950
10295 -1295950 -1290102 -1142031 -1404029 -1634190 -1135909 -299892 599181 1259571 1616231 1756522
10285 1756522 1995438 2460882 2095100 2745478 1895580 17717 232101 2116254 1793248
10276 1793248 732349 958369 1106435 431890 -1612558 -2613983 -1659950 -424618 80429
10267 80429 -30174 -244004 639534 1519219 868268 539343 517309 311177 117333 744705
10257 744705 1001226 562199 -626321 -1984862 -2011733 -2133659 -2525802 -1614831 -247536
10248 -247536 586496 1180851 1618722 1436579 1290008 359717 -1311608 -2572949 -2629739
10239 -2629739 -1382307 -513270 77524 -145327 -580751 -936342 -2176029 -3175630 -2865190
10230 -2865190 -3043621 -3617544 -2931466 -2264258 -3150528 -3612596 -2530516 -1674452 -1197010
10221 -1197010 -1185680 -2828384 -4124981 -3879205 -3408478 -2699110 -1346857 493409 582642
10212 582642 -147633 59918 -441734 -1948901 -2587543 -1411547 -817927 -782282 -632180
10203 -632180 -2185990 -3682077 -3272703 -2176645 -1634910 -1217544 -1381028 -1121662 -211237
10194 -211237 -21055 -391221 -1428040 -2900965 -4312534 -4809525 -4777567 -4066004 -3469909
10185 -3469909 -2618492 -1628488 -1790740 -1684909 -1304195 -623809 307735 459902 -427623
10176 -427623 -198014 1088034 1391008 1746832 1904654 1011095 -76550 -1075935 -387293
10167 -387293 -778870 -1655874 -636186 770735 1069866 1256692 2058363 1628053 407752
10158 407752 -8743 769051 544088 384537 -78857 -386631 -54842 127471 -454720 -298338
10148 -298338 -1464622 -2927342 -3138082 -2832178 -2007136 -1687286 -1310764 -23850 524594
10139 524594 934930 1362419 -1123755 -3825485 -4353325 -3280127 -2459996 -1717481 -147644
10130 -147644 910846 436467 642088 691753 818972 887822 684883 880757 654641 -555846
10120 -555846 -1742998 -2389244 -2249781 -1676268 -1021878 -357051 79824 167610 1019849 1310000
10110 1310000 1423818 -150889 -1621744 -1025759 -1509568 -2277735 -2816334 -3662353 -3076928
10101 -3076928 -1801648 -865677 -35335 793838 796898 518345 -318864 -1114166 -380603 500342
10091 500342 910214 -808484 -2024365 -1537645 -1317440 -860504 -22996 -224065 -1428174
10082 -1428174 -522454 466713 384225 352337 108888 -461921 -645060 -1524415 -1053088 77730
10072 77730 -97404 -1391162 -2560491 -2517976 -2315232 -2325841 -1604838 -649986 55158 -265031
10062 -265031 -1083477 -762989 -830862 -1401034 -1775727 -2428395 -2430884 -243727 -236802 -1362829
10052 -1362829 -1041564 -26868 328876 895589 1725654 1303338 315601 14881 577616
10043 577616 1420604 1733601 914827 -595851 -1611711 -2818122 -2897534 -2683345 -2497764
10034 -2497764 -1747599 -850384 255136 336946 443264 660901 2237507 2866748 2024655
10025 2024655 1776928 1907654 2854340 3412129 2676685 890144 -94379 -619732 -1731589
10016 -1731589 -1170305 502490 2176113 3013673 2976817 3520272 4029348 3288019 1853907
10007 1853907 1265965 957318 171631 -1095738 -1277656 -912319 124166 488899 -136828
9998 -136828 -696402 -938942 -2223858 -2223136 -2458753 -2818466 -2079310 -2245047 -1110915 -98183
9988 -98183 -161423 -532619 -1020647 -856556 -133959 228829 101498 -112464 -207393 -174086
9978 -174086 -1827515 -3939489 -5462344 -4855308 -3477430 -1664519 -1142272 -1591383 -1408403
9969 -1408403 -183378 1329396 1180975 -157108 -1239618 -1341949 -2378506 -4082370 -4243484
9960 -4243484 -3100664 -1952419 -992497 -919347 -1360998 -493484 978019 1518356 2149826
9951 2149826 3275316 3607893 3085700 2629234 1765201 1154317 1586237 2902338 3806356
9942 3806356 3556836 3304756 2720779 1967850 982253 859030 2163175 2626090 2134391
9933 2134391 1155770 1461616 2446544 1815014 -858606 -3922220 -5687987 -5852267 -4616565
9924 -4616565 -3112919 -2112165 -2640236 -3272338 -3543759 -3442459 -3076886 -3130202 -2932355
9915 -2932355 -1913584 -831628 21648 1061577 1901966 1090936 718639 835561 1090750
9906 1090750 1237028 -152639 142364 -289608 -1700087 -1629459 -404815 1133318 1506983
9897 1506983 1429226 1350884 689399 -1148355 -1477937 -572407 -558844 -1041058 -1303754 -1542795
9887 -1542795 -2202958 -2629172 -2193555 -2003017 -2930308 -3137218 -631136 709679 -26051
9878 -26051 -1274088 -2664061 -1360214 -17270 430087 344325 -757549 -290363 -281822 -1542408
9868 -1542408 -1076408 -901350 -1584217 -2398518 -1133383 221677 -510818 -811659 -1261287
9859 -1261287 -2480967 -2785582 -2868146 -2689082 -1392948 -513972 -362570 -530012 -38323
9850 -38323 831869 -358830 -996761 -1361838 -1309147 -1004685 -1401366 -1797843 -1710361 -1319009
9840 -1319009 -682515 -408946 -738394 -504829 -284738 -225360 -1002767 -962920 -464715 -575815
9830 -575815 -2090118 -2515157 -1937892 -471631 849178 368885 25288 -405137 -576119
9821 -576119 502806 1012328 -533684 -1041319 -739237 -1208051 -835283 -404004 2760
9812 2760 1721708 2915545 2683112 1654307 494120 -611630 -978116 302631 1967421
9803 1967421 2186684 1192283 -19736 659778 872832 -652748 -1532626 -350745 1231784
9794 1231784 1568568 2536890 2968835 1937161 861072 225420 -1088609 -1353146 203810
9785 203810 1621784 2669403 2192638 1783472 1650842 2107142 1611900 1302242 1651512
9776 1651512 594444 -949290 -1862422 -1979149 -1890904 -1573409 -1134694 509823 1135664
9767 1135664 1519150 1969295 732211 -387742 -769126 -1913218 -3233002 -3420102 -2949008
9758 -2949008 -2063524 -1082495 180675 571688 -505602 -1887865 -2373387 -1182437 47402
9749 47402 67627 -460083 -1294454 -1552316 -2472117 -3084224 -3178317 -3059005 -2317836 -2421380
9739 -2421380 -3506293 -3201867 -2880904 -3332277 -3874883 -3863304 -2477537 -1122180 73949
9730 73949 740143 787581 1682106 2133932 2023858 2073256 1787977 2101230 1122178 -726926
9720 -726926 -2218912 -1971410 -395827 955811 979501 1060217 1163570 859958 1666317 2744800
9710 2744800 2423775 2293650 1959545 913217 -3651 -1374627 -1658029 -681960 -1800364
9701 -1800364 -3837610 -4203788 -4071381 -3444011 -2490751 -1682671 -1676912 -997226 -561101 -898520
9691 -898520 -1715890 -1596964 -500807 -167993 -409195 -4348 767400 1018573 574145 223799
9681 223799 760697 2979851 4596249 3726418 1764257 820893 1181676 1759879 1202307
9672 1202307 420169 266537 557787 702095 -345766 -1493344 -379026 1784599 2321641
9663 2321641 958948 -218360 -1157090 -1179610 -228191 -50391 -27625 106851 -564544 -1082765
9653 -1082765 -536955 569000 763625 48868 -614704 -925917 -1528812 -2378490 -3410094
9644 -3410094 -4727325 -4924411 -3855010 -2060416 -843170 -1724269 -2202639 -1104369 -882747
9635 -882747 -1061832 -290167 966489 2532988 4561994 4161392 2333641 948350 1822516
9626 1822516 3026920 3006741 1671703 718881 637487 1433549 2056918 1262836 -108917
9617 -108917 -239500 323739 94630 -388750 -380748 -523303 -930595 -261434 595796 702836
9607 702836 255303 329621 1005266 1135584 -174514 -1212631 -495704 830015 1157845
9598 1157845 48154 -1268126 -1242676 -320813 372711 69682 -1510211 -1864886 -1441105
9589 -1441105 -1157213 203107 1103201 1296720 917845 517846 -784113 -2237187 -2011704
9580 -2011704 -792214 836747 2802387 3608198 2477551 1333238 262837 -85962 308769
9571 308769 -389121 -727474 -133881 371633 215159 -1243867 -1950847 -1576159 -1313039 -1449475
9561 -1449475 -1473191 -1625124 -1539889 -625532 1111484 924877 -1108020 -2587702 -3407032
9552 -3407032 -3559814 -2781395 -1589081 -1209937 -1449008 -886687 806690 1674742 -71435
9543 -71435 -1646652 -2055453 -2131238 -2921339 -3554219 -2027309 -1033214 -826309 -1031119 -1001172
9533 -1001172 -281704 -115678 -1304427 -3060881 -3805641 -4086706 -4117679 -3416077 -3046352
9524 -3046352 -4034919 -4773535 -4349852 -3105461 -2151674 -1259179 -649 306690 169219
9515 169219 71772 -431987 -1475365 -996998 -81697 209116 1117017 1114601 -97405 -1365277
9505 -1365277 -2578206 -3435767 -2417135 -957246 -78642 -52691 -101237 518322 1899734
9496 1899734 3117699 3716506 3137903 1369414 401956 -351686 -743782 678015 3061703
9487 3061703 4069087 3422897 1798667 560971 785786 1205123 1163509 786464 186759
9478 186759 451793 396735 -7835 39216 188107 210686 -492369 -1890908 -2406550 -1303163
9468 -1303163 282452 2335384 2852362 2622609 2338992 1089759 156479 -292292 -1744164
9459 -1744164 -1263248 -103463 -78416 -144647 -687431 -577398 636584 2058453 2781416
9450 2781416 3008243 2270750 996104 48702 579681 1048008 -205924 -1986775 -2672945
9441 -2672945 -1853532 -942058 -1032440 -1117890 -829806 -1060741 -1234327 -1474543 -2168371 -1501345
9431 -1501345 -540100 -857075 -1078209 -2547678 -3332458 -2701034 -2377840 -1268580 -1708057
9422 -1708057 -2865126 -4018129 -4018524 -2826063 -1879983 -527088 -1124451 -1716040 -1129390
9413 -1129390 -350237 1286329 2920884 3342859 1836677 127529 -646305 -989445 -31042
9404 -31042 164001 -321560 -38254 485501 815281 -12489 -564000 -530701 43219 281204
9394 281204 821853 2569444 4187107 3322928 1083106 -369619 -1411527 -1590288 -1867519
9385 -1867519 -1737616 -1208803 501936 1654400 1529739 512392 -530211 509045 1012513
9376 1012513 1637881 1231386 -548723 -1046974 -1420101 -1067277 -713969 -1399186 -1857636
9367 -1857636 -1463132 -422413 484344 717918 -167418 -1019045 -1818467 -2410122 -2727423
9358 -2727423 -2166379 -1541406 -1029283 -647290 -243228 -308016 -1059682 -896704 -492947 -229331
9348 -229331 -63437 -702644 66818 1264833 1417606 1085204 394773 200107 413238 1183536
9338 1183536 2905779 3365390 2429322 1109828 7784 -495738 412225 1132703 1482257
9329 1482257 1522483 1649989 2224178 2180382 2478482 2198427 1959774 2184692 1996872 2146574
9319 2146574 2950515 3614346 4897697 4137760 3331888 2786575 2059898 2973453 3062221 968769
9309 968769 -28943 627765 -132745 -811052 -1182870 -17611 1565082 1738813 2032400
9300 2032400 1535556 1070143 872843 -914221 -3664066 -4331460 -3188231 -2811651 -2537759
9291 -2537759 -2298438 -2374931 -1483500 -780885 -724799 -857514 -760605 -631292 -1403719 -3517282
9281 -3517282 -4137149 -3067362 -2249560 -301756 991437 1130388 2016089 2380578 1235698
9272 1235698 193065 429875 1337272 543172 -12863 -690083 -1154171 -1155936 -1314668 -656628
9262 -656628 665793 1119057 911554 -1074233 -2103162 -1899293 -1439202 -364679 975471
9253 975471 869431 -246304 -1071036 384157 1925331 2029604 1768956 681466 -1020907
9244 -1020907 -1442920 -621368 506927 1900014 3124275 3382554 2384908 1843125 2386483
9235 2386483 3939781 5019806 4258553 2176668 897354 609555 221630 149904 1506442
9226 1506442 1704170 1221624 954817 1259677 1695982 509050 -196314 353588 560941
9217 560941 -26362 -33065 1276616 1626601 949229 -33389 134992 141821 -1377075 -1629019
9207 -1629019 -346860 198411 1457326 2050080 1477795 1021107 1649124 1402023 1691959
9198 1691959 824099 -11885 190674 904027 1800257 2471953 1581647 1354451 2459050
9189 2459050 2762745 2139266 30149 -2289759 -3387905 -1951414 139225 703806 72410
9180 72410 175073 689428 491774 -44255 -342048 -147264 216166 20565 169683 653652
9170 653652 -155059 -688775 -734762 -1403343 -970929 -305706 -1372124 -2063920 -1360768 -210267
9160 -210267 -226892 -322707 388267 276864 -1131220 -1622054 -1220332 -1215430 -1247128 -1241699 -2120700
9149 -2120700 -3532665 -3596451 -3053092 -773056 1488044 1631398 787510 1184057 2275306
9140 2275306 2934911 2674013 3012030 3634799 2867805 1298166 675092 1443135 2151340
9131 2151340 1791358 1420916 1477993 2146989 3615426 3372033 2229641 2579569 3790277
9122 3790277 3991735 2574317 1842367 2531888 2864234 2947476 3112382 2405142 1636393 1698783
9112 1698783 1654769 391272 -459703 -2114500 -3620694 -2946679 -1043288 -627773 -1199386
9103 -1199386 -1859996 -1692550 48141 1443770 724361 -186320 -488361 -2270199 -2985602
9094 -2985602 -1900476 -1363601 -1570342 -678772 344296 248043 373468 247848 798112
9085 798112 1498323 700631 -885545 -2545658 -2211804 -508159 588864 892127 1259500
9076 1259500 1226159 1321666 2502137 2745971 2242345 2977080 3394782 2726358 2180424 1794245
9066 1794245 962081 399930 241234 526080 1384423 2427505 3054125 3275007 3250433 2747916
9056 2747916 1712399 220072 -742291 -415021 -354481 -197626 129693 -187977 -345691
9047 -345691 -220965 -938773 -542588 102511 240462 707747 1418005 1313087 -110002 -123498
9037 -123498 -143440 -701343 -830649 -688286 -290317 234921 -255554 -652670 -1204373 -1342785
9027 -1342785 -599200 402774 1486058 1337206 494042 120056 251159 -97812 -699296
9018 -699296 -524697 -127797 231755 -28975 -355432 -223907 -176542 541277 1455917 1904451
9008 1904451 1585703 1498600 1698919 707640 116341 786100 244639 428142 2017355 1974251
8998 1974251 1346403 1762854 1724834 1344962 896602 223223 -164498 -177409 525212 1550856
8988 1550856 1780887 965921 -173040 -264810 -670915 -1412401 -1704520 -1271192 -1456468 -1446148
8978 -1446148 -802247 -660225 -1447826 -2289754 -3263809 -3525634 -2592292 -1365893 -472279
8969 -472279 651709 1409223 2014094 2760397 3258558 2374553 1258057 326613 -1012625
8960 -1012625 -947712 -159975 1717234 4035998 4369988 2934800 1965496 2009714 2763505
8951 2763505 3991083 3756096 2650204 2366528 2264533 1163624 639619 307814 -179694
8942 -179694 3451 -154952 222510 1068463 -212458 -1465857 -914192 -423864 -161660
8933 -161660 -200130 -360893 -91929 352410 629726 830333 1052829 2430274 3260570 3319800
8923 3319800 1786089 -890745 -3180835 -3546176 -2268505 -454094 595756 982317 951342
8914 951342 450029 299327 -40599 -613176 296056 2518871 4324475 4393080 3812945 1944490
8904 1944490 684656 140759 -146498 -799734 -832991 -117853 458412 -313738 -1206866 -1012916
8894 -1012916 -1071765 77504 -589463 -2105585 -1319849 -461443 -38233 916497 1997748
8885 1997748 1791173 1121661 -423791 -742717 12755 943771 1232291 -21989 -1270721
8876 -1270721 -282392 2420577 1970123 -235065 -542986 983033 1283456 88747 -1446158
8867 -1446158 -3050110 -5298970 -6116326 -4523619 -2922164 -3036076 -4022358 -3410717 -1607261
8858 -1607261 -462425 -674114 -327235 360646 1087280 2357879 2800159 2578297 2767031
8849 2767031 3071353 2542094 1994443 2410287 2461818 2323465 1440791 859342 728124 493162
8839 493162 950816 2321144 1998846 706595 -696384 -1870280 -1978257 -643418 2055800
8830 2055800 4230860 4864508 4238091 4178906 4475827 3090559 1021310 -345615 -1067957
8821 -1067957 -1774081 -1428811 -490402 251722 965305 1921494 2150690 1672840 2518995 3901125
8811 3901125 4824609 4622577 2904866 2200497 2461671 1373258 -125430 -1128042 -1229084
8802 -1229084 -530488 251758 900440 809028 1035273 2065491 1350517 868122 504745 -215787
8792 -215787 -1065952 -1028837 -912703 -1307289 -789500 -221232 -1750890 -3392573 -3080552 -2074581
8782 -2074581 -1844800 -1255108 -267140 739682 890522 1403642 1824026 423136 -218608
8773 -218608 -316713 -335613 -735262 -219067 157503 -662382 -1445793 -749390 490349 -107746
8763 -107746 -524245 129452 -281838 -2098643 -2809010 -2704527 -1948697 -984398 -928560 -758090
8753 -758090 -1310878 -2606659 -2763800 -466895 179956 -712950 -228572 135540 1643997
8744 1643997 2530932 2178237 850457 233232 1152299 633381 -1491756 -2750315 -1919277
8735 -1919277 -221481 126314 -934537 -1846704 -1588842 -595160 170281 -120181 800676
8726 800676 1608968 1729484 2030850 2262756 2452878 3076428 3026534 3393197 3157752 2419165
8716 2419165 1726270 1618283 1525895 265302 -1177874 -2324559 -2118752 -513470 806735
8707 806735 885540 477348 271004 -398055 -999176 -1181510 -1857327 -1944449 -1201059 -488366
8697 -488366 108218 803195 1146217 1229428 1483697 1051164 892063 702257 465026 993660
8687 993660 510921 -935616 -1317655 -893825 287930 1613712 2064416 838283 -1092716
8678 -1092716 -880418 -1121937 -1587453 -383104 163096 1376723 2416863 1005305 -626951
8669 -626951 -1562018 -3042581 -3342762 -2034730 -683720 -1144812 -1763101 -1433924 -768260
8660 -768260 -125587 78854 684653 976327 -79133 -1396158 -1398021 -958655 -828987 -1532044
8650 -1532044 -1677918 -1289847 599800 1609782 1246143 575047 -266669 -1123728 -1157032
8641 -1157032 -1690329 -3175153 -3139281 -2130542 -853007 718080 735128 -957522 -2616770
8632 -2616770 -3486211 -2933675 -1804812 -1686543 -2629803 -2920581 -1434719 411148 472374
8623 472374 136527 -173566 -2473352 -3535862 -2396929 -1686576 -1548208 -1969350 -1377730
8614 -1377730 -181330 -575299 -1692032 -1591342 -821769 -759104 -492108 -862386 -1807677
8605 -1807677 -2879610 -2767062 -1928206 -2064525 -3190898 -2095643 -125345 806514 108285
8596 108285 -1711677 -2147484 -2254136 -2631921 -2385635 -999123 231343 -243200 -439455
8587 -439455 -442168 -173601 226509 -238442 -235812 534963 675835 768682 871681 691453 669851
8576 669851 394020 541570 820549 -314394 -1514801 -1321359 -960993 -658200 -1344067
8567 -1344067 -1992683 -2223100 -2297855 -1719717 -765908 720147 1986291 1931365 1969833 1699292
8557 1699292 1954741 1484059 -145984 -932394 -1281088 -553573 709272 1647862 2131961
8548 2131961 641126 -811862 -412556 44593 351399 122660 -93944 87497 493334
8539 493334 -775948 -2431854 -1777575 -1063764 -777886 -992646 -1444358 -912899 374066
8530 374066 530595 -632872 -292112 1201651 2029557 2148322 2617315 2890543 3016183
8521 3016183 2212345 1570252 2107388 2096956 894681 -166911 -1381142 -2020014 -2294931
8512 -2294931 -1469871 -904777 625216 1174465 -246416 206263 1012375 1625749 1233507
8503 1233507 832396 1257646 2662420 3305452 2619091 1438132 1688225 1518399 181499
8494 181499 -192579 589421 1307928 1326643 1308950 1722832 2867850 2517110 810861 -170576
8484 -170576 75198 123669 -366088 -76183 551980 1060056 2084852 2920581 2584767 2616483
8474 2616483 3119131 2671196 1483488 771092 869108 774495 602821 1280877 1830700 2225089
8464 2225089 2279525 1391900 539284 -255303 198540 1516240 965983 -616691 -1540334
8455 -1540334 -2074996 -1442043 -711948 -43294 1359097 1913498 1719421 1171752 1435909
8446 1435909 3272870 3310251 1983707 1503057 1127651 721586 -427114 -1807930 -1565965
8437 -1565965 -272359 51022 354431 -401846 -1014747 -994970 -143534 328150 1005368 1808285
8427 1808285 1713367 1743466 2283520 1277599 54282 -70815 -339906 -673624 -453653 -79160
8417 -79160 163724 -330598 52036 1827915 1777294 88724 -606428 -483337 290661 1560651
8407 1560651 1488069 443020 -116049 -181083 47443 -621781 -1653854 -1821003 -1392064 -833364
8397 -833364 -1234444 -1571677 -1799097 -1641719 -1241606 -527493 -316043 311778 712081 620087
8387 620087 144329 -680733 436722 2376174 3022412 3501733 3465885 3594932 2467048
8378 2467048 249854 -544531 -474997 438015 793301 -91244 -56798 -733699 -651972 199518
8368 199518 340159 -153731 -464439 -801426 -397483 -941940 -1741482 -1362149 312046 2313778
8358 2313778 3027499 2349000 1825948 846832 -80497 -40244 -949838 -2041017 -2103545 -881581
8348 -881581 -1541140 -1921913 -1116133 -1364091 -1645589 -1763736 -2457451 -3730303 -3396838 -725465
8338 -725465 374103 -133985 -1158360 -1655170 -1821164 -1163977 -1402541 -1763296 -2927656
8329 -2927656 -3607806 -2192762 -1266276 -1099041 -1829669 -1750387 -1527076 -569972 190187 1230237
8319 1230237 2602520 1967647 133578 -1122862 -688731 321724 -370167 -946297 -201632
8310 -201632 -286765 -860479 -582098 -539064 -399417 -341237 -267384 851530 1555935 1041716
8300 1041716 -442310 -1716230 -906696 727016 1144615 255753 -759731 -213087 -472491
8291 -472491 -624762 68851 280826 389651 444791 -346949 -116325 962421 1705411 1910945
8281 1910945 1492000 -22742 -1504576 -722349 1641352 1029447 -1379537 -1349678 -266478
8272 -266478 -453862 -692749 -737015 358603 1451548 654876 -797253 -764666 458038
8263 458038 499868 -250184 -486954 -1056916 -2498556 -3404840 -3283353 -3262421 -1839519 -219379
8253 -219379 378944 1104224 1557560 1075568 209128 -594263 -1493597 -2263769 -3346970 -3512720
8243 -3512720 -2896661 -1444029 -1039125 -1399581 -487461 1763827 2815370 2477495 2078014
8234 2078014 1897448 1594485 295471 -1547110 -1493706 -95963 690664 -528891 -1604770
8225 -1604770 -2127286 -1620388 -805296 -469773 -401543 601756 1228643 141816 -273354
8216 -273354 878630 763745 1328992 2592847 2133274 1019340 -75697 -1235579 -2281629
8207 -2281629 -2988184 -3555684 -3056616 -2941336 -2091172 -843982 119928 -272519 -1669029
8198 -1669029 -1968446 -1833831 -2338269 -2015326 -1743682 -1088237 -1489362 -1849264 -364735
8189 -364735 507111 383532 343530 610509 -96831 -1445562 -2296005 -1805347 -760028 -812738
8179 -812738 -1272794 -850360 -782926 -1228357 -2825452 -3740812 -2600311 -1468029 295695
8170 295695 1964755 2898937 3229440 3111383 1981889 743479 10842 -263804 88828
8161 88828 -36512 -245846 -864962 -980523 482523 2170332 1579754 1026651 1437433 2084641
8151 2084641 2326144 1177782 398097 274122 501761 785251 1616134 2231981 2224270 1137765
8141 1137765 509960 511232 928414 158031 47240 1916441 3407788 3008449 1104725
8132 1104725 -973530 -2063902 -2417430 -2185311 -1902225 -1202308 -748646 -576409 -420047
8123 -420047 -430274 -84183 -1270063 -1401442 -1647779 -2371141 -1949695 -968506 -697919 -1299760
8113 -1299760 -1201297 159602 1701649 1059928 157421 371090 359554 814025 1283417 1295975
8103 1295975 1199946 1460184 310201 -984392 -1123661 -63219 713825 281520 1289178
8094 1289178 3193885 3957988 3855412 3204115 2425835 1427133 538567 -119924 -1318371
8085 -1318371 -1402062 -984645 -801179 -700291 -1031844 -1723409 -2189035 -2530563 -1531274 414196
8075 414196 1441150 943723 845195 881592 160679 262979 956340 1729421 2623759 2315056
8065 2315056 1583129 2059225 3073940 3030245 2044894 1649162 1229985 -69783 -238806
8056 -238806 897565 1425076 772287 205068 347276 716901 440472 -110989 -556334 -1163178
8046 -1163178 -2076864 -3227698 -4221887 -3528472 -1728903 -218702 2633604 4389690 4161831
8037 4161831 2190503 533350 -121963 -297730 57447 21407 -631278 -1858061 -1506189
8028 -1506189 13472 789785 1043961 161618 -338919 -73579 -402327 -485820 195859 708065
8018 708065 792604 -584044 -1577670 -1123798 -746720 -1379916 -2128923 -1762737 -1977623 -3149637
8008 -3149637 -3345818 -2053286 -324148 164155 -22494 204022 822977 -345399 -2235252
7999 -2235252 -2172372 -676003 1288660 1917715 515919 -614746 88033 551691 -459308
7990 -459308 -1992455 -2675719 -1907651 -865588 -27127 -546706 -700567 -975923 -802148
7981 -802148 -68489 575048 1940207 2244404 1944632 1214201 843289 917460 1322974 2249061
7971 2249061 1422096 286278 -437891 -1368800 -1800727 -1771996 -1061234 -1267545 -2038680 -2322953
7961 -2322953 -2166188 -1759790 -2222984 -3301735 -4625036 -4734362 -3097687 -1859505 -1960904
7952 -1960904 -1714101 -147841 1276968 2739032 3285944 3545551 3658081 3194560 2621251
7943 2621251 1054962 371692 443663 -884240 -1771959 -1907591 -1121149 -10057 487810
7934 487810 720118 868587 -710036 -1543999 11316 2108637 3222299 4292768 4592338
7925 4592338 3772111 2850213 1355042 394403 111388 400595 773770 847677 728251 969570
7915 969570 848921 -87865 -1761924 -2888030 -2862410 -2481108 -2805036 -2655878 -1535391
7906 -1535391 -326171 -754786 -1291253 -1284772 -1752135 -2479079 -3349268 -2858794 -1663894 -1663176
7896 -1663176 -2300314 -1550547 161470 842631 -34561 -11631 1023691 951967 289613 6086
7886 6086 364657 338261 -491900 -1724991 -2657281 -1439282 377275 1375011 1945064 2376299
7876 2376299 2959299 1962762 366206 -98348 123394 504660 531833 643234 827937 272155
7866 272155 -115691 -64596 -872053 -1474957 -2677268 -3308078 -2152559 -2620115 -4195889
7857 -4195889 -5120431 -5346308 -4350359 -3032043 -1484137 23899 251918 866344 1624825
7848 1624825 1037474 1290775 1672297 1702426 1862624 1322182 385672 -192292 521214 1788500
7838 1788500 2153227 1355703 402302 770149 507417 675896 1513426 1751040 1597456 1407632
$$ [...]
##END NTUPLES=NMR SPECTRUM
##END=
