##TITLE=C13_LR-683A-AK'
 CDCl3, 23000 sc

 24.9.2019
##JCAMPDX= 6.0         $$ Bruker NMR JCAMP-DX V2.0
##DATA TYPE= NMR SPECTRUM
##DATA CLASS= NTUPLES
##ORIGIN= UXNMR, Bruker Analytische Messtechnik GmbH
##OWNER= root
$$ XWIN-NMR		Version 3.5
$$ Thu Sep 26 13:42:47 2019 Russian Standard Time (UT+4h)  she@DPX200
##.OBSERVE FREQUENCY= 50.327896
##.OBSERVE NUCLEUS= ^13C
##.ACQUISITION MODE= SIMULTANEOUS
##.ACQUISITION SCHEME= undefined
##.AVERAGES= 20257
##.DIGITISER RES= 17
##SPECTROMETER/DATA SYSTEM= spect
##.PULSE SEQUENCE= zgpg30
##.SOLVENT NAME= CDCl3
##.SHIFT REFERENCE= (INTERNAL, CDCl3, 0, 222.624)
##AUDIT TRAIL= $$ (NUMBER, WHEN, WHO, WHERE, WHAT)
$$ ##TITLE= Audit trail, XWIN-NMR		Version 3.5
$$ ##JCAMPDX= 5.01
$$ ##ORIGIN= Bruker BioSpin GmbH
$$ ##OWNER= she
$$ F:/spectra/data/she/nmr/c13/1/pdata/1/auditp.txt
$$ ##AUDIT TRAIL=  $$ (NUMBER, WHEN, WHO, WHERE, WHAT)
(   1,<2019-09-26 10:07:51.54 +0400>,<she>,<DPX200>,
      <created by zg, POWCHK disabled, PULCHK disabled
       terminated by command 'halt'
       configuration hash MD5:
       00 E9 B6 7A A2 85 ED C7 34 08 36 98 17 FE 4E 26
       data hash MD5: 32K
       E2 BB FB F8 FA 34 F3 07 E1 5E 3A A8 A5 17 1F 0C>)
(   2,<2019-09-26 13:40:57.23 +0400>,<she>,<DPX200>,
      <Start of raw data processing
       efp BC_mod = 2 LB = 1 FT_mod = 6 PKNL = 1 PHC0 = -392.2328 PHC1 = 34.40636 SI = 32K 
       data hash MD5: 32K
       47 16 3A E6 83 1B E7 D6 70 AE 6A 92 AE EE BA D1>)
(   3,<2019-09-26 13:41:00.06 +0400>,<she>,<DPX200>,
      <abs ABSG = 5 
       data hash MD5: 32K
       42 E6 30 A3 86 17 E0 6E 0E 52 A1 03 FF 3C 99 AA>)
(   4,<2019-09-26 13:41:27.70 +0400>,<she>,<DPX200>,
      <pk PHC0 = 7.068665 PHC1 = -4 
       data hash MD5: 32K
       4D E9 85 E7 94 D3 AF 51 BF 7B 6A 84 D3 33 C2 F8>)
(   5,<2019-09-26 13:41:33.23 +0400>,<she>,<DPX200>,
      <abs ABSG = 5 
       data hash MD5: 32K
       BF 6A 87 79 4A E8 CE A2 BB 2B A2 7A EE 16 25 F3>)
(   6,<2019-09-26 13:41:39.21 +0400>,<she>,<DPX200>,
      <abs ABSG = 5 
       data hash MD5: 32K
       87 D4 BE 2E 8D 3E FF 62 47 17 1E 0F 2F 4B 66 75>)
$$ ##END=
$$ 
$$ hash MD5
$$ 33 C9 E8 37 C9 97 AE A8 06 FC B3 7B B7 ED 91 A2
##$RELAX= 
##$RELAX= 
##$RELAX= 
##$RELAX= 
##$RELAX= 
##$RELAX= 
##$RELAX= 
##$RELAX= 
$$ Bruker specific parameters
$$ --------------------------
##$DU= <F:/spectra>
##$EXPNO= 1
##$NAME= <c13>
##$PROCNO= 1
##$TYPE= <nmr>
##$USER= <she>
##$AMP= (0..31)
100 100 100 100 100 100 100 100 100 100 100 100 100 100 100 100 100 100 
100 100 100 100 100 100 100 100 100 100 100 100 100 100 
##$AQSEQ= 0
##$AQ_mod= 1
##$AUNM= <au_zg>
##$AUTOPOS= <>
##$BF1= 50.322709
##$BF2= 200.13
##$BF3= 50.322709
##$BF4= 500.13
##$BF5= 500.13
##$BF6= 500.13
##$BF7= 500.13
##$BF8= 500.13
##$BYTORDA= 1
##$CFDGTYP= 0
##$CFRGTYP= 5
##$CHEMSTR= <none>
##$CNST= (0..31)
1 1 145 1 1 1 1 1 1 1 1 1 1 1 1 1 1 1 1 1 1 1 1 1 1 1 1 1 1 1 1 1 
##$CPDPRG= <waltz16>
##$CPDPRG1= <>
##$CPDPRG2= <waltz16>
##$CPDPRG3= <>
##$CPDPRG4= <mlev>
$$ [...]
##$SUBNAM4= <"">
##$SUBNAM5= <"">
##$SUBNAM6= <"">
##$SUBNAM7= <"">
##$SUBNAM8= <"">
##$SUBNAM9= <"">
##$SW= 239.972175391363
##$SWIBOX= (0..15)
0 1 3 0 0 0 0 0 0 0 0 0 0 0 0 0 
##$SW_h= 12077.2946859903
##$TD= 32768
##$TD0= 1
##$TE= 0
##$TE2= 300
##$TE3= 300
##$TEG= 300
##$TL= (0..7)
120 120 120 120 120 120 120 120 
##$TP= (0..7)
150 150 150 150 150 150 150 150 
##$TP07= 0
##$TPNAME0= <>
##$TPNAME1= <>
##$TPNAME2= <>
##$TPNAME3= <>
##$TPNAME4= <>
##$TPNAME5= <>
##$TPNAME6= <>
##$TPNAME7= <>
##$TPOAL= (0..7)
0.5 0.5 0.5 0.5 0.5 0.5 0.5 0.5 
##$TPOFFS= (0..7)
0 0 0 0 0 0 0 0 
##$TUNHIN= 0
##$TUNHOUT= 0
##$TUNXOUT= 0
##$USERA1= <user>
##$USERA2= <user>
##$USERA3= <user>
##$USERA4= <user>
##$USERA5= <user>
##$V9= 5
##$VALIST= <valist>
##$VCLIST= <CCCCCCCCCCCCCCC>
##$VD= 0
##$VDLIST= <DDDDDDDDDDDDDDD>
##$VPLIST= <PPPPPPPPPPPPPPP>
##$VTLIST= <TTTTTTTTTTTTTTT>
##$WBST= 1024
##$WBSW= 4
##$XGAIN= (0..3)
0 0 0 0 
##$XL= 0
##$YL= 0
##$YMAX_a= 111002218
##$YMIN_a= -112049017
##$ZGOPTNS= <>
##$ZL1= 120
##$ZL2= 120
##$ZL3= 120
##$ZL4= 120
##$ABSF1= 222.624
##$ABSF2= -17.3728
##$ABSG= 5
##$ABSL= 3
##$ALPHA= 0
##$AQORDER= 0
##$ASSFAC= 0
##$ASSFACI= 0
##$ASSFACX= 0
##$ASSWID= 0
##$AUNMP= <proc_1d>
##$AZFE= 0.1
##$AZFW= 0.5
##$BCFW= 0
##$BC_mod= 2
##$BYTORDP= 0
##$COROFFS= 0
##$CY= -3
##$DATMOD= 1
##$DC= 0
##$DFILT= <>
##$DTYPP= 0
##$F1P= 0
##$F2P= 0
##$FCOR= 0.5
##$FTSIZE= 32768
##$FT_mod= 6
##$GAMMA= 0
##$GB= 0
##$INTBC= 1
##$INTSCL= 4.134877e-10
##$ISEN= 128
##$LB= 1
##$LEV0= 0
##$LPBIN= 0
##$MAXI= 10000
##$MC2= 0
##$MEAN= 0
##$ME_mod= 0
##$MI= 0.1934396
##$NCOEF= 0
##$NC_proc= 1
##$NLEV= 6
##$NOISF1= 120.0001
##$NOISF2= 80.00006
##$NSP= 0
##$NTH_PI= 0
##$NZP= 0
##$OFFSET= 222.624
##$PC= 1.4
##$PHC0= -385.1641
##$PHC1= 30.40636
##$PH_mod= 1
##$PKNL= yes
##$PPARMOD= 0
##$PSCAL= 0
##$PSIGN= 0
##$REVERSE= no
##$SF= 50.3227315989248
##$SI= 32768
##$SIGF1= 140
##$SIGF2= 120
##$SINO= 11.81781
##$SIOLD= 32768
##$SREGLST= <13C.CDCl3>
##$SSB= 0
##$STSI= 32768
##$STSR= 0
##$SW_p= 12077.2946859903
##$SYMM= 0
##$S_DEV= 0
##$TDeff= 32768
##$TDoff= 0
##$TI= <>
##$TILT= no
##$TM1= 0
##$TM2= 0
##$TOPLEV= 0
##$USERP1= <user>
##$USERP2= <user>
##$USERP3= <user>
##$USERP4= <user>
##$USERP5= <user>
##$WDW= 1
##$XDIM= 32768
##$YMAX_p= 535915909
##$YMIN_p= -5565687
$$ End of Bruker specific parameters
$$ ---------------------------------
##NTUPLES= NMR SPECTRUM
##VAR_NAME=  FREQUENCY,     SPECTRUM/REAL,   SPECTRUM/IMAG
##SYMBOL=    X,             R,               I
##VAR_TYPE=  INDEPENDENT,   DEPENDENT,       DEPENDENT
##VAR_FORM=  AFFN,          ASDF,            ASDF
##VAR_DIM=   32768,         32768,           32768
##UNITS=     HZ,            ARBITRARY UNITS, ARBITRARY UNITS
##FACTOR=    0.368581032318806, 1,           1
##FIRST=     11203.0474431902, 0,            0
##LAST=      -874.247242800138, 0,           0
##MIN=       -874.247242800138, -5565687,    0
##MAX=       11203.0474431902, 535915909,    0
$$ Real data points
##PAGE= N=1
##DATA TABLE= (X++(R..R)), XYDATA
$$ [...]
8228a59323M50142M4081L59107k9311o5873L60826K44235k08570r1402j65758
8218G38154k85776J1983M72559k75361L4404N79851k10445j38796L51476j41077
8208A136972k27083l93946l33703n3606K55338K42851M5098n29293j12335K37152
8198B67445J10371k35052Q3707P42083L70816q6055o10299n39253k66795K7556
8188a35476j58179l45699J75699Q9008R47785R86997N7852K18602r978q47583
8178I79028j303864k8527q7887k42589K95566L35960m22951p27155J91234M88618
8168e22567N47644K24241L50757o26547o22171P1770K48655l78419l81022K97586
8158g90073K82906o6894k40368j11208j88743K92537L85378M31078M70855K36199
$$ y = [-159323, 290819, 334900, 694007, 664696, 598823, 959649, 1203884, 995314, 903912, 738154, 452378, 464361, 936920, 661559, 695963, 1275814, 1065369, 926573, 1278049, 1136972, 909889, 515943, 182240, 128634, 383972, 626823, 671921, 142628, 30293, 267445, 377816, 142764, 226471, 968554, 1339370, 1253315, 643016, 103763, -163032, -135476, -293655, -639354, -463655, -374647, 573138, 1560135, 1617987, 1836589, 1826611, 979028, -324836, -353363, -441250, -683839, -388273, -52313, -475264, -1202419, -1011185, -522567, 25077, 249318, 600075, -26472, -648643, -576873, -328218, -706637, -1087659, -790073, -507167, -574061, -814429, -925637, -1114380, -821843, -436465, -5387, 465468, 701667]
8148G01667l4985M21676L63804n76299j202991q36091o43046k26344k63794k8301
8138b324704N80643R09941N61366J35439p83831n79461R2793J74046O89371q4688
8128f29085o58209R6145J54836N99111P85395J66955k83846p98280o58529L87858
8118h37649J42222Q10504L48030n26282l75241K38491M48343l93155O70694P69900
8108A295857K56424j13671J75056N96101l97630j490815j579894N0503P32776
8099d75293J20603m93369j36629P04248R41401N43874r34941j155149p0003L35598
8089f19660M17359M16175k15913l70710m78299M22434J207087M85701l12927o12896
8079C38351J4439J79320J56280N07450L24832j56794m97512k08677O568j28917
$$ y = [701667, 666682, 1088358, 1452162, 875863, -327128, -1163219, -1806265, -2032609, -2296403, -2324704, -1744061, -834120, -272754, -137315, -921146, -1500607, -1407814, -1233768, -544397, -629085, -1287294, -1191149, -1036313, -437202, 348193, 515148, 231302, -566978, -1225507, -837649, -695427, 115077, 463107, -63175, -438416, -199925, 248418, -144737, 525957, 1295857, 1552281, 1438610, 1613666, 2209767, 1812137, 321322, -1258572, -1208069, -475293, -354690, -848059, -984688, -280440, 660961, 1204835, 269894, -885255, -955258, -619660, -202301, 213874, -2039, -372749, -851048, -428614, 778473, 1264174, 951247, 338351, 352790, 532110, 688390, 1195840, 1520672, 1363878, 866366, 657689, 664257, 535340]
8069E35340l95975j084728r70667o83108l7293L53259J4557M01058J1094j218790
8059c075253o52295N27068P35275K28709L78451N45891J86541m76154k85450j97229
8049b084446k74699n70145r809L12589P66084J193611J181461j83834o71511K22085
8039a18614l48532k60457P7768k19614K02010L91792K78853n57858r17445o35398
8029b107495m50587K84843J324208N88026k62810n12333l33470M66363M39918
8020e63337M0780M87808N49644J53625J21979q8473n27862K20938J30182k27204
8010B98080J36424m42174P20487Q07146P03000J8304k53671o31520p63263n06634
8000H6179o450K40609k07808q21275m47768l61364n17513k42544N77412J333186
$$ y = [535340, 139365, -945363, -1916030, -2599138, -2636431, -2283172, -2268615, -1867557, -1856463, -3075253, -3727548, -3200480, -2465205, -2236496, -1858045, -1312154, -1125613, -1601767, -1887217, -2084446, -2359145, -2929290, -2939099, -2626510, -1860426, -666815, 514646, 330812, -340699, -118614, -467146, -727603, -649835, -869449, -667439, -275647, 3206, -554652, -1472097, -2107495, -2558082, -2273239, -949031, -361005, -623815, -1136148, -1469618, -1003255, -563337, -522557, -34749, 514895, 668520, 790499, 702026, 174164, 395102, 525284, 298080, 434504, -7670, 712817, 1519963, 2222963, 2241267, 1987596, 1356076, 592813, 86179, 79729, 320338, 112530, -708745, -1156513, -1517877, -2035390, -2277934, -1700522, -367336]
7990c67336R03272P8922m6490J84982J16165o41984M4689O77972K01727l17098
7980H34821J33214p8486o83683P063L89719m33923k90214O925o6639n49478K43642
7969d87039P81614J043732N17545j077787o92395J65492M05573O36192J19522
7960A412449J41634J20225k63656j54864n01939q80121m05998O17006P13944O1097
7950H59777j005583j385721k59508J215655O44727j34259k47032K27399M1607
7941d2938l18236n68095k56697Q46076J191471M45226j2821m66230j071920p59314
7931a013478L91040Q80675P24279M31819n3524l53843j065259q16054m7863L89314
7921e32894O23339J268526o2383p56261M65541L39976l74682j05477O52722N84947
$$ y = [-367336, 535936, 614858, 568368, 753350, 869515, 227531, 272220, 950192, 1151919, 834821, 968035, 889549, 205866, 212929, 602648, 168725, -121489, -114564, -181203, -730681, -487039, 294575, 1338307, 1855852, 778065, 85670, 251162, 656735, 1292927, 1412449, 1554083, 1674308, 1410652, 1255788, 753849, -126272, -532270, 84736, 798680, 859777, -145806, -1531527, -1791035, -575380, 69347, -64912, -311944, -84545, -42938, -361174, -929269, -1185966, -339890, 851581, 1296807, 1283986, 817756, -254164, -1013478, -622438, 258237, 982516, 1414335, 1360811, 1006968, -58291, -874345, -922208, -532894, 90445, 1358971, 1296588, 540327, 1005868, 1345844, 971162, 865685, 1518407, 2103354]
7911B103354r1383r08149J90926J93108q89298m88889m29102J52020N70245p3686
7901C29146o46885p01610j43927M19390M25360P9259j13088O84302N51443m49623
7891D33767l6071J25651j5154n24636l00675l23954k78853j064969j117458j58130
7881c260482N62096K83920O16984N16218J12326N13297P61256M35197O52364j028826
7871A64350r39357M0784m25586q96749l59321J027565P95261o22417n52893j48301
7861a916664n74475l62659j22360N88404Q87142k51008o02724K32536J85036l46769
7851b283541j29531J260131Q29300k85020j91459M24341N89003Q77887M77721
7842A568832m55518k63656o24480r54077m72364K57983O1946L46447J222162Q57494
$$ y = [2103354, 2011971, 1103822, 1294748, 1487856, 598558, 109669, -319433, -167413, 402832, 329146, -317739, -1019349, -1163276, -743886, -318526, -239267, -352355, 331947, 883390, 433767, 397696, 523347, 508193, -16443, -317118, -641072, -919925, -1984894, -3102352, -3260482, -2698386, -2414466, -1797482, -1281264, -1168938, -655641, 105615, 540812, 1193176, 164350, -775007, -734223, -1159809, -2056558, -2415879, -1388314, -593053, -1215470, -1768363, -1916664, -2491139, -2853798, -2976158, -2387754, -1500612, -1751620, -2354344, -2121808, -1936772, -2283541, -2413072, -1152941, -323641, -608661, -800120, -375779, 213224, 1091111, 1568832, 1113314, 849658, 225178, -728899, -1201263, -943280, -881334, -534887, 687275, 1544769]
7832A544769O23997l9397l35647n35840J05192p6347n10884l4911k67183n56252
7822h2503O03342Q32201r92393j759446o04868M25531J010658L11992L14138L72117
7812D30769R50510k12610l03607n31726n51972j43013n59434m44744N78489O28313
7802a59025L93502L12182P07908R72209L49513m68620p15158p01606n33528j77086
7792a9709p2624P93581m35059j068639k12968j23367n51872m28599O72842J81463
7782a264951M28951R86481N197m141J70642M84966J54340j82388Q3272K68158
7772A130527j14347q86953r80519k30496N70006N18975j03694r80446r36200o4568
7762b077715O63413R29432K09765n77692k635L79209r9779p7675N12601J52232
$$ y = [1544769, 2168766, 2129369, 1793722, 1257882, 1363074, 1286727, 775843, 740932, 473749, -82503, 520839, 1353040, 360647, -1398799, -2003667, -1578136, -567478, -255486, 58652, 430769, 1381279, 1168669, 865062, 333336, -218636, -361649, -921083, -1365827, -787338, -159025, 234477, 546659, 1254567, 2226776, 2576289, 2107669, 1392511, 690905, 157377, -19709, -92333, 701248, 266189, -802450, -1015418, -1138785, -1690657, -2119256, -1446414, -1264951, -836000, 150481, 155678, 151537, 322179, 807145, 961485, 779097, 862369, 1130527, 1016180, 129227, -851292, -1081788, -511782, 7193, -96501, -1076947, -2013147, -2077715, -1414302, -484870, -275105, -852797, -855432, -476223, -576002, -653677, -141076, 11156]
7752A1156K37885N27217K60825L25990k07859l32857p79092k00687P059j76609
7742c26972N3904M29608L47025K04425M761L36253J18962k88436l46484l07354
7732B25692k37441l55778k11501J00024O80715P73115k41917l36960n13166j94349
7722c11566J017024J346758P99056K0778j36765p89616j242124q31836j122149
7713a250440q84187k60249N22899K35689J27319r3401k16242o8614Q38282J065443
7703A6499R6308m70179J15692L30312l22121n10905J41280N17241K00790q6967
7693B7950L18840K82297p0904l87444j02191m34346m6094J555251R36792n8251
7683B021900l4501k44339n16400p87244n18666L04809K59546l38825m48143k14604
$$ y = [11156, 249041, 776258, 1037083, 1363073, 1155214, 822357, 43265, -157422, -150363, -326972, -273068, 156540, 503565, 707990, 712751, 1049004, 1167966, 879530, 533046, 225692, -11749, -367527, -579028, -479004, 201711, 974826, 732909, 395949, -117217, -311566, 705458, 2052216, 2851272, 2872050, 2735285, 1945669, 703545, -128291, -1250440, -2134627, -2394876, -1871977, -1636288, -1508969, -1602370, -1818612, -1887226, -1048944, 16499, 112807, -357372, -241680, 88632, -233489, -744394, -603114, -85873, 114917, 27950, 346790, 629087, 558183, 170739, 68548, -365798, -411892, 1143359, 2080151, 2021900, 1987399, 1743060, 1226660, 439416, -79250, 225559, 485105, 146280, -301863, -516467]
7673e16467j70986K9661k32487L70892Q13957k84688r26955o98074J80817L85759
7663a048571Q72137R91502j0706m99930n26941K75887k98358n82681l52348n86655
7653a766664j42763K91311J128348J701897O20009n79000j486987p33127m83063
7644a450039r87109m76323K21283J227372J280589J16787J21421M38673n75042
7635h2388j286414l46471Q48161j33923p2199N65580J236183L07709k42102M76242
7625A270378J035934L27475l83471K4851p37307q98533n43038j005048o40714
7616a549473M44175P77657N07712M43693j25114j03470K76413M16658P01098j21951
7606A667398l67182j56821r4248J44686K29027m28011o81845J01579O72811J29422
$$ y = [-516467, -687453, -657792, -890279, -519387, 294570, 9882, -917073, -1615147, -1434330, -1048571, -176434, 815068, 804362, 304432, -222509, 53378, -244980, -827661, -1180009, -1766664, -1909427, -1618116, -489768, 1212129, 1832138, 1253138, -233849, -966976, -1450039, -2437148, -2913471, -2692188, -1464816, -184227, -67440, 53981, 492654, -82388, -1368802, -1715273, -867112, -1001035, -1073234, -507654, 728529, 1036238, 794136, 1270378, 2306312, 2633787, 2250316, 2275167, 1537860, 639327, 96289, -908759, -1549473, -1105298, -327641, 180071, 623764, 498650, 395180, 671593, 1088251, 1789349, 1667398, 1300216, 1143395, 1049147, 1193833, 1422860, 994849, 313004, 414583, 1087394, 1216816]
7596A216816k79844o79157q34038k19372M61972M56751R53469r6282J70524M87416
7586A638255m95818j283862m25794K838j08352O74751N54623M95591M42167L21952
7576A816351l29027j326328j061730j14110J096223Q77447P65606M83863n41854
7567A666441q67970q56619j92162N06683N62432L52834j15030p50356p96276n93714
7557a083737n04906M63043N50392J31122L91603N42974j01288m03277K69468K30470
7547D85864J41220L0032J69194p49111l60428L40483R7356L00171J05981K64632
7537H25394k87785k47687n85468j005321o28874M16591K77548J24432M12595O88437
7527a0138O50478K85870q33526j075673q19495l26904J3288L47503J080903K29292
$$ y = [1216816, 936972, 257815, -576223, -795595, -333623, 123128, 1076597, 980315, 1150839, 1638255, 1142437, -141425, -567219, -564381, -672733, 2018, 556641, 1052232, 1494399, 1816351, 1487324, 160996, -900734, -1014844, 81379, 958826, 1724432, 2208295, 1666441, 798471, -58148, -250310, 256373, 818805, 1171639, 1056609, 306253, -490023, -1083737, -1588643, -1125600, -575208, -444086, -52483, 490491, 389203, -14074, 255394, 485864, 627084, 657116, 826310, 77199, -283229, 57254, 154610, 454781, 560762, 825394, 537609, 289922, -295546, -1300867, -1929741, -1513150, -1235602, -1111170, -698575, -10138, 640340, 926210, 92684, -982989, -1802484, -2129388, -2116100, -1768597, -687694, -458402]
7517d58402m46586L73246p7224J66549J582903J304525O4172m82032n52912M2391
7507A516630l87773r69710m60910L53115M03573n02712o7784Q32712P80813M2385
7497A540339k54826o7566j57826m49651m59113o806J86016K23010R1038p84588
7487a39973j004805j75450j27522j87147L1599n84991p7563K9030l05893J95923
7477b346792J093219R99280L26319j83678M96580Q52040l42969n64316l33628
7468c945J92388J059715M36070M76254n25308l82710R6998k20998j09711n47349
7458D71404m92819j26861m78352K59480R52091K90803j55995n8011j58574o10585
7448a07419m02687m6735Q4967L78934Q4411L02093R48620R34508m9759o38847
$$ y = [-458402, -904988, -531742, -608966, -442417, 1140486, 2445011, 2509183, 2027151, 1474239, 1516630, 1128857, 159147, -301763, 51352, 454925, -47787, -115571, 717141, 1497954, 1540339, 1285513, 1217947, 1060121, 610470, 151357, 144551, 330567, 553577, 644615, -139973, -1144778, -1320228, -1447750, -1634897, -1603298, -2188289, -2265852, -2236822, -2542715, -2346792, -1253573, -254293, 72026, -111652, 384928, 1236968, 893999, 329683, -3945, 188443, 1248158, 1684228, 2160482, 1635174, 1252464, 1349462, 1128464, 1018753, 471404, -21415, -148276, -626628, -367148, 584943, 875746, 719751, 661740, 503166, -107419, -510106, -556841, -471874, -92940, -8529, 293564, 1242184, 2176692, 2126933, 1488086]
7438A488086p48211j404290k11387K67318m36387j29708J31325J18960k38882
7429a163176P21394J254158O55371k87663k00711K58010n92404m84556j02739
7420E7684Q1963K02561Q81439N78889K82983P11876L91445N6143j194965p34739
7410A315279r1347M8159N49897N69167o67065j075114l05388J346581J086381
7401B776550K81618K35920r3758n37743m75165n36418M9777N59663K28674p53339
7391A735779r52702K04131M44319j251K79418R93277L63778j43474k92999j368779
7381A261497o60469J96743M08037O72674J19857j95278n55741Q2482L80464j80054
7371A530212l4932L19545J81799K83036N57467O32921Q41556k48286r63284K9337
$$ y = [1488086, 739875, -664415, -875802, -608484, -1044871, -1174579, -1043254, -924294, -1163176, -441782, 812376, 1467747, 1180084, 979373, 1237383, 644979, 160423, 57684, 139647, 342208, 1223647, 1802536, 2085519, 2797395, 3188840, 3244983, 2050018, 1315279, 1223932, 1272091, 1821988, 2391155, 1724090, 648976, 343588, 1690169, 2776550, 3058168, 3294088, 3200330, 2662587, 2187422, 1651004, 1700781, 2260444, 2489118, 1735779, 783077, 987208, 1431527, 1430276, 1709694, 2702971, 3066749, 2923275, 2630276, 1261497, 601028, 797771, 1205808, 1878482, 1998339, 1803061, 1247320, 1329802, 1710266, 1530212, 1495280, 1814825, 1996624, 2279660, 2837127, 3470048, 4311604, 4063318, 3100034, 3129371]
7361C129371j53322o98457l61643Q70115P15171J15745K29631J17117j05050p0406
7351C788272J30311m65073n35871N45798k1222j8640P73215J576267J554923M26504
7341G754484k83159Q9458L13944N2127L68875j07341r02072P869n2188l73896
7331F868101O93504J544685R44491l13866l01143k69567n21733K36488J800221
7322A0681181J826665J139431Q35267Q18236O11847M88553Q28584J194996J829556
7313B0254316K995300L996714M727730N782583P149556Q887410J0858846J3235685
7305G7888140J7026248K2168060K9779910L8289075M8367868N6430179M9591132
7298C39540612K6639072M096363j4783511l8081850n4672266n4950500m5265764
$$ y = [3129371, 2976049, 2277592, 1915949, 2786064, 3501235, 3616980, 3846611, 3963728, 3858678, 3788272, 3918583, 3453510, 2917639, 3463437, 3442215, 3423575, 4196790, 5773057, 7327980, 7754484, 7471325, 7560783, 7874727, 7926854, 8295729, 8188388, 7286316, 7294185, 7241997, 6868101, 7561605, 9106290, 10050781, 9736915, 9435772, 9166205, 8644472, 8880960, 10681181, 12507846, 13647277, 14482544, 15300780, 15912627, 16401180, 17229764, 18424760, 20254316, 23249616, 27246330, 31974060, 37756643, 44906199, 53793609, 64652455, 77888140, 94914388, 117082448, 146862358, 185151433, 233519301, 289949480, 339540612, 366179684, 370276047, 355492536, 317410686, 262738420, 207787920, 162522156]
7291A62522156l4129393k4960690j8953969j4802967j1573272r322382p497989
7284D1281494n468000l534704l856082m001206l472004k602183j667201j475927
7276A5204187r60493r08633j286510j294634j296749o19503m16928j418656j182865
7267E819216q81526o16131n21450K6777J91523j52618k43851p12124n30085M41457
7257B821188N74281L50562j51287P31667O61836k01038m50498j8412J4463J23914
7247D456676J53244j117609j133279p15175j09496P22025M70897o14986l03296
7238A809001M12864R63885R199p48530n46414l83911l90684n20358L64081M62048
7228A431181k89123r33066q21299j092418k54736P32804Q27493M22525M96137
$$ y = [162522156, 128392763, 103432073, 84478104, 69675137, 58101865, 48779483, 41281494, 35813494, 32278790, 28422708, 24421502, 20949498, 18347315, 16680114, 15204187, 14243694, 13335061, 12048551, 10753917, 9457168, 8837665, 8420737, 7002081, 5819216, 4937690, 4321559, 3800109, 3826886, 4018409, 3865791, 3621940, 2909816, 2379731, 2821188, 3395469, 3746031, 3594744, 4326411, 4988247, 4787209, 4336711, 4318299, 4332762, 4456676, 4609920, 3492311, 2359032, 1643857, 1534361, 2256386, 2727283, 2112297, 1809001, 2221865, 3185750, 3194949, 2446419, 1900005, 1516094, 1125410, 605052, 969133, 1431181, 1142058, 208992, -612307, -1704725, -1959461, -1226657, -399164, 23361, 519498]
7219E19498R48983K96184o53361k09530J24722n2290l10669j199336n33103J81781
7209h87121R57415P75578j39870n8581J82887p3237l19744l05202J38311N50396
7199H20832q2397m72646q94870p65815k2820Q75702L63773l01369m94565o13737
7189a587912o77088O06336J080803N06029P81342K60746L03062L33590l94158
7180A212750j185310m92044M44382m18433l24292J197787M70881l10144o03889
7171h312n50113k98403K83416P86516P25928n18722j95138N67500K8316j13448
7161G07540l00596q40662q66870j45195m1028M74762K90502L14844J081696P30580
7151A405573n89626n52566j06562j62842n45606l42752l60302j81847L22747J55631
$$ y = [519498, 1468481, 1764665, 1111304, 901774, 1026496, 974206, 663537, -535799, -1068902, -887121, 70294, 845872, 706002, 647421, 830308, 757071, 437327, 132125, 270436, 820832, 738435, 265789, -629081, -1394896, -1417716, -542014, -178241, -479610, -974175, -1587912, -2265000, -1658664, -577861, -71832, 709510, 970256, 1273318, 1606908, 1212750, 27440, -464604, -20222, -438655, -762947, 434840, 905721, 595577, -8312, -558425, -856828, -573412, 213104, 939032, 420310, 225172, 792672, 820988, 707540, 406944, -433718, -1300588, -1445783, -1486811, -1012049, -721547, -406703, 674993, 1405573, 815947, 263381, 156819, -6023, -551629, -894381, -1254683, -1436530, -1113783, -958152]
7141i58152o5317J40958K52686M68869j5608L52307L22617k09675j33808m14920
7131b60043J74202M57888q9750j90562j91564M75531J023704o8291p04764n00289
7121A26062k00431k35403K49388K94264o47770m88801P48139J416762Q20799J85174
7111B268183l65275p99753q41485n10745K6369q66643j060106j48057R58012J314858
7101b4642J690402J320225j37299j503724o40861K7243R450n2496n37271p46094
7091e95067j079051n47610J37347k4773Q15039K004529Q58411r1627q86202j233013
7081f42017j99326l6254m31219J87492M99142J40285o93828l38248M64725P8645
7071i70603n44023L13955O35735N37159J47177o31764j147316k85191Q69881l6542
$$ y = [-958152, -1023469, -882511, -629825, -160956, -176564, 175743, 498360, 288685, 154877, -260043, -85841, 372047, 282297, 91735, -99829, 375702, 1399406, 1331115, 626351, 126062, -74369, -309772, -60384, 233880, -413890, -902691, -154552, 1262210, 2083009, 2268183, 1902908, 1103155, 261670, -249075, -222706, -1089349, -2149455, -2297512, -1339500, -24642, 1665760, 2985985, 2848686, 1344962, 704101, 731344, 740794, 688298, 151027, -595067, -1674118, -2221728, -2084381, -2109154, -1294115, 710414, 1568825, 1477198, 590996, -642017, -841343, -877597, -1308816, -1121324, -622182, -481897, -1175725, -1513973, -1049248, -970603, -1514626, -1200671, -564936, -27777, 119400, -512364, -1659680, -1944871, -1074990, -1111532]
7061a111532k77476M13409K58156N25670P78836J86464m40895m15460q27503q57073
7051a767404k0383m7281M39248P78957Q96517M53218M44344k47305J18433M92793
7041A541137L34066j37759q59832m87917k1086l37725l02932J7067n56698m36106
7031a247785K02285N28862L52793L88467q879J20996L29750K93292K87756l84299
7021H63238m14621O7990n15092j81112n78800m55352P03149M36273L91211M70557
7011G87441P3505k94318p27045p63864Q7561R84516J774825O52563p40816r19423
7001I14945m95666j1704J41208j96314p7719k16582o02706q61052q79678k89610
6991b574878L4337P57793Q02228J90480J38377k16572k11550K23926j52041j50902
$$ y = [-1111532, -1389008, -975599, -717443, -191773, 587063, 773527, 332632, -82828, -910331, -1767404, -1787787, -1835068, -1395820, -616863, 279654, 732872, 1177216, 929911, 1048344, 1541137, 1875203, 1737444, 877612, 389695, 368609, 30884, -272048, -254981, -811679, -1247785, -1045500, -516638, -163845, 224622, 215743, 336739, 666489, 959781, 1247537, 863238, 448617, 516607, 1515, -179597, -758397, -1213749, -510600, -74327, 316884, 787441, 860946, 566628, -160417, -924281, -836720, 147796, 1922621, 2575184, 1834368, 914945, 419279, 407575, 548783, 352469, 274750, 58168, -544538, -1405590, -2285268, -2574878, -2540541, -1782748, -980520, -790040, -651663, -868235, -1079785, -855859, -1007900, -1158802]
6981a158802j83347j012835j29994J047467O98285k50365K5565K44938n2133o2225
6971h33446O77726P95465P48174K29706m52489m13591l80404r34518j35553P29046
6961C0116M37998J16324L47229R28188O59295k04127P091j77703p20522J8369
6951A442258j32322j33293K55300L99989l99482l61228j82573m00970n92140r63300
6941a067761o12376J419608J335639j47741L10585R0479k63617n6281l99513P8334
6931F87356k85062L3144M18752J48072Q4709m4092p00205j46470J11149j62387
6921A44966J00595J55736j02759m4196l31584o58561l53679o69945n6928k40607
6911b056962l22414M53516O04940k1466K75083L04175N90912K6834l84621j53572
$$ y = [-1158802, -1342149, -2354984, -2484978, -1437511, -739226, -989591, -964026, -719088, -771221, -833446, -155720, 639745, 1387919, 1617625, 1165136, 751545, 371141, -563377, -698930, 30116, 468114, 584438, 931667, 1859855, 2519150, 2315023, 2322114, 2144411, 1423889, 1442258, 1309936, 1176643, 1431943, 1831932, 1432450, 1071222, 888649, 487679, -104461, -1067761, -1680137, -260529, 1075110, 927369, 1237954, 1328433, 1064816, 1008535, 609022, 687356, 402294, 435438, 854190, 1002262, 1086971, 1042879, 342674, 196204, 307353, 144966, 245561, 401297, 298538, 254342, -77242, -735803, -1089482, -1759427, -1816355, -2056962, -2379376, -1925860, -1320920, -1342386, -1067303, -763128, -172216, -145382, -530003, -683575]
6901f83575K67001J060270J285247O44099m66175J43877j21175q55811n45313
6892G28445n59043p63769n70253N8927q0804M38458R97974J271366Q41176l67990
6882A994487M2832N0334j56128q64541j101821p99467l54125r4140L91426L19114
6872e72029o34601m95381J16115L94348k81321n2653N75209m68249l44825N26657
6862a236730Q34852J183071K21367m28770j2040m78788n64545o1151r9544j74538
6852h16816n30250O5244O1828K12672j4567J7118m5560L15263R04160K9450r24008
6841g25466p25188K99334K92841k34588o86366l0269J120861R04385j81235q62834
6831h28525l61717N27151K48842k42766L6913J34517k788l65554K87830P71515
$$ y = [-683575, -416574, 643696, 1928943, 2573042, 2106867, 2250744, 2129569, 1273758, 728445, 169402, -594367, -1164620, -1105693, -1186497, -748039, 249935, 1521301, 2362477, 1994487, 2037319, 2087653, 1931525, 1066984, -34837, -834304, -1188429, -1282569, -891143, -572029, -1206630, -1702011, -1585896, -1191548, -1472869, -1525522, -950313, -1418562, -1763387, -1236730, -401878, 781193, 1002560, 573790, 561750, 82962, -481583, -542734, -642278, -816816, -1347066, -1281822, -1219994, -1007322, -1021889, -1004771, -1050331, -735068, 169092, 198542, -725466, -1450654, -1151320, -858479, -1093067, -1779433, -1809702, -688841, 215544, 34309, -828525, -1190242, -663091, -414249, -657015, -620102, -485585, -488373, -853927, -566097, 205418]
6821B05418J34899r7151m88710o48349j302869n18260L43455J79271M88502O07530
6811a096264K18933k90913j3671J187656M57416K7569L17984l32028k12135q77255
6801f12708o0862K55998M36480P08118J407178R11497p26015r27774q63316m85065
6791D3531l14421J22217Q8047j96752m94933q1511J057383O36328l03595q98779
6781c42485o09250N60346R21446l75016j567128m68779R92839J312898M58418
6772H83289p17542l98380M11845m69222q16182o50083k83895q45963k39011R65952
6762b159192J532130Q40149n57462q82773o81692L94296N40796k81881l1234O95025
6752e91838P91014L18178j125025m47555Q80322M52709M54271L95227O8753J95862
$$ y = [205418, 340317, 243166, -245544, -893893, -2196762, -2715022, -2371567, -2192296, -1703794, -1096264, -877331, -1168244, -1181915, 5741, 463157, 490726, 808710, 476682, 264547, -612708, -673570, -417572, 18908, 727026, 2134204, 3045701, 2319686, 1391912, 528596, 43531, -270890, -148673, -60626, -257378, -752311, -833822, 223561, 859889, 556294, -342485, -951735, -391389, 530057, 155041, -1412087, -1880866, -888027, 424871, 883289, 165747, -232633, 179212, -290010, -1106192, -1756275, -2040170, -2886133, -3125144, -2159192, -627062, 213087, -344375, -1227148, -1908840, -1514544, -973748, -1255629, -1286863, -591838, 199176, 517354, -607671, -1055226, -174904, 277805, 732076, 1127303, 1196056, 1391918]
6742A391918m77023j400236r3982L85678P4664K49088j27580J66109O1822n21972
6732b91514p25429l1469M68445M94009k8902M70786O13444P5790J13069p81812
6722C76417r79259K3168J046366O71465l81331n17902j98672j80143k88561p18284
6712a146736J93794Q01091k3301m77877o5085M39444K71742l82675l90690m32332
6702a212625n09634j26318M50884L554J29167j0729L64996L02778r48081r51212
6692b507220M4674O55361O53103R23732K4206j55303O88223M97653j202102q31641
6682a209314o1717o8442n81971j08306Q39489O19984L01717O81016R14885L7344
6672A364685p17446p16625p81861p01883K13629N65328N00593K52261m13385j162400
$$ y = [1391918, 914895, -485341, -579323, -193645, -118981, 130107, 2527, 168636, 230458, -291514, -1016943, -1048412, -579967, -85958, -114860, 355926, 969370, 1045160, 1158229, 376417, -602842, -579674, 466692, 1138157, 756826, 238924, 40252, -139891, -428452, -1146736, -952942, -151851, -175152, -653029, -718114, -278670, -6928, -389603, -780293, -1212625, -1722259, -1848577, -1397693, -1394139, -1264972, -1275701, -910705, -607927, -1556008, -2507220, -2462546, -1807185, -1154082, -230350, -206144, -361447, 326776, 824429, -377673, -1209314, -1271031, -1339473, -1921444, -2029750, -1190261, -570277, -268560, 412456, 1327341, 1364685, 647239, -69386, -851247, -1553130, -1339501, -774173, -273580, -21319, -434704, -1597104]
6662a597104j011585k44680O77173M05071K47121J37834m0373Q42972P80780k56791
6652e9582K2069J67195j49439n63413j3014J45167k14271m3233K84404N37591
6642A13474O5915m59211l69661M92741R33393P10135l52095m48297o07599n49067
6632d70272k08810n56859j24262K77296M06685J423288M39410k98114j07800M1338
6622H21900k98605p83746n55366k89730J32257K25619P18550L23977R2724L06291
6612F93871r8191j451059o06227J647046J277287K50657k06752m25296r2124K14717
6602A203929K5389J8599q6743l96347o09098k18754L23682l67375n55151Q2834
6592e79035P3592j77907p7850M67360J077305N09853l76946K6624L16295J59087
$$ y = [-1597104, -2608689, -2853369, -2176196, -1771125, -1524004, -1386170, -1426543, -583571, 197209, -59582, -37513, 129682, -19757, -583170, -596184, -451017, -665288, -708521, -424117, 113474, 179389, -279822, -649483, -156742, 776651, 1486786, 1134691, 686394, 78795, -470272, -679082, -1235941, -1360203, -1082907, -676222, 747066, 1186476, 888362, 780562, 821900, 523295, -260451, -815817, -1105547, -973290, -747671, -29121, 294856, 387580, 693871, 595680, -855379, -1461606, 185440, 1462727, 1713384, 1506632, 1081336, 989212, 1203929, 1229318, 1247917, 1161174, 764827, 155729, -63025, 260657, -106718, -661869, -579035, -505443, -683350, -761200, -293840, 783465, 1293318, 916372, 942996, 1259291, 1418378]
6582A418378m12100p59864M5791J14601K20977J36197K41291K29076J30506j47398
6572A217455m47179K27212K07464j182288j354456M22135O82334N77757N96610
6563I47044M68779J7720j298452j062757k54083M46222k27701m40617K14484r905
6553a199266m09224L19618M82917K89813O14949Q68391J33857K01856J051388
6544B354299R22786k95604n02722J93964K89830l93509j106931o45468k1191J8076
6534H13530o10453l13669M24338J128683k49585r20545m24855k79098M80827O88534
6524G37707P6015o96036q16800L53040L68558l06878k60216K06418m73606m05920
6514a217718R01063J216771M68367n47665r70995n58012k88165n36779J139937
$$ y = [1418378, 1006278, 246414, 292205, 406806, 627783, 763980, 1005271, 1234347, 1364853, 1217455, 770276, 997488, 1204952, 22664, -1331792, -909657, -227323, 350434, 947044, 1415823, 1433543, 135091, -927666, -1181749, -735527, -963228, -1403845, -1189361, -1199266, -1608490, -1288872, -805955, -516142, 98807, 967198, 1101055, 1302911, 2354299, 3277085, 2981481, 2478759, 2672723, 2962553, 2569044, 1462113, 816645, 795454, 813530, 203077, -110592, 313746, 1442429, 1192844, 272299, -152556, -431654, 49173, 737707, 813722, 117686, -699114, -346074, 22484, -284394, -544610, -338192, -811798, -1217718, -316655, 900116, 1368483, 820818, -150177, -708189, -996354, -1533133, -393196]
6505c93196J604168j15205j038701j330665o88285k61491L83926K17407P42811
6496h79231K94471K05163J067305N60822K98244j09206l88635j94379M76190M35804
6486A766548l68041o56612o38366k67100K47709N10055M68655j3471p44748J60157
6476D64786Q94930K51978m21378j198693r07945N15679l54403p51831N58547J019840
6466G1510O80231M79911l57969o41911p58313j71932O39639J11113o14398o13134
6456a175253L330l45072m32385k65594J27688J149214J215965j23124m663O14948
6446G65054k90539j28937K46205j68866K27960j68119P5119O75014m66369j371207
6436f04685p45989L95343J72606M82524L08241j75724j95316n71708j50712R5497
$$ y = [-393196, 1210972, 1095767, 57066, -1273599, -1961884, -2223375, -1839449, -1622042, -879231, -584760, -379597, 687708, 1248530, 1546774, 1437568, 1048933, 854554, 1330744, 1766548, 1398507, 741895, 103529, -163571, 84138, 594193, 1062848, 1049377, 304629, 464786, 1359716, 1611694, 1190316, -8377, -916322, -400643, -755046, -1506877, -948330, 71510, 751741, 1231652, 873683, 231772, -526541, -698473, -58834, 52279, -562119, -1175253, -1171923, -1516995, -1949380, -2214974, -2087286, -938072, 277893, 154769, 150106, 765054, 474515, 345578, 591783, 422917, 650877, 482758, 557877, 1232891, 766522, -604685, -1350674, -955331, -782725, -300201, 8040, -167684, -363000, -934708, -1085420, -989923]
6426i89923k8627J12416p5610j042526q44899N52360J504256N33713L16104L55901
6416C93165o429R0055j78133j106074k78532O21174J80190k65117K26372O32949
6406C09620m67722j478841j350688k65160R10905J458519J010981O0307o28494
6397d40573q92033K33063P43451Q75473Q18192J96865J86209p83961j093968k83787
6387d41069L19548N7252k7665K48766J26206n17259o34808o76264Q5161P05158
6377g54974L19628M57670L64147M82245O63307P26488l22373p08152p52969J05729
6367E80746N40850K55849L98491l85570q39851j19193o73942p84389m07294P907
6357a426396J94476j74652N32770K91905M12505R05254K80277O35863K79495j074193
$$ y = [-989923, -1018550, -906134, -981744, -2024270, -2869169, -2316809, -812553, -278840, 37264, 393165, 386736, 476791, 298658, -807416, -1085948, -464774, -284584, -549701, -323329, 309620, -158102, -1636943, -2987631, -3252791, -2341886, -883367, 127614, 187921, -440573, -1332606, -1099543, -356092, 519381, 1337573, 1534438, 1720647, 936686, -157282, -441069, -121521, -64269, -91934, 156832, 283038, -234221, -869029, -1545293, -1460132, -754974, -435346, 22324, 386471, 868716, 1532023, 2258511, 1936138, 1227986, 475017, 580746, 1121596, 1377445, 1775936, 1390366, 550515, 431322, -242620, -1027009, -1434303, -1426396, -1231920, -1406572, -873802, -581897, -169392, 735862, 1016139, 1652002, 1931497, 857304]
6347H57304m60490L40411j77673k20886R76170j32995j119519j025467j010629
6338a973774j51941R57631J535093R53479m39028m79502N17646J92123r81843
6329A29884p55334L31775M05633o7153m30524L19855N17152k45550j18592M97316
6319E84462Q05405Q38653k59200r51296o75824p03801K37766O49692L37828m18707
6309D44978n28287l50461M13113K97078j54833l21320J96047P90021J046440K60919
6299B093695o80139j040136l05063O27552j72724m38270q3934J90256m01090m1074
6289b50927O15407L34377O08261m03290J05736N79299K24510L89046k15016o03042
6279A384361k27101L70718K83079j80546o12165o52282k51687l54840q24545J15241
$$ y = [857304, 396814, 737225, 559552, 338666, 1314836, 1181841, 62322, -963145, -1973774, -2125715, -1168084, 367009, 1320488, 881460, 401958, 919604, 1111727, 129884, -625450, -293675, 111958, 44805, -385719, -65864, 451288, 205738, 87146, 584462, 1389867, 2228520, 1969320, 1018024, 342200, -361601, -123835, 525857, 863685, 444978, -83309, -433770, -20657, 276421, 121588, -199732, -3685, 786336, 1832776, 2093695, 1413556, 373420, 68357, 695909, 523185, 84915, 981, 191237, -209853, -250927, 364480, 698857, 1307118, 903828, 1009564, 1588863, 1813373, 2202419, 1987403, 1384361, 1157260, 1527978, 1811057, 1630511, 1018346, 366064, 114377, -240463, -1065008, -949767]
6269i49767N81970J026703N61889l14617J19868O60591J81517Q5762K75467j26966
6259B102417m48887o73150o91379m75032J88087P08404m4451n09291n7751L31896
6249D30863J98592j55533k72439K36934k44914o40381J48176l52121o74064L3434
6239a291453O92947N85585K40701M82250O73753K4138Q7020P96898o216r05830
6229A379793j008031M63857J541574O84976m40020l2717K45986n05372l94492
6220A935554J171907J028333J48324k73024k67334L66235R697r12904r57316k80065
6210A969407L41414R987K47447Q811j139855j275407l61693J23873K58417R52771
6200A135172P75422o90708j122960m53526K93482Q31372K15079J05207K97251
$$ y = [-949767, -367797, 658906, 1220795, 906178, 1026046, 1686637, 1868154, 1953916, 2229383, 2102417, 1653530, 980380, 289001, -186031, 2056, 710460, 666009, 156718, 98967, 430863, 629455, 473922, 201483, 438417, 193503, -446878, -298702, -650823, -1324887, -1291453, -598506, -12921, 227780, 710030, 1383783, 1407921, 1494941, 2291839, 2285623, 1379793, 371762, 835619, 2377193, 3062169, 2622149, 2589432, 2835418, 2330046, 1935554, 3107461, 4135794, 4284118, 4011094, 3743760, 4109995, 4119692, 3206788, 2249472, 1969407, 2310821, 2320808, 2568255, 2577066, 1437211, 161804, -199889, -76016, 182401, 1135172, 1910594, 1219886, 96926, -356600, -63118, 768254, 983333, 1088540, 1385791]
6191A385791l19282m77169J17387N23025l53417m09426k8793k83052p21255L11651
6181b54540N30209L10402K48657L6068q4126K85260Q36145O41911m50375q16835
6171A282776k08121K69890R18752j2296o9942n41913j437659q46549k56393J7901
6161h83554R6839J12194J76414O06808K09042j87026K47996M64207M05349N24447
6151A772716k87222j092572r11745M5180K94509j29713q2520k4322r2146K46916
6141b60919L69908j5724J39504o71588k60780J70395m23951n30695L08620L55800
6131h19430K17762N90978L59675N21807P64103K50061n48210N23883J204366q9167
6121B975828n65249j67428p849m41173k27099m1027m40497R4961P78739R42649
$$ y = [1385791, 1066509, 589340, 706727, 1229752, 876335, 466909, 438116, 155064, -566191, -254540, 275669, 586071, 834728, 870796, 786670, 1071930, 1908075, 2549986, 2099611, 1282776, 1074655, 1344545, 2263297, 2251001, 2181059, 1639146, 201487, -645062, -901455, -883554, -786715, -674521, -498107, 108701, 317743, 130717, 378713, 842920, 1248269, 1772716, 1485494, 392922, -518823, -473643, -179134, -308847, -391367, -415689, -507835, -260919, 108989, 93265, 232769, -438819, -699599, -529204, -953155, -1483850, -1175230, -819430, -601668, -10690, 348985, 870792, 1634895, 1884956, 1336746, 1860629, 3064995, 2975828, 2410579, 2243151, 2235302, 1794129, 1567030, 1526003, 1085506, 1180467, 1959206, 2901855]
6111B901855P3575l81935o56112q57680j87691L16557j9943k78040L29177L09523
6101A549286l20580J52693Q04482k05981j461080j710232o77064O15164N67348
6092f85964m31906o53223R6216L80816L55439N25102O08929J067398P79495l20576
6082A721726j125550m6499N5667r9345J05450P8741k62991j871O80029O00604
6072A705961l78411J0521J532717R81394m01651j46245j54104l35800m60599m80354
6062A873429K41077L19329n2884L62752N15952k9545J55240Q38654M27431l29145
6052D322290o41853k3754m37101m83983o8186L87063K77112K26702K40343L67605
6042D166238J92495J62792M69300K75099M44795L78112J31211q51840n29773K40478
$$ y = [2901855, 2975430, 2593495, 1937383, 1079703, 892012, 1208569, 1188626, 910586, 1239763, 1549286, 1228706, 1381399, 2185881, 1979900, 518820, -1191412, -1868476, -1253312, -685964, -1117870, -1771093, -1674877, -1294061, -938622, -413520, 195409, 1262807, 2042302, 1721726, 596176, 549677, 605344, 505999, 611449, 690190, 427199, 425328, 1105357, 1705961, 1327550, 1338071, 2870788, 3852182, 3450531, 3304286, 3150182, 2814382, 2353783, 1873429, 2114506, 2433835, 2380951, 2743703, 3259655, 3230110, 3385350, 4224004, 4651435, 4322290, 3680437, 3656683, 3219582, 2735599, 2667413, 3054476, 3331588, 3558290, 3798633, 4166238, 4358733, 4521525, 4990825, 5265924, 5710719, 6088831, 6220042, 5368202, 4838429, 5078907]
6032E078907M49163k80516J22421O16145N54591M49500L55248L35460L02775J359834
6022I343528K402592J912690O98150J024987J301495o0990r87801q91140N77503
6013A5321014J639603J693629J883850K235092K163200J990186J868123J704496
6005C0499193J703786K214530K836337N716267Q686507R646754J1563808J7095253
5997H9962435K3353881L0967879L8425219L7794968K0520418p690937k5940827
5990B07393036k5795373j5351247m163306O188998J7575145K7051864K4926661
5983B37825778K726003k6732514l9823726l7055954k9729353k1958236j5362928
5976F9889070j1396090r511003p795830n811319m516326l093748j986505k190533
$$ y = [5078907, 5528070, 5247554, 5369975, 5986120, 6540711, 6990211, 7345459, 7680919, 7983694, 9343528, 11746120, 13658810, 14356960, 15381947, 16683442, 16622452, 15634651, 14743511, 15321014, 16960617, 18654246, 20538096, 22773188, 24936388, 26926574, 28794697, 30499193, 32202979, 34417509, 37253846, 42970113, 51656620, 61303374, 72867182, 89962435, 113316316, 144284195, 182709414, 220504382, 241024800, 233333863, 207393036, 181597663, 166246416, 162083110, 168272108, 185847253, 212899117, 237825778, 240551781, 213819267, 173995541, 136939587, 107210234, 85251998, 69889070, 58492980, 48981977, 41186147, 35374828, 30858502, 27764754, 25778249, 23587716]
5968B3587716k363112k521664k509276j787741j168853j124531j015192p94530
5960A0302817j071499o19676o76488j28978P8425k08367k90178j63378k32665
5951F990013m3722l55996l21538p89173r54971m86230J119868J519784M16501
5942G094536m69578j153028p68362j82628k6881q0868k57326l73755l25537r34783
5932B521790k47901J90116m01478m06268M67994Q73153M58581n26310o95953l07350
5922A926374L20601n5979n21555n38192j1047K07530J81693L1330j46846l66409
5912A027500N51675R85708L41989L36603J52813J81223l06458j049968o19085
5903A602000L87960O92541K06309o57435m46900j39644k23291p77689l9986M24480
$$ y = [23587716, 21224604, 18702940, 16193664, 14405923, 13237070, 12112539, 11097347, 10302817, 9231318, 8611642, 7935154, 7806176, 7884601, 7676234, 7386056, 7222678, 6990013, 6946291, 6590295, 6268757, 5479584, 4524613, 4038383, 5158251, 6678035, 7094536, 6624958, 5471930, 4703568, 4520940, 4494059, 4413191, 4155865, 3782110, 3456573, 2521790, 2273889, 2464005, 2062527, 1656259, 2124253, 2997406, 3455987, 2929677, 2233724, 1926374, 2246975, 2190996, 1669441, 1131249, 1120202, 1327732, 1509425, 1540755, 1393909, 1027500, 1579175, 2564883, 2906872, 3243475, 3396288, 3577511, 3271053, 2221085, 1602000, 1989960, 2682501, 2888810, 2231375, 1784475, 1644831, 1421540, 643851, 603865, 1028345]
5893A028345J82856J60221l71019n44113o3667K55380l66449l34374L61498K19132
5883E27810J18542O69604M8232O7095Q62626K92215m10045k48873l61279j67446
5873A398481k66040o3449J37879o2867l1499l82335j252820j169161Q1229J105570
5863e05012P78762j78686L83747O00307L27165M2966O6191M86450K20585O2491
5853B284966r3174k97667k18990j05093r51697n91439L16726j08580L16787N06495
5843A058334J49542o03647o06720r0822O32666M38005m11284q5797j59457j78791
5833A42029N07093O81705q8751o62318M35434p6391j000245j28743p2552L30777
5823F8038R82018P63983p28275j404980m16176J255094J512558P38552M12103
$$ y = [1028345, 1211201, 1371422, 1000403, 456290, 392623, 648003, 281554, -52820, 308678, 527810, 646352, 1315956, 1364188, 1431283, 2293909, 2586124, 2176079, 1927206, 1565927, 1398481, 1132441, 1068992, 1206871, 1144004, 1112505, 730170, -522650, -1691811, -1610582, -505012, 273750, 95064, 478811, 1079118, 1406283, 1449249, 1515440, 2001890, 2222475, 2284966, 2191792, 1894125, 1675135, 1570042, 618345, 26906, 343632, 235052, 551839, 1058334, 1207876, 604229, -2491, -93313, 539353, 977358, 566074, 480277, 320820, 142029, 649122, 1330827, 1242076, 579758, 1015192, 938801, -61444, -190187, -262739, 68038, 1050056, 1814039, 1085764, -319216, -735392, 519702, 2032260, 2770812, 3182915]
5814C182915J71602m04744j401092j183830M57227O22017l40247m76603K26080
5805H53325O17001J197372J146688k5974l68285k43185k96944m94104m57152k61655
5795A667087l1959L71080k7916r84141K21789J008030M27561m60534k60368p38784
5785A191845q09747m74748l85760N99809L55023p1073J147181M81941n53764K07394
5775A688101L43609q6730l38956p33584n30005L95534R46803K74813j076740j127663
5765b44818J00432O52398l90243K57669M73728K67577K67965P0702L95726P56596
5755B607732m98641n02914J19106M76084P333n54368r60132m9426P24561J003115
5745B372450O17499J98244o09761j066359j88751M93702M91064Q79032m22305
$$ y = [3182915, 3354517, 2949773, 1548681, 364851, 822078, 1444095, 1103848, 627245, 853325, 1470326, 2667698, 3814386, 3788412, 3420127, 3176942, 2879998, 2385894, 1928742, 1667087, 1635128, 2006208, 1978292, 994151, 1215940, 2223970, 2651531, 2190997, 1930629, 1191845, 382098, -92650, -478410, 121399, 476422, 405349, 1552530, 2034471, 1480707, 1688101, 2031710, 1944980, 1606024, 872440, 342435, 737969, 1684772, 1959585, 882845, -244818, -144386, 508012, 117769, 375438, 849166, 1116743, 1384708, 1455410, 1851136, 2607732, 2109091, 1606177, 1725283, 2201367, 2208700, 1654332, 694200, 644774, 1369335, 2372450, 2989949, 3188193, 2578432, 1512073, 1323322, 1817024, 2308088, 3187120, 2764815]
5736B764815n41853j30140p69710n04225L80658P20021N33447N54979j11877l58483
5726B537632j575824j282800M83284P46995J11226n5968p6535n6592k19644K34892
5716H46666N45875O67446Q85035J61109j78309P39081J249621P45227n0292l1968
5706E579491K94421J52765m21534m50785O5141j95781P7238O03480O09398K61997
5696F575831n62858o53210m98529Q4058J31385P65877R10969J49855o83285n71806
5686E648287Q03456J953747Q99011q41265r80125j42331K89465J053676O02108
5677I286029J68988J137937J147296J196065J201521J787248K998919L506219
5669B2430222M140278M142926M247128N585399R678936J3790435J8123300K5298565
$$ y = [2764815, 2222962, 2092822, 1323112, 818887, 1199545, 1919566, 2453013, 3007992, 2896115, 2537632, 961808, -320992, 162292, 909287, 1020513, 964545, 888010, 831418, 611774, 846666, 1392541, 2059987, 2945022, 3106131, 2927822, 3666903, 4916524, 5661751, 5611459, 5579491, 5873912, 6026677, 5605143, 5154358, 5219499, 5023718, 5100956, 5704436, 6313834, 6575831, 6012973, 5359763, 4861234, 4945292, 5076677, 5842554, 6753523, 6903378, 6220093, 5648287, 6451743, 8405490, 9304501, 8463236, 7483111, 7340780, 7630245, 8683921, 9286029, 9455017, 10592954, 11740250, 12936315, 14137836, 15925084, 18924003, 22430222, 26570500, 30713426, 34960554, 40545953, 50224889, 64015324, 82138624, 107437189]
5661A07437189L7488318N0275605N1141111J8365327l3073278n3186586m4999867
5654A33447819l1912559k1621936j5921116j1532387o664913l422453k196552
5647D0175903j583138j165493r11081M98904L423120N634531P133763J0218284
5639F3424793J3897406J8741485K7893456M0926435N0671101M1854200j620391
5632B55788485m4769953n2323651m1124372k8312641j9968465j4594587j0558662
5625D4136154p070143n228881l614304l012783k250722j392725j170338m37194
5617A9959064p58892j257557q81388l51452j280056j833038p92610n56408r23184
5608A1324479m83694p25302j165000M17726J043373J50426m61698k59121P0737
$$ y = [107437189, 144925507, 195201112, 246342223, 264707550, 231634272, 178447686, 133447819, 101535260, 79913324, 63992208, 52459821, 45794908, 42372455, 40175903, 38592765, 37427272, 36516191, 37015095, 40438215, 46072746, 53206509, 63424793, 77322199, 96063684, 123957140, 164883575, 215554676, 257408876, 255788485, 211018532, 158694881, 117570509, 89257868, 69289403, 54694816, 44136154, 37066011, 31837130, 28222826, 25210043, 22959321, 21566596, 20396258, 19959064, 19200172, 17942615, 17061227, 16709775, 15429719, 13596681, 12804071, 12247663, 11324479, 10840785, 10115483, 8950483, 9368209, 10411582, 10562008, 10100310, 9841189, 9911926]
5599I911926L45734L39312J237089J509300J412009J030861O80883J954967M252713
5590B2674794M320561M202664M808547N248506P232217J0318132J2889406J6274710
5582H7969537K3106818L0731052L5210505K8755020N057962k2852904l4648735
5575A53329255l2160776k5163300j8723914j5488621j2232602q490614o340933
5568C4728495n492614m934070l846243k894112k069111j125462j180522j160275
5560A2026086n84981o52391j626123j703226j87125N80511l08355r33032m63691
5551F147673k78845j35596n26915q81838j193370o40795J24089n05628l63705
5542A745070K71958K93847l17132l10844K74828L37105J33491K86484l24198p28496
$$ y = [9911926, 10257660, 10596972, 11834061, 13343361, 14755370, 15786231, 16467114, 18422081, 22674794, 26995355, 31198019, 36006566, 41255072, 48487289, 58805421, 71694827, 87969537, 111076355, 141807407, 177017912, 205772932, 210830894, 187977990, 153329255, 121168479, 96005179, 77281265, 61792644, 49560042, 41069428, 34728495, 29235881, 24301811, 20455568, 17561456, 15492345, 14366883, 13186361, 12026086, 11441105, 10788714, 9162591, 7459365, 7272240, 7852751, 7544396, 6611364, 6147673, 5868828, 5733232, 5206317, 4324479, 3131109, 2490314, 2614403, 2108775, 1745070, 2017028, 2310875, 1993743, 1682899, 1957727, 2294832, 2428323, 2714807, 2390609, 1662113]
5532A662113q10879m9344O27315R02827Q25627l38084L79233O69954o19659q46981
5522B402122p33144m99879K13427P97259o59591j168060m94918l21455O17660
5513A53421M96602L99686o50290q16120M0816L64777K72760J54904L40498J290482
5503B047536J215886R5515j233263j696051n49068K55900M89524O16518N16297
5494A758794P51303p1284n50650j93799K68405J95631j67069L950j5763j13993
5484A865525n3713m51895J59774Q38940J74181j07106M1544L94561J7374N41941
5474C421126J177436J08885j241898o72464L83540L26656j70476j40897J54171
5465C346079J082217R93805Q53817K15969o46895q72280M70621P60529j06618
$$ y = [1662113, 851234, 801890, 1429205, 2332032, 3157659, 2819575, 3198808, 3868762, 3249103, 2402122, 1668978, 1169099, 1382526, 2179785, 1520194, 352134, -142784, -464239, 153421, 650023, 1049709, 399419, -416701, -375885, -11108, 261652, 416556, 757054, 2047536, 3263422, 3358937, 2125674, 429623, -119445, 136455, 625979, 1242497, 1758794, 2510097, 2438813, 1888163, 1694364, 1962769, 2158400, 1991331, 1995281, 1979518, 1865525, 1811812, 1359917, 1519691, 2358631, 2532812, 2425706, 2467250, 2861811, 2879185, 3421126, 4598562, 4707447, 3465549, 2793085, 3176625, 3503281, 3332805, 3191908, 3346079, 4428296, 5422101, 6275918, 6491887, 5844992, 4972712, 5443333, 6203862, 6097244]
5456F097244L59301L69137K86628M50056O76772L69319m63142p34122q93881m12270
5446F105042K92777O36813K99419j59342M0118J451728J584227N53932L53494
5437A1158208O16110J028100J194374J907784K381204K599136K445390L774320
5429B7104626M908031N302055O074323P409820J0367727J4611188J9841561K6175385
5421A21794716L5936602N0199337P3991551J02435292J09308804M2249607o7416739
5414D68499170j12461111r5349855o8260953m7664284l2919311k2776222j6059484
5407G3007950j2639633r974004p404361o076411n203633m187695l159797k382334
5399B1980082k156830k319914k193445j256997m92024o59615q74444l53059k79976
$$ y = [6097244, 6456545, 6825682, 7112310, 7562366, 8239138, 8608457, 8145315, 7411193, 6517312, 6105042, 6397819, 7034632, 7334051, 7174709, 7214827, 8666555, 10250782, 10804714, 11158208, 11774318, 12802418, 13996792, 15904576, 18285780, 20884916, 23330306, 27104626, 32012657, 37314712, 43389035, 50798855, 61166582, 75777770, 95619331, 121794716, 157731318, 207930655, 281922206, 384357498, 493666302, 535915909, 468499170, 356038059, 260688204, 192427251, 144762967, 111843656, 89067434, 73007950, 60368317, 50394313, 42989952, 36913541, 31709908, 27522213, 24362416, 21980082, 19823252, 17503338, 15309893, 14052896, 13560872, 12901257, 12026813, 11673754, 11393778]
5390A1393778n62567j389938j101998p67574r10250j026847o70890m659L93643
5381E352698J92572O48482Q53204j74195p23417j001142j147140n05415L28441
5372C824088J18236J65147k88783l35358m8051J02809N77469M58938M11972M782
5362D991249m35328L74026P30249K12383k66537O22272L16502j636460j676953
5353C231403J26452L66521K13902K21649q7039J07660K74666K93292P34408J032639
5343F515553K88033N26807J14904L9392N17296J022529J404516J182333J833065
5334A3444428J713814K052825K092920K294326L454499N016030O126388P006740
5326D3201970R801775J2741367J5676552K1520403K9809985L6522187L2708184
$$ y = [11393778, 10831211, 9441273, 8339275, 7571701, 6661451, 5634604, 4963714, 4959055, 5352698, 5545270, 6193752, 7046956, 6872761, 6149344, 5148202, 4001062, 3495647, 3824088, 3942324, 4107471, 3818688, 3483330, 3435279, 3538088, 4115557, 4574495, 4986467, 4991249, 4555921, 4929947, 5660196, 5872579, 5606042, 6228314, 6544816, 4908356, 3231403, 3357855, 3724376, 3938278, 4159927, 4072888, 4180548, 4455214, 4748506, 5482914, 6515553, 6803586, 7330393, 7445297, 7484689, 8001985, 9024514, 10429030, 11611363, 13444428, 15158242, 17211067, 19303987, 21598313, 25052812, 30068842, 36195230, 43201970, 53003745, 65745112, 81421664, 102942067, 132752052, 169274239, 201982423]
5319B01982423J1114279j8317383l3814439l3308931k7048909k0984727j5950897
5312F3671416j1466249q056728n233524m842751n703635n242321l826066k573502
5304A6726640j967793j159741j703661k070517j470374m61009j15997o06817l44541
5295F826190L84658N07701J23873L96335k27400o55128j159469j118208o6508
5286E012044j89447o72926j100121n50961P1329N39268J92386J01309L4061j50524
5276C286418K51159K78404j02855M67358Q55642J86859r6010L75469m57993j132941
5266C911510r72850o87405o03532j64529Q15589R81830K38654P7903Q11762j40796
5256D268136p86776l79483n77539o96754J8406K58428L18196N49394K13860j31833
$$ y = [201982423, 213096702, 194779319, 160964880, 127655949, 100607040, 79622313, 63671416, 52205167, 44148439, 38914915, 34072164, 28368529, 23126208, 19300142, 16726640, 14758847, 13599106, 11895445, 9824928, 8354554, 7893545, 7777548, 7170731, 6826190, 7210848, 7718549, 7842422, 8238757, 8011357, 7356229, 6196760, 5078552, 5012044, 4822597, 4149671, 3049550, 2498589, 2569918, 3109186, 3301572, 3402881, 3436942, 3286418, 3537577, 3815981, 3713126, 4180484, 5036126, 5222985, 5126975, 5502444, 5044451, 3911510, 2938660, 2251255, 1647723, 1483194, 2298783, 3280613, 3519267, 3597170, 4408932, 4268136, 3481360, 3101877, 2524338, 1827584, 1845990, 2104418, 2422614, 2972008, 3185868, 3054035]
5246C054035q5347k82535r12934n39841p19123o88104Q14795N76933r20836m37656
5236a40613J28976K56587M15446L49008K46248l14864m01692m62742p46948j01883
5226g72477J20597j26452O3252L87326J234309Q47635M92891L53167k76434n83781
5216A740033o82092j18912M85795L78003p5797k64136l81225J44800R12882Q42531
5206B981882k65020j292688o68809J03759N77160Q185p6432j9642L93002K58854
5196B000251k99504j92828L6203n24770j043755j68852R8407M32583J037905O12011
5186A987651n88028p58584j46523j00070k10726K17621m3177j80487M79385j42299
5176E14763J54287N8653n31363K86494Q87042n1489n88326k70980k44489M05911
$$ y = [3054035, 2968688, 2686153, 1773219, 1233378, 514255, -173849, 640946, 1217879, 297043, -140613, -11637, 244950, 660396, 1009404, 1255652, 940788, 539096, 76354, -670594, -772477, -651880, -778332, -715080, -327754, 906555, 1754190, 2247081, 2600248, 2323814, 1740033, 1057941, 939029, 1424824, 1802827, 1727030, 1462894, 1081669, 1226469, 2139351, 2981882, 2716862, 1424174, 755365, 859124, 1436284, 1444469, 1368037, 1348395, 1741397, 2000251, 1700747, 1507919, 1544122, 1019352, -24403, -193255, -94848, 337735, 1375640, 1987651, 1399623, 641039, 494516, 394446, 183720, 401341, 358164, 177677, 657062, 514763, 669050, 727703, 196340, 482834, 1369876, 1318387, 730061, 459081, 214592, 620503]
5166F20503P61212M73863j97702k16602R1809l1023j70948L77690L96725J6931
5156B122458o53954p57467J61028O34311R65252Q78196P63650J1279k14356N43262
5146D453659L24692Q3743J5464J73062K68644P18109J732339k5959p23616l18211
5136F701926K21670K27298j046483m01135J33892l83251l99120N01717J044555
5127F601069J242769Q84219K21988l13873m788K00311N51173J18123n99526L61949
5117I263414J595038J845489J997803K019735J807609K112957K171227L222421
5109B6035693M417844N806371P445238J0028455J3766030J8247474K4243646L3479338
5101A43470089M7160734O9030061R7358170J10929783O6253533l5510470j05183360
$$ y = [620503, 1381715, 1855578, 1657876, 1441274, 1533083, 1502060, 1331112, 1708802, 2105527, 2122458, 1468504, 711037, 872065, 1506376, 2471628, 3349824, 4113474, 4124753, 3910397, 4453659, 4778351, 4862094, 4877558, 5050620, 5319264, 6037373, 7769712, 7743753, 7020137, 6701926, 6923596, 7150894, 6104411, 5703276, 5837168, 5453917, 5054797, 5556514, 6601069, 7843838, 8728057, 8950045, 8636172, 8631384, 8831695, 9382868, 9500991, 8901465, 9263414, 10858452, 12703941, 14701744, 16721479, 18529088, 20642045, 22813272, 26035693, 30453537, 36259908, 43705146, 53733601, 67499631, 85747105, 109990751, 143470089, 190630823, 259660884, 357019054, 467948837, 534202370, 498691900, 393508540]
5094C93508540j05189619p7702519n3266388l6299696k4893678j8105872j3871588
5087F4179180j0746256r058236p229214n630228m434855l840384l192054j729017
5079A8318936j378349j882067j850930j853765j407522k67709k3586Q5450K51055
5070I991513n87871j315788p17821q90430p69357p43146p29637k72241J04344
5061D069566L02457N36100n61231p08821k91919m62373j079530r35870k07809
5052F60570k48936l074m0580k07493L89708R1473O20593J291129J182161L44404
5042D079955j013242p74576P00866J086600N7718p73775p99602m14649j71608
5033A977687N24994M83403l05294k06277o07902j63272l01010r28160R8380J88092
$$ y = [393508540, 288318921, 210616402, 157350014, 121050318, 96156640, 78050768, 64179180, 53432924, 44374688, 37145474, 31515246, 27080391, 23240007, 20047953, 18318936, 16940587, 15058520, 13207590, 11353825, 9946303, 9678594, 9655008, 9740458, 9991513, 9403642, 8087854, 7370033, 6479603, 5710246, 4967100, 4237463, 3965222, 4069566, 4372023, 4908123, 4346892, 3638071, 3346152, 2883779, 1804249, 868379, 660570, 411634, 408560, 367980, 160487, 550195, 641668, 1262261, 2553390, 3735551, 4079955, 3066713, 2292137, 2993003, 4079603, 4137321, 3363546, 2563944, 2149295, 1977687, 2502681, 2986084, 2680790, 2474513, 1866611, 1703339, 1402329, 474169, 572549, 760641]
5023G60641K99503n38659p26270J05222K16378J43500Q8792j25673j51249k26580
5013a54395j004093l05136L01092N59679P86161O03344k86909n53679N13920O99213
5003A159197K70696O63868J76052k49151k83053q05116q64696j261131J72782
4994a020552R07367M70843N77614K28540m30325n19294o2522l39990J03834P99160
4984G14675R01581K97316m77492m33610J35102k97748p96945M44461L85170j53451
4974G19059J68549k05465j93646J95010N21287m4096m41599o22691m54828m82333
4964h40753P44399M46145l51301J29512m68884k10627M31485L42717o60966o36496
4954a074769J0643K12205M60661O54674P01373P78296M19034L46512p43650j114021
$$ y = [760641, 1060144, 521485, -204785, -99563, 116815, 260315, 349107, 223434, 72185, -154395, -1158488, -1463624, -1162532, -602853, 183308, 786652, 499743, -53936, 459984, 1159197, 1429893, 2093761, 2269813, 2020662, 1737609, 932493, 67797, -1193334, -1020552, -113185, 357658, 935272, 1163812, 733487, 214193, 151671, -188319, -84485, 714675, 1616256, 1913572, 1436080, 1002470, 1137572, 839824, 42879, 487340, 872510, 719059, 887608, 682143, 488497, 683507, 1204794, 1160698, 719099, 96408, -358420, -840753, -96354, 349791, -1510, 128002, -340882, -551509, -120024, 222693, -438273, -1074769, -1064126, -851921, -391260, 263414, 964787, 1743083, 2162117, 2508629, 1764979, 650958]
4944F50958m61676K76688N12143p0757m77561m07715o50835O2439K19121j2672
4934c59867o72086r62168L85093J419106Q99595L745q2240k69713m46437n26973
4924f11945J54899j2668m46199j28919P7992j09738Q277j70835O03345M18815
4914b16976J0001O98465L48377m13755J86195M02510l46771j192674p92108J5691
4904a301045r6426N50521N4079k09095K96092N05966N02325k17277P22109Q85537
4894A692786K31663L94631o4899n48077n45610J39076M31835K6349o17484j305712
4884a65442p95162l86305o46675J28289L42581j82487k10289L42437M74324J14684
4874i84045l37631p71685q37413j08917N21756N01377J239319J632318L93817
$$ y = [650958, 189282, 465970, 978113, 907356, 429795, 22080, -628755, -566316, -347195, -359867, -1031953, -1994121, -1609028, -189922, 709673, 713418, 631178, 361465, -84972, -611945, -457046, -469714, -915913, -1044832, -966840, -1076578, -1068301, -1239136, -635791, -216976, -206975, 491490, 839867, 426112, 612307, 1014817, 668046, -524628, -1316736, -1301045, -1397471, -846950, -792871, -1001966, -705874, -199908, 302417, 85140, 807249, 1692786, 1924449, 2319080, 2254181, 1706104, 1160494, 1299570, 1731405, 1757754, 1140270, -165442, -960604, -1346909, -1993584, -1865295, -1522714, -1705201, -1915490, -1573053, -1098729, -984045, -1321676, -2093361, -2930774, -3039691, -2517935, -2016558, -777239, 855079, 1248896]
4865A248896o32602o09294L5490n68505o50667N95326N75876j33096K30618J77560
4855B69602l75533n71766J87069L18413L14306j85734p97275o47370l79689K32495
4845a635482O51173L65926q637n46257Q7184R5400l21851m57268j52505M97174
4835a425143J74150N729Q11067j6008Q6078L39265N68694J222082k12589j121708
4825D31617n41794K85773K23220L11723J34462j95083o74260j814601q19748R55943
4815a702748P05099N21382J188751N01500m06266j74312J58525K10560N8139j82593
4805H78037q37283L41970Q27710L20387m07845j036041m28372j25851L46645P48931
4795F28288O17767p6209n51808l57963j84073n73113o00669K8533j36848p1364
$$ y = [1248896, 616294, 7000, 42490, -526015, -1176682, -581356, -5480, -138576, 92042, 269602, -105931, -677697, -490628, -172215, 142091, -43643, -840918, -1488288, -1867977, -1635482, -984309, -618383, -627020, -1173277, -1086093, -990693, -1312544, -1769812, -1922317, -1425143, -1250993, -1245264, -434197, -450205, -364127, -24862, 543832, 1765914, 1553325, 431617, -110177, 175596, 398816, 710539, 845001, 649918, -24342, -1838943, -2658691, -1702748, -997649, -476267, 712484, 1213984, 807718, 633406, 791931, 1002491, 1060630, 878037, 40754, 382724, 1210434, 1530821, 1122976, 86935, -341437, -467288, -120643, 628288, 1246055, 1169846, 618038, 260075, 76002, -497111, -1097780, -1069247, -1206095, -1277459]
4785a277459j8339L80315M64848M31213L16165m95n91075p02023o6899N15857
4775e47892o8619k98050j09183j103961n74699R82041J127415L6748l62425j24561
4765a043186l29822p29242K51916Q68887L94738O4709l8543J19105R55731L16085
4755H30378r11233p61461n85355m8060M58153Q17212J33863p78288j253447k88910
4745b387148L05266M39462R89363N41117l42048j87615j58481J27978k6066m63110
4735a161282m78067L6526K55211J83402J588759N63779n9395K36023Q06281j9708
4725A951529p35274l15531J74262K59676l18119r3681m20678m60817l21879N04640
4715B24128R15035M76796L88213N39393j00720j55593m14775p00227m66108j303897
$$ y = [-1277459, -1295798, -915483, -450635, -19422, 296743, 296248, -294827, -996850, -1063749, -547892, -616511, -914561, -1023744, -2127705, -2702404, -1720363, -592948, -556200, -918625, -1043186, -1373008, -2102250, -1850334, -981447, -586709, -522000, -560543, -441438, 514293, 830378, -80855, -842316, -1427671, -1475731, -1017578, -200366, -66503, -844791, -2098238, -2387148, -2081882, -1642420, -653057, -111940, -453988, -641603, -800084, -672106, -698172, -1161282, -1639349, -1602823, -1347612, -1164210, 424549, 988328, 928933, 1164956, 1971237, 1951529, 1216255, 900724, 1074986, 1334662, 1016543, 922862, 502184, 41367, -280512, 224128, 1139163, 1615959, 2004172, 2543565, 2442845, 2287252, 1872477, 1172250, 706142, -597755]
4705e97755j075799K87071N11628L66302p3205j56994P56329P25918K28328J01781
4695A073604M25689L8043q62995m61819N26897O88250j25591o78822q98671n54625
4685h30040n33362K10938Q26251N77651m5951o93692j227286j1214N47350K28177
4675i51178J73353o26783m10985M60694L38825O23115O10604n96897n35709N2958
4665h62003R73922O79538l64537j049401k28216L52236k79401n1954M32594R314
4655c87908n74213j87056K05682K39274k37034L75885O99563K94747J95629J30414
4645G54983j16986J69152J36520l18570k81677j59002m73110k8987j30094l53951
4635h01722L72791J02883q46032R17183J773526K21961p10068n63981p39754p02423
$$ y = [-597755, -1673554, -1386483, -874855, -508553, -581758, -738752, 17577, 743495, 971823, 1073604, 1499293, 1537336, 674341, 212522, 739419, 1427669, 1302078, 623256, -275415, -830040, -1363402, -1152464, -326213, 251438, 205487, -488205, -1715491, -1726705, -1179355, -951178, -777825, -1404608, -1815593, -1354899, -1016074, -392959, 217645, -379252, -914961, -862003, 111919, 791457, 426920, -622481, -850697, -498461, -777862, -829816, -397222, -387908, -962121, -1149177, -943495, -704221, -941255, -565370, 134193, 428940, 624569, 754983, 637997, 807149, 943669, 625099, 343422, 184420, -288690, -317677, -447771, -801722, -428931, -326048, -1172080, -254897, 1518629, 1740590, 1030522, 466541, -273213, -975636]
4625i75636k78526N31340M20727L10940R02101L79456J08075M63813J43227Q0296
4615B085813M55030O37101L7963m82524o0723q3383o7838m16189n78600q98181
4605F28469m8074O3963p06405o87176n08091M6301L11126n62028l53846K47197
4595a568564O84026K30462j86444J6639J65587P128n66057j97024P97333J143640
4585E26726R25346l4073j065115q23033L74706N23572J65854M53857N61556m30648
4575A178748o57508q6614l29442n58010R8145R4907k69700L87467p5284j003652
4565a220943L38337J087633M48286n33878l80741J33970l72479J7698m729m52558
4555i39404N8832k0312J26595O7245R5084N83991j27888m21143k32575l57370
$$ y = [-975636, -1254162, -722822, -302095, 8845, 910946, 1290402, 1398477, 1862290, 2005517, 2085813, 2540843, 3177944, 3215907, 2733383, 2672660, 2589277, 2521439, 2105250, 1526650, 628469, 580395, 644358, -62047, -749223, -1257314, -1211013, -899887, -1461915, -1815761, -1568564, -884538, -654076, -840520, -823881, -658294, -651166, -1217223, -1414247, -616914, 526726, 1452072, 1417999, 352884, -470149, -95443, 428129, 593983, 1047840, 1609396, 1178748, 521240, 434626, 105184, -452826, -354681, -259774, -529474, -142007, -217291, -1220943, -882606, 205027, 653313, 119435, -261306, -127336, -499815, -482117, -486846, -939404, -880572, -900884, -774289, -707044, -611960, -27969, -155857, -577000, -809575, -1166945]
4545a166945r0244O89732M52022l93559K61280K70755M68849J089771L29849j051618
4535H59892m38997K23661k59319L2622n9481j23245L74351O36887m73912j447274
4525f74815l39725L16886l45931l5172K12433M72682L91577M37694j00852K78750
4515F13527P24790l4007K84500M4397q72809o0268Q30881P263r17128q21219k18275
4504d18348L11060P18975o01236q02880L93714N19483L58141M89733P97270m69531
4494A296381j082002k25756m46130r0535L39385J062652R82224N4454j23284l15176
4484A452213m70905q55524j024816k81619l05003l71187l42873k75116J71815
4475b303015M97227M57904R73226P41498r08067p53256n56487q95360l87173L92067
$$ y = [-1166945, -1257189, -567457, -115435, -508994, -247714, 23041, 491890, 1581661, 1911510, 859892, 420895, 644556, 385237, 417859, 358378, 235133, 609484, 1246371, 772459, -674815, -1014540, -697654, -1043585, -1078757, -866324, -393642, -2065, 435629, 334777, 613527, 1338317, 1304310, 1588810, 1633207, 760398, 700130, 1531011, 1538274, 621146, -200073, -418348, -107288, 611687, 10451, -792429, -398715, 120768, 478909, 968642, 1765912, 1296381, 214379, -11377, -457507, -548042, -208657, 853995, 1836219, 1890673, 1767389, 1452213, 981308, 125784, -899032, -1180651, -1485654, -1856841, -2199714, -2474830, -2303015, -1805788, -1347884, -374658, 366840, -541227, -1294483, -1850970, -2746330, -3133503, -2741436]
4465b741436J206250J294816J379003O98779l55520m71732l89277k12317p0077
4456C38489o28870j3494J182293R48738J79850n84015q21773m47097l52729L64668
4446A66060K21464J6090m90782k35793O98108R5611m10116p02732n36303o77147
4436a855540j00228P05386N62728k30139n85973K8063l25304l90809k5973N13562
4426a704227Q24111J311882Q31331n11196m70104K22062L84397k8097k07429o82569
4416b9839n19536L08617Q84031K91370n94746r58800r38175j005058L81560N23134
4406a657442M22353M47116L3926j25771M75163N05281J68543K52252N16033L54335
4396A391789J84143k26647j60534l84498j61739k22168q19243o50483K9071K18613
$$ y = [-2741436, -1535186, -240370, 1138633, 1837412, 1481892, 1010160, 620883, 408566, 338489, -290381, -303875, 878418, 1827156, 2007006, 1422991, 601218, 154121, -198608, 166060, 387524, 403614, -87168, -322961, 375147, 470758, 60642, -642090, -1178393, -1855540, -1955768, -1250382, -687654, -917793, -1503766, -1475703, -1801007, -2191816, -2217789, -1704227, -880116, 431766, 1263097, 751901, 281797, 503859, 888256, 860159, 652730, -29839, -549375, -240758, 643273, 934643, 339897, -618903, -1557078, -2562136, -2180576, -1657442, -1235089, -787973, -754047, -879818, -404655, 100626, 269169, 521421, 1037454, 1391789, 1575932, 1349285, 1188751, 804253, 642514, 420346, -398897, -1049380, -1020309, -801696]
4386h01696l10911J51155R69586J26692o14887n92035k93101L95001O22996M59488
4376A12288n15825n83858k61838j58240j26932m9728N092J02756K91234K71084
4366i13967K70459r4868P5743j11571r33101J22727J140441N4723R0553M13247
4356A14386O44086R30575P79262N4238j139106r68037k06406n7679K88422o3767
4346C75974k7172r1732q47328J11302M46806j56379J27086K79889j66294o50625
4336e98473l75153L76385O74036l1415n59468k14818L68613K11043k70503k61209
4326f80962l83963k93216L90403Q07672M2029o4812L69893J98544m77981k56683
4316c49076k07188l88265q40917o54810M6135L99151N01906N50415M86969R6333
$$ y = [-801696, -1112607, -961452, 8134, 134826, -480061, -1072096, -1365197, -970196, -347200, 112288, -403537, -987395, -1249233, -1407473, -1534405, -1584133, -1579041, -1476285, -1185051, -913967, -643508, -738376, -662633, -774204, -1707305, -1584578, -444137, -389414, -298861, 114386, 758472, 1689047, 2468309, 2522547, 1383441, 415404, 208998, 151319, 439741, 375974, 348802, 257070, -590258, -478956, -32150, -188529, -61443, 218446, 52152, -598473, -973626, -597241, 76795, 45380, -514088, -728906, -360293, -149250, -419753, -680962, -1064925, -1358141, -967738, -160066, -118037, -182849, 187044, 385588, -92393, -349076, -556264, -944529, -1785446, -2440256, -2394121, -1994970, -1493064, -942649, -455680, -359347]
4306c59347r9745M65323j71663p96927p20545o34234l5534K71814M53281K52224
4296a375353K09183R96508Q71635k12279p39466n87453o93583r32836m25586K48006
4286b641224J68493m00466j38654Q9869M15916P62472J183137L71200p84698m84359
4276a458314o66974k79841O10776O59501M40181O15418k20370l79933l85908J46350
4266i19114K60418m13215L99113Q20795K29307j094026q60741J055423J407320
4257H85280J53438q21937q16291l76694r00314n701O78818M83541j04855j20730
4247i45445P9162N34936N23237l46355p69418p00036p14252n88016l60550O2585
4237c224152l05601P4627N73194J079572R84928P1513J57084L82373L24974J39686
$$ y = [-359347, -459092, 6231, -165432, -962359, -1682904, -2317138, -2352672, -2080858, -1627577, -1375353, -1166170, -169662, 701973, 489694, -249772, -837225, -1530808, -2463644, -2889230, -2641224, -2472731, -2873197, -3011851, -2921982, -2506066, -1743594, -560457, -189257, -973955, -1458314, -2125288, -2405129, -1794353, -1134852, -694671, -79253, -299623, -679556, -1065464, -919114, -658696, -1071911, -672798, 147997, 377304, -716722, -1577463, -522040, 885280, 1038718, 216781, -599510, -976204, -1876518, -1882219, -1203401, -719860, -824715, -945445, -866283, -331347, 191890, -154465, -923883, -1623919, -2338171, -2926187, -3286737, -3224152, -3529753, -3455126, -2881932, -1802360, -817432, -745919, -588835, -206462, 118512, 258198]
4227B58198k60051k95782K37580m95963o19960J6691J80098K24492N27000k16139
4217d43836o26174n51400m54053j87183N62008L44054L05838K43326Q757m00012
4207a198675K61884M21476q3763R8368M93384j56354l85640J04431L38137J031729
4197I24977K99701l44865p01846j71608k07509o81083m81479O39249J046462p25991
4187d03992j192774J44839J042281M66745L36839Q85932L82376k93600M84418
4178A853064R82165P21576J43275L80324J769297K157693K739192L145564N26946
4169A4419096j973746k835397l097236k156564j277590q46362n42667M06999J51359
4160B247892j013824p43619j239481l69287P17571M25172K13331L27741J81063
$$ y = [258198, -1853, -297635, -60055, -556018, -1175978, -1159287, -979189, -754697, -227697, -443836, -1070010, -1621410, -2075463, -2262646, -1700638, -1356584, -1050746, -807420, -798663, -1198675, -936791, -515315, -599078, -500710, -7326, -163680, -549320, -444889, -106752, 924977, 1224678, 879813, 177967, 6359, -201150, -882233, -1363712, -724463, 321999, -403992, -1596766, -1451927, -409646, 57099, 393938, 1279870, 1662246, 1368646, 1853064, 2835229, 3556805, 3700080, 4080404, 5849701, 8007394, 10746586, 13892150, 14419096, 12445350, 9609953, 6512717, 4356153, 3078563, 2232201, 1689534, 2096533, 2247892, 1234068, 490449, -749032, -1118319, -400748, 24424, 237755, 565496, 746559]
4151G46559o48812m93375k83795l93234M14149J248992P20016m88612q27264k71165
4141b76541j65284m37448p84343K8555J302714R96204L35188J92871J48681k16181
4131A124416k50675N2049O88739k3742k68337o58220p11963K30861L39246j07966
4121D14408R0237K2142J69308O80922P1845j072590n94274M10259M97123k73312
4111D16068l41121l98445m60149J72055J3022l76898K50179J84426J26427K67131
4101a47305q30936j052050L71205J103042k6728J53783L49004m03776j402418
4092a886179j483708m2894P58756O69938N55745M87783L2748O12485N35680J20138
4082C60492R1369l55993n28110n19470k11765J237005O62330J96072O68972K49724
$$ y = [746559, 97747, -395628, -679423, -1072657, -658508, 590484, 1310500, 821888, -5376, -276541, -441825, -879273, -1663616, -1635061, -332347, 663857, 999045, 1191916, 1340597, 1124416, 873741, 925790, 1614529, 1590787, 1322450, 664230, -47733, 183128, 522374, 414408, 504645, 526787, 696095, 1377017, 1448862, 376272, -218002, 192257, 689380, 416068, 74947, -323498, -783647, -611592, -598570, -975468, -725289, -540863, -414436, -147305, -978241, -2030291, -1659086, -556044, -582772, -428989, -79985, -483761, -1886179, -3369887, -3412781, -2654025, -1984087, -1428342, -940559, -907811, -295326, 240354, 360492, 451861, 95868, -432242, -951712, -1163477, 73528, 735858, 931930, 1600902, 1850626]
4072A850626p4202j42640m76007j215395j268335K09871J267796l45409j006952
4063a200647l3747O20888L10977l86338l85211j89097P50648J014427k02277r07897
4053f08274k67649P48703N30790L14146r62722j073372j45821M13636J04760K48910
4043f96893M12089K58759o1957p6167p92796j020825o3224o68343o98004N32212
4033b875149P51798M90783m86782o15724l72208Q2814m9222N57438J534419J483524
4023E01691Q07244L93400q0832q11889o06529K94041M45246l42905o12870j40818
4013a54221J87158l10644n75319l56907O99553P01932j7660K41978l29308l99669
4003c13107n37084p59531p26922L57251O59969k6879n8257l60804n97638q0003
$$ y = [1850626, 1776424, 1633784, 1157777, -57618, -1325953, -1116082, 151714, -193695, -1200647, -1234394, -613506, -302529, -688867, -1074078, -1263175, -512527, 501900, 299623, -608274, -875923, -127220, 403570, 717716, -245006, -1318378, -1464199, -1050563, -945803, -696893, -284804, -26045, -88002, -164169, -956965, -1977790, -2041014, -2709357, -3407361, -2875149, -2123351, -1632568, -2119350, -2735074, -3107282, -3024468, -3073690, -2516252, -981833, 501691, 1308935, 1702335, 1621503, 809614, 203085, 497126, 942372, 599467, -13403, -154221, 32937, -277707, -853026, -1209933, -510380, 191552, 173892, 415870, 86562, -313107, -850191, -1609722, -2336644, -1979393, -1319424, -1346303, -1404560, -1765364, -2363002, -2443005]
3993b443005r5618O21565N00928J23864o6011j84111m7246K76404N54752p0270
3983h28748M3596R61493Q43331O235m89656m34151r00126j418505j081287J32894
3973c164924R95716M36640o71909P88462J504007k8276m00100k66908l73817k58205
3963a439314q5992O36156J377670n7169j137328k66434N02956J89344o92065j58154
3953a130330J28656K22602O22692L08053K09057K62064R70578J165575k99776
3944B459171j004149p92123n32118o3207P3834M79285R75234J04592j24427J68191
3934A744283j19776q7132k36903K2688j8467o59460m68147m44482o26743L8455
3924h55684J35092k33753P2014J47050P9789k7117j97632P2990L11011K05730
$$ y = [-2443005, -2538623, -1917058, -1416130, -1292266, -1358277, -1542388, -1589634, -1313230, -758478, -828748, -785152, 176341, 1019672, 1025907, 536251, 102100, -798026, -2216531, -3297818, -3164924, -2169208, -1732568, -2404477, -1616015, -112008, -140284, -540384, -807292, -1181109, -1439314, -1525306, -889150, 488520, 431351, -705977, -972411, -469455, -280111, -972176, -1130330, -1001674, -779072, -156380, 151673, 360730, 622794, 1593372, 2758947, 2459171, 1455022, 662899, 130781, 67574, 141408, 620693, 1595927, 1700519, 1576092, 1744283, 1624507, 1537375, 1300472, 1323160, 1304693, 645233, 177086, -267396, -894139, -855684, -720592, -954345, -882331, -735281, -655492, -682609, -880241, -807251, -496240, -290510]
3914b90510K80017J48444J93977M56057j58682L8462o20304k22457M19660j46215
3904I8449k26479j27516j28057m93496j75611K56377Q3974m22641l03252m52667
3894a890919m66577l1134K86502O28123Q09614M58461m27616K80013N97138R705
3884B53310l03400K02070L9234r09320k50168O88968N14015r22n29501o23487
3874i19201m26839L00780Q61100K11658m00929J64162J413010P79388j87898j89286
3864A605945q17554m71093m41634p75704l18776l32861K62539P41065j10105l60655
3854a018833o87282m42332Q80829P91737k72127R3806N37229N7769n97882m0482
3844f97568M16236j66735p20814j32003l52925p59853k14758N32597N49678M54849
$$ y = [-290510, -10493, 137951, 331928, 787985, 629303, 667765, 47461, -174996, 244664, 98449, -128030, -255546, -383603, -877099, -1052710, -796333, -712359, -1135000, -1438252, -1890919, -2357496, -2388630, -2102128, -1474005, -664391, -205930, -633546, -353533, 243605, 253310, -50090, 151980, 191214, -718106, -968274, -279306, 234709, 233787, -295714, -919201, -1346040, -1045260, -184160, 27498, -373431, -209269, 1203741, 1983129, 1795231, 1605945, 788391, 317298, -124336, -900040, -1218816, -1551677, -1289138, -548073, -658178, -1018833, -1706115, -2148447, -1267618, -475881, -748008, -654202, -116973, -59204, -657086, -697568, -281332, -448067, -1168881, -1300884, -1653809, -2413662, -2628420, -2095823, -1546145, -1091296]
3834a091296O21223M69638j87054k06098k33335l26657p57583m98359L41506L45138
3824a522877M62205O00900K06069N5258J12369l79608j31588q3398J62542K45682
3814b72446K29108K5676M4322N73607l8384l95530p49104r3527o701J57210J93181
3803c32588n00421r08045j06472L49085k7929k69583P25335J529338J184643M8710
3793A692073j216777j168139j152258j60040Q29507O54228k53749K37954R73981
3784D36780p9691p89990l03003O78405l6853r87917m50984O02399R68872m16697
3774c78679r36569O6915L58827o332l92188l3760J12965j14464M73516l07908
3764a157677r44555K41032L28987N94424M22970k31753m5469N92772j95436m40026
$$ y = [-1091296, -470073, -435, -187489, -393587, -626922, -953579, -1711162, -2209521, -1868015, -1522877, -1060672, -459772, -253703, -198445, -86076, -465684, -597272, -680670, -518128, -272446, -43338, -17662, 26660, 600267, 561883, 166353, -582751, -676278, -682979, -525769, -332588, -833009, -1741054, -1847526, -1498441, -1526370, -1795953, -1070618, 458720, 1643363, 1692073, 475296, -692843, -1845101, -2005141, -1175634, -521406, -775155, -537201, 436780, 357089, -432901, -735904, -57499, -94352, -1082269, -1533253, -930854, 38018, -378679, -1315248, -1248333, -889506, -895838, -1288026, -1321786, -1208821, -1323285, -849769, -1157677, -2102232, -1861200, -1532213, -937789, -514819, -746572, -792041, -199269, -394705, -834731]
3754h34731M4422M42913O08289K14833K76112j51214N1290N56910K64074o33717
3744H39181j584333p75476k35157O08976K99709r61367k91883M57169o46065j24641
3734b413887l5004p8364l11443K61849P30642J63958J42620K20019K71751J27114
3724i20745k87641k57201m26835j99774L21892q5351j9046O29973J327720N51730
3714F34722l2939j54105k28687k17082m01486n04333J83094N63222p5320p54950
3704i87864j083025k21283Q51598P56310Q7176q45523l50598L50826j50150p98169
3694b390702m32115r70207M72119J217025P36202P90811Q06695N4182o43733m27151
3684g86874R84541R10526k3223m17572J36779l05641p70036p8281l34874p50086
$$ y = [-834731, -790309, -347396, 260893, 475726, 751838, 600624, 651914, 1208824, 1472898, 839181, -745152, -1520628, -1755785, -1146809, -847100, -1808467, -2100350, -1643181, -2289246, -2413887, -2448891, -2527255, -2838698, -2576849, -1846207, -1682249, -1539629, -1319610, -1047859, -920745, -1208386, -1465587, -1892422, -2092196, -1770304, -1855655, -1874701, -1244728, 82992, 634722, 601783, 447678, 218991, 1909, -399577, -903910, -720816, -157594, -232914, -987864, -2070889, -2292172, -1440574, -684264, -597088, -1442611, -1793209, -1442383, -1592533, -2390702, -2822817, -3793024, -3320905, -2103880, -1367678, -576867, 229828, 284010, -359723, -786874, 197667, 1108193, 1084970, 667398, 804177, 498536, -271500, -349781, -684655, -1434741]
3674a434741j94107Q72952N58616p86708p54408L26266R73033J163169Q26298
3665A550370l37736j111021j047834o36685k95102N88711Q16688j36416n99690
3656a208715p49274j03680P0626Q4100R5245J48111L89515k50584O2577R85304
3646d76775R01172N75464O74522n5749o77741p95778o01490k98466p7234L52805
3636d79270J00038j00641l48752L73170J283884M75065K06794J60410R1581m37199
3626A325080m31879N2710j45342j129414j213380Q3312J100271j10805n39362
3617a008809O50135L96143j57075o875k47963p89690n85108O9735Q06642P24384
3607a48481o06708r37042P8380J102503K97671o68572K12803M34324J37603L53925
$$ y = [-1434741, -1628848, -755896, -197280, -983988, -1738396, -1412130, -439097, 724072, 1550370, 1212634, 101613, -946221, -1582906, -1878008, -1289297, -472609, -609025, -1208715, -1957989, -2061669, -1991043, -1906943, -1811698, -1663587, -1274072, -1524656, -1462079, -476775, 424397, 999861, 1674383, 1618634, 940893, 145115, -456375, -754841, -832075, -479270, -379232, -479873, -828625, -455455, 828429, 1303494, 1510288, 1670698, 1762279, 1325080, 893201, 945911, 800569, -328845, -1542225, -1458913, -358642, -469447, -1008809, -358674, 37469, -119606, -126481, -374444, -1164134, -1749242, -1679507, -872865, -148481, -755189, -1692231, -1613851, -511348, -213677, -882249, -669446, -235122, -97519, 256406]
3597B56406l53574p89234M10263L54600k10688j91359m07957J64960J57877j69116
3587g77822m99690L11389N97970k60752m40742l34638j49892J37414R3125k21687
3577a545325j23282J17296K95642K42372k59395k13598k41349l54975L14480Q24640
3567i43494K50144m57662L10636P94764L64602M57151r8658n61474k28775k81602
3557c94368n39114p05666l87893k36837j74660M65903K53640N05522l72809m83002
3547b069284O97250L19862L21626N85854R98256k35904q69058m99651r00439j066073
3537b717561o5776M02676l91041r50062l75J494031J486960Q06967O8494m63731
3527c29418J91227L34335m61869j85022m1929n33067J98941M34177J70159L82415
$$ y = [256406, -97168, -886402, -476139, -121539, -332227, -523586, -931543, -766583, -608706, -777822, -1277512, -966123, -368153, -628905, -1069647, -1404285, -1554177, -1416763, -1323638, -1545325, -1668607, -1551311, -1255669, -1013297, -1272692, -1486290, -1727639, -2082614, -1768134, -943494, -693350, -1151012, -840376, -45612, 318990, 776141, 677483, 116009, -112766, -394368, -933482, -1639148, -2027041, -2263878, -2438538, -1972635, -1718995, -1213473, -1586282, -2069284, -1372034, -1052172, -730546, -144692, 853564, 617660, -251398, -751049, -1651488, -2717561, -2783337, -2380661, -2771702, -3721764, -3722139, -2228108, -741148, 65819, 134313, -329418, -138191, 196144, -265725, -450747, -492676, -1025743, -826802, -392625, -222466, 159949]
3517A59949K15931K01508J98849R8314J59683L51772K37780p5913p61530j935835
3507a149492j515973l26622P33925J773718J507045L20282r3506r1491N81413
3498A739299O75635j1973j35141n51687j655080r92278N16816O61011L61795j23136
3488D85261r13819n96743p0521K3617J035435J334852J16580j044427o91077m80815
3478h01657o69184j77136P38088N26928l63210p55972l30504M18701J39654k35009
3468a509301p00233k75113P93543K32026K11931J035255R1652j21669L04484J88846
3458B51421p5786k28803J75147O8602l41368o70444m99523J4323M56457O48660
3448b01314M16598l47979r84418M5922k53035O14310N38597o12559l38000j63866
$$ y = [159949, 375880, 577388, 776237, 874551, 1034234, 1386006, 1623786, 1547873, 786343, -1149492, -2665465, -2992087, -2258162, -484444, 1022601, 1342883, 1249377, 1157886, 1739299, 2414934, 2402961, 2267820, 1716133, 61053, -931225, -414409, 246602, 608397, 485261, -428558, -1025301, -1095822, -1072205, -36770, 1298082, 1414662, 370235, -320842, -801657, -1470841, -1647977, -909889, -382961, -746171, -1502143, -1832647, -1413946, -1274292, -1509301, -2209534, -2484647, -1691104, -1459078, -1247147, -211892, -120240, -241909, 62575, 251421, 175635, -53168, 121979, 190581, -150787, -821231, -1320754, -1306431, -849974, -201314, 215284, -132695, -1117113, -1071191, -1324226, -709916, -171319, -783878, -1121878, -1285744]
3438a285744J7288l28307m78798k88349j51272J506K27188P59372P73793J17433
3428f35890k35841R3671L13457N9872j89657P1454J130913R34384L80098O2084
3418A984545m07078n54876j108111r70328o35217o94492N23009P56566L62420
3409g43562m41771j00210O37015R36492J19956K29392n00818j290826j096213
3400b250545k35112L33511J45628N16060R37061k30317m16148J62295O24675J20958
3390b91934k92241j63337J51126P22394M06550n39338j040001k69332M57667N25847
3380c32599m0963q8727O40359P51624n5724r36089m41741O08355j02520j105160
3370a103185p17799K6171K10065J26327n78864Q8790P02311J82124j31992O60679
$$ y = [-1285744, -1268456, -1596763, -2075561, -2363910, -2515182, -2513676, -2286488, -1527116, -753323, -635890, -871731, -778060, -464603, -404731, -594388, -522934, 607979, 1542363, 1922461, 1984545, 1577467, 1022591, -85520, -1055848, -1691065, -2385557, -1862548, -1105982, -743562, -1185333, -1285543, -648528, 287964, 407920, 637312, 136494, -1154332, -2250545, -2485657, -2152146, -2006518, -1490458, -553397, -783714, -1199862, -1037567, -412892, -291934, -584175, -747512, -596386, 126008, 532558, -6780, -1046781, -1316113, -858446, -332599, -373562, -462289, 178070, 929694, 873970, -62119, -503860, 104495, 1975, -1103185, -1820984, -1794813, -1584748, -1458421, -2037285, -1948495, -1246184, -1064060, -1196052, -535373]
3360e35373J209444P00278q09794q98570l79263k51682j44011M6543N88939M14604
3350e8885K4922O0055J1430J99729O8234m01720p30451k49838P49236J119026
3340G91738k22283n70312q45717q13653j127913m09821M40777j72112r65924J4343
3330c880877J695475R45891N42805R28159p22882j251753p5101L40660j7668k13077
3320a708368Q8156l86942k69627L81656O04380N83933L15438K21846j6653L08739
3310A22558m12993r99858J52581O68760J40664L5405N09005O10771Q8995j76158
3300G39730J48731M97774m09391k68060J28950n03287j247931k45767j84630o28017
3290a971898l20309J54547L39742R05370J027892L98328j23711k51124j06070
$$ y = [-535373, 674071, 1374349, 564555, -334015, -713278, -964960, -1108971, -1062428, -473489, -58885, -33963, 26092, 37522, 237251, 305485, -96235, -826686, -1076524, -327288, 791738, 569455, -857, -846574, -1660227, -2788140, -3197961, -2757184, -2929296, -3895220, -3880877, -2185402, -1239511, -696706, 231453, -491429, -1743182, -1818283, -1477623, -1495291, -1708368, -1620212, -2007154, -2276781, -1895125, -1290745, -706812, -391374, -169528, -186181, 122558, -290435, -1290293, -1137712, -468952, -328288, -292883, 216122, 826893, 915888, 739730, 888461, 1386235, 976844, 708784, 837734, 334447, -913484, -1159251, -1343881, -1971898, -2292207, -2137660, -1797918, -892548, 135344, 533672, 409961, 158837, 52767]
3281E2767j55109l61491Q9315M99367J22236m23082r13175l99705K08217M17845
3271h62815O75522J61272O123r8853P4696P38529J49619j7365M66897k29992l66489
3260F97144r19295j132481K73449Q23181K46146J90253O42744M93846J61620m1139
3250A435468L49715n90774j100778q26316k63811R8q77792q28367J09713N54841
3240b038003K52741r6057p3785j18099P1790Q71166J135583Q5658m49675k8808
3230c87489J002898J004365n76012q42431o29080m64038O2915j32788O1899O32032
3220b67729M4189K99387q785q43332k09793j47333n68367m76337j52338M0155
3210b290283P04903M97652n165r57717q36115K08945R45779J020082L31551m55114
$$ y = [52767, -102342, -463833, -374518, 124849, 247085, -175997, -1089172, -1488877, -1280660, -862815, -187293, -26021, -19898, -118751, -44055, 694474, 844093, 826728, 1293625, 1063633, 697144, -222151, -1354632, -1081183, -258002, -11856, 178397, 821141, 1314987, 1476607, 1435468, 1785183, 1194409, 93631, -732685, -996496, -996398, -1874190, -2702557, -2592844, -2038003, -1785262, -1881319, -1955104, -2073203, -2001413, -1130247, 5336, 90994, -358681, -387489, 615409, 1619774, 1043762, 201331, -427749, -891787, -828872, -961660, -899761, -267729, -223540, 75847, 67062, -776270, -986063, -1133396, -1701763, -2178100, -2330438, -2290283, -1585380, -1087728, -1092893, -2050610, -2886725, -2677780, -1732001, -711919, -380368, -835482]
3200h35482o58185j197159l05639Q65552R03007R33235N51660l82913J08662L7082
3190A9820k99494j47926K59008j16470m59401k47425o6481J33063M99686j89475
3180f15095l71566k31106N06588R27225Q6812j117170n34596k9474J11699k68992
3170a535675l81279N3774N02157L57224K39548N06361k1598j47823n357m86500
3160i19168j030556n2232J41733R3172M37191k5180M46804J223414Q73940j431
3150A187687o61992q02983o19325M12907M38480k40263j066446K8997J137041
3141a85897Q15983L02918Q49754L37721K41088J08248q73816r51720M4520N59978
3131A248777l60689k64859K52221M08103j76559j209107j017333P8633N15640
$$ y = [-835482, -1493667, -2690826, -2996465, -2130913, -1227906, -294671, 256989, -125924, -17262, 19820, -279674, -427600, -168592, -285062, -744463, -991888, -1058369, -925306, -425620, -615095, -986661, -1217767, -711179, 216046, 302858, -814312, -1348908, -1378382, -1266683, -1535675, -1916954, -1863180, -1361023, -1003799, -764251, -257890, -279488, -427311, -432668, -919168, -1949724, -2001956, -1860223, -1767051, -1329860, -1355040, -908236, 315178, 1189118, 1187687, 525695, -277288, -896613, -483706, -45226, -285489, -1351935, -1322938, -185897, 630086, 933004, 1782758, 2120479, 2361567, 2469815, 1595999, 644279, 688799, 1248777, 888088, 623229, 875450, 1283553, 1106994, -102113, -1119446, -1040813, -525173]
3122e25173P25629P50893M64729k85110l17834L10607j32455R6613q0915n64778
3112D42206K12544k70072o97056o50974J60360K062o03363K55627J103855L01084
3102B56273k47961n42389m33598N08543Q28415L78033L69283M45670L72494m77394
3092A457369p22072q64003j030458L90240P96956J33940o40259l79901M98242
3083c59946O89852n60074m72414l35292R33055P89096M17672J264366k74006m51297
3073A641012j13041k09517p49711j035242j01466O49789L29027r971L75963P39263
3063A516106k95924m82822j1910K48134K59506j05856n76523p34396l37960k05601
3053g27246o5914p17407m4194J026015P96485N91982N92781m15380Q7463J274650
$$ y = [-525173, 200456, 951349, 1416078, 1130968, 813134, 1123741, 991286, 1087899, 1006984, 442206, 654750, 384678, -312378, -963352, -802992, -800930, -1404293, -1148666, -44811, 256273, 8312, -534077, -967675, -459132, 369283, 747316, 1116599, 1562269, 1934763, 1457369, 735297, -128706, -1159164, -768924, 28032, 161972, -478287, -858188, -359946, 329906, -230168, -702582, -1037874, -104819, 684277, 1101949, 2366315, 2092309, 1641012, 1527971, 1318454, 568743, -466499, -567965, 81824, 410851, 400880, 776843, 1516106, 1220182, 737360, 725450, 973584, 1233090, 1127234, 550711, -183685, -521645, -727246, -793160, -1510567, -1554761, -528746, 267739, 859721, 1452502, 1037122, 1124585, 2399235]
3043B399235P35251q11923r48325l74598k08542j64253j63542n12646j52976M39622
3033B37303L99757j96426m26549r6117n60434p58317m78407P68743O36166K29821
3023b44460N51251K96071o3450r4223J38505K16414N75599K22653l42197K81287
3013A537450J950K58731k2085n82718j062671m58438j65176n5637p93416j177641
3003b519651J04295R6184P50101N73101j75924N50908N21320n39522K32190P64253
2993C57255N87296K03610n18912l52560j68060o1598m08646n22031L1065O5923
2983g86658J31975O67872Q42438m10437q28508m06266M00013P1683J86118P17398
2973E85628M59374J94657l6910J44013k90595m54086K32436R45810k02554p43025
$$ y = [2399235, 3134486, 2322563, 1374238, 999640, 791098, 626845, 463303, -49343, -202319, 237303, 637060, 440634, 14085, -82032, -642466, -1400783, -1879190, -1110447, -474281, -244460, 306791, 602862, 539412, 445189, 583694, 800108, 1375707, 1598360, 1256163, 1537450, 1539400, 1798131, 1776046, 1193328, 130657, -327781, -492957, -548594, -1342010, -2519651, -2415356, -2319172, -1569071, -995970, -1171894, -620986, -99666, -639188, -406998, 357255, 944551, 1148161, 629249, 276689, 108629, 47031, -361615, -883646, -852581, -786658, -654683, 13189, 855627, 445190, -383318, -789584, -389571, -317888, -131770, 585628, 1045002, 1239659, 1202749, 1346762, 1056167, 602081, 834517, 1780327, 1577773, 834748]
2963H34748m22767k21409p41063q49908n77885q8304L38657K78479j69895m60230
2953b079577j5246J001064J564664J081745m07719p86647m29930k8240N93104
2944D93218J10648j091988j604212n88353o8440L23796L77154M72128J74167K65493
2934a136389R47365J125996M08278q46887p00411k33481K2822N21738J11301m7606
2924A72726J29659M3343J7644j806J12152l27719n0957m42790j29723K88449n87282
2913g76304N35843J068863K37096o00426k60708K60295P37901N0371p23618m57936
2903G1377L87112K55765l7435l75928q76597o64257k81095p4020k91263k4904
2893a911245j66439o21493k11873J59284O99366J085505L0993n59854M27297J614336
$$ y = [834748, 411981, 190572, -550491, -1400399, -1978284, -2066588, -1727931, -1449452, -1619347, -2079577, -2094823, -1093759, 470905, 1552650, 1144931, 358284, -71646, -99886, 493218, 603866, -488122, -2092334, -2680687, -2749127, -2425331, -2048177, -1576049, -1401882, -1136389, -189024, 936972, 1345250, 498363, -202048, -435529, -412707, 109031, 220332, 172726, 302385, 345728, 363372, 361566, 473718, 145999, 95042, -347748, -477471, -189022, -776304, -240461, 828402, 1065498, 465072, 204364, 464659, 1202560, 1252931, 529313, 71377, 458489, 714254, 676819, 300891, -575706, -1239963, -1521058, -1595078, -1886341, -1911245, -2077684, -2699177, -2911050, -2751766, -2052400, -966895, -935902, -1495756, -1068459, 545877]
2883E45877O21325n48879l69175K33456j51039L70672R68857j35299j343522m72897
2873b80624N68148j38267m78872J81776O26976J89140L54710k37719N6967J092991
2863A935226K56149r50756q73814j328897q43310j2209J08589O04630J458488
2854C54096P76612L38034P47717K24934k10266j42541l34152m43162j78954K37986
2844A370304o60733o50385r57466j038490J98268O98624n5605N97587J529168
2835A031272J015428J79862k21733j116433j153441j08683Q82254M50535n25078
2826D33983j210511j139982N283M90780K97403p7747j077275q90916J90168L39759
2816b639055R0841K58753P25752M36765n72065m14274P94095P67811j10177K82786
$$ y = [545877, 1167202, 618323, 249148, 482604, 331565, 702237, 1671094, 1535795, 192273, -280624, 287524, 149257, -329615, -147839, 479137, 668277, 1022987, 785268, 842235, 1935226, 2191375, 1240619, 366805, -962092, -1805402, -1817611, -1709022, -1104392, 354096, 1130708, 1468742, 2216459, 2441393, 2231127, 2088586, 1754434, 1311272, 1132318, 1370304, 709571, 59186, -898280, -1936770, -1738502, -1039878, -1095483, -497896, 1031272, 2046700, 2226562, 2004829, 888396, -265045, -373728, 508526, 959061, 433983, -776528, -1916510, -1911227, -1420447, -1123044, -1200791, -2278066, -3168982, -2978814, -2639055, -2548214, -2289461, -1563709, -1126944, -1699009, -2113283, -1319188, -551377, -661554, -378768]
2806c78768M81957M32891J60830n20367k38576l21322J69784j20243m73771o8340
2796h75925m84938K3606R23091K81110m23792m31038l87757k7867j73121m522
2786a581153l64208j11554q9090l42496Q99308J007125P33597P32506J080835
2777A964870M66299q47142q01750j09313J23376R1419Q7985N56219j11460n85189
2767H35314j069736j192833K36291N24249q01487r06177m65166J61353O83988
2758a994204P15328N36219L38356l18363J2474j02561K55556M89614m26n02467
2748e70474J43684L13453J12381M92917P98908K57746m95398q16738q54413l27511
2738i45445j91525J59539M57536j09500j3478Q47675R51089R12501P2814p96851
$$ y = [-378768, 103189, 536080, 696910, 176543, -62033, -383355, -213571, -333814, -807585, -875925, -1360863, -1337257, -414166, -133056, -556848, -987886, -1375643, -1403510, -1576631, -1581153, -1945361, -2056915, -2146005, -2488501, -1589193, -582068, 151529, 884035, 1964870, 2431169, 1584027, 782277, 672964, 796340, 887759, 975744, 1531963, 1420503, 835314, -234422, -1427255, -1190964, -666715, -1468202, -2374379, -2839545, -2678192, -1994204, -1278876, -742657, -404301, -722664, -710190, -812751, -557195, -67581, -68007, -570474, -426790, -113337, -956, 491961, 1290869, 1548615, 1053217, 236479, -617934, -945445, -1136970, -977431, -519895, -629395, -642873, 204802, 1155891, 2068392, 2141206, 1344355]
2728A344355r05668j066600m91546l9262j49569J68284K32570K46976O3656O04590
2718G786J66524o64490l70783k98309l37177r9157L77189Q49975Q99994L67821
2708H99373k66183j87831m0315N72371P15704M32177O16219k43309j030346j77494
2698A290366M85863J12069m65549j172539m61694J81201L72940M16902J92698
2689I52257N72092j14334j644388j088835K0146J42914O58911O71818J51609o7651
2679B54539j30307m52723o04428J13677O07712O66064k0352j20411K87439K59007
2669H60217j106826n04173K24935P173L49336P04455l43560r02861n99525l24420
2659a635249k9954J52540m20887k95067R38201Q05253N98137L77288p52772q99553
$$ y = [1344355, 438687, -627913, -1119459, -1158721, -1308290, -1140006, -907436, -660460, -596804, 7786, 174310, -490180, -860963, -1159272, -1496449, -1595606, -1218417, -368442, 531552, 899373, 633190, 445359, 405044, 977415, 1693119, 2125296, 2741515, 2498206, 1467860, 1290366, 1776229, 1888298, 1422749, 250210, -211484, -30283, 342657, 759559, 952257, 1524349, 1410015, -234373, -1323208, -1303062, -1160148, -501237, 170581, 322190, 254539, 124232, -328491, -932919, -819242, -211530, 454534, 434182, 313771, 601210, 860217, -246609, -750782, -525847, -518674, -169338, 535117, 191557, -711304, -1310829, -1635249, -1665203, -1512663, -1933550, -2228617, -1290416, -485163, 112974, 490262, -262510, -1162063]
2649a162063q84675j41721K73542K05776n4326L60192P91084p4183n02273N496
2639a183151j92986j17205M45726J326955M95842o25201o14361j418338p07324
2630b590043Q03698J543928O46316l79804j66040J3066K40108J1601K5733J53216
2620C01779k31262n20564r74914k98538Q43500L80100j7232O45694M69751K16624
2610H14938j004751p33329O26954M32344J5961K34502j99747o37855k10904O81088
2600A9201M77439K30599o063n74805r9999P33670N76334l46678k49775m11995
2590C47928k92243J24943P6468R32936N85549L1536j82563n53603J86655O65456
2580A923062j99846p97566p55310j109097p86769N17608O53969k227k31751j87511
$$ y = [-1162063, -2046738, -2188459, -1914917, -1709141, -1763467, -1403275, -612191, -686374, -1188647, -1183151, -1376137, -1493342, -1047616, 279339, 775181, 149980, -464381, -1882719, -2590043, -1786345, -242417, 403899, 24095, -141945, -128879, 111229, 122830, 148563, 301779, 70517, -450047, -1424961, -1723499, -879999, -499899, -517131, 128563, 598314, 814938, -189813, -923142, -296188, 136156, 152117, 386619, 186872, -450983, -661887, 19201, 496640, 727239, 721176, 146371, 46372, 780042, 1356376, 1009698, 759923, 347928, 55685, 180628, 257096, 1190032, 1775581, 1807117, 1624554, 1070951, 1257606, 1923062, 1723216, 925650, 170340, -938757, -1725526, -1207918, -553949, -556176, -787927, -975438]
2570i75438J53834K74158M18370O64339M48826R8217n6055L81746n68221j377844
2560e38068p40810L56547j31570P7795N04929N14940J300979J162802M28456n77919
2550B358081r45145l73686o02874q28814j3957L27201L87703J95511l49549l13032
2540a58561J19937l8677J13554J48004L08013R52332L08045o94683m73810Q47015
$$ y = [-975438, -821604, -547446, -129076, 535263, 984089, 1082306, 1026251, 1407997, 839776, -538068, -1278878, -922331, -1053901, -976106, -471177, 43763, 1344742, 2507544, 2936000, 2358081, 1412936, 1039250, 436376, -392438, -406395, -79194, 308509, 504020, 154471, -158561, -38624, -77301, 36253, 184257, 492270, 1444602, 1752647, 1057964, 584154, 1431169]
$$ [...]
##END NTUPLES=NMR SPECTRUM
##END=
