##TITLE=C13_LR-678-CR2-1
 CDCl3, 21400 sc

 25.11.2020
##JCAMPDX= 6.0         $$ Bruker NMR JCAMP-DX V2.0
##DATA TYPE= NMR SPECTRUM
##DATA CLASS= NTUPLES
##ORIGIN= UXNMR, Bruker Analytische Messtechnik GmbH
##OWNER= root
$$ XWIN-NMR		Version 3.5
$$ Thu Nov 26 10:03:22 2020 Russian Standard Time (UT+4h)  she@DPX200
##.OBSERVE FREQUENCY= 50.327896
##.OBSERVE NUCLEUS= ^13C
##.ACQUISITION MODE= SIMULTANEOUS
##.ACQUISITION SCHEME= undefined
##.AVERAGES= 21400
##.DIGITISER RES= 17
##SPECTROMETER/DATA SYSTEM= spect
##.PULSE SEQUENCE= zgpg30
##.SOLVENT NAME= CDCl3
##.SHIFT REFERENCE= (INTERNAL, CDCl3, 0, 222.661)
##AUDIT TRAIL= $$ (NUMBER, WHEN, WHO, WHERE, WHAT)
$$ ##TITLE= Audit trail, XWIN-NMR		Version 3.5
$$ ##JCAMPDX= 5.01
$$ ##ORIGIN= Bruker BioSpin GmbH
$$ ##OWNER= she
$$ F:/spectra/data/she/nmr/c13/1/pdata/1/auditp.txt
$$ ##AUDIT TRAIL=  $$ (NUMBER, WHEN, WHO, WHERE, WHAT)
(   1,<2020-11-26 10:01:15.14 +0400>,<she>,<DPX200>,
      <created by zg, POWCHK disabled, PULCHK disabled
       terminated by command 'halt'
       configuration hash MD5:
       00 E9 B6 7A A2 85 ED C7 34 08 36 98 17 FE 4E 26
       data hash MD5: 32K
       67 06 03 B8 44 11 5A D4 02 F3 71 52 EF 22 BB 5C>)
(   2,<2020-11-26 10:01:23.29 +0400>,<she>,<DPX200>,
      <Start of raw data processing
       efp BC_mod = 2 LB = 1 FT_mod = 6 PKNL = 1 PHC0 = -214.4989 PHC1 = 27.96242 SI = 32K 
       data hash MD5: 32K
       91 36 3A E7 04 DE 5F F8 FF 87 C8 91 0C 0A 0E 1D>)
(   3,<2020-11-26 10:01:26.09 +0400>,<she>,<DPX200>,
      <abs ABSG = 5 
       data hash MD5: 32K
       B7 1A A1 D1 F9 E6 C9 73 B6 8D AA A0 9D F8 BD E9>)
(   4,<2020-11-26 10:02:01.90 +0400>,<she>,<DPX200>,
      <pk PHC0 = 9.062927 PHC1 = -6.6 
       data hash MD5: 32K
       01 90 F0 CB 4C 22 74 DA CE E0 5D 45 8A 36 80 C6>)
(   5,<2020-11-26 10:02:05.67 +0400>,<she>,<DPX200>,
      <abs ABSG = 5 
       data hash MD5: 32K
       09 A5 08 5A 5A A4 27 79 BD 6D C7 9D FF 8F 1E 9D>)
$$ ##END=
$$ 
$$ hash MD5
$$ 37 6A 5F 53 2D 8B 1E 15 CF 2B 02 2A 96 2F E2 1E
##$RELAX= 
##$RELAX= 
##$RELAX= 
##$RELAX= 
##$RELAX= 
##$RELAX= 
##$RELAX= 
##$RELAX= 
$$ Bruker specific parameters
$$ --------------------------
##$DU= <F:/spectra>
##$EXPNO= 1
##$NAME= <c13>
##$PROCNO= 1
##$TYPE= <nmr>
##$USER= <she>
##$AMP= (0..31)
100 100 100 100 100 100 100 100 100 100 100 100 100 100 100 100 100 100 
100 100 100 100 100 100 100 100 100 100 100 100 100 100 
##$AQSEQ= 0
##$AQ_mod= 1
##$AUNM= <au_zg>
##$AUTOPOS= <>
##$BF1= 50.322709
##$BF2= 200.13
##$BF3= 50.322709
##$BF4= 500.13
##$BF5= 500.13
##$BF6= 500.13
##$BF7= 500.13
##$BF8= 500.13
##$BYTORDA= 1
##$CFDGTYP= 0
##$CFRGTYP= 5
##$CHEMSTR= <none>
##$CNST= (0..31)
1 1 145 1 1 1 1 1 1 1 1 1 1 1 1 1 1 1 1 1 1 1 1 1 1 1 1 1 1 1 1 1 
##$CPDPRG= <waltz16>
##$CPDPRG1= <>
##$CPDPRG2= <waltz16>
##$CPDPRG3= <>
##$CPDPRG4= <mlev>
##$CPDPRG5= <mlev>
##$CPDPRG6= <mlev>
##$CPDPRG7= <mlev>
##$CPDPRG8= <mlev>
##$CPDPRGB= <>
##$CPDPRGT= <>
##$D= (0..31)
$$ [...]
##$SUBNAM4= <"">
##$SUBNAM5= <"">
##$SUBNAM6= <"">
##$SUBNAM7= <"">
##$SUBNAM8= <"">
##$SUBNAM9= <"">
##$SW= 239.972175391363
##$SWIBOX= (0..15)
0 1 3 0 0 0 0 0 0 0 0 0 0 0 0 0 
##$SW_h= 12077.2946859903
##$TD= 32768
##$TD0= 1
##$TE= 0
##$TE2= 300
##$TE3= 300
##$TEG= 300
##$TL= (0..7)
120 120 120 120 120 120 120 120 
##$TP= (0..7)
150 150 150 150 150 150 150 150 
##$TP07= 0
##$TPNAME0= <>
##$TPNAME1= <>
##$TPNAME2= <>
##$TPNAME3= <>
##$TPNAME4= <>
##$TPNAME5= <>
##$TPNAME6= <>
##$TPNAME7= <>
##$TPOAL= (0..7)
0.5 0.5 0.5 0.5 0.5 0.5 0.5 0.5 
##$TPOFFS= (0..7)
0 0 0 0 0 0 0 0 
##$TUNHIN= 0
##$TUNHOUT= 0
##$TUNXOUT= 0
##$USERA1= <user>
##$USERA2= <user>
##$USERA3= <user>
##$USERA4= <user>
##$USERA5= <user>
##$V9= 5
##$VALIST= <valist>
##$VCLIST= <CCCCCCCCCCCCCCC>
##$VD= 0
##$VDLIST= <DDDDDDDDDDDDDDD>
##$VPLIST= <PPPPPPPPPPPPPPP>
##$VTLIST= <TTTTTTTTTTTTTTT>
##$WBST= 1024
##$WBSW= 4
##$XGAIN= (0..3)
0 0 0 0 
##$XL= 0
##$YL= 0
##$YMAX_a= 34819464
##$YMIN_a= -139288176
##$ZGOPTNS= <>
##$ZL1= 120
##$ZL2= 120
##$ZL3= 120
##$ZL4= 120
##$ABSF1= 222.6606
##$ABSF2= -17.33621
##$ABSG= 5
##$ABSL= 3
##$ALPHA= 0
##$AQORDER= 0
##$ASSFAC= 0
##$ASSFACI= 0
##$ASSFACX= 0
##$ASSWID= 0
##$AUNMP= <proc_1d>
##$AZFE= 0.1
##$AZFW= 0.5
##$BCFW= 0
##$BC_mod= 2
##$BYTORDP= 0
##$COROFFS= 0
##$CY= -3
##$DATMOD= 1
##$DC= 0
##$DFILT= <>
##$DTYPP= 0
##$F1P= 0
##$F2P= 0
##$FCOR= 0.5
##$FTSIZE= 32768
##$FT_mod= 6
##$GAMMA= 0
##$GB= 0
##$INTBC= 1
##$INTSCL= 4.134877e-10
##$ISEN= 128
##$LB= 1
##$LEV0= 0
##$LPBIN= 0
##$MAXI= 10000
##$MC2= 0
##$MEAN= 0
##$ME_mod= 0
##$MI= 0.1934396
##$NCOEF= 0
##$NC_proc= 3
##$NLEV= 6
##$NOISF1= 120.0001
##$NOISF2= 80.00006
##$NSP= 0
##$NTH_PI= 0
##$NZP= 0
##$OFFSET= 222.6606
##$PC= 1.4
##$PHC0= -205.436
##$PHC1= 21.36242
##$PH_mod= 1
##$PKNL= yes
##$PPARMOD= 0
##$PSCAL= 0
##$PSIGN= 0
##$REVERSE= no
##$SF= 50.322729756361
##$SI= 32768
##$SIGF1= 140
##$SIGF2= 120
##$SINO= 11.81781
##$SIOLD= 32768
##$SREGLST= <13C.CDCl3>
##$SSB= 0
##$STSI= 32768
##$STSR= 0
##$SW_p= 12077.2946859903
##$SYMM= 0
##$S_DEV= 0
##$TDeff= 32768
##$TDoff= 0
##$TI= <>
##$TILT= no
##$TM1= 0
##$TM2= 0
##$TOPLEV= 0
##$USERP1= <user>
##$USERP2= <user>
##$USERP3= <user>
##$USERP4= <user>
##$USERP5= <user>
##$WDW= 1
##$XDIM= 32768
##$YMAX_p= 286233222
##$YMIN_p= -1632109
$$ End of Bruker specific parameters
$$ ---------------------------------
##NTUPLES= NMR SPECTRUM
##VAR_NAME=  FREQUENCY,     SPECTRUM/REAL,   SPECTRUM/IMAG
##SYMBOL=    X,             R,               I
##VAR_TYPE=  INDEPENDENT,   DEPENDENT,       DEPENDENT
##VAR_FORM=  AFFN,          ASDF,            ASDF
##VAR_DIM=   32768,         32768,           32768
##UNITS=     HZ,            ARBITRARY UNITS, ARBITRARY UNITS
##FACTOR=    0.368581032318806, 1,           1
##FIRST=     11204.8891385315, 0,            0
##LAST=      -872.405547458802, 0,           0
##MIN=       -872.405547458802, -1632109,    0
##MAX=       11204.8891385315, 286233222,    0
$$ Real data points
##PAGE= N=1
##DATA TABLE= (X++(R..R)), XYDATA
$$ [...]
15854g4016J16946J98431p1571p9895p0597j88171j64588J2005o9039j32977J47789
15843c75683M3535j22665P759J00605K78444K79832N5392J77221Q5865r5351j04356
15832C30598j20734N8150O7151k5938q9276O9515J82521J04560j15128R911j6106
15821D55224n761N6775L3302k90448l91855j58193j57265j50771J42477K41429
15811b25086K56519J95797J60795o4744o7539J44513K9055j77151k60365j48815
15801a57021R4476J70939l2522j34101Q4889J59582L2878o0156L596R7857o7648
15790A92769j50038j01807M5400J83599Q4361q9026j7797R2678K57264Q4362l16313
15779B65452l39980j01276M9686J04447j6489J999N65P8004K07232Q4117Q637
$$ y = [-74016, 42930, 241361, 169790, 89895, 19298, -168873, -333461, -321456, -390495, -523472, -375683, -332148, -454813, -447054, -346449, -68005, 211827, 267219, 444440, 530305, 434954, 330598, 209864, 268014, 335165, 309227, 219951, 289466, 471987, 576547, 461419, 471330, 455224, 449463, 506238, 539540, 249092, -142763, -300956, -458221, -608992, -466515, -225086, 31433, 227230, 388025, 323281, 255742, 400255, 429310, 252159, -8206, -157021, -62545, 108394, 75872, -58229, 26660, 186242, 219120, 158964, 162560, 260417, 192769, 42731, -59076, -13676, 169923, 254284, 165258, 147461, 240139, 497403, 581765, 265452, -74528, -175804, -126118, -21671, -38160, -36161, -35596, 42408, 249640, 333757, 342394]
15768C42394k679m1330O9392l6483j48141J25553N0785k41620j63438q5439j67271
15757b98277j69678m0283l8960J15431O9729J44093K08729j46394j71722k2908
15747c50240o7557k83739m9710K62003K47677L3919J37357R8933k1955j16421
15737a09733j15439j36415j56190m4286J76174K08630R6173J47002J35373R8582
15727B99871k32593k87257q3790J60155P7474n9391K464N4879O4150p3215j28628
15716b05881j11267P7155Q0826N1984J23392R2292j8667k5755m0414j96909j72035
15705c45279M9962J01739m5034J21146N6953j22467L3719J9349J02584j5056m6697
15694h9081p0708J38314J05062l2311j28714j63508j66783P4696K47508J05599
$$ y = [342394, 339715, 298385, 367777, 331294, 183153, 308706, 359491, 117871, -45567, -131006, -298277, -467955, -508238, -547198, -431767, -362038, -217945, -9216, -155610, -327332, -350240, -417797, -701536, -751246, -489243, -241566, -207647, -70290, 28643, 6688, -109733, -225172, -361587, -517777, -562063, -385889, -177259, -81086, 65916, 201289, 299871, 67278, -219979, -303769, -143614, -66140, -125531, -123067, -68188, -4038, -77253, -205881, -317148, -239993, -159167, -107183, 16209, 108501, 89834, 64079, 23665, -173244, -345279, -295317, -193578, -238612, -117466, -60513, -182980, -149261, -129912, -27328, -42384, -89081, -159789, -21475, 83587, 51276, -77438, -240946, -407729, -333033, -85525, 20074]
15684B0074Q343l0526O0978R7524p9178k33780j01172Q9327K04958P610p9772
15673c5614J2687o2810k08751M894K23420K28662k8589J31568J39086j25405j26040
15662A53108q644J44604R0658n8193j3592j77154k91312j02138K19730L01563
15652B58630q520l38484j15250j3151K09897K34088p067l1419r9491j7899K20508
15641B91842J7123K860j19437O4041K01744L2249p6181m4023q0910k02849j07889
15630b1430J46372n6031P646J07100J79301J35117j02050k99133j87028J07742
15620A7606L15542J84730j90748o32553m47212j25073J40288L26959L17756O5333
15610b7372n4755q164K41058K29464k46784m98837k0354K74309P0203M4950J52300
$$ y = [20074, 28417, -2109, 58869, 156393, 77215, -156565, -257737, -168410, 36548, 44158, -35614, -22927, -85737, -294488, -289594, -66174, 162488, 133899, 265467, 404553, 279148, 153108, 144464, 289068, 379726, 321533, 307941, 130787, -160525, -262663, -42933, 258630, 250110, -88374, -203624, -216775, -6878, 227210, 220143, 188724, 89233, 71334, 291842, 308965, 311825, 192388, 256429, 458173, 490422, 414241, 370218, 289308, 86459, -21430, 124942, 68911, 76557, 183657, 362958, 498075, 396025, 96892, -90136, 17606, 333148, 517878, 327130, -305423, -752635, -877708, -737420, -410461, -92705, -27372, -82127, -90291, 150767, 380231, 133447, -365390, -385744, -111435, -41232, 3718, 156018]
15599A56018J47236p878P4508R2244n2560j37557k27126q6591K1465Q25o5158
15588h4574o6123M3848J39207J69032k07270k24612j5051J17169N2015o7003J08681
15577c4681J37231Q1732N4351k446Q1747j35597j97760k04420j71834m6214J36692
15566c01199J93734O0984k3543K9451K826q0321j21563R534J33388R3420J51547
15555A48258O1950Q960l4871p3109m9652j6488n6834j55643p6520j1836l8934
15544b94719J33982K9448m0927J43539j06486j76412L8460K66310J82613m7136
15534A28672k09028j23551M8960k4002J9844J71109J67205r8749J5199J11547
15524B07206j2967M1887J63723M0893j49528P361j5707N503N3806J61019n1274
$$ y = [156018, 303254, 295376, 369884, 462128, 409568, 272011, 44885, -41706, -20241, -19416, -84574, -150697, -106849, 32358, 201390, -5880, -230492, -245543, -128374, -76359, -143362, -34681, 102550, 184282, 238633, 236187, 317934, 182337, -15423, -219843, -391677, -437891, -301199, -107465, -46481, -70024, -40573, -37747, -118068, -239631, -230097, -96709, -3289, 148258, 210208, 219168, 184297, 111188, 61536, 45048, -11786, -167429, -243949, -255785, -294719, -160737, -131289, -172216, -28677, -135163, -311575, -273115, -6805, 175808, 128672, -80356, -203907, -154947, -178949, -159105, 12004, 179209, 80460, 95659, 207206, 194239, 236126, 399849, 440742, 291214, 298575, 282868, 288371, 342177, 503196, 451922]
15513D51922k11827m0757p8168r1821O6620J4788J01734K16678J0934l17691k78058
15502a55646l7167J06000K31934J12101k26954k2062J01478L5908J1344l8238
15492A18698K4368p2207M9254N2121L915j4899J23736J96999k6832m5605k1266
15481C88282j05167j6792L9205j14659p1761K5663j18584l08738k3271L6958L6047
15470b32817J27278J47250o4578p4168j44693n2481K13130R6181Q8891O6242P5417
15459B45652L137j69806Q8414J01202J79179P0114M3773J51067O0027p1445l6709
15448F64605q8661k46114l83833l784K96578P6304k29834k13405m2299k2202j8085
15437b10730J03387K01650J3207j16305o0930J2612l8045M1462j6675N8511P1036
$$ y = [451922, 240095, 199338, 121170, 29349, 95969, 110757, 212491, 429169, 440103, 122412, -155646, -192813, -86813, 145121, 257222, 30268, 8206, 109684, 145592, 156936, 118698, 143066, 70859, 120113, 172234, 176149, 161250, 284986, 481985, 455153, 409548, 388282, 283115, 266323, 305528, 190869, 119108, 144771, 26187, -282551, -305822, -268864, -232817, -105539, 41711, -22867, -97035, -241728, -294209, -81079, 15102, 103993, 170235, 245652, 248789, 78983, 167397, 268599, 447778, 517892, 561665, 712732, 772759, 701314, 664605, 575944, 329830, -54003, -57787, 238791, 315095, 85261, -128144, -170443, -192645, -210730, -107343, 94307, 107514, -8791, -69721, -57109, -95154, -53692, -70367, -11856, 59180]
15426E9180j0246n2059R7432J39746r2987j80405n4304O8529p2890k99131k02490
15415e99625p1873j6638P7668J90462K75933j0789r4925N5422k820L6378J36157
15404b4650j12819k89250j91861l0605m7814R4635L25607L28593Q4229O9868j924
15393B04009j0992R266K09174L37770K33149J02589o3348N2034n7539q1321j16394
15382H18397l10586j92415k1264m8995k48627j97817J393K10396J86991J63989
15372C61462J32694j2245j03310j41259j97093j55761k2255l1737j46236K7922
15362b87818K07526M5648j14236n047J642R6969K8856K887R0894l0257j93093
15351a56029j84701M3685O8830J94707K67498q4675l63908k29327J19592K04849
$$ y = [59180, 48934, -3125, 94307, 234053, 141066, -39339, -93643, -25114, -98004, -397135, -599625, -671498, -688136, -610468, -420006, -144073, -154862, -249787, -194365, -197185, -160807, -24650, -137469, -426719, -618580, -649185, -696999, -602364, -276757, 51836, 136065, 205933, 204009, 193017, 202283, 411457, 749227, 982376, 1084965, 1021617, 1073651, 1016112, 934791, 818397, 507811, 315396, 294132, 245137, -3490, -201307, -199914, 10482, 197473, 361462, 494156, 481911, 378601, 237342, 40249, -115512, -137767, -169504, -315740, -287818, -80292, -34644, -148880, -153927, -152285, -55316, -26460, -23573, 67321, 37064, -156029, -340730, -297045, -228215, -33508, 233990, 149315, -214593, -443920, -324328, -119479]
15341a19479Q5401p0689P7845R6052j56624m5426J50603L73647J26607j89986
15331C27951k46427M7790J4616j86830k25763p8853j07337N0622K58607J95663
15321E0039J74027j54247j08788J10007j77907n7623J87669K54906J11638K1399
15311D11120k8487O6511J23353k0688j49224k34204j61936j26678P583J51310
15301C8660M1323J13138j67361k21290J03181P041j78813q5127K14904K17924
15291H3580L8048j34102k76330j57045J24474O8178j51365j6105K51655L76477
15281B07465J51815j8403r0674j34049j43465l8296p3904l6834o3131q5963J68383
15270a57056K17016J11505j14690j46672k01973k15370q1528K18623K29710j03234
$$ y = [-119479, -34078, -104767, -26922, 69130, -87494, -132920, 17683, 391330, 517937, 327951, 81524, 129314, 143930, -42900, -268663, -347516, -454853, -404231, -145624, 50039, 224066, 69819, -38969, 71038, -106869, -164492, 23177, 278083, 389721, 411120, 382633, 449144, 572497, 551809, 402585, 168381, 6445, -120233, -112650, 38660, 79983, 193121, 25760, -195530, -92349, -85308, -264121, -349248, -134344, 83580, 121628, -12474, -288804, -445849, -321375, -253197, -404562, -420667, -169012, 207465, 359280, 340877, 250203, 116154, -27311, -65607, -139511, -176345, -239476, -325439, -157056, 59960, 171465, 56775, -89897, -291870, -507240, -588768, -370145, -140435, -243669]
15260b43669j6301o8242r0857j98232k34423j58086M1403K47687J2795N5638o902
15249f59189p0483K17662K99847J36261J28131k2314q0767j24155k43550j81974
15239f00531N9793K28582n7773J81811K53060K46103j12295m24563l58106R6970
15229d86949M26156K46371n4685k26831k23834j53532J62567K05038L01034O9168
15219B64503N1382J5510k09511k29594j22876Q6967K61526R2787r1106j18877
15209G11o6391j07719j04897J8420N5976Q0911J18141L0975K3218J88731K2927
15198B61003k08894k65026K4308R3066j03156j49975J39772J69436o1097j17964
15188b18527L2877J55166j1641n9120j34402r732J84994r2341j47716j1282r0507
$$ y = [-243669, -259970, -328212, -419069, -617301, -851724, -1009810, -968407, -720720, -707925, -652287, -659189, -729672, -512010, -212163, -75902, 52229, 29915, -50852, -175007, -418557, -600531, -540738, -312156, -369929, -188118, 64942, 311045, 198750, -225813, -583919, -486949, -60793, 185578, 130893, -95938, -319772, -473304, -310737, -105699, 195335, 264503, 315885, 331395, 121884, -107710, -230586, -143619, 117907, 210694, 119588, 711, -65680, -173399, -278296, -259876, -203900, -122989, -4848, 26127, 49345, 238076, 261003, 52109, -212917, -188609, -95543, -198699, -348674, -208902, -39466, -100563, -218527, -185650, -30484, -42125, -101245, -235647, -245379, -60385, -152726, -300442, -311724, -402231]
15177d02231k44633r5899J17756J39696K13992r7808j35161o8821j79282L3515
15167g18876J55692J24332K01430K06523J1777j43290l29366j59554J9458J69706
15157d62168J14458P6548K5317k7646l6776J63724N536j05173J03217K12455J17026
15146A86518P5252J31566Q488j08239k25441q8565n8715j52798o9495M2356n7523
15135c16596j73140o6299R453Q4375O2117R3523J77806K9425J87715k787j07219
15124b1627P5732L5736j22330P7588J51478K01973J04405k62347l00827n8610
15114a18829J79996r8480q8791R9212J35517J9482k44089p3354J11142L2384J1891
15103c3919O8539N3660J00113J91532j06423m48144j89159K09594K90114J01562
$$ y = [-402231, -646864, -742763, -625007, -485311, -271319, -369127, -504288, -573109, -752391, -718876, -563184, -438852, -237422, -30899, -19122, -162412, -491778, -651332, -631874, -462168, -347710, -271162, -245845, -273491, -310267, -146543, -141007, -246180, -142963, 69492, 186518, 261770, 393336, 401824, 293585, 68144, -20421, -79136, -231934, -301429, -259073, -316596, -489736, -556035, -546582, -462207, -400090, -306567, -128761, -99336, 88379, 85592, -21627, 54105, 89841, -32489, 45099, 196577, 398550, 502955, 240608, -60219, -118829, 61167, -37313, -126104, -26892, 108625, 128107, -115982, -189336, -78194, -45810, -33919, 34620, 88280, 188393, 379925, 273502, -174642, -363801, -154207, 135907, 237469]
15093B37469J22410p6728k16807J53188R3584n0241k5861n2031k66870k64639
15083c46526n5798Q5451P2794J34538J25318l8158q9193n8480m1033n2802P9413
15072a84476P0291j02649O186J41J23236J55313j63548j08975J43483J89150O8119
15061A96271q9249j47105m7421o9470n899L1587R3154J18296p8224l28497k26502
15050e53059j34225q5319J6578Q6014m2132j38472J29857L31224K68812J31253
15040A0531M5013j22939k95297K8935J67047j55170n930J60157R4862J17618M9893
15029I4720K6885J23026L3783O4094N1891j47784k14053k47415k3703Q9309Q230
15018a41017O8910J57717p0023k97672k33705O2466O4229k9263J48322J31281
$$ y = [237469, 359879, 283151, 66344, 219532, 313116, 262875, 237014, 184983, -81887, -346526, -402324, -316873, -244079, -109541, 15777, -22381, -111574, -170054, -211087, -263889, -184476, -114185, -216834, -210648, -210507, -87271, 68042, -95506, -204481, -60998, 128152, 196271, 107022, -40083, -87504, -156974, -162873, -131286, -38132, 80164, 1940, -326557, -553059, -687284, -772603, -756025, -670011, -712143, -850615, -720758, -389534, -120722, 10531, 55544, -67395, -362692, -333757, -166710, -321880, -327810, -167653, -72791, 44827, 94720, 121605, 244631, 278414, 342508, 394399, 246615, 32562, -214853, -238556, -149247, -141017, -72107, 85610, 15587, -282085, -515790, -453324, -389095, -418358, -270036, -138755]
15008a38755O6698J19475K10056N3352j43502p9589N3319j13091k17174n4861
14998b44072K9623M5741q9578J79115J2294R7821J75752O8788j02299k80856j13629
14987b21300J0005R2863j976m2346O2751P5178R2233Q5993j68983k62625j75487
14976d53694J0851Q5435l09p4242O8463J29586J71718J96799J50192J51852l4702
14965D01949j39429k40154l21868k02356j98853n5038n4300k38414R4258K11823
14955g42382J21419J34394p035j04601j86821P960L61022J75015k682R7083Q7327
14944e9301j39245k04684k7400n8101k0641P7422J15280J39034J09935R4822k54544
14933b27423k58378K5581J76120M0556k3170K4475k6700O6332N2857J19847K54758
$$ y = [-138755, -72057, 47418, 257474, 310826, 167324, 87735, 141054, 27963, -189211, -244072, -214449, -168708, -258286, -79171, -66877, 30944, 206696, 275484, 173185, -107671, -221300, -211295, -118432, -120408, -162754, -100003, -24825, 67408, 153401, -15582, -278207, -453694, -442843, -357408, -357717, -431959, -363496, -233910, -62192, 134607, 284799, 436651, 401949, 262520, 22366, -299502, -501858, -700711, -755749, -810049, -1048463, -954205, -742382, -620963, -486569, -493604, -598205, -785026, -777066, -416044, -241029, -243711, -146628, -59301, -198546, -403230, -430630, -488731, -509372, -431950, -316670, -177636, -67701, 27121, -227423, -485801, -460220, -284100, -243544, -266714, -242239, -268939, -202607, -149750, -29903, 224855]
14922B24855J54791j31999k14717l2332j34985j67124n1946J65256K11051Q0812
14912A03662J08734K2566p4763J67473M1508j72547j85816L3187K3398J68860
14902B36262L31786Q2841j05849j18490K4159j51162j49850j32656k52149K9598
14892b05510J40325j33739q2734R4014J21390m7182n3305j6591K51142L05440
14882C73250k2721j77965k47792j21188Q1052P6095m4372L2010Q6242j96221j52633
14871c14243K5836j46909q8408o1190n8505Q9817J53892M5734j47443j61595j07456
14860g70470J28017K45584L236j2963K01458K15770R4160O0364p0414J9453R7167
14849B11362r8195k81720j30748N5149O1666l8230N5656L0554j10188M8934N3255
$$ y = [224855, 379646, 247647, 32930, 598, -134387, -301511, -353457, -188201, 22850, 103662, 212396, 234962, 160199, 327672, 369180, 196633, 10817, 44004, 67402, 236262, 568048, 650889, 545040, 426550, 450709, 299547, 149697, 17041, -235108, -205510, -65185, -198924, -281658, -187644, -66254, -113436, -166741, -183332, 67810, 373250, 350529, 172564, -75228, -196416, -115364, -39269, -83641, -51631, 34611, -161610, -314243, -288407, -435316, -523724, -584914, -643419, -553602, -399710, -353976, -501419, -663014, -770470, -642453, -396869, -393633, -406596, -205138, 10632, 104792, 165156, 94742, 114195, 211362, 113167, -168553, -299301, -244152, -182486, -220716, -165060, -134506, -244694, -195760, -142505]
14838a42505Q4025K06163P0000j01455j52464K2666J67554L6755k8468J25229
14828B87500K01193j65799m4369O1370j21099m35559l04785P5073J12453q4388
14818d18410R1296J70321K40625R4902q2437M6858j33031k60223j27656l0505
14808d08260L0245J86227K07441j18972n6303L67497K07561j40970p7239j57113
14798D0114k41767q0507J31778J84006N1435m4576j91740j974K57741k3981l61609
14787b81080j74688J15936J14683K89353K96363j25693k72261l2384J80424L11775
14777D22428r626k17812n0396Q4484o3302j91771M4837n864k19033o8572J06574
14766a68053j23646j14200M7423j58048j71421j73400r6237K48800L06443K70050
$$ y = [-142505, -58480, 147683, 217683, 116228, -36236, -13570, 153984, 190739, 162271, 287500, 488693, 322894, 278525, 339895, 218796, -216763, -521548, -446475, -334022, -418410, -327114, -156793, 83832, 178734, 96297, 143155, 10124, -250099, -377755, -408260, -378015, -191788, 15653, -103319, -159622, 207875, 415436, 274466, 197227, 40114, -201653, -282160, -150382, 33624, 85059, 40483, -151257, -153231, 104510, 80529, -281080, -455768, -339832, -225149, 64204, 360567, 234874, -37387, -69771, 110653, 422428, 412802, 194990, 144594, 229078, 165776, -25995, 18842, 12978, -206055, -274627, -168053, -291699, -405899, -358476, -516524, -687945, -861345, -957582, -708782, -402339, -132289]
14756a32289m5824k31092o2720J01302J35799M0025K39632J57439M3026J74188
14746D19486J12102l0355k05668l25290k41016j99736n6928R8353P3472l5929
14736c91509k46J11036K42899L7584k43671k64208j67979J01917K40790J15989
14726b17398J72042J34744j8243j76289j34891j0603R2009K03543J62205n3858
14716A53261j01091K58657K05374k1627j52396k49168j00046J35507J01923k38844
14706h450j95678r9414j70582j83798O5712J40587J95387J47525j09223j00926
14696c18860J34227L15622Q4307j56101p6834j03715j00274p8752J69946K23250
14686I2816J09962Q8314j37448j70043k9575J59770J54689j44821k32748k55250
$$ y = [-132289, -178113, -409205, -471925, -370623, -234824, -194799, 44833, 202272, 245298, 419486, 531588, 501233, 295565, -29725, -270741, -470477, -527405, -429052, -355580, -391509, -391755, -280719, -37820, -236, -243907, -508115, -676094, -574177, -333387, -217398, -45356, 89388, 71145, -105144, -240035, -250638, -158629, 44914, 207119, 153261, 52170, 310827, 516201, 494574, 342178, 93010, -7036, 128471, 230394, -8450, -204128, -303542, -474124, -657922, -592210, -451623, -256236, -108711, -217934, -318860, -184633, 130989, 215296, 59195, -17639, -121354, -221628, -300380, -130434, 92816, 202778, 291092, 153644, -16399, -45974, 113796, 268485, 123664, -109084, -364334]
14676c64334J4979J57678K2214r0435p2935R4264J62998n095j61276j32155M2916
14665c31181K52330K3092n7662r8203Q0477J13703k15733l38474j59698K7390
14655g03959Q2653K8364K53816K41408P5727Q634j8976J67846J02006M0022m8150
14644B29391l193J27186K8323m0884N7341J05372J0276p324j11344j45148q643
14633B41353J30675M9512k44235k37439m7528k28801j96334J48613N4509o0173
14623c89848j6029J17239Q7389j31742o5958J15352P6781o4051J05802J21298
14613d3767K57665n0804j34184r4816j82610q8414m5933j8830J03689J15381Q2508
14602a00115n9521j81943M9704L31926J39552j41085r3166j05805k18297q4802
$$ y = [-364334, -349355, -191677, -169463, -259898, -332833, -238569, -75571, -80666, -241942, -374097, -331181, -78851, -55759, -113421, -211624, -131147, -17444, -233177, -571651, -731349, -703959, -621306, -592942, -339126, -97718, -21991, -13357, -32333, 135513, 237519, 277541, 229391, 226198, 353384, 381707, 340823, 398164, 503536, 513812, 506488, 395144, 249996, 241353, 372028, 421540, 177305, -60134, -107662, -336463, -532797, -384184, -329675, -389848, -405877, -288638, -201249, -332991, -398949, -283597, -206816, -270867, -165065, -43767, 213898, 163094, 28910, -65906, -248516, -336930, -382863, -401693, -298004, -182623, -100115, -159636, -341579, -291875, 40051, 179603, 38518, -54648, -160453, -378750, -463552]
14592d63552L14724L31855J25075R6120j05104k32318k68309r4583r955j14090
14582d20137o3191Q024J8313j1682J48097K06475k06033q3094J36841O1840n4416
14571b58963q6552l0861J55632K20786J60551K07802j8986j78114M5198O6160
14561B82653p7897r3926Q3449O6108J71856J02117j11508o640k7099k41861k15318
14550f8066j89487j57273j09323J08905O7786j39660r716K13135R4415Q083O7213
14539a13988R6557K48462k8757q2199R684j69465j55327L6238O3296Q7422j0550
14528a8627j24131n6562J25611K60724R7005J56771L0563j71275j03833j47981
14518D8265m5120J40160P5291j15599j18253j19881j19502k58100L1316K53374
$$ y = [-463552, -148828, 183027, 308102, 404222, 299118, 66800, -201509, -296092, -306047, -420137, -483328, -475304, -456991, -468673, -320576, -114101, -320134, -403228, -266387, -204547, -258963, -345515, -376376, -220744, 42, 160593, 368395, 349409, 171295, 216493, 282653, 204756, 110830, 194279, 260387, 432243, 534360, 422852, 416212, 389113, 147252, -68066, -257553, -414826, -524149, -415244, -347458, -487118, -496834, -283699, -189284, -181201, -113988, -17431, 231031, 202274, 120075, 129759, -39706, -195033, -158795, -95499, -8077, -18627, -142758, -199320, -73709, 187015, 284020, 440791, 471354, 300079, 196246, 48265, 3145, 143305, 218596, 102997, -15256, -135137, -254639, -512739, -481423, -228049]
14508b28049J43264O4027o578j13421M3197K466m4943k1044j7631q0379q2453
14497c41544K9398L07564K89166Q853l29759j00519J64274J7838J92555K27998
14487D65824J17485k8006j6347K2182N0034J7397j28849j2535L7386j84282j41752
14476A98537j51411k49828j32144o2809r6427K0803Q1441L0490M9150j36293n8423
14465e06914R3359J03071J94870K43199l6019r9968o5897O8446J56379J15249
14455B65775j22884k91121j53842k722P223l63N6218q857L4169j51570j84979
14444e52953J04508K38198M9902m2102j52429j17900m7622j14707M0758R4002
14434e00345J51367K05081Q3655P6546P2426m7230j75870j5838N8609m3916p5293
$$ y = [-228049, -84785, -20758, -27336, -140757, -97560, -95094, -140037, -161081, -178712, -259091, -341544, -312146, -4582, 284584, 293437, -36322, -136841, 27433, 45271, 237826, 465824, 583309, 555303, 538956, 561138, 611172, 628569, 499720, 487185, 524571, 340289, 198537, 47126, -202702, -334846, -397655, -494082, -473279, -391838, -361348, -312198, -448491, -506914, -413555, -310484, -115614, 127585, 91566, -8402, -74299, -5853, 150526, 265775, 142891, -148230, -302072, -304794, -297571, -297934, -241716, -250573, -216404, -367974, -552953, -448445, -210247, -160345, -202447, -354876, -472776, -520398, -635105, -594347, -500345, -348978, -143897, -60242, 16304, 88730, 41500, -134370, -150208, -91599, -135515, -210808]
14423b10808o2986J90108L38973p9435l99587l57117j37678J95516K87725J76875
14413e8414J45043K13425J03858j54728j48015j9656L7251P4527k0457k13880
14403d1046j43116o6261l2098l9357o7524j23712j108R9857Q0302M8752r0988
14392c76299j04554o207O6014j56203l8103J10098L19689K57812J20686K098j47858
14381D7173j39496q2306J51124K68568q4045k28502M6727L52287K91936N1494
14371F74960j34576j08319l4356l8876J18929j66823k65157p0697j92183k6829
14361b43927P8396k8763k21497k54822j1550L84950K16200p2967L20060L05876
14351D71956m9978j68339k07681k80081j88829M7188J72886J94006J55452P3317
$$ y = [-210808, -273794, -83686, 255287, 175852, -223735, -580852, -718530, -523014, -235289, -58414, 86629, 300054, 403912, 249184, 101169, 81513, 118764, 193291, 172834, -41046, -184162, -250423, -282521, -321878, -389402, -513114, -514222, -414365, -334063, -285311, -376299, -480853, -487060, -421046, -577249, -615352, -505254, -185565, 72247, 192933, 195031, 47173, -92323, -174629, -23505, 245063, 161018, -67484, -20757, 331530, 623466, 674960, 540384, 432065, 397709, 358833, 477762, 310939, 45782, -24915, -217098, -243927, -165531, -194294, -415791, -670613, -682163, -297213, -81013, -153980, 166080, 471956, 421978, 253639, 45958, -234123, -422952, -375764, -202878, -8872, 146580, 219897]
14341B19897J7592J79501N8840l31556p7150J77986j4413j69343m8236K9441j25338
14330h2779j68373J01081J52045j0568P3730n3088r0888K9561r9622l7826P5948
14319a10779j6075m1623m3117j14562K5606P7187k22923r9006J41107K34465K37064
14308F7344m5872l4875M9265o8815j71977M8943o2510j63917R0217K51971Q8898
14297D8672k2657Q9615N9498j27780j92438K4752K01468K08108O6190j08465j73877
14286G3086L7804M1380k95744j61499j57514l53477p0Q3736M9040J81053N0962
14275d51243J46658K73999J79616j1188P4017Q1768N2021j05140j19258k5787
14265I5463m7428j1459P1015j66582k99176j39936K679O6978J2291J745m9135
$$ y = [219897, 237489, 416990, 475830, 144274, 67124, 245110, 230697, 61354, 13118, 42559, -82779, -251152, -150071, 1974, -8594, 65136, 12048, -78840, -49279, -148901, -186727, -110779, -126854, -168477, -211594, -326156, -300550, -223363, -446286, -545292, -404185, -169720, 67344, 21472, -13403, 35862, -32953, -204930, -155987, -218497, -382414, -292197, -40226, 48672, 26015, 115630, 175128, 47348, -145090, -120338, 81130, 289238, 355428, 246963, 73086, 110890, 152270, -143474, -304973, -462487, -815964, -816034, -732298, -683258, -502205, -451243, -304585, -30586, 149030, 137842, 211859, 293627, 345648, 240508, 121250, 95463, 48035, 36576, 107591, -58991, -358167, -498103, -495424, -428446, -416155, -414410, -463545]
14254d63545m4941L083J89313K51185K46350O6612J04033J54128p1897k19138
14244B15183r6336N4816K58169J87038M6847q2691j55148j85670k49489j96557
14234b03838p1361K1788J43524K10105m2517k68443l1087J05878P0948J07151
14224D2148N6425k17997j62660R6635m7414q4815j10420N1211J32831J61453R9333
14213A6730P0872K7834j13097n8968m8873K2418N0683K24107K45743R2720j65161
14202C65008k98250q454j25900j37289j31379o7993j03868m9610P6313J33405
14192c48017R8921j09788j59666J42784L27790K80315o845j49489N1732K7287
14182A55024j11616J749N8025j56561j98984p9048m6387J80155R6349j75789j01574
$$ y = [-463545, -508486, -505403, -316090, -64905, 181445, 248057, 352090, 506218, 434321, 215183, 118847, 173663, 431832, 618870, 665717, 583026, 427878, 242208, -7281, -203838, -275199, -253411, -109887, 100218, 57701, -210742, -241829, -135951, -65003, 42148, 98573, -119424, -282084, -185449, -232863, -317678, -428098, -376887, -244056, -82603, 16730, 87602, 115436, 2339, -56629, -105502, -83084, -32401, 191706, 437449, 530169, 365008, 66758, 58304, -67596, -204885, -336264, -404257, -508125, -557735, -481422, -348017, -249096, -358884, -518550, -375766, -47976, 232339, 225494, 76005, 127737, 155024, 43408, 45157, 103182, -53379, -252363, -331411, -377798, -197643, -101294, -277083, -378657]
14171c78657k13502k67484k8141J33506K66345M35384K14343p2081o7918q1064
14161e9269j64115j78430l4377J37407J40229O4189l2542P6642R5281k4080k30121
14150b09186k19020J88763J65531N147j61504j20667j14844K0769j1454J52195
14140c04270K13918K6978N028N5889J69125N2686O1274R9777p5721j74970m4014
14129H5700m6940j56917j70750k54011o0631K00735Q7235j1260R4665K37803M8065
14118E3694K646j201j27344p2771Q3972M9172j63116j32994p3796j9683J25315
14107b76106J81893M9419n6145O2076j60857j68640M043J62521J86062J26793
14097A11059o0772M644J26078k4998j15491j20726j49233n0806p2568K9563j32090
$$ y = [-378657, -592159, -859643, -887784, -754278, -487933, -52549, 161794, 89713, 21795, -59269, -223384, -401814, -436191, -298784, -158555, -94366, -126908, -50266, 45015, 20935, -209186, -428206, -239443, -73912, -68765, -230269, -350936, -465780, -445011, -456465, -304270, -90352, -63374, -58346, -2457, 166668, 219354, 280628, 380405, 304684, 129714, 85700, 38760, -118157, -288907, -542918, -603549, -402814, -315579, -326839, -232174, 5629, 53694, 56340, 55139, -72205, -144976, -61004, -11832, -174948, -307942, -381738, -401421, -276106, -94213, -44794, -100939, -38863, -199720, -368360, -364317, -201796, -15734, 111059, 50287, 54931, 181009, 156011, 40520, -80206, -229439, -280245, -352813, -323250, -455340]
14086d55340k146K46946R7711n5022J7132n289J54430M6100l5024O5257J02502
14075A77257o2097J77026K82683r0162l43469j5947R0979j06799n3334j27120
14065g0983p5226l9639J92814O2169k05810J91345L29587L4598j75367q8011N1356
14054B06833k18751o0627R6823m875k21894j47295J34865K23589Q1729r8367l2342
14043d0312j78345j19636J4196j12296j71981M7181K01758Q2273K8945J90384
14033e7833K79364J49893j55842k38637n9805j38506j8819J61289M611j02130
14023a76415j12842j8455J42403j08859j81940j18087o4542J84228K48767j51497
14013c57239j95854J99228L41616K02780p7565j00060N8637l5569O6578J20728
$$ y = [-455340, -457486, -210540, -112829, -167851, -150719, -156008, -1578, 44522, 9498, 74755, 177257, 115160, 292186, 574869, 484707, 141238, 125291, 216270, 109471, 56137, -70983, -146209, -185848, 6966, 69135, -136675, 54670, 384257, 418855, 243488, 155477, 206833, -11918, -72545, 24278, 19403, -202491, -349786, -214921, 8668, 90397, -7970, -40312, -218657, -338293, -324097, -436393, -608374, -561193, -359435, -277162, -248217, -57833, 221531, 371424, 215582, -23055, -82860, -221366, -240185, -78896, -74285, -176415, -289257, -307712, -165309, -274168, -456108, -574195, -638737, -454509, -205742, -357239, -553093, -353865, -12249, 190531, 112966, 12906, 71543, 35974, 102552, 223280]
14003B23280j28234l21149j23198J23445P5653j47340j24697J44629J87928J62351
13993G2668j13820l32397j61783J2316J03200K41526L17944j0306l13340j18212
13983c02204J50871q2544j73000j0268j1862J23168J37481L2559R5706J49554
13973A09461m5474r766k4862k47763j26181L4598m755N1291l6103J57198K81834
13962A39478j3737j45115r4052N4404P8056j56520j41304J59208n4866k98112
13952d72560j63719J87951K28090J26457q6274j97123J0512K72406J95783j53780
13942e2257n0982J94074N1418j61723k50921j73476l8831R6661K28059J20396
13932c7582K2526j20203j55944j6968J14887k0954q6465k9590L3980J06967J16102
$$ y = [223280, 95046, -226103, -349301, -225856, -150203, -297543, -422240, -277611, -89683, 72668, -41152, -373549, -535332, -523016, -419816, -178290, 139654, 129348, -183992, -302204, -151333, -233877, -406877, -417145, -429007, -305839, -168358, -135799, -40093, 109461, 63987, 54221, 29359, -218404, -344585, -309987, -314742, -263451, -299554, -142356, 139478, 125741, -19374, -113426, -59022, 19034, -137486, -278790, -119582, -174448, -472560, -636279, -448328, -220238, -93781, -180055, -377178, -366666, -94260, 101523, -52257, -103239, 90835, 142253, -19470, -270391, -443867, -482698, -386037, -157978, -37582, -15056, -135259, -291203, -308171, -193284, -214238, -300703, -330293, -296313, -189346, -73244]
13921g3244J49807K70260L6452k58572K2870J36865j1485j52402j66567j80570
13911b26586j20027j05866q470J45244L3807j98512M8496J42213j5958P2446j9614
13900b52827j13063N063J35753K05416J39191J65764J39211k28679l24391r7707
13890b26269K6311Q7538k7859K9665J919M8028l7964j1924L4639M1776k2869p7705
13878a34714l8346O425K9506l0208o5853j37611L4649M3612O4118J75714J18885
13867F6177L4099N4883Q3184M7316J52933J97582o3045p671R3305o884R5915J05490
13855H53284j12114k35975l37435k71054P0352K91599J25807k38018k72455n2045
13845a78054K34110P1836j9092Q9837r5680j25503j2730l2167o3568p6262k0582
$$ y = [-73244, 76563, 346823, 383275, 124703, 147573, 284438, 272953, 120551, -46016, -226586, -346613, -452479, -460949, -315705, -281898, -480410, -431914, -289701, -305659, -233213, -252827, -365890, -360827, -225074, -19658, 119533, 285297, 424508, 195829, -128562, -226269, -199958, -112420, -140279, -110614, -108695, -60667, -98631, -110555, -75916, -34140, -57009, -134714, -173060, -166635, -137129, -167337, -233190, -370801, -336152, -292540, -228422, -52708, 66177, 100276, 155159, 238343, 285659, 438592, 636174, 573129, 565458, 658763, 651879, 747794, 853284, 741170, 505195, 167760, -103294, -32942, 258657, 384464, 146446, -126009, -178054, 56056, 127892, 108800, 198637, 102957, -22546, -35276, -67443, -131011, -207273, -227855]
13834b27855O816j986K9933M414J99324J93533j41634j35084l9415j49585m5360
13823c06899n6992p5785J61515J71789Q7687K36264R7942q5613j56872k35126
13813a62090r7527j4541N1802J52837K36040r898n6571j4882j34744r6459J83760
13802C7727K42555j283k77402j16856Q3463J0976M1891L9139J1086P9490j39338
13791A1448l64113O858J93226O1679J21987O8835L6951R2476L9778j87608k25563
13780a44046q0629J1652p2049K1675R9643p3212J04429K71967K03063M2399K2286
13769D07178k85452m16613r8114R8505j94934j64622P4654K52193J89462k69q0703
13758b18715k5773K07083K15364r1576p7511l7474k92988j56760J67942L05537
$$ y = [-227855, -221039, -223025, -193092, -188678, 10646, 204179, 62545, -72539, -111954, -261539, -306899, -363891, -439676, -278161, -106372, -18685, 217579, 315521, 229908, 73036, -162090, -259617, -274158, -222356, -69519, 166521, 156623, 100052, 85170, -49574, -146033, 37727, 280282, 278999, 1597, -115259, -31796, -20820, 21071, 60210, 71296, 150786, 11448, -352665, -345807, -152581, -90902, 31085, 99920, 136871, 229347, 269125, 81517, -144046, -224675, -213023, -285072, -263397, -163754, -236966, -132537, 139430, 342493, 384892, 407178, 121726, -294887, -393001, -294496, -489430, -654052, -579398, -327205, -137743, -138012, -218715, -244488, -37405, 177959, 86383, 8872, -28602, -321590, -478350, -310408, -4871]
13748d871K93953m1088j91010o6133n031J994k66789k30165k10221l8290L73900
13737c83751M27447R4183p7158K3150o3817j69999k55100j52114k0203J17777
13727d59585N0022j60019j94132k4519J39419J62822K94694K41876J44621P93
13717A95992o3757n9039j16190j34133j38708k10615l2852J46776J11903o6340
13707c66963k6233K59376K13185p7104j22794l0780j16609Q877Q1311J38549J92259
13696A53074L6253j48220p2445q3964j22571j02713L4706L8315r0647k09862M319
13685e63755K47899P6936J1396J39126Q1171r8683k22807k08082j2102P3509L5012
13674d40380n12O2670K29688P7554l2685O7692J2500j7246Q2157K7207N7855q6571
$$ y = [-4871, 289082, 247994, 56984, -9149, -14180, -12186, -278975, -509140, -719361, -757651, -383751, 43696, 137879, 60721, 83871, 20054, -149945, -405045, -557159, -577362, -459585, -409563, -569582, -763714, -788233, -648814, -485992, -191298, 50578, 195199, 195992, 132235, 73196, -42994, -177127, -315835, -526450, -559302, -412526, -300623, -366963, -393196, -133820, 79365, 2261, -120533, -151313, -267922, -259045, -177734, -39185, 153074, 189327, 41107, -31338, -115302, -237873, -340586, -305880, -267565, -358212, -568074, -563755, -315856, -238920, -227524, -88398, -7227, -105910, -328717, -536799, -548901, -475392, -440380, -440892, -378222, -148534, -70980, -103665, -35973, -23473, -40719, 41438, 68645, 126500, 39929]
13662C9929k94906p2121J33532N5594Q2344L62079K82403j24609j27295R4327
13652D31277P8086M8778j16965j33259j23651j20453j84273j12519J64999J74374
13642A06394J32214L3226n8226k04054M3010O4169j68246p0586J42804K25524
13632B46229K57592o9058l11312j58940j60889Q444P8186J01287k8394o2289K721
13621i6423j75734k35523r2288K32431K95235J77117L0539J0967O5361R5935j21330
13610A86287k62817n2295j48946m3944n2001q8128J00459J47010R0313J4216L11510
13599B01664K55533j22245k82736k44316j26922k35998p6063r9014r524J21094
13589f18527m165k2683J06499l8642j93348Q4891K9470Q2584K50728K57297L6871
$$ y = [39929, -254977, -327098, -193566, -137972, -55628, 306451, 588854, 464245, 336950, 431277, 509363, 558141, 441176, 307917, 184266, 63813, -120460, -232979, -67980, 106394, 238608, 271834, 213608, 9554, 52564, 116733, -51513, -122099, 20705, 246229, 503821, 434763, 123451, -35489, -196378, -187934, -109748, -8461, -36855, -99144, -96423, -272157, -507680, -599968, -367537, -72302, 104815, 135354, 146321, 211682, 307617, 186287, -76530, -128825, -277771, -321715, -373716, -461844, -361385, -214375, -124062, -109846, 201664, 457197, 334952, 52216, -192100, -319022, -555020, -631083, -730097, -739621, -618527, -622692, -645375, -538876, -577518, -770866, -685975, -656505, -573921, -323193, -65896, -29025]
13578b9025o7265J5623j04243m4277R0812R6192J60095J24945k33212l68716L1976
13567c27095K24938K11826l6605j48346l3991L3575Q3785m9551j11390J68401
13557A5547J46114P7055j43960k96337j90282M9245m7900N5395J06931J9822P1881
13546a36489J15993K88707J52168J782q2312o5554p6858k33191j43120r2921N7095
13535b14700K79825J67908Q2625R5408j4367m7357k10502l04293p8236O8654L6294
13524a38741J42536J40823j58605j94293n7403J99166K36297m4893k11660j96537
13514b83310k49091j88278M1172J49355K81196L47693J58116j67822l15591p7349
13504c03909J81488J33152k2502j43400k7241J48357P9309J08225j2407k30225
$$ y = [-29025, -96290, -80667, -184910, -229187, -138375, -42183, 117912, 242857, 9645, -359071, -327095, -102157, 109669, 73064, -75282, -109273, -75698, 8087, -41464, -152854, 15547, 161661, 238716, 94756, -201581, -391863, -342618, -390518, -335123, -228192, -208370, -136489, -20496, 268211, 420379, 422161, 339849, 274295, 197437, -35754, -178874, -271795, -214700, 65125, 233033, 315658, 411066, 396699, 349342, 138840, -165453, -243689, -175035, -138741, 3795, 144618, -13987, -208280, -265683, -66517, 169780, 124887, -86773, -283310, -532401, -720679, -679507, -530152, -248956, 98737, 256853, 89031, -226560, -303909, -122421, 10731, -11771, -155171, -182412, -34055, 45254, 153479, 141072, -89153]
13494h9153k70296m316J12791R3607O7972j5401l5687R892J26317l3279m6794
13483h4347J64761p4424j37126L7411J20495N1482m4728R7183l5532k38112j01159
13472b44096p5028j6687Q3609J70035N3417O742o6842j35677j72243J71736J45106
13461g9928j17785n4198J54896J66674Q1787j40452L6078J72773o5528j66235
13451a1918j81241j73705p0831J17661K05676J13872M303K6639j50397k09180
13441c29121p6131j37627k01293r757J92496J50082J56767M2605p9031O6275L34865
13430A10130L17891n206k82922k71921L7069J59781P2007k80390k38041p5762
13420d57364p6273J80308K39228l6086j0786L6211o250P581R9742J00579M4753
$$ y = [-89153, -359449, -363765, -250974, -157367, -89395, -104796, -140483, -130591, -4274, -37553, -84347, 80414, 5990, -131136, -93725, 26770, 78252, 33524, 130707, 95175, -142937, -244096, -319124, -335811, -252202, -82167, -28750, -22008, -88850, -224527, -396770, -225034, -79928, -197713, -251911, -97015, 69659, 151446, 10994, 47072, 219845, 154317, -11918, -193159, -366864, -437695, -320034, -114358, -486, 3817, 30456, -119941, -329121, -405252, -542879, -744172, -753929, -561433, -411351, -254584, -211979, -291010, -224735, 110130, 428021, 422815, 139893, -132028, -94959, 64822, 136829, -143561, -381602, -457364, -533637, -353329, -114101, -150187, -160973, -124762, -131012, -123431, -23689, 76890, 121643]
13409A21643N8596j69139k28777j00604J32974K71640K54008j44111m49944j12333
13399c66047N4757P6913K7231M4973K00581J00905j05720j64400k44832o1539
13389d37178J17577j8505j61251r0115P7751Q693J52893K7576j4185J62210K63472
13378H8938J75269p1896j65472N087J13750J47081Q5202j12189l39075j28620
13368b01925J79172K36276j10317k56721J78944J88859k23783k52051k4983J82231
13358a04298J59529M6467j3926J44564J90547p1357k43233k28136k37550q9820
13348d47213l5300J51645K50617K9791k17546k19793N3996K11725K09143l9739
13338e2674k13375k39772J09115J04022L3017Q8620K16350J33766j70668k83653
$$ y = [121643, 180239, 11100, -217677, -318281, -185307, 86333, 340341, 196230, -253714, -366047, -311290, -234377, -207146, -162173, 38408, 139313, 33593, -130807, -375639, -437178, -319601, -338106, -499357, -589472, -511721, -503028, -350135, -322559, -336744, -174534, 88938, 264207, 192311, 26839, 31926, 145676, 292757, 377959, 265770, -73305, -201925, -22753, 213523, 103206, -153515, 25429, 214288, -9495, -261546, -286529, -104298, 55231, 101698, 87772, 232336, 422883, 351526, 108293, -119843, -357393, -447213, -482513, -330868, -80251, -50460, -268006, -487799, -433803, -222078, -12935, -52674, -266049, -505821, -396706, -292684, -259667, -171047, 45303, 179069, 8401, -275252]
13328b75252o6988R5673L1671J237K4656K9396k634k9217j61491M0419R9761j38738
13316c51507j8975M9031P7630K48671j03287k52806J53176J66277K50433J82694
13306D01337p4898p3152J4785q3635k25237k01964j13653n1829j10200j61020
13296f79466J19372K81317P5329n1946Q2373J19971K75381K40985J02694N6401
13286F22411j12880k05077k49070q3912m314j49253j19923o4870J28319K14863
13276b3706J90408n5673p5093j5266O8094L5834L4932O1201k14223j96680L013
13265a87159N9450q0597n8397J6276J5803Q6137K02152j5229j17873k1316N3688
13254d7065J47918J59767R324O0960L7559l2424k47384p1547K29343J20281O6920
$$ y = [-275252, -342240, -246567, -214896, -213659, -189003, -159607, -162241, -191458, -352949, -312530, -212769, -351507, -370482, -321451, -243821, 4850, -98437, -351243, -198067, -31790, 218643, 401337, 326439, 253287, 268072, 184437, -40800, -242764, -356417, -408246, -518446, -679466, -560094, -278777, -203448, -255394, -173021, -53050, 222331, 463316, 566010, 622411, 509531, 304454, 55384, -28528, -32842, -182095, -302018, -366888, -238569, -23706, 166702, 111029, 35936, 20670, 88764, 124598, 159530, 220731, 6508, -190172, -187159, -127709, -208306, -266703, -250427, -234624, -148487, 53665, 38436, -79437, -100753, -47065, 100853, 260620, 269944, 330904, 368463, 336039, 88655, 17108, 246451, 366732, 433652]
13243D33652j43952j24806j33638M8833j2917j67611n51J41551M0173Q2191K44635
13232D07560K58016L7280j37364n1049N5625m2199l8863p6672o4423P3276J94804
13221F15991J01992q6060k11239k34364j43489p9436j23527o5652O1953K14183
13211E0352K89521Q8373q2682j9315K05278J18671N8819K8761J02440K23475K2061
13200A085754k01097l60314l06709P1999K95474K14959j1008j18982j80388k45221
13190B44467j15002O0671J69966K15330J56018M1237j43626j48108l33624k14857
13180f7528j05204k7435K15723M23810L16126m8701k45172k38374k84292j44881
13170b05928J53388M28300J91663k1280n6741j51445j44751l173J20941J3745
$$ y = [433652, 289700, 164894, 31256, 80089, 67172, -100439, -100990, 40561, 80734, 162925, 407560, 665576, 702856, 565492, 514443, 570068, 527869, 489006, 412334, 347911, 421187, 615991, 717983, 631923, 420684, 186320, 42831, -36605, -160132, -225784, -163831, 50352, 339873, 428246, 345564, 326249, 531527, 650198, 709017, 737778, 840218, 1063693, 1085754, 884657, 524343, 217634, 289633, 585107, 800066, 789058, 670076, 489688, 244467, 129465, 190136, 360102, 575432, 731450, 772687, 629061, 480953, 147329, -67528, -172732, -200167, 15556, 439366, 755492, 706791, 461619, 223245, -61047, -205928, -52540, 375760, 567423, 546143, 489402, 337957, 193206, 190033, 310974, 324719]
13160C24719j94263j86452j12939j70126N811L8288Q6661K40072J78505N148n7983
13149A57441j03493j433L12276L46812r0272l20954j31973J95582K8577j64833
13139B27730Q9901K32961J71818J15247j1341n8354q9138M8779J91239J27191
13129A046033m1977j50816j33531J21989J13204p552p4266j66993l12699j32884
13119B60508L9410m7363j48206j28159j55644R8363K57067K57499L34104K66288
13109A033867J7117k00200k16595k16721M3768K49775J10736q0667m5157o8857
13099F27066p1102R7239O5730j24545j33798O7822K09743J69106O3975K5030l7312
13088I58954J11905P0359q1992j78025j55910N9388J53590K25439K02424j44096
$$ y = [324719, 130456, -55996, -168935, -339061, -333250, -294962, -208301, 31771, 210276, 215424, 157441, 53948, 52515, 364791, 711603, 621331, 300377, 168404, 363986, 392563, 227730, 317631, 550592, 722410, 837657, 826316, 767962, 678824, 727603, 918842, 1046033, 1004056, 853240, 719709, 841698, 954902, 947350, 873084, 706091, 393392, 260508, 299918, 252555, 104349, -23810, -179454, -81091, 175976, 433475, 767579, 1033867, 1050984, 850784, 634189, 417468, 461236, 711011, 821747, 741080, 695923, 627066, 555964, 653203, 718933, 594388, 460590, 528412, 738155, 907261, 971236, 996266, 958954, 1070859, 1141218, 1059226, 881201, 725291, 784679, 938269, 1163708, 1366132, 1222036]
13078A222036j45712j9952k374r1198J16083J54574J6467l0953r0317q7094k4744
13067A016816J54814J70245J05975n7448k03179m752J31372k6058m8899l7098
13057A201788J8277N2720l5026J06339R6914j8795Q0571J13249R0973j9964p1289
13046A615757Q589Q5871j0163L3837K88784J18979j2927Q7485l7174j86002o1932
13035A931104J0425J09347J25175m1870M2599J37914J08543Q8094N6566n8776
13025B509121J49095K79240K81101Q7003K7650J85810J52361n2126k19298j95859
13015C204098J9426K86759M10240K80421J7399n0142K51734M68014L93596L07344
13005E588889O01341O00038M80829J95215L20105O38213O69720Q65152J211063
$$ y = [1222036, 1076324, 1056372, 1053998, 962800, 1078883, 1233457, 1249924, 1218971, 1128654, 1041560, 1016816, 1171630, 1341875, 1447850, 1390402, 1187223, 1182471, 1313843, 1287785, 1238886, 1201788, 1220065, 1272785, 1237759, 1344098, 1441012, 1422217, 1502788, 1616037, 1707010, 1687046, 1615757, 1624346, 1710217, 1700054, 1733891, 2022675, 2141654, 2128727, 2216212, 2179038, 1993036, 1931104, 1941529, 2050876, 2176051, 2134181, 2176780, 2314694, 2423237, 2511331, 2567897, 2509121, 2658216, 2937456, 3218557, 3305560, 3333210, 3519020, 3671381, 3619255, 3399957, 3204098, 3223524, 3510283, 3920523, 4200944, 4218343, 4168201, 4419935, 4887949, 5281545, 5588889, 6190230, 6790268, 7271097, 7466312, 7786417, 8424630, 9094350, 9959502, 11170565]
12996A1170565J030659J017125J217829J490547J879911K314758K973796L839185
12988B6934375M569950N726151P564953R252220J1589500J5338564K0778447K8044998
12980A29799158L6716144M4749199M4260208K4026130j1292231l7873337m4335080
12973A86050191l8757566l0142567k2484484j7033529j3161205j0123324p988596
12966D6358920o342581n197411m216199l500340l084557k717242k337908j895912
12958A7066770j642438j455007j159101r31657o93152n67220l98627m07397n79323
12949I232848n66379m68031m53037l39803k44239l59972k53137k65907p1090j80726
12939F030527m6761M9555k31183j62716m9539N6235j1941k58231m751L35101L6855
$$ y = [11170565, 12201224, 13218349, 14436178, 15926725, 17806636, 20121394, 23095190, 26934375, 31504325, 37230476, 44795429, 54047649, 65637149, 80975713, 101754160, 129799158, 166515302, 211264501, 255524709, 279550839, 268258608, 230385271, 186050191, 147292625, 117150058, 94665574, 77632045, 64470840, 54347516, 46358920, 40016339, 34818928, 30602729, 27102389, 24017832, 21300590, 18962682, 17066770, 15424332, 13969325, 12810224, 11878567, 11185415, 10618195, 10219568, 9812171, 9232848, 8666469, 8198438, 7745401, 7405598, 7161359, 6801387, 6548250, 6282343, 6211253, 6030527, 5983766, 6033321, 5802138, 5639422, 5589883, 5646118, 5634177, 5375946, 5371195, 5706296, 5743151]
12928E743151Q2899K85875L27495M10409L22528K55567N17893R62897J107816
12919A0016530R48957M88227J52590j32270m98923l60211j9926L68571O24684
12910A1588229O47514Q40293J133800J400386J534164J987662K432711L036295
12902B4601054L803336M702665O038362P621614R632543J2621519J6918637K2505146
12894A08444876K9986073L9379506M7516896M3603499J7302372k0081167m3034658
12887B23117397m5349061l7733982k8658586k1443181j6065093j2338302r803953
12880E1725239p617668o117799m878000l992350l475975k864807k292167j920995
12872A8565478j721447j523412j223909j162606j026230p50858p09692o32269
$$ y = [5743151, 5826050, 6111925, 6439420, 6849829, 7172357, 7427924, 7945817, 8908714, 10016530, 10965487, 11453714, 11606304, 11474034, 10975111, 10614900, 10594974, 10963545, 11588229, 12235743, 13076036, 14209836, 15610222, 17144386, 19132048, 21564759, 24601054, 28404390, 33107055, 39145417, 46767031, 56399574, 69021093, 85939730, 108444876, 138430949, 177810455, 225327351, 268930850, 286233222, 266152055, 223117397, 177768336, 140034354, 111375768, 89932587, 73867494, 61529192, 51725239, 44107571, 37989772, 33111772, 29119422, 25643447, 22778640, 20486473, 18565478, 16844031, 15320619, 14096710, 12934104, 11907874, 11157016, 10447324, 9815055]
12864I815055o06433o91763n02317k94336k01713j81004j74091j83433k56194
12855F723771l13214j70140j40003j86446j01629j42137j04858J0927J6920k57478
12845E335713k79728O4202J8886o1394J6109J27358L71245K53010J76147R8608
12835F120156n0288K00132O10191O12821K62508J39992K86745L57317M38466M80797
12825I458837N45944R31525J138931J002482J188659J590120K001529K153436
12817B0011463K506819L333029M258343N128199O209526Q000622J0358914J3307743
12809G3114658J7499409K3704625L1876531M0866794M6093352L7209363P796628
12802B78161360k6241812m3476623m2906076l5002995k6569458j9760199j5044791
$$ y = [9815055, 9208622, 8516859, 8014542, 7720206, 7518493, 7337489, 7163398, 6979965, 6723771, 6410557, 6240417, 6100414, 5913968, 5812339, 5670202, 5565344, 5576271, 5593191, 5335713, 5055985, 5120187, 5139073, 5077679, 5093788, 5221146, 5592391, 5845401, 6021548, 6120156, 6069868, 6270000, 6880191, 7493012, 7755520, 7895512, 8182257, 8539574, 8978040, 9458837, 10004781, 10936306, 12075237, 13077719, 14266378, 15856498, 17858027, 20011463, 22518282, 25851311, 30109654, 35237853, 41447379, 49448001, 59806915, 73114658, 90614067, 114318692, 146195223, 187062017, 233155369, 270364732, 278161360, 251919548, 208442925, 165536849, 130533854, 103964396, 84204197, 69159406]
12795F9159406j1642392r154719p152951n705975m661656l792646l297331k730369
12787B1021367k093064j821058j599589j371185j182212j077064r35154q47702
12779A0094339r21402q76848q14844o52124l40946j84013m46860n17007j65066
12770E175229j30214k55572k62751l73052k29775j37078j40608j41044l61403
12761C143732m64982k92346j28304L552J26951j23236k42768M6149m8458k14091
12751A806199j39590p755L0944R9479J24443O0735j88167p1383l8776p1542j13048
12740A491539q492r8272p6326J01337Q12j82559j77104R72L5078P9856N5509k14915
12728A007435k78069p9713J08235N9030n6918j56862J4958O6011M9165R3252r1792
$$ y = [69159406, 57517014, 48362295, 41209344, 35503369, 30841713, 27049067, 23751736, 21021367, 18928303, 17107245, 15507656, 14136471, 12954259, 11877195, 10942041, 10094339, 9172937, 8296089, 7481245, 6829121, 6488175, 6304162, 5857302, 5340295, 5175229, 5045015, 4789443, 4526692, 4153640, 3923865, 3786787, 3646179, 3505135, 3143732, 2678750, 2386404, 2258100, 2261652, 2388603, 2265367, 2022599, 2068748, 2020290, 1806199, 1666609, 1658854, 1689798, 1789277, 1913720, 1974455, 1786288, 1714905, 1676129, 1604587, 1491539, 1483047, 1384775, 1308449, 1409786, 1410598, 1228039, 1050935, 1051907, 1086985, 1166841, 1222350, 1007435, 729366, 649653, 757888, 816918, 760000, 603138, 618096, 684107, 733272, 826524, 734732]
12717G34732j01631j73467m0164K05386K34311n3880l97116l34717j373N7588
12707A29669R7637M849k07340m6042J6095j48620M5915M7675Q6674K32601K68679
12696E27792N5628J52937P7454o4706j6156m1798j66792L564J13404o9619j24649
12685D47059m1282J3881P956j1026Q516k4421R5948K65127m788q1403K4142J67731
12673H67440J76226j25253k65733r4499j01378j07336J7725N2270p3184l07029
12663C9249j39128j34061m1576J32406l5161j57763m3669J33115K18166K69570
12653B41148J40483q804l604J2014j7849j9886j85920j59779k0737J9876J29330
12642A26272K60712K43994n632m5551n5189k82949j11535L7037Q2939J27685j22800
$$ y = [734732, 633101, 459634, 419470, 624856, 859167, 805287, 408171, 73454, 72081, 129669, 227306, 232155, 24815, -21227, -5132, -153752, -107837, -60162, 26512, 259113, 527792, 583420, 736357, 813811, 749105, 732949, 691151, 524359, 527923, 641327, 571708, 447059, 405777, 419658, 427614, 416588, 425104, 400683, 496631, 761758, 756970, 675567, 699709, 867440, 1043666, 918413, 652680, 558181, 456803, 349467, 367192, 419462, 346278, 39249, -99879, -233940, -275516, -143110, -178271, -336034, -379703, -246588, -28422, 241148, 381631, 372827, 369223, 381237, 363388, 343502, 157582, -2197, -22934, -3058, 126272, 386984, 630978, 625346, 579795, 524606, 241657, 130122, 167159, 250098, 377783, 254983]
12631B54983k67154O4795K35965J82042o1678j4279J94935N9965r6967r7954j88349
12620B66304j73553N5251J22693n7753j88241p3654J42984K25135J74564l2999
12610D60731r1437k18245k27967p8039r3021q0730J11375K36867L15102K25315
12600E59951n1002p5243k50035l58622j89514m736K40336K66066N3503k39263
12590d8559l13513j41018M9639J73814K64283J05969k44380k45032j28627o4692
12580e92116J09292J35183j2185l1546j9926j5241Q1533K59875K46632j0832m1740
12569A08929l5627j44953j12543j29926M9412J90650J24767n824j21594P4332
12559b377J71492K44469J28319j79329j00159j41897m3957J14180O2252n6918
$$ y = [254983, -12171, 52624, 288589, 470631, 408953, 394674, 589609, 649574, 552607, 454653, 266304, 92751, 148002, 270695, 212942, 24701, -48953, 94031, 319166, 493730, 460731, 369294, 151049, -76918, -154957, -247978, -328708, -217333, 19534, 334636, 559951, 508949, 433706, 183671, -174951, -364465, -369201, -128865, 137201, 190704, -48559, -362072, -503090, -453451, -279637, -15354, 90615, -153765, -398797, -527424, -592116, -482824, -347641, -359826, -391372, -411298, -426539, -345006, -85131, 161501, 150669, 108929, 73302, -71651, -184194, -314120, -264708, -74058, 50709, 44885, -76709, -2377, 169115, 413584, 541903, 362574, 262415, 120518, 76561, 190741, 252993, 196075]
12549A96075p4090K6459J77820Q2263j32362j22202j23236M8388J79118O2343
12539C20576J30627o7297k55578q4647K5100Q4282J57954J56841M761j39446j63377
12528A69796j89018o6846J3259j52220q8853J17569M8165J9941J49494J94605
12518B15892J79917n5511o3645o0444l6203j30349k28223j54187Q1157Q5639k3351
12507a89308J61843J24785L9411j60217j31961J27941J16216j57837j12215J56330
12497b5012K93299k1879j56964J42492J32787k2381k41842k55574O0736K14587
12487A20249J14961J30844L02157P8666j18977k81109j27673J21897J9651j58247
12477B02419j51460j2422J09955j3682j31000j78818m5770k0149j16780j91345
$$ y = [196075, 121985, 148444, 326264, 408527, 276165, 153963, 30727, 79115, 258233, 320576, 451203, 383906, 128328, 43681, 68781, 153063, 311017, 467858, 472619, 333173, 169796, -19222, -86068, -72809, -225029, -313882, -196313, -148148, -128207, 21287, 215892, 395809, 340298, 276653, 216209, 180006, 49657, -178566, -332753, -251596, -165957, -189308, -27465, 97320, 136731, -23486, -155447, -27506, 88710, -69127, -181342, -25012, 268287, 246408, 89444, 231936, 364723, 342342, 100500, -155074, -94338, 120249, 235210, 366054, 668211, 746877, 627900, 346791, 219118, 341015, 360666, 202419, 50959, 38537, 148492, 134810, 3810, -175008, -220778, -240927, -357707, -549052]
12467e49052j10003N9730M2916K11291J44160r5050j6707R8203Q9976n0777j08708
12456b84021J68308J07935J8238k2263O7111k5414j53379j09927N5104J06413
12446g1895M5292K64443K37615J0262j26826l09702k39856m9625J76808J07230
12436D3746r8879N3611J82035p9285j35888j07458k61949j60485J4412J63354
12426c86786K17005N1785K8655R5884Q6572J37480N7873l95650j74266J86208
12416i5240J05786L4885J66599K49530J9988k16702k88832j09896q0947j75226
12406c90055N5980K15960J30283L6465j17829P1974K06341P6480j21051j48684
12396A5864j73145N5787R1568j31857p4878K25159K23497j6169q8304J16904J85963
$$ y = [-549052, -659055, -599325, -556409, -345118, -200958, -296008, -312715, -214512, -124536, -175313, -284021, -115713, -7778, 10460, -11803, 55308, 29894, -123485, -233412, -178308, -71895, -26603, 237840, 475455, 485717, 358891, 49189, -190667, -240292, -63484, 43746, -55133, -1522, 180513, 101228, -34660, -142118, -404067, -564552, -550140, -386786, -169781, -117996, -89341, 6543, 93115, 230595, 288468, -107182, -281448, -95240, 10546, 45431, 212030, 461560, 481548, 264846, -23986, -133882, -214829, -390055, -334075, -118115, 12168, 48633, -69196, 2778, 209119, 285599, 164548, 15864, -157281, -101494, -9926, -141783, -216661, 8498, 231995, 215826, 127522, 244426, 430389]
12385D30389j6263j89847m4614J5410j07031J16861R2039j05071j98437j97812
12375b04376j25224o0488R3378L6602L3956J11910Q6241J62602O8844o1990j17699
12364B3756r7024j66807j19486j05812p3077J03976K28541J67050j14401j01384
12354b54668j59724j00994J98465N0086j03386p9179K8911L45351K49369n4877
12344A19354k13587R4585K80886j1390l45523j57276K39550K43999o6967k92120
12334a08489j40194J07118K70113n6630r6567J04524J4272j1969m9479P5080K55084
12323C62863J63490L5295J9979j22811j55088j69299k02935k66359J30062K68629
12313F3826Q927j9659L0015l0075m3830j83238k51996j19927r903R7163O8240
$$ y = [430389, 414126, 224279, 179665, 195075, 88044, 204905, 296944, 191873, -6564, -204376, -329600, -390088, -296710, -260108, -226152, -114242, -28001, 134601, 203445, 141455, 23756, -73268, -240075, -359561, -465373, -538450, -434474, -205933, -38883, -153284, -254668, -414392, -515386, -316921, -266835, -370221, -449400, -420489, -75138, 174231, 119354, -94233, 352, 281238, 269848, -75675, -232951, 6599, 250598, 183631, -108489, -248683, -141565, 128548, 71918, -24649, 79875, 94147, 82178, 32699, 107779, 362863, 526353, 561648, 581627, 458816, 303728, 134429, -68506, -334865, -204803, 63826, 72753, 53094, 83109, 53034, 9204, -174034, -426030, -545957, -555860, -458697, -390457]
12302c90457J2963p9500L3317K89210J91610R4160r1910k3352N2149K6497j05951
12291H736p2540o0989j57601J1275R9198l6449j16557M4355J42999K06539R7672
12280A66638j60570k03952n8995m9457p3645l095j20579j4019j38113k72632J61614
12269g66805J25299J17258J45308j46439j3699J53750O1292L530O1637R0581J2598
12258a55690M9306Q1222K40837J26285k3873m3353j42693k46250k52764j65414
12248e32387M3065J92599R4204O4433M4538m6650K5809m2967J773J37915Q4101
12237F6433j04116r3588q1208K6769l3318J05662R5942j94495k08001j57460J51132
12226d26248J74570j36322k11519q9878o5124J14625J18168J1371q599J9405K46761
$$ y = [-390457, -377494, -456994, -423677, -134467, 57143, 151303, 59393, 36041, 88190, 114687, 8736, -63804, -124793, -282394, -271119, -171921, -208370, -324927, -280572, -137573, 68966, 166638, 6068, -197884, -256879, -306336, -379981, -383076, -503655, -517674, -655787, -928419, -766805, -641506, -524248, -378940, -525379, -539078, -385328, -324036, -320506, -258869, -168288, -155690, -106384, -25162, 215675, 341960, 318087, 274734, 132041, -114209, -366973, -532387, -489322, -296723, -202519, -138086, -93548, -140198, -114389, -157356, -155583, -17668, 66433, -37683, -131271, -212479, -185710, -219028, -113366, -17424, -211919, -419920, -577380, -426248, -251678, -388000, -599519, -689397, -754521, -639896, -521728, -510357, -518956, -499551, -252790]
12215b52790K22973j64466k74785q169O9461k5779j06297J275K5257k1595p116
12204e42031J48907J48204J04497k09457o6888J3987L0776J06014Q3471J43400
12194c9120M1266n8157J25587J30566j46187j51962k19122k44052J68041K62391
12184a30749J17966N6326j8965M3795o3787m28548k45737K98884L33017K71662
12174B33864j32190m56218j8111K39742J21528o5868j0671J33225J23738J1301
12164A80340o8035J549J31035r444L2856j3382j16639P0916o7238l23727m59042
12153f40811p8170K34024J53120J17995n5395j88449j52560P1207L16384J83679
12143c8976M2463l833j57730j32166R8298p6494l29461k37346r8234k52392k14090
$$ y = [-252790, -29817, -194283, -469068, -477237, -407776, -433555, -539852, -538577, -513320, -534915, -542031, -393124, -244920, -140423, -349880, -416768, -402781, -372005, -265991, -182520, -39120, 2146, -56011, 69576, 200142, 53955, -98007, -317129, -561181, -393140, -130749, -12783, 43543, 24578, 68373, 4586, -423962, -669699, -370815, -37798, 233864, 101674, -354544, -372655, -132913, -11385, -77253, -87924, 45301, 169039, 180340, 112305, 113854, 244889, 235445, 268301, 254919, 138280, 209196, 141958, -181769, -640811, -718981, -484957, -331837, -213842, -269237, -457686, -610246, -539039, -222655, -38976, 3487, -346, -158076, -290242, -191944, -268438, -597899, -835245, -933479, -1185871, -1399961]
12132a399961J009645J225729K58743r8153j60937j45598j28092l012j05114j8181
12122D35069j22644o2996j1037j56023j32203j48533K4045J66675J17150O7608
12112A77111O4575O663k3344o1538q8308j73683j18990L2632J37011O7205J52742
12101A72076J15926K1681M7803m9433o9031p4081L1576J05752K3527O731R8195
12090D30722R8023p5383k90673j50129l6960q1126q5468l7375n2425N4951J91702
12079c4141J52076J463k14141k56291k56504p8576R2642J46939K46629L80519
12069A80615L9068o5381l9964p9696Q5284k5444R2353o768k20842k09328j37281
12058c87384j9491j73777p2673K73996L22958J33354P4033p277k52504j62690
$$ y = [-1399961, -390316, 835413, 1094156, 996003, 835066, 689468, 561376, 558364, 453250, 435069, 312425, 249429, 238392, 82369, -49834, -198367, -174322, -7647, 109503, 177111, 241686, 248349, 225005, 163467, 75159, -98524, -217514, -184882, -47871, 19334, 172076, 288002, 309683, 357486, 308053, 239022, 164941, 196517, 302269, 325796, 332527, 430722, 528745, 453362, 162689, 12560, -24400, -105526, -190994, -228369, -280794, -225843, -34141, 117935, 119398, -94743, -351034, -607538, -686114, -593472, -446533, -199904, 180615, 219683, 154302, 114338, 34642, 119926, 94482, 186835, 180067, -40775, -250103, -387384, -406875, -580652, -653325, -379329, -56371, 76983, 151016, 143739, -108765, -271455]
12048b71455R7094J43072J7627m1641K2622N1863J14763P7624k27907k92424N8179
12037b50583J55945o9213l1446j0960j8028j53727r8995J04282o0438R950J20628
12026c02585K06430K28257p1468k01746j05189M9115J99463J39678j00338k63181
12016b21564k00036m2603K07084L53980K31799N1234j8528J5266k8979l0267j14063
12005B03323p9537j12268k65630j19460j5400q3672j26759K2405J18859r4057
11995e52196j77257r3977J07258J76143J93993j0385J58612K14071m0009l05551
11985c29298k39442O5172K23743L85641K58325L869k19337k84111N306J58145
11975B8013J34337N2433J4402o6913O2907N0103j15867M065J13488j30114k20529
$$ y = [-271455, -174361, -31289, -13662, -55303, -32681, 19182, 133945, 211569, -16338, -308762, -250583, -94638, -163851, -195297, -206257, -224285, -378012, -477007, -372725, -433163, -423213, -302585, -96155, 132102, 60634, -141112, -246301, -197186, 2277, 141955, 41617, -221564, -421600, -464203, -257119, 96861, 328660, 379894, 361366, 376632, 347653, 317386, 203323, 123786, 11518, -254112, -373572, -388972, -472644, -599403, -576998, -458139, -552196, -729453, -823430, -716172, -540029, -346036, -356421, -197809, 16262, -23747, -329298, -568740, -503568, -279825, 105816, 364141, 368010, 148673, -135438, -130132, 28013, 162350, 214783, 229185, 162272, 225179, 275282, 159415, 163480, 276968, 146854, -73675]
11964g3675j9772j61213j07562K22489K80549m6685q8371r4973j23361J29735
11954h2839O3307j38829n9299R0302J08605R3801P64n5502j46540l2261K61750
11943A03259J53930Q3126o9821p9108J23731J26981K1770k05128j54272N7611
11933A62079J19240J1437r9989J5667k8654l3135M5694N2234o9020k76987j33399
11922b34833J9015j59986j34868K09898K73268J70337r1412J6496J12941K04643
11912C85499K49788N2484j15414k08424j79804k00523j90212P7486K62458J24024
11902B57362o7372l6675J17604r8061j56595j07635k24906o5531J50310O6089
11892a65410p5363j56589M7983J87457J21138o2582j218R9675Q7287J82060J07983
$$ y = [-73675, -93447, -254660, -362222, -139733, 140816, 94131, 5760, -89213, -212574, -82839, -19532, -158361, -217660, -127358, -18753, 75048, 75812, 20310, -126230, -158491, 103259, 257189, 340315, 270494, 191386, 315117, 442098, 463868, 258740, 104468, 162079, 281319, 292756, 192767, 208434, 179780, 146645, 192339, 244573, 175553, -101434, -234833, -215818, -375804, -510672, -300774, -27506, 142831, 51419, 67915, 180856, 385499, 635287, 687771, 572357, 363933, 184129, -16394, -206606, -129120, 133338, 257362, 189990, 153315, 270919, 172858, 16263, -91372, -316278, -381809, -231499, -165410, -240773, -397362, -349379, -161922, -40784, -103366, -104584, -4909, 82378, 264438, 372421]
11881C72421l4146k61092j31543J32289N0181k19308l09491J1737L1277K1052
11871c36623K03117L9070r7594l8881j04779n3760L761K20739K50027Q2146o7385
11860I9838k72811j36614o6136M62J32147L8501k3393J74681K67519o3831j63972
11849a3609j74955j28244J12362J50968J30477P4963j6160n4916m5361K94r7530
11838f1711j46469k9228q9712J73J55535k3467j71706q3371K3463N7383m0212
11827d09322R9439K5320l605Q9294J7874J63605P2068k6390p6802j53433P6859
11816a25093K92698J13520j24803k83366j18491J47519K63854J57397q9028j50722
11806H3485j44231j38701j7429Q5993P6302r6061l7542K08844J09337m3309j4757
$$ y = [372421, 338275, 77183, -54360, 77929, 128110, -91198, -400689, -388952, -357675, -336623, -133506, -94436, -192030, -230911, -335690, -389450, -385689, -164950, 85077, 167223, 99838, -172973, -309587, -375723, -375261, -243114, -204613, -228006, -53325, 214194, 150363, -13609, -188564, -316808, -204446, -53478, 76999, 151962, 135802, 80886, 35525, 35819, -61711, -208180, -237408, -327120, -326947, -171412, -194879, -366585, -449956, -426493, -369110, -409322, -309883, -284563, -288168, -198874, -181000, -17395, 54673, 28283, -48519, -201952, -125093, 167605, 281125, 156322, -127044, -245535, -98016, 165838, 323235, 234207, 83485, -60746, -199447, -216876, -130883, -54581, -150642, -188184, 20660, 129997, 86688, 71931]
11795G1931J78905K80937J22777j00866j94680j54557j06130p8503o0622Q8995
11785D8187N1222k466o8911j19623P3220K79932J88383j20881M0960K68252J42638
11774G80913O548m3360j14471l7811o7537j76557J6627N5319n3930j07644J5052
11763B73149J20552q9674k73467l7080J14464K16724M3404p0255K0532m0935j7705
11752B59709J17868O8843J05789L12290J66990J44729k7795J54137N68029J133358
11742C003947J12130j935369j107427o5085j4519K1220O4672L6887Q8686J8357
11732B23499j02439n468o712j99858l12978J5239J82184l782M4268K05740M8865
11721H8558J46802K04880O1117J73875J96551j45313j25911L5634r6545p753K1908
$$ y = [71931, 250836, 531773, 654550, 553684, 359004, 204447, 98317, 19814, -40808, 48187, 99409, 96943, 28032, -91591, -18371, 261561, 449944, 329063, 370023, 638275, 780913, 787461, 744101, 629630, 591819, 524282, 347725, 364352, 419671, 365741, 258097, 273149, 393701, 304027, 30560, -6520, 107944, 324668, 368072, 297817, 318349, 277414, 259709, 377577, 446420, 552209, 864499, 1031489, 1176218, 1148423, 1302560, 1870589, 3003947, 3116077, 1180708, 73281, 8196, -6323, 14897, 79569, 116456, 205142, 223499, 121060, 115592, 108880, -90978, -403956, -388717, -206533, -210315, -166047, 39693, 88558, 235360, 440240, 501357, 675232, 871783, 726470, 600559, 636193, 539648, 531895, 553803]
11710E53803k5847O2532j07858j72377J903J95172J98100j7024j36673r0812o4268
11699C96651l70217n70427j58170K42714K32463K75515J56772Q8530J80657O45
11689D75133n5792K3685K584J04438K61397j6657l09600k81252k84085m4549J31125
11678F427J75763J08437J72800j37938k62916K7893R3117J26217K36194R1563
11668F37557K8052M2243m3573M2166J53689J57204P5840k22618l79001k02166
11658B89393J5788q1601k0208J42237O238L2304R3973Q7858r7258j78430j45496
11647A44798m7657J40912J85302J7270K8770q1523l5249J5601J01745R629N6761
11636E36359P5403J1243M9585L58293N56450K44536o8637o8457J13525J68278
$$ y = [553803, 527956, 590488, 482630, 310253, 312156, 507328, 705428, 688404, 551731, 460919, 396651, 26434, -543993, -702163, -459449, -226986, 48529, 205301, 293831, 474488, 475133, 419341, 443026, 445610, 550048, 811445, 794788, 485188, 203936, -80149, -124698, 6427, 182190, 290627, 463427, 325489, 62573, 90466, 183583, 309800, 545994, 637557, 665609, 707852, 664279, 706445, 860134, 1017338, 1093178, 870560, 491559, 289393, 305181, 223580, 203372, 345609, 351847, 384151, 478124, 565982, 468724, 290294, 144798, 97141, 238053, 423355, 440625, 469395, 387872, 352623, 368224, 469969, 479598, 536359, 611762, 623005, 672590, 1030883, 1587333, 1831869, 1763232, 1694775, 1808300, 1976578]
11626A976578J10904L18311J90230R1383R5005J75077M72575M52621M57429M88952
11616D829065O28927P99912P29867P47287P42278N97694P02568J016209J065403
11607A1859210R06163P57617Q68843R11415P18438L69313j50820o93599j015034
11598A4531546j027291j074119j062422j077521q83216p93375o02227m32851m30784
11589G147740k86699k61425l78254l36406q2867R1511q4824k61018j2836k37985
11579E296937m16684p4337m8615j12341k19964m29463j71462j35329k19992j3636
11569C455114r9269j29902j72153j88996L1114j06379j03502l6414J50648J68619
11559B968880k9575l3607N1768j5101k44549m74401l18779l0913q2566M2109K27961
$$ y = [1976578, 2087482, 2405793, 2596023, 2687406, 2782411, 2957488, 3430063, 3882684, 4340113, 4829065, 5457992, 6257904, 6987771, 7735058, 8477336, 9075030, 9777598, 10793807, 11859210, 12765373, 13522990, 14391833, 15303248, 16021686, 16390999, 16240179, 15546580, 14531546, 13504255, 12430136, 11367714, 10290193, 9406977, 8613602, 8011375, 7578524, 7147740, 6861041, 6599616, 6221362, 5884956, 5802089, 5893600, 5808776, 5547758, 5534922, 5296937, 4880253, 4805916, 4757301, 4644960, 4424996, 3995533, 3824071, 3688742, 3468750, 3455114, 3355845, 3225943, 3053790, 2864794, 2895908, 2789529, 2686027, 2649613, 2800261, 2968880, 2939305, 2905698, 2957466, 2942365, 2697816, 2223415, 1904636, 1873723, 1791157, 1833266, 2061227]
11548B061227J12261k8259k87308m35198l00367j29871k9454j06945O7717R8978
11538A022781P4843r0614j42539j4140n5939j25379j43084p6267O6679L45014
11528H61355J87645J40565J88957J02136j20020j85479J02763o9476j01077J47917
11518A255286J71116j20383K0316L94416K70129o9638L5736J4969k33374j30221
11508A608352L7247n234j62511l2215P3684P8548p1929j12307k96234q0559K38223
11497A275065J55829j69760m47009k98074O8204J05590L5156o7224J2489J37083
11487H07349J24238Q182j58965m1755o0684m2500L5074Q9502R4940J12728J13314
11476A081423R5425R7672M0526L1313Q7913J28735P0526o4877j00975m8653r4832
$$ y = [2061227, 2173488, 2145229, 1857921, 1422723, 1122356, 992485, 963031, 856086, 923803, 1022781, 1097624, 1007010, 864471, 850331, 794392, 669013, 525929, 449662, 516341, 861355, 1049000, 1189565, 1378522, 1480658, 1360638, 1175159, 1277922, 1208446, 1107369, 1255286, 1426402, 1306019, 1326335, 1720751, 1990880, 1921242, 1956978, 1971947, 1738573, 1608352, 1645599, 1640365, 1477854, 1445639, 1519323, 1597871, 1525942, 1413635, 1117401, 1036842, 1275065, 1430894, 1261134, 814125, 516051, 584255, 689845, 725001, 657777, 670266, 807349, 931587, 939769, 780804, 739049, 678365, 635865, 670939, 760441, 855381, 968109, 1081423, 1176848, 1274520, 1315046, 1346359, 1434272, 1563007, 1633533, 1568656, 1467681, 1419028, 1324196]
11465A324196j19929j68051p6541J23640N586k08670j25719j68491l0496M2148
11455E97673j97500j59526j57860k12059l8063J47281J2631K8941J33982j55786
11445b86l82583k85779N41017P28272j13711j63596j3464k71222k54955J39089
11435g7218N5044L6629j17091j84224K4322J85644P99o5588O2564J81311J1875
11424A14067j68324j27825J86377Q8045R7311J38008J9209k63298j26848J47124
11414A03846K919p6828K36465Q2821j90370m2183O0523O6576K00751K08949q5787
11403E67682k35547k40150J73022J73916k45578k40430j30696P7823K02768p7157
11393B5653K8952M525J29846J12922j82687n5589K16269K02922N4837J16703l9163
$$ y = [1324196, 1204267, 1036216, 959675, 1083315, 1088901, 880231, 754512, 586021, 555525, 597673, 400173, 240647, 82787, -129272, -167335, -20054, -7423, 21518, 155500, -286, -382869, -668648, -127631, 600641, 486930, 323334, 309870, 38648, -216307, -77218, -22174, 14455, -102636, -286860, -262538, -76894, -76095, -141683, -79119, 102192, 114067, -54257, -182082, 4295, 92340, 189651, 327659, 346868, 83570, -43278, 103846, 106765, 29937, 266402, 349223, 158853, 116670, 177193, 243769, 444520, 653469, 567682, 332135, 91985, 265007, 438923, 193345, -47085, -177781, -99958, 102810, 25653, 54605, 59130, 188976, 301898, 119211, 63622, 279891, 482813, 537650, 654353, 615190]
11382F15190j01244j34350j78423j13417j46825P601P0221j50626k99476j08219
11372e39568J12803L2233N5n3251J83514P1721j04209J82357K51882J49745J658
11361B88940l6715m8237R014M2939N536j09037j87769k9822J3261j24860Q0959
11350i5791J13323J05685K62691P8531j01970k04984l65299k04572K2835J46938
11340b42613J26420m5239o8226j6896j5633Q1934J73981L5183j27352K08262J55471
11329B65292L7062j3073k30874l1277J58140L07432K39810r2903j69638m0098
11319D29873o1602o8348j06400J55366K79281N6539L7042j13347j76744q9100
11309C42560j25110j44276l08151k51674o9318J04968N4808j0753J27391J08755
$$ y = [615190, 513946, 379596, 201173, 87756, -59069, -51468, 18753, -131873, -431349, -539568, -426765, -394532, -394477, -447728, -264214, -192493, -296702, -114345, 137537, 287282, 288940, 252225, 203988, 213002, 255941, 261477, 152440, -35329, -65151, -51890, -176750, -95791, 17532, 123217, 385908, 464439, 362469, 157485, -207814, -412386, -389551, -242613, -116193, -161432, -229658, -246554, -262187, -180253, -6272, 28911, -98441, 109821, 265292, 302354, 289281, 58407, 27130, 185270, 492702, 732512, 639609, 469971, 429873, 368271, 299923, 193523, 348889, 628170, 684709, 721751, 608404, 431660, 342560, 217450, 73174, -234977, -486651, -555969, -451001, -396193, -406946, -279555, -170800]
11299a70800R6358j20146k05045R6104M19847K04076j91341k48823j51266l4129
11289c05165q7299o6721J13995m9167k69786J7652J56350K12010K57783j693j21284
11278a43325m6885j28251j59263M0661J19853K79406K53405J7279k55832k33397
11268b56349J0384R3145m8575j92942j33321j49554p3266J27726J79839R6086
11258c46827k01605R9444K82862N8149j7626L229M5775J25648J18910J7216m7948
11247A37227R306n8674p8075J41353J63094j7366p4978q6960J44239J09460j10696
11236B77930j32232J35265J04190L1488J91470M1719k24428k10714k56317j84476
11226b26105J11068J24872o9567J62625J77167k70068k39026J13495J9463p2151
$$ y = [-170800, -74442, -194588, -399633, -303529, 116318, 320394, 129053, -119770, -271036, -305165, -392464, -459185, -345190, -394357, -664143, -646491, -490141, -278131, -20348, -22041, -143325, -190210, -318461, -477724, -437063, -317210, -37804, 215601, 232880, -22952, -256349, -245965, -152820, -201395, -394337, -527658, -677212, -750478, -622752, -442913, -346827, -548432, -448988, -166126, -107977, -125603, -122374, -76599, 49049, 167959, 185175, 137227, 146533, 87859, 9784, 151137, 314231, 296865, 221887, 134927, 279166, 388626, 277930, 145698, 280963, 385153, 416641, 608111, 649830, 425402, 214688, -41629, -226105, -115037, 9835, -59732, 102893, 280060, 9992, -229034, -115539, -96076, -168227]
11216a68227k8275O1643P2160l7131K4634m1916J67243K0838j36552r8031p9137
11205b42751J04614J25364L4464q7428k47246j71144J53580J40374p7249J72945
11195i4477L47448Q7101j47617j62268l5109P0928P9435O6252m3376k53421j09098
11184a94202R3400L2603p9691j50877q2812k2061p598J71197M0944j89893k14017
11173f03007o4270J35618K12772J39550j92466p9386K15392K65588J37202R2082
11163B59075J21645Q70Q6123J95620R8080q80j88086l20158j74424J53571K04912
11152D36348L8904l8865j95477O0350J91652n9389J6573R5314j36384q4396J5831
11141C40461j40787o8054L23346J79698k83586k83007j39240p5016J46482P0683
$$ y = [-168227, -196502, -134859, -62699, -99830, -75196, -117112, 50131, 70969, -65583, -163614, -242751, -138137, -12773, 21691, -65737, -312983, -484127, -330547, -190173, -267422, -94477, 252971, 340072, 192455, 30187, -4922, 66006, 145441, 211693, 168317, -85104, -194202, -100802, -68199, -147890, -298767, -381579, -403640, -411238, -240041, -199097, -388990, -603007, -667277, -531659, -318887, -179337, -371803, -451189, -235797, 29791, 166993, 259075, 380720, 381590, 467713, 663333, 761413, 760533, 572447, 252289, 77865, 231436, 436348, 475252, 436387, 240910, 301260, 492912, 433523, 450096, 545410, 409026, 324630, 340461, 199674, 131620, 454966, 634664, 351078, 68071, -71169, -146185, 297, 70980]
11131G0980J03147L4347r5177Q5194J00068K18873K64423J46377j52413k87742
11121D88077j7593J87808K431j68818j98477k12740o0770l862J93574J96882N2567
11110D59079J03028O6573j30783k91614k01103j60627j80860J4014o8735r5444
11100d86472Q3003J89931R9208k7829J13493K99237K07044j68466r4189j10997
11090A03963k3533N5893M554K4637J81493J57038k58742k94916R3792M043j16610
11079f8388j30551j66831k1435N8855J01861P5891j34696J5561L4346r0730p5098
11068d01215J8928P6105M3902M3847J49355J73138M0371r0554p3728n6296j49655
11057b25802j50882O7871J25506J12920J0864j36087l18216j31785K39531Q9811
$$ y = [70980, 174127, 208474, 113297, 198491, 298559, 517432, 781855, 928232, 775819, 488077, 470484, 658292, 660723, 491905, 293428, 80688, 19918, 16056, 209630, 406512, 459079, 562107, 628680, 497897, 206283, 5180, -155447, -336307, -322293, -391028, -486472, -403469, -213538, -114330, -142159, -28666, 270571, 477615, 309149, 214960, 103963, 80430, 136323, 140877, 165514, 347007, 504045, 245303, -49613, 44179, 48222, -68388, -198939, -365770, -387205, -328350, -226489, -150598, -285294, -269733, -235387, -326117, -401215, -382287, -306182, -262280, -218433, -69078, 104060, 144431, 53877, -19851, -76147, -225802, -376684, -308813, -183307, -70387, -59523, -195610, -513826, -645611, -406080, -316269]
11047c16269j5730J28776K69163J68934K6082l4475j98622j10745K23772K95816
11037D36702L7659j96286k95618J09764J34940k4068J5204l8810j10905j59136
11027i0554j41245q5590p1327j70509J3156J47749J06110l3549m1301J28415j410
11016b40055Q1057J05137o891R6586N9857l86l0070L7148O043k05134l0599l3442
11004a60749o0625j23550L9474J5644p2521L665J77741L0519j04998j26164O0004
10993c21560J88882J23488K26204J38023K1998j48103j17482j35971r8780m9674
10983a72975l49406j83178K4089J20183n3554k56759r9428j06265P2924K69186
10973g35183J79729m9807L6227J40532K14479J26948j0683q4899p558L9933J49459
$$ y = [-316269, -331999, -203223, 65940, 234874, 260956, 226481, 27859, -82886, 140886, 436702, 474361, 278075, -17543, 92221, 227161, 203093, 218297, 179487, 68582, -90554, -231799, -317389, -388716, -559225, -546069, -398320, -292210, -325759, -367060, -238645, -240055, -158998, -53861, -60752, 35834, 95691, 95305, 65235, 102383, 108426, -96708, -127307, -160749, -221374, -344924, -305450, -289806, -362327, -358662, -180921, -150402, -255400, -381564, -321560, -132678, -9190, 217014, 355037, 377035, 228932, 111450, -24521, -123301, -172975, -522381, -705559, -681470, -561287, -614841, -871600, -971028, -1077293, -1004369, -735183, -555454, -605261, -569034, -428502, -214023, -87075, -97758, -182657, -190215, -150282, -823]
10962h23j4286k69785j52088j12870j16176J59969J74965J41436J34022k9053
10952h4689O4820J88987K58282N8410j52079K9331P8475P7622O579l01457k19575
10941D706j15730j05401j45054M6807Q2659K9589o5744m5480K12050J70967K45811
10930C15180N230j74928k4104n7604o711K6473J48919j02322j99639k71834k28729
10919e70069Q7512K83013K54667K1216j0400j2122m8816j97587k03618j8699K18290
10908a96613M3847l6991j74701n0792m7630Q959J56922K31009N9344k0264L846
10897b3064n2536j58907j38605j297R7298R8327P462j27472k17085o6648R4903
10886d87624J11856J53416K00665R3369j79255j36752k03030j52597l3792n0049
$$ y = [-823, -15109, -284894, -436982, -549852, -666028, -506059, -331094, -189658, -55636, -84689, -19869, 169118, 427400, 485810, 333731, 363062, 441537, 519159, 525738, 224281, 4706, -111024, -216425, -361479, -314672, -232013, -202424, -268168, -313648, -101598, 69369, 315180, 320410, 145482, 121378, 63774, 57063, 83536, 232455, 130133, -69506, -341340, -570069, -482557, -199544, 55123, 76339, 65939, 53817, 5001, -192586, -396204, -414903, -196613, -152766, -189757, -364458, -415250, -462880, -453921, -296999, -65990, -6646, -26910, -23064, -75600, -234507, -373112, -374409, -277111, -178784, -171322, -298794, -515879, -582527, -487624, -375768, -222352, -21687, 71682, -107573, -244325, -447355, -599952, -633744, -683793]
10876f83793J70080L95632M15122P4612j84331j29014q3m8254k16340l20390k17251
10865g44010K21976L90172J02785J03642J5016k65498n6303O4991O1798k9219
10855a34650L6786R1056K03114L4642j08731j42934Q2873J73629N4573l6489j29601
10844A24268j61982j21600k1141J14144J53495R8628o7393K7645K28295q635j44205
10833B21519q2414l027p6817q7852k36088p8503J34101K06206J94692o1985q1473
10822D8359m1342q5397m2315j00966j25759M5876j97177k64387J18902K23644
10812d20562M6374Q3643J33551J23325p1462Q158Q1637J84678q3399k53529N1593
10801a15993K9825J8056k9002l3809j17156J12937K78048J04769M265k05463j23345
$$ y = [-683793, -513713, -118081, 297041, 371653, 187322, 58308, 58225, 9971, -206369, -526759, -744010, -522034, -131862, -29077, 74565, 89581, -175917, -232220, -167229, -105431, -134650, -97864, -6808, 196306, 230948, 122217, -20717, 62156, 235785, 290358, 253869, 124268, -37714, -159314, -180455, -66311, 87184, 185812, 118419, 146064, 374359, 365724, 221519, 139105, 136078, 59261, -28591, -264679, -343182, -209081, -2875, 191817, 129832, 48359, 7017, -78380, -120695, -221661, -347420, -301544, -498721, -763108, -644206, -420562, -374188, -290545, -156994, -33669, -105131, -96973, -15336, 169342, 85943, -167586, -115993, -86168, -68112, -97114, -130923, -248079, -135142, 142906, 247675, 251940, 46477, -76868]
10790g6868R8363l2520m3899J35740N6680K10065K38501r199j81101k97553j58103
10779e9894o5974K8088R8280J19042n0654k20310O9847J43805R2215J15992M8641
10768C19078P7425l462j47037j03384j7869J0312m964j16573K259J44847R6645
10757B57277J78149O648k47981p4428j66044k72613k97056k07325M6853L50511
10747d26009L25248K66093J55767q0587r9482N9364J19952Q2708o2476M0854J69120
10736E50552k02453k39745J06700J61000J09209n094q7520o1531N9991j51717
10726B39392l13210j1680J61674K33076K95354O7210k08873j90675j3866Q2019
10716C40421J47129p9996K640N7777q6515k65308M0436L87303J36421j68464j19420
$$ y = [-76868, 21495, -11025, -54924, 80816, 137496, 347561, 586062, 576863, 395762, 98209, -59894, -125868, -97780, 500, 119542, 68888, -151422, -81575, 62230, 154445, 270437, 319078, 396503, 393041, 246004, 142620, 124751, 135063, 130099, 13526, 15785, 160632, 257277, 435426, 442074, 194093, 119665, -46379, -318992, -616048, -823373, -776520, -426009, -100761, 165332, 321099, 240512, 141030, 200394, 320346, 403054, 340578, 381432, 550552, 348099, 108354, 215054, 376054, 485263, 480169, 392649, 331118, 391109, 239392, -73818, -85498, 76176, 309252, 604606, 671816, 462943, 272268, 258402, 340421, 487550, 407554, 410194, 467971, 381456, 116148, 156584, 543887, 680308, 511844, 392424]
10705C92424J78617K62275J9623N7185K04821J85084o308J41178K34091L3907
10695A702897M8134O4896L08804N69717P88579J055511J180661J334174J550021
10686H603394J878770K325050L099679L734184M966058O778829O583763J473713
10678C9443440n210964p287887o164515m366533k953845k135639j699860j235067
10670H389130j143580j172351j129489q11395m56621l18415k81723m77376m78954
10661B119226l94827l34998k72584r4423m6350p1493k6353R8918L1023k06802
10651H01337j77242n7585j55509L9914K43662K19558J05777J14787Q0767j79962
10641A035504l79404k32614M1447j19789Q5587L81796K06159p6129l9608P5116
$$ y = [392424, 571041, 833316, 852939, 910124, 1114945, 1300029, 1293721, 1434899, 1668990, 1702897, 1751031, 1815927, 2124731, 2694448, 3483027, 4538538, 5719199, 7053373, 8603394, 10482164, 12807214, 15906893, 19641077, 24607135, 31385964, 37969727, 39443440, 34232476, 26944589, 20780074, 16413541, 13459696, 11324057, 9624197, 8389130, 7245550, 6073199, 4943710, 4132315, 3675694, 3357279, 3075556, 2598180, 2119226, 1724399, 1389401, 1116817, 1022394, 976044, 904551, 878198, 977116, 1008139, 801337, 624095, 566510, 411001, 450915, 694577, 914135, 1019912, 1134699, 1215466, 1035504, 656100, 423486, 464933, 345144, 430731, 812527, 1018686, 942557, 902949, 978065]
10631I78065j8525q0173j79162j88491P8235Q2049j56889k83980j60371J17173
10621A87931J51178R8242L388j4640j487N9707J31359J3712j57478n6759N7287
10610D72440J36284n2620j99710j42892J46904O2587k6643k61629k34980j08394
10600b08653q3365K45910L08651O4382o4142n2330o2579q019K7363j24975k1852
10589B0391J22360j782J13629L5275j85756m9293K13858J2294o6469p6352m8489
10578H9666L6191m9966K0442N4466q4755r3505n1796N6544M6292q551O3686k4894
10566E3820l9860q6568j15089P8038j1391K4068J20196J75863p8266p4149N4731
10555A01393j63538j46866J42308K695r625o9289j56549R1594K85283M55705J94439
$$ y = [978065, 959540, 879367, 700205, 511714, 589949, 671998, 515109, 231129, 70758, 187931, 339109, 437351, 440739, 426099, 424612, 484319, 615678, 629390, 471912, 415153, 472440, 608724, 556104, 356394, 213502, 360406, 422993, 396350, 134721, -100259, -208653, -292018, -46108, 262543, 326925, 262783, 210453, 147874, 139855, 167218, 42243, 20391, 142751, 140969, 254598, 289873, 104117, 54824, 268682, 280976, 214507, 138155, 89666, 125857, 75891, 96333, 150799, 66044, -27461, -79257, -22713, 23579, 15028, 78714, 53820, 13960, -72608, -187697, -109659, -121050, -96982, 23214, 199077, 120811, 46662, 101393, -62145, -209011, -66703, -64008, -73633, -142922, -299471, -207877, 77406, 533111, 727550]
10544G27550m8555j20985j26790k16043k22865j05908k9957l7289K04392J48067
10534A71617M9533r1486q6999P4664J85267O0793r5979j41737j3021j00605p2712
10523f0665J45142M6709K7597r3891j28607J30577K86252Q5332o3402k59306l04016
10512a88278j61756K11149K87640J6217p7244o5668j02341K2383P2882J83186
10502A98170K05667j68876k97266r9043J41320K78861R1053k32081p2093J19864
10492A65576j04108j46742q7801P3102K11050K49080P4179K6362N9929j83382
10482C37245n4164K73849L11323K86352Q2532m31985n78063l38800r7247q2558
10472b91516J62199L32681J95831J91873j26753k76461j52755j7394N1739K30868
$$ y = [727550, 678995, 558010, 431220, 215177, -7688, -113596, -143553, -180842, 23550, 171617, 221150, 129664, 42665, 117329, 302596, 363389, 267410, 125673, 112652, 12047, -60665, 84477, 131186, 158783, 64892, -63715, 66862, 353114, 438446, 375044, 115738, -188278, -350034, -138885, 148755, 164972, 87728, 22060, -80281, -57898, 14984, 198170, 403837, 234961, -62305, -161348, -20028, 258833, 349886, 117805, 45712, 165576, 61468, -85274, -173075, -99973, 111077, 360157, 434336, 460698, 520627, 337245, 283081, 556930, 868253, 1154605, 1237137, 805152, 227089, -111711, -208958, -291516, -129317, 203364, 399195, 591068, 464315, 187854, 35099, 17705, 69444, 300312]
10462C00312J28935j10843j21377m9128o9830q8111J21513P6533q3083j6300J47881
10451B36502q3747k78355j71947Q6804K19342J47975M5142R3784j1874j57376
10441A26250k01339J6272L6922R5352Q889j06399j18346J81496M35283L57083
10431H31463m4305l69138k14950J7273R4805j30597r0391p26q8380p9027M2291
10420c1682M7878J80129l3361k72266j68287K72876K01218m2658j38798j52208
10410a37159L7467K32075n1022l08295k51703L2864J94979Q442j72177K9870J49282
10399b35377L02087L16038k6675k17607l0918j31617j11938J4323N9751n5867
10389a17800J35882J05712j29630o0402r1053j23907q8668J07938K09886L3075
$$ y = [300312, 429247, 318404, 197027, 147899, 78069, -10042, 111471, 188004, 104921, 88621, 236502, 152755, -125600, -297547, -210743, 8599, 156574, 201716, 295500, 283626, 126250, -75089, -58817, -21895, 73457, 82346, -24053, -142399, 39097, 474380, 831463, 787158, 418020, 203070, 220343, 315148, 184551, 94160, 93434, 5054, -73973, -31682, 16196, 196325, 162964, -109302, -277589, -4713, 196505, 153847, 15049, -137159, -99692, 132383, 81361, -226934, -478637, -445773, -250794, -242352, -414529, -384659, -235377, 66710, 382748, 356073, 138466, 107548, -24069, -136007, -121684, -61933, -117800, 18082, 123794, -5836, -66238, -157291, -281198, -369866, -261928, -52042, -18967]
10379a8967j4538p7768M6437k2870r0829j825K35672J53165J38650J62653o295
10368E03485q4250k41691j72559k7761q0599J4742J99664J37284J64338L4592
10358D47245j21372j6941r1369j04626L9668p9024k07043k53810n9853J17756
10348c29369J73352J06650q1099L6765J61900L3306j30130k77686j8676K15004
10338a09983K62287r6834o0073M9200J30147J09579j28792M0700p5688j32890
10328a2347m5140L1604J37914J99983O2595k19011j14459N9215R0515J27940N7002
10317C75811L840r0925L9385R9962K2869j16898K5243J41435j65678k59317j9819
10306E5908K08172J04183k8721j82443l27192k94183J69903K54052L4564Q7577
$$ y = [-18967, -33505, -111273, -64836, -87706, -178535, -180360, 55312, 208477, 347127, 509780, 503485, 419235, 177544, 4985, -22776, -103375, -88633, 111031, 248315, 412653, 447245, 325873, 308932, 217563, 112937, 152605, 73581, -133462, -387272, -447125, -329369, -156017, -49367, -130466, -93701, 68199, 101505, -28625, -306311, -324987, -109983, 152304, 55470, -4603, 44597, 174744, 284323, 155531, 196231, 120543, -12347, -57487, -25883, 112031, 312014, 374609, 155598, 41139, 100354, 190869, 318809, 375811, 379651, 288726, 328111, 428073, 450942, 334044, 359287, 500722, 335044, 75727, 55908, 264080, 368263, 339542, 157099, -170093, -464276, -294373, -40321, -5757, 81820]
10296H1820K3337j16801Q9937J45561l5148j3356J67767K0364o2171r9745K0204
10285B21769M2189K4999p7365p6188k38921k47019N9554Q6797J6596L7821N5909
10274i3859L14017L42882J6394P0192K21360k4309j01122j09606j89660j08318
10264C37971O5416N8580m6058o3260n0282l0919J51785q8735j16712j1514r5088
10253A11184p2417p5257R6510j46337j85617K26004Q3403j58982j41735P8514
10243a84730K78279K07976R5651m3459k00953l69446l4738K63903J84711J14888
10233C12082J94748Q3159q8496k11686j16425k0870m6595q1554O4431K25588O2688
10222C77070j11416j09538K28448J49907k93549k95018O8530L3268j03076q0146
$$ y = [81820, 105157, -11644, 78293, 223854, 188706, 175350, 343117, 363481, 301310, 201565, 221769, 263958, 288957, 211592, 135404, -103517, -350536, -290982, -204185, -187589, -149768, -93859, 220158, 563040, 579434, 649626, 870986, 846677, 745555, 635949, 446289, 337971, 403387, 461967, 415909, 352649, 302367, 271448, 423233, 334498, 217786, 206272, 111184, 38767, -36490, 60020, -86317, -271934, -45930, 37473, -121509, -263244, -184730, 93549, 301525, 397176, 353717, 152764, -216682, -251420, 12483, 197194, 312082, 506830, 589989, 501493, 289807, 173382, 152512, 105917, 24363, 88794, 314382, 377070, 265654, 156116, 384564, 534471, 240922, -54096, 14434, 47702, -55374, -135520]
10212a35520l4831J9535P4861K6580j14132J86426M21717L87528o8917l81220
10202C82027k82263m45J65404J02472R7694K7654J23031K83768J90434o4697l34982
10191F90097j56203q6283P1626K0444j80337j1942R1380J99064J03217J9204k831
10180G57436o4770n693P0968J23496J51550n2663j89172j2365L11654L55787J28931
10169A575159o3080J6816J15902N623j88981O1166K2767j41507J15751J45745
10159A665361j04753j09457J39577J71379J19474J88710Q8035r4365j05447j1133
10149A947381R9085J18379o7324j666L3041K8048L3019J02711J25848N4097p9078
10138B393541j70186k19422j10549n3773O0569O8986n6857Q1357m6125j60552
$$ y = [-135520, -170351, -150816, -75955, -49375, -163507, 22919, 444636, 832164, 763247, 382027, 99764, 99319, 264723, 367195, 464889, 492543, 615574, 899342, 1089776, 1025079, 690097, 533894, 447611, 519237, 539681, 359344, 347402, 438782, 637846, 741063, 760267, 757436, 692666, 686973, 757941, 881437, 1032987, 980324, 791152, 778787, 1090441, 1446228, 1575159, 1512079, 1528895, 1644797, 1650420, 1461439, 1522605, 1545372, 1403865, 1519616, 1665361, 1560608, 1451151, 1590728, 1762107, 1881581, 2070291, 2158326, 2063961, 1958514, 1947381, 2046466, 2164845, 2097521, 2095855, 2128896, 2156944, 2189963, 2292674, 2418522, 2472619, 2393541, 2223355, 2003933, 1893384, 1839611, 1900180, 1969166, 1912309, 1993666, 1947541, 1786989]
10128A786989L1330l8658j67565l6571J41142R7259l4200j64186j26747j5548
10118A473245j06876o4886j1942j1917m5143P7945J69431J45081k6117k13534
10108A385287j86905P9459M197k10904k11180j58671r475K05157K14952M5482
10098A157399j7424q2365o93J71431J92894o0933j07772K9400N9731M9995j25734
10087A265929k94559j47534q3918N8543P010N9973J96212K2405j450q6927j38219
10076H57465m6043P1286P7547n7252j32368k34530k22153j1939Q8944M3667m7767
10065C86857J09629q0554j07138J15689K01222K31891R6613k17763j95217n5094
10055D86135R1590l271k05725j91423j50967R7600J24116J7884K7773L2574J18246
$$ y = [1786989, 1818319, 1779661, 1612096, 1575525, 1716667, 1813926, 1779726, 1615540, 1488793, 1473245, 1366369, 1301483, 1289541, 1277624, 1232481, 1310426, 1479857, 1624938, 1598821, 1385287, 1198382, 1277841, 1282038, 1071134, 859954, 701283, 691808, 896965, 1111917, 1157399, 1139975, 1057610, 1056917, 1228348, 1421242, 1360309, 1252537, 1281937, 1341668, 1391663, 1265929, 971370, 823836, 739918, 798461, 805471, 865444, 1061656, 1084061, 1082611, 995684, 857465, 811422, 882708, 960255, 903003, 770635, 536105, 313952, 302013, 390957, 434624, 386857, 496486, 415932, 308794, 424483, 625705, 857596, 954209, 736446, 541229, 486135, 577725, 574454, 368729, 177306, 26339, 123939, 248055, 265939, 293712, 326286, 444532]
10044D44532J75898p1147j65882j84129j98757N656r9436j59746m0646l2949N5840
10033b70766M0086M1162K10370J23912J91623k8944k9892P8746J3610p8436j84033
10022A07438k48916Q459k642p8956K8942O1414k7904k1410q0510j57460J09511
10011c02034M40721J87352J12239J56717m1164j90194j98037k0450K04709J57032
10001E06891j09921j16436l0697O8141O5580k1756j10334j77315q9190l3703j73866
9990b22606j93154K66815L25088q970o059j0906m4568J92376K34559o5414q8865
9979C78296n7846r2808m3246J28571J30476p7551j69765P8518O3257O8111J36132
9968E42145P4023q8731q1874m3318j62946L5959J10130k5761k47311n3765J84835
$$ y = [444532, 620430, 549283, 383401, 199272, 515, 6171, -93265, -253011, -293657, -326606, -270766, -230680, -189518, 20852, 144764, 336387, 307443, 277551, 356297, 369907, 291471, 107438, -141478, -133019, -135661, -214617, -185675, -124261, -152165, -173575, -254085, -411545, -302034, 138687, 326039, 438278, 594995, 553831, 363637, 165600, 145150, 349859, 506891, 396970, 280534, 249837, 317978, 383558, 361802, 251468, 74153, -15037, -48740, -222606, -415760, -148945, 176143, 167173, 161114, 150208, 105640, 298016, 532575, 467161, 378296, 320450, 227642, 184396, 312967, 443443, 365892, 196127, 274645, 337902, 406013, 542145, 616168, 527437, 445563, 402245, 239299, 275258, 385388, 359627, 112316, 58551, 243386]
9957B43386r8011k10435k07553m7223J95665J67838n4825Q7892J30805q3362j51061
9946b6884j58974p0422n3061O2033J63011K333m3108J69249K01101K16580J71411
9935F33269Q0771k21259l30287m9231O0516k5668j8611r220n2791L1074j33308
9924c4745k2621j51535l42692q3182K32936L51973K67598J1934j73332j9896K13929
9913B50367J47624j59442j26259J7340O158j2652J50570J29373o3444M8800m0580
9902C47855j57859j08354o5291J02591M15457K27733p3142j04382k9237P9390
9892F34761J45679p1312o8345j14029j78208K8352Q4258J0639j145J72382J22482
9881G65514P620J94891J96277M8674l6754J27062O9022j43880k6801J27018L19872
$$ y = [243386, 145375, -65060, -272613, -319836, -124171, 43667, -11158, 76734, 207539, 124177, -26884, -185858, -256280, -309341, -247308, -84297, -81964, -125072, 44177, 245278, 461858, 633269, 714040, 492781, 162494, 113263, 173779, 148111, 129500, 120280, 67489, 98563, -34745, -57366, -208901, -551593, -634775, -401839, -49866, 217732, 229666, 56334, 36438, 250367, 397991, 238549, 112290, 129630, 135788, 123136, 273706, 403079, 339635, 388435, 347855, 189996, 81642, 16351, 118942, 534399, 762132, 688990, 584608, 555371, 634761, 780440, 709128, 640783, 526754, 348546, 376898, 461156, 471795, 470650, 643032, 765514, 773134, 968025, 1164302, 1212976, 1176222, 1303284, 1372306, 1228426, 1201625, 1328643, 1648515]
9870A648515J85371k56783k72432L5103J05391P5628j0218j27000o4978J1806
9860A330403Q2399J7542J78078L23182K64631j5790o8755O839N2241m2700K468
9849B130538J8231J7041J13915n6698j18309n0982r0776L9371j94940k46620L5399
9838A596170p4391k53892j43007Q0118j00496r9576J01525J5787P493J9872N706
9827A155309N5702L8078n8700r3179K0020J02056J74298j51202k82549j52567
9817H07266N1567o8249k33055j10233M3538R3239L3140J08276K73339J76860j01635
9806A074053j04700M5206O8741P5313J09980m2041k49328l01993k41699j11888
9796C21644J7333L42241K70328K27647K70911K25873J47539k8066k12561j26477
$$ y = [1648515, 1833886, 1577103, 1304671, 1339774, 1445165, 1520793, 1510575, 1383575, 1318597, 1330403, 1412802, 1430344, 1608422, 1931604, 2196235, 2180445, 2111690, 2118529, 2170770, 2128070, 2130538, 2148769, 2165810, 2279725, 2223027, 2104718, 2053736, 1962960, 2002331, 1807391, 1560771, 1596170, 1521779, 1267887, 1124880, 1204998, 1104502, 1004926, 1106451, 1122238, 1129731, 1149603, 1155309, 1211011, 1249089, 1190389, 1097210, 1117230, 1219286, 1393584, 1242382, 959833, 807266, 858833, 790584, 557529, 447296, 490834, 584073, 617213, 725489, 998828, 1175688, 1074053, 969353, 1014559, 1083300, 1158613, 1268593, 1226552, 977224, 675231, 433532, 321644, 338977, 681218, 951546, 1179193, 1450104, 1675977, 1823516, 1795450, 1582889, 1456412]
9786A456412j87220l31921j35274J9889r2037m0211r9963j79106q0348o4803Q2966
9775C48384K15147M1793n383o6586j05157m5678j52970l7166K54145K07594k5428
9764F28695k56563k85798n9285J99862J18081j46270L3409q5074l04450j55637
9754c13030R985R291N4742P0159k44932k29504J71311P7643J35988J81655J52017
9743G5325P7500l2283j41365p4894J59116o7734j17768j52179m8620J40692K01852
9732A9642J42783m3894m0462J40059j50043j80450L6725R6619k9482o9233j8569
9721i6305J21223J21247k5541k11108l23499j0764P3505l2777J45838J03964J5210
$$ y = [1456412, 1269192, 937271, 801997, 821886, 729849, 689638, 589675, 410569, 330221, 265418, 348384, 563531, 605324, 599941, 533355, 428198, 382520, 229550, 192384, 446529, 654123, 628695, 372132, 86334, 27049, 226911, 344992, 198722, 232131, 147057, -157393, -313030, -303045, -293754, -239012, -168853, -413785, -643289, -471978, -394335, -258347, -76692, 75325, 152825, 120542, -20823, -95717, 63399, -4335, -122103, -274282, -322902, -182210, 19642, 162425, 118531, 78069, 218128, 68085, -112365, -75640, 20979, -8503, -77736, -96305, 24918, 146165, 120624, -90484, -413983, -424747, -351242, -384019, -238181, -134217, -119007]
$$ [...]
##END NTUPLES=NMR SPECTRUM
##END=
