##TITLE=C13_LR-671-CR2-MH
 D2O, 23000 sc

 16.10.2019
##JCAMPDX= 6.0         $$ Bruker NMR JCAMP-DX V2.0
##DATA TYPE= NMR SPECTRUM
##DATA CLASS= NTUPLES
##ORIGIN= UXNMR, Bruker Analytische Messtechnik GmbH
##OWNER= root
$$ XWIN-NMR		Version 3.5
$$ Thu Oct 17 13:41:59 2019 Russian Standard Time (UT+4h)  she@DPX200
##.OBSERVE FREQUENCY= 50.327896
##.OBSERVE NUCLEUS= ^13C
##.ACQUISITION MODE= SIMULTANEOUS
##.ACQUISITION SCHEME= undefined
##.AVERAGES= 18859
##.DIGITISER RES= 17
##SPECTROMETER/DATA SYSTEM= spect
##.PULSE SEQUENCE= zgpg30
##.SOLVENT NAME= CDCl3
##.SHIFT REFERENCE= (INTERNAL, CDCl3, 0, 222.624)
##AUDIT TRAIL= $$ (NUMBER, WHEN, WHO, WHERE, WHAT)
$$ ##TITLE= Audit trail, XWIN-NMR		Version 3.5
$$ ##JCAMPDX= 5.01
$$ ##ORIGIN= Bruker BioSpin GmbH
$$ ##OWNER= she
$$ F:/spectra/data/she/nmr/c13/1/pdata/1/auditp.txt
$$ ##AUDIT TRAIL=  $$ (NUMBER, WHEN, WHO, WHERE, WHAT)
(   1,<2019-10-17 10:27:44.43 +0400>,<she>,<DPX200>,
      <created by zg, POWCHK disabled, PULCHK disabled
       terminated by command 'halt'
       configuration hash MD5:
       00 E9 B6 7A A2 85 ED C7 34 08 36 98 17 FE 4E 26
       data hash MD5: 32K
       A4 51 C1 85 E9 CA 59 B3 8C 21 0A 9B FD 91 68 7D>)
(   2,<2019-10-17 13:39:49.10 +0400>,<she>,<DPX200>,
      <Start of raw data processing
       efp BC_mod = 2 LB = 1 FT_mod = 6 PKNL = 1 PHC0 = -373.771 PHC1 = 25.80636 SI = 32K 
       data hash MD5: 32K
       BE E7 64 78 CB A0 DA 97 75 B7 A5 56 C7 D9 76 A2>)
(   3,<2019-10-17 13:39:52.18 +0400>,<she>,<DPX200>,
      <abs ABSG = 5 
       data hash MD5: 32K
       EE 50 7E 3F 08 8B 67 6C 28 4D 6E BD EA 1F 3C B2>)
(   4,<2019-10-17 13:40:06.92 +0400>,<she>,<DPX200>,
      <pk PHC0 = -5.067145 PHC1 = -5.4 
       data hash MD5: 32K
       7A 02 36 AB 34 8F BF 37 39 09 C3 4D 2A CF 1A 2D>)
(   5,<2019-10-17 13:40:10.34 +0400>,<she>,<DPX200>,
      <abs ABSG = 5 
       data hash MD5: 32K
       8D 9D 4C B8 B7 19 98 5A 37 CF 3F BA C2 4C 70 A5>)
(   6,<2019-10-17 13:40:59.40 +0400>,<she>,<DPX200>,
      <pk PHC0 = -8.253138 PHC1 = 5.800001 
       data hash MD5: 32K
       8E C0 A3 DE AA AE A8 6C 76 57 A9 E1 B6 8B 2E 4F>)
$$ ##END=
$$ 
$$ hash MD5
$$ F9 65 50 B3 DF A5 91 CF C0 85 2D 73 AA 9F 6E D8
##$RELAX= 
##$RELAX= 
##$RELAX= 
##$RELAX= 
##$RELAX= 
##$RELAX= 
##$RELAX= 
##$RELAX= 
$$ Bruker specific parameters
$$ --------------------------
##$DU= <F:/spectra>
##$EXPNO= 1
##$NAME= <c13>
##$PROCNO= 1
##$TYPE= <nmr>
##$USER= <she>
##$AMP= (0..31)
100 100 100 100 100 100 100 100 100 100 100 100 100 100 100 100 100 100 
100 100 100 100 100 100 100 100 100 100 100 100 100 100 
##$AQSEQ= 0
##$AQ_mod= 1
##$AUNM= <au_zg>
##$AUTOPOS= <>
##$BF1= 50.322709
##$BF2= 200.13
##$BF3= 50.322709
##$BF4= 500.13
##$BF5= 500.13
##$BF6= 500.13
##$BF7= 500.13
##$BF8= 500.13
##$BYTORDA= 1
##$CFDGTYP= 0
##$CFRGTYP= 5
##$CHEMSTR= <none>
##$CNST= (0..31)
1 1 145 1 1 1 1 1 1 1 1 1 1 1 1 1 1 1 1 1 1 1 1 1 1 1 1 1 1 1 1 1 
##$CPDPRG= <waltz16>
##$CPDPRG1= <>
##$CPDPRG2= <waltz16>
##$CPDPRG3= <>
$$ [...]
##$SUBNAM4= <"">
##$SUBNAM5= <"">
##$SUBNAM6= <"">
##$SUBNAM7= <"">
##$SUBNAM8= <"">
##$SUBNAM9= <"">
##$SW= 239.972175391363
##$SWIBOX= (0..15)
0 1 3 0 0 0 0 0 0 0 0 0 0 0 0 0 
##$SW_h= 12077.2946859903
##$TD= 32768
##$TD0= 1
##$TE= 0
##$TE2= 300
##$TE3= 300
##$TEG= 300
##$TL= (0..7)
120 120 120 120 120 120 120 120 
##$TP= (0..7)
150 150 150 150 150 150 150 150 
##$TP07= 0
##$TPNAME0= <>
##$TPNAME1= <>
##$TPNAME2= <>
##$TPNAME3= <>
##$TPNAME4= <>
##$TPNAME5= <>
##$TPNAME6= <>
##$TPNAME7= <>
##$TPOAL= (0..7)
0.5 0.5 0.5 0.5 0.5 0.5 0.5 0.5 
##$TPOFFS= (0..7)
0 0 0 0 0 0 0 0 
##$TUNHIN= 0
##$TUNHOUT= 0
##$TUNXOUT= 0
##$USERA1= <user>
##$USERA2= <user>
##$USERA3= <user>
##$USERA4= <user>
##$USERA5= <user>
##$V9= 5
##$VALIST= <valist>
##$VCLIST= <CCCCCCCCCCCCCCC>
##$VD= 0
##$VDLIST= <DDDDDDDDDDDDDDD>
##$VPLIST= <PPPPPPPPPPPPPPP>
##$VTLIST= <TTTTTTTTTTTTTTT>
##$WBST= 1024
##$WBSW= 4
##$XGAIN= (0..3)
0 0 0 0 
##$XL= 0
##$YL= 0
##$YMAX_a= 35493049
##$YMIN_a= -113037142
##$ZGOPTNS= <>
##$ZL1= 120
##$ZL2= 120
##$ZL3= 120
##$ZL4= 120
##$ABSF1= 222.624
##$ABSF2= -17.3728
##$ABSG= 5
##$ABSL= 3
##$ALPHA= 0
##$AQORDER= 0
##$ASSFAC= 0
##$ASSFACI= 0
##$ASSFACX= 0
##$ASSWID= 0
##$AUNMP= <proc_1d>
##$AZFE= 0.1
##$AZFW= 0.5
##$BCFW= 0
##$BC_mod= 2
##$BYTORDP= 0
##$COROFFS= 0
##$CY= -3
##$DATMOD= 1
##$DC= 0
##$DFILT= <>
##$DTYPP= 0
##$F1P= 0
##$F2P= 0
##$FCOR= 0.5
##$FTSIZE= 32768
##$FT_mod= 6
##$GAMMA= 0
##$GB= 0
##$INTBC= 1
##$INTSCL= 4.134877e-10
##$ISEN= 128
##$LB= 1
##$LEV0= 0
##$LPBIN= 0
##$MAXI= 10000
##$MC2= 0
##$MEAN= 0
##$ME_mod= 0
##$MI= 0.1934396
##$NCOEF= 0
##$NC_proc= 0
##$NLEV= 6
##$NOISF1= 120.0001
##$NOISF2= 80.00006
##$NSP= 0
##$NTH_PI= 0
##$NZP= 0
##$OFFSET= 222.624
##$PC= 1.4
##$PHC0= -387.0912
##$PHC1= 26.20636
##$PH_mod= 1
##$PKNL= yes
##$PPARMOD= 0
##$PSCAL= 0
##$PSIGN= 0
##$REVERSE= no
##$SF= 50.3227315989248
##$SI= 32768
##$SIGF1= 140
##$SIGF2= 120
##$SINO= 11.81781
##$SIOLD= 32768
##$SREGLST= <13C.CDCl3>
##$SSB= 0
##$STSI= 32768
##$STSR= 0
##$SW_p= 12077.2946859903
##$SYMM= 0
##$S_DEV= 0
##$TDeff= 32768
##$TDoff= 0
##$TI= <>
##$TILT= no
##$TM1= 0
##$TM2= 0
##$TOPLEV= 0
##$USERP1= <user>
##$USERP2= <user>
##$USERP3= <user>
##$USERP4= <user>
##$USERP5= <user>
##$WDW= 1
##$XDIM= 32768
##$YMAX_p= 576798117
##$YMIN_p= -9825631
$$ End of Bruker specific parameters
$$ ---------------------------------
##NTUPLES= NMR SPECTRUM
##VAR_NAME=  FREQUENCY,     SPECTRUM/REAL,   SPECTRUM/IMAG
##SYMBOL=    X,             R,               I
##VAR_TYPE=  INDEPENDENT,   DEPENDENT,       DEPENDENT
##VAR_FORM=  AFFN,          ASDF,            ASDF
##VAR_DIM=   32768,         32768,           32768
##UNITS=     HZ,            ARBITRARY UNITS, ARBITRARY UNITS
##FACTOR=    0.368581032318806, 1,           1
##FIRST=     11203.0474431902, 0,            0
##LAST=      -874.247242800138, 0,           0
##MIN=       -874.247242800138, -9825631,    0
##MAX=       11203.0474431902, 576798117,    0
$$ Real data points
##PAGE= N=1
##DATA TABLE= (X++(R..R)), XYDATA
$$ [...]
$$ plain form
22713 -2363657 -2433276 -2500893 -1617378 -1238272 -1574179 -2829290 -5093069 -5319292 -4768146
22704 -4768146 -3317856 -2710420 -1617055 798166 347645 -637423 -1141185 -213099 721400
22695 721400 410627 358825 2220345 2704057 1004321 -1665586 -2917159 -2443131 -1893009
22686 -1893009 -1922680 -1631948 -913297 -98195 253056 365962 -159610 -1668626 -2798047
22677 -2798047 -4813993 -6274719 -6476631 -5778460 -4034512 -3090309 -3442686 -3761458 -2931279
22668 -2931279 -1667708 786163 1259098 -454622 -1708085 -2515542 -2233067 -2062648 -2092378
22659 -2092378 -1900772 -1711842 -2223706 -2245606 -2245840 -1301668 -522469 -1124597 -657544 1049135
22649 1049135 2432937 2343802 2117654 1452329 -1083375 -3165649 -4183202 -4616326 -5680309
$$ packed form
22713b363657o9619o7617Q83515L79106l35907j255111k263779k26223N51146
22704d768146J450290O07436J093365K415221m50521r85068n03762R28086R34499
22695G21400l10773n1802J861520M83712j699736k669907j251573M74028N50122
22686a893009k9671K90732P18651Q15102L51251J12906n25572j509016j129421
22677b798047k015946j460726k01912O98171J743948R44203l52377l18772Q30179
22668b931279J263571K453871M72935j713720j253463q07457K82475J70419k9730
22659b092378J91606J88930n11864k1900k34R44172P79199o02128M67053J706679
22649A049135J383802q9135k26148o65325k535704k082274j017553m33124j063983
$$ plain form
22640 -5680309 -5949289 -4535886 -2054683 138203 664231 958918 686039 -465666 -1083575
22631 -1083575 -199140 449806 516006 -636025 -1923501 -1813445 -1394112 -2083358 -2761140
22622 -2761140 -2062631 -779649 -841103 -422702 -678294 -52267 603464 -377431 -1111189
22613 -1111189 -449863 523126 657814 414263 551204 1027819 593592 636710 562421 -765085
22603 -765085 -1655509 -116948 1922428 3099469 2877173 3426974 5559488 5196360 1377447
22594 1377447 -18276 779788 848631 853775 239163 -1511329 -2820070 -2003905 -372456
22585 -372456 434651 477714 341698 820301 1713878 1915388 787039 794250 1221160 184570
22575 184570 -679966 -1207338 -559289 548244 178341 -220622 224399 1249622 1339147
$$ packed form
22640e680309k68980J413403K481203K192886N26028K94687k72879j151705o17909
22631a083575Q84435O48946O6200j152031j287476J10056M19333o89246o77782
22622b761140O98509J282982o1454M18401k55592O26027O55731r80895p33758
22613a111189O61326R72989J34688k43551J36941M76615m34227M3118p4289j327506
22603g65085q90424J538561K039376J177041k22296N49801K132514l63128l818913
22594A377447j395723P98064O8843N144o14612j750492j308741Q16165J631449
22585c72456Q07107M3063j36016M78603Q93577K01510j128349P211M26910j036590
22575A84570q64536n27372O48049J107533l69903l98963M45021J025223Q9525
$$ plain form
22566 1339147 329041 -984091 -745092 212525 808809 476159 -384085 -1915456 -4262436
22557 -4262436 -4854372 -2782949 -1800682 -806522 1126204 1694965 1743098 1864592 1291430
22548 1291430 275606 288836 972820 1361932 1259107 1412616 1656798 1983905 1929064 1242119
22538 1242119 417924 509582 1514920 1801608 1866043 1179378 -287927 -3062579 -4664666
22529 -4664666 -3579334 -2998334 -2308879 -789342 268236 556150 -1639566 -2644080 -914779
22520 -914779 -35794 989508 1946865 2412187 3159759 3879707 3765282 3625962 2162345
22511 2162345 205478 409343 1224876 697720 -35739 -319743 -658420 -1866192 -2403700
22502 -2403700 -1082405 -1687360 -2239100 -2359378 -2035112 -444676 1315053 2154701 1277822
$$ packed form
22566A339147j010106j313132K38999R57617N96284l32650q60244j531371k346980
22557d262436n91936K071423R82267R94160J932726N68761M8133J21494n73162
22548A291430j015824J3230O83984L89112j02825J53509K44182L27107n4841o86945
22538A242119q24195R1658J005338K86688O4435o86665j467305k774652j602087
22529d664666J085332N81000O89455J519537J057578K87914k195716j004514J729301
22520i14779Q78985J025302R57357M65322P47572P19948j14425j39320j463617
22511B162345j956867K03865Q15533n27156p33459k84004l38677j207772n37508
22502b403700J321295o04955n51740j20278L24266J590436J759729Q39648q76879
$$ plain form
22493 1277822 -819800 -1420883 -1175535 -2337035 -4358843 -5495692 -4315761 -2327793
22485 -2327793 -2110468 -2955320 -2981374 -1906563 -1593899 -1310501 -508962 -223253 -622942
22476 -622942 -1493575 -2274451 -3511479 -3943289 -2847698 -595081 1978103 3310049 2916163
22467 2916163 1974326 499120 -213968 -1010564 -953852 -507440 -955300 -1762840 -2249037
22458 -2249037 -1225331 904546 2110766 1840965 900559 920814 1845323 2240380 1870567
22449 1870567 1386883 1787201 2798372 2923451 2287940 -67741 -2575178 -5436088 -5898227
22440 -5898227 -4569843 -3011846 -1473877 -1634022 -2249826 -2109852 -1794089 145490 1704242
22431 1704242 1013935 212455 -964626 -1453267 766133 1972332 1608307 1616603 590025
$$ packed form
22493A277822k097622o01083K45348j161500k021808j136849J179931J987968
22485b327793K17325q44852k6054J074811L12664K83398Q01539K85709l99689
22476f22942q70633p80876j237028m31810J095591K252617K573184J331946l93886
22467B916163r41837j475206p13088p96596N6712M46412m47860q07540m86197
22458b249037J023706K129877J206220k69801r40406K0255R24509L95057l69813
22449A870567m83684M00318J011171J25079o35511k355681k507437k860910m62139
22440e898227J328384J557997J537969j60145o15804J39974L15763J939579J558752
22431A704242o90307q01480j177081m88641K219400J206199l64025Q296j026578
$$ plain form
22422 590025 604523 277272 -1694157 -1892137 -630881 -192034 182972 413596 -854297
22413 -854297 -2442387 -2538811 -2261584 -905753 1397137 3129110 2874459 1659547 -946125
22404 -946125 -1118381 591856 -155832 -1148054 -542789 1450805 1241843 -363063 -327871
22395 -327871 -95611 307657 700359 733954 590496 -331445 -418826 1611765 2631100 2804136
22385 2804136 1965080 -411813 -1833906 -1756099 -1871100 -2639261 -2385864 -1903398 -1598837
22376 -1598837 -1188104 -197630 896152 799152 827188 1473226 2275394 2248406 1945187 -276013
22366 -276013 -2633458 -2882403 -1208217 -42540 225855 -312700 348341 2148796 2155833
22357 2155833 907455 1106855 1590136 734132 374956 -844870 -2196191 -2494767 -1328937
$$ packed form
22422E90025J4498l27251j971429j97980J261256M38847L75006K30624j267893
22413h54297j588090r6424K77227J355831K302890J731973k54651j214912k605672
22404i46125j72256J710237p47688r92222O05265J993594k08962j604906L5192
22395c27871K32260M03268L92702L3595j43458r21941q7381K030591J019335J73036
22385B804136q39056k376893j422093P7807j15001p68161K53397M82466L04561
22376a598837M10733R90474J093782r7000K8036O46038Q02168k6988l03219k221200
22366b76013k357445k48945J674186J165677K68395n38555O61041J800455P037
22357B155833j248378J99400M83281q56004l59176j219826j351321k98576J165830
$$ plain form
22348 -1328937 -683678 -767007 -277473 321377 -498939 -1268699 -1248888 -1616446 412160 1105314
22338 1105314 -388334 -1995187 -2373545 -2433700 -2394672 -2835566 -3131641 -1281017 27623
22329 27623 126851 -554275 -392279 -192499 -760835 -580650 -1076908 -860041 656597 2208677
22319 2208677 3329093 3731544 4819502 4402870 3264820 2214105 1674395 2477428 2026532
22310 2026532 837125 153803 -767213 -228496 94448 -1492382 -2078671 4800 2263133
22301 2263133 2643373 1541593 819118 -422305 -1120912 -2175969 -3190160 -4097474 -4059942
22292 -4059942 -4017944 -4152458 -4355169 -4151515 -3504600 -1780186 -1762347 -3411396 -3582362
22283 -3582362 -3432555 -3428084 -4401411 -5881268 -5578780 -5731446 -4992000 -2445226 -1161588
$$ packed form
22348a328937O45259q3329M89534N98850q20316p69760J9811l67558K028606O93154
22338A105314j493648j606853l78358o0155L9028m40894k96075J850624J308640
22329B7623R9228o81126J61996J99780n68336J80185m96258K16867J516638J552080
22319B208677J120416M02451J087958m16632j138050j050715n39710Q03033m50896
22310B026532j189407o83322r21016N38717L22944j586830n86289K083471K258333
22301B263133L80240j101780p22475j241423o98607j055057j014191r07314L7532
22292d059942M1998j34514k02711K03654O46915J724414J7839j649049j70966
22283c582362J49807M471r73327j479857L02488j52666P39446K546774J283638
$$ plain form
22274 -1161588 -1513353 -1942787 -2766961 -3366886 -3517765 -3710477 -2782776 -2117926 -675495
22265 -675495 500432 1175378 1513887 2160410 2478611 3126854 3427792 3439297 2285306
22256 2285306 1458721 1571675 1430301 1025106 425987 -223194 -322916 -305504 -938308 -3057297
22246 -3057297 -4465436 -3101966 -1408528 -1819395 -2064051 -1027074 1075764 832317 231689
22237 231689 1014687 19386 -310782 -354729 539686 809880 140581 859959 1663567 600702
22227 600702 -1822508 -2814224 -2555107 -2733242 -3815981 -3786122 -2838321 -2034012 -1012018
22218 -1012018 53322 2093501 3014786 3084553 2472753 2148253 1621038 416855 -408114
22209 -408114 -1336536 -2918119 -5021685 -5733096 -5833177 -5585292 -5010006 -1807325 1601392
$$ packed form
22274a161588l51765m29434q24174n99925j50879j92712R27701O64850J442431
22265f75495J175927O74946L38509O46523L18201O48243L00938J1505j153991
22256B285306q26585J12954j41374m05195n99119o49181r9722J7412o32804k118989
22246c057297j408139J363470J693438m10867k44656J036977K102838k43447o00628
22237B31689P82998r95301l30168m3947Q94415K70194o69299P19378Q03608j062865
22227F00702k423210r91716K59117j78135j082739K9859R47801Q04309J021994
22218a012018J065340K040179R21285O9767o11800l24500n27215j204183q24969
22209d08114r28422j581583k103566p11411j00081K47885N75286L202681L408717
$$ plain form
22200 1601392 2313172 1471466 982130 -166908 -1482530 -1668765 -1964141 -1457211 -917421
22191 -917421 -459887 -480587 -909398 -1843305 -2035938 -1002066 -129812 319862 1580341
22182 1580341 1419623 1603855 1328963 620964 438877 670011 1251546 245302 -1696063
22173 -1696063 -1246779 -704294 -1971595 -2476101 -2590598 -2695126 -2972082 -2840194 -3267014
22164 -3267014 -3095159 -2367755 -1544435 -1755189 -3054566 -4311456 -5122278 -4530770 -1832856
22155 -1832856 1323535 2368972 1499958 1002015 1146249 228794 -3229276 -4863271 -5153055
22146 -5153055 -4933948 -3518322 -2555056 -2271392 -1424959 358045 977816 -546127 -2461567
22137 -2461567 -2577531 -2367154 -1852536 -1906542 -2426256 -880191 719823 1679301 1710849
$$ packed form
22200A601392P11780q41706m89336j149038j315622j86235k95376N06930N39790
22191i17421M57534k0700m28811r33907j92633J033872Q72254M49674J260479
22182A580341j60718J84232k74892p07999j82087K31134N81535j006244j941365
22173a696063M49284N42485j267301n04506j14497j04528k76956J31888m26820
22164c267014J71855P27404Q23320k10754j299377j256890q10822N91508K697914
22155a832856L156391J045437q69014m97943J44234r17455l458070j633995k89784
22146e153055K19107J415626R63266K83664Q46433J783004O19771j523943j915440
22137b461567j15964K10377N14618n4006n19714J546065J600014R59478L1548
$$ plain form
22128 1710849 583966 218694 -146531 430037 919827 1265438 -208225 -2470933 -2385257
22119 -2385257 -711552 -142140 -1209274 -1868363 -1049443 -396414 460617 353429 -1910812
22110 -1910812 -921283 1986053 2243242 203840 -2624634 -4275453 -4331544 -2772711 -1580343
22101 -1580343 -1844790 -1429245 -1141134 -2365761 -4541741 -4728478 -3379535 -1839314 -1332055
22092 -1332055 -1690691 -1067606 -996704 -2378995 -4347621 -4881880 -3245208 -1625055 -2965903
22083 -2965903 -4093544 -3761863 -3346541 -3244631 -3201147 -2775161 -3229278 -3685592 -3738298 -3836715
22073 -3836715 -4066336 -2519245 -1105924 -946221 -403825 -77056 -1467598 -1702842 -521387
22064 -521387 -249377 -422842 -831717 1140881 2614856 1989509 820518 -367573 -1073058
$$ packed form
22128A710849j126883l65272l65225N76568M89790L45611j473663k262708Q5676
22119b385257J673705N69412j067134o59089Q18920O53029Q57031j07188k264241
22110a910812R89529K907336K57189k039402k828474j650819n6091J558833J192368
22101a580343k64447M15545K88111j224627k175980j86737J348943J540221N07259
22092a332055l58636O23085P0902j382291j968626n34259J636672J620153j340848
22083b965903j127641L31681M15322J01910M3484M25986m54117m56314n2706r8417
22073c836715k29621J547091J413321J59703N42396L26769j390542k35244J181455
22064e21387K72010j73465m08875J972598J473975o25347j168991j188091p05485
$$ plain form
22055 -1073058 -125830 1528412 2490386 3290215 3823154 3422784 2308702 3014937 3139254
22046 3139254 1278674 -211481 239050 1063097 1291118 1444049 1473644 1185727 303295
22037 303295 -401093 609922 809959 -944469 -1293059 -733653 13929 810406 458183
22028 458183 -423092 -117011 1113827 1340214 509010 -1276321 -1771175 -1882275 -2963768
22019 -2963768 -2037262 -1197470 -2040400 -3103556 -1686916 289094 241409 -145044 -384843
22010 -384843 -954538 -152855 1252511 1415943 751761 453819 -310666 -518459 410296
22001 410296 492543 790478 759164 1612435 1722397 399934 -1192189 -1287415 1107143 3696497
21991 3696497 5188120 4434721 3171909 1282947 -664451 55414 811308 618750 1323746
$$ packed form
22055a073058R47228J654242R61974P99829N32939m00370j114082P06235J24317
22046C139254j860580j490155M50531Q24047K28021J52931K9595k87917q82432
22037C03295p04388J011015K00037j754428l48590N59406P47582P96477l52223
22028D58183q81275L06081J230838K26387q31204j785331m94854j11100j081493
22019b963768R26506Q39792q42930j063156J416640J976010m7685l86453k39799
22010c84843n69695Q01683J405366J63432o64182k97942p64485k07793R28755
22001D10296Q2247K97935l1314Q53271J09962j322463j592123r5226K394558K589354
21991C696497J491623p53399j262812j888962j947398P19865P55894j92558P04996
$$ plain form
21982 1323746 2089000 2568816 1076185 -898760 -801959 169136 -53202 -393474 150495
21973 150495 1337694 1436562 199984 -488157 -1008359 -1363824 -2027028 -2568459 -1723727
21964 -1723727 -1846469 -2072797 244298 303602 -855240 -534330 -797226 -1845880 -2317192
21955 -2317192 -3133304 -3948913 -4612282 -3267928 -1172292 -667893 -1474322 -2189204 -2636009
21946 -2636009 -2917463 -2202469 -1460642 -2405145 -2718660 1135437 3003983 1816464 -326721
21937 -326721 -1907580 -2685949 -3081166 -3388622 -3703565 -4189668 -4601512 -4155111 -2587705
21928 -2587705 -1532810 -1874994 -2497048 -2881127 -1665606 -565335 -644195 -350674 260342
21919 260342 -254329 -564511 1332533 2635374 1481551 126152 -106655 -637317 -214311
$$ packed form
21982A323746P65254M79816j492631j974945R6801R71095k22338l40272N43969
21973A50495J187199R8868j236578o88141n20202l55465o63204n41431Q44732
21964a723727j22742k26328K317095N9304j158842L20910k62896j048654m71312
21955b317192q16112q15609o63369J344354K095636N04399q06429p14882m46805
21946b636009k81454P14994P41827r44503l13515L854097J868546j187519k143185
21937c26721j580859p78369l95217l07456l14943m86103m11844M46401J567406
21928b587705J054895l42184o22054l84079J215521J100271p8860K93521O11016
21919B60342n14671l10182J897044J302841j153823j355399k32807n30662M23006
$$ plain form
21910 -214311 -180701 486939 2119860 1700774 1144448 1186915 1615238 1449271 1135251 855420
21900 855420 265995 1407797 2327714 2130276 1849495 1604470 1098564 997952 1098256
21891 1098256 652639 132752 -468326 -1651259 -2423462 -1134310 550589 2276906 2768781
21882 2768781 1975417 1586012 258526 -742028 -732388 -499409 -118807 320476 -2569
21873 -2569 -1305447 -1363771 362478 348053 575997 874273 -683685 -1771231 -2971657
21864 -2971657 -3551478 -2799501 -1564103 -1859452 -1858380 -1133466 -1924747 -2062941 -1463287 -578206
21854 -578206 -241436 158863 146555 -43902 532045 42577 -1527019 -2965956 -2939191 -1762349
21844 -1762349 -509864 1152143 3640805 2941360 1051398 28877 -1004989 -2132729
$$ packed form
21910b14311L3610O67640J632921m19086n56326M2467M28323j65967l14020k79831
21900H55420n89425J141802R19917j97438k80781k45025n05906j00612J00304
21891A098256m45617n19887o01078j182933p72203J289152J684899J726317M91875
21882B768781p93364l89405j327486j000554R640K32979L80602M39283l23045
21873b569j302878n8324J726249j4425K27944K98276j557958j087546j200426
21864b971657n79821P51977J235398k95349J072P24914p91281j38194N99654Q85081
21854e78206L36770M00299j2308j90457N75947m89468j569596j438937K6765J176842
21844a762349J252485J662007K488662o99445j889962j022521j033866j127740
$$ plain form
21836 -2132729 -2955248 -3326196 -4635655 -6738724 -6745339 -4223475 -3145900 -2747750 -1664911
21827 -1664911 448425 1410385 473826 -275569 115621 1342189 1833404 776601 4328
21818 4328 1189663 2861457 4498362 4209069 2326674 1596532 961345 -335307 144142
21809 144142 32360 -750186 -1087352 37128 495658 369838 1052455 2221419 2339562
21800 2339562 2390412 2602820 1704931 -368634 -1360839 -1008894 33841 30958 333166 793785
21790 793785 2263322 3848028 4560618 5964042 7348091 6404998 5159356 4669063 4416210
21781 4416210 3077456 597361 245807 200235 -961357 -2240747 -2067250 -841324 26199
21772 26199 417510 654688 1128891 1080223 -956519 -704241 1462475 2582935 2004357
$$ packed form
21836b132729q22519l70948j309459k103069o615K521864J077575L98150J082839
21827a664911K113336R61960r36559p49395L91190J226568M91215j056803p72273
21818D328J185335J671794J636905k89293j882395p30142o35187j296652M79449
21809A44142j11782p82546l37166J124480M58530j25820O82617J168964J18143
21800B339562N0850K12408q97889k073565r92205L51945J042735k883L02208M60619
21790G93785J469537J584706P12590J403424J384049r43093j245642m90293k52853
21781D416210j338754k480095l51554m5572j161592j279390J73497J225926Q67523
21772B6199L91311K37178M74203m8668k036742K52278K166716J120460n78578
$$ plain form
21763 2004357 140815 -397265 -39380 377827 -153923 -2059769 -4326337 -5351516 -4808232
21754 -4808232 -3753061 -2662827 -1681504 49216 1605385 829390 -644281 -1489263 -3757416
21745 -3757416 -4267865 -4027463 -3483889 -3151116 -4295639 -5056397 -3671409 -871052 1143713
21736 1143713 2605087 3639910 3440512 2578270 1114915 812144 1000507 -650593 -2282450
21727 -2282450 -2930030 -3496162 -2531625 -399444 -247091 -698059 -255013 -749001 -1897421
21718 -1897421 -1769303 -1109822 -776555 447838 496503 -110190 -1059360 -2129162 -1248544
21709 -1248544 463739 1556869 1599835 833792 1308917 2697536 4152398 3993289 1733047
21700 1733047 -1041571 -2342619 -1628065 -1216740 -899243 50643 910236 627980 1059386
$$ packed form
21763B004357j863542n38080L57885M17207n31750j905846k266568j025179N43284
21754d808232J055171J090234R81323J730720J556169p75995j473671q44982k268153
21745c757416n10449K40402N43574L32773j144523p60758J384988K800357K014765
21736A143713J461374J034823j99398q62242j463355l02771J88363j651100j631857
21727b282450o47580n66132R64537K132181J52353m50968M43046m93988j148420
21718a897421J28118O59481L33267J224393M8665o06693r49170j069802Q80618
21709a248544J712283J093130M2966p66043M75125J388619J454862j59109k260242
21700A733047k774618j301048P14554M11325L17497R49886Q59593k82256M31406
$$ plain form
21691 1059386 2963569 3719383 1007713 -531641 -874214 653525 3093783 2623361 -238907
21682 -238907 -1902911 -1476255 -1837634 -2392706 -2492633 -1752231 -1156107 -565830 -431860 -398122
21672 -398122 -116842 -91772 1246793 1970328 1655459 1545386 486913 229584 692879
21663 692879 1433286 1060232 1260716 2022106 2377673 1782822 1049725 606082 661229 2014050
21653 2014050 2681608 2662642 2534790 1522151 273765 -853350 -355688 960858 2448483
21644 2448483 3141137 2268215 459268 883659 2397579 4071276 5104599 4475030 3490587
21635 3490587 2108487 1655882 1863378 740976 -890595 -476803 641980 786494 60576
21626 60576 -751851 -532519 146884 558561 1522506 2966707 5136674 6820708 7092502
$$ packed form
21691A059386J904183P55814k711670j539354l42573J527739K440258m70422k862268
21682b38907j664004M26656l61379n55072r9927P40402N96124N90277J33970L3738
21672c98122K81280K5070J338565P23535l14869j10073j058473k57329M63295
21663F92879P40407l73054K00484P61390L55567n94851p33097m43643N5147J352821
21653B014050O67558j8966j27852j012639j248386j127115M97662J316546J487625
21644B448483O92654q72922j808947M24391J513920J673697J033323o29569r84443
21635C490587j382100m52605K07496j122402j631571M13792J118783J44514p25918
21626F0576q12427K19332O79403M11677R63945J444201K169967J684034K71794
$$ plain form
21617 7092502 5318994 3636916 2177528 384553 -956734 52755 1084808 2363912
21609 2363912 4463337 4300016 4130414 4448673 3468735 2057296 1919590 1719650 1377225
21600 1377225 467513 -189964 -892767 -3217830 -3118873 -1188494 -219839 911164 331002
21591 331002 -727191 -1994231 -3393929 -2838120 -2543282 -2808539 -1240083 -499208 -1510281
21582 -1510281 -1616883 -554661 208858 1050742 3351006 3356188 1471467 1581331 1176380
21573 1176380 -107832 -688323 448994 3267186 4866411 3859625 2030718 501877
21565 501877 620010 1517423 1337326 443941 -672554 -1835657 -1751670 -639043 646028
21556 646028 2322357 2831422 2014510 1030564 -39347 412860 1533935 1168711 -418028
$$ packed form
21617G092502j773508j682078j459388j792975j341287J009489J032053J279104
21609B363912K099425j63321j69602L18259r79938j411439j37706j99940l42425
21600A377225r09712o57477p02803k325063R8957J930379R68655J131003n80162
21591C31002j058193j267040j399698N55809K94838k65257J568456P40875j011073
21582a510281j06602J062222P63519Q41884K300264N182j884721J09864m04951
21573A176380j284212n80491J137317K818192J599225j006786j828907j528841
21565E01877J18133Q97413j80097q93385j116495j163103Q3987J112627J285071
21556F46028J676329N09065q16912r83946j069911M52207J121075l65224j586739
$$ plain form
21547 -418028 -1450775 -2297545 -2725681 -1727468 -1165308 -603942 1191984 3632911 4902976
21538 4902976 4612851 2798120 819736 769889 2030628 1595527 -108294 -2036190 -3815723
21529 -3815723 -4345401 -3818208 -3274596 -2503223 -1911121 -2311066 -3385033 -3798302 -3506181
21520 -3506181 -3002401 -1976299 -1425770 -2045184 -2809780 -2316070 -640689 1838500 3055093
21511 3055093 2048505 1542783 3270299 3163618 2036402 2043257 1621743 307477 -602897
21502 -602897 -1495613 -1984518 -2051325 -3094551 -4144266 -2801708 -1205745 -925235 -1745848
21493 -1745848 -3031599 -3359324 -2636162 -1699454 -389952 1186845 1228876 1259397 1667794
21484 1667794 1922631 965592 602132 504378 100256 -229374 -986568 -3593965 -4812973
$$ packed form
21547d18028j032747q46770m28136R98213N62160N61366J795926K440927J270065
21538D902976k90125j814731j978384m9847J260739m35101j703821j927896j779533
21529c815723n29678N27193N43612P71373N92102l99945j073967m13269K92121
21520c506181N03780J026102N50529o19414p64596M93710J675381K479189J216593
21511C055093j006588n05722J727516j06681j127216O855m21514j314266r10374
21502f02897q92716m88905o6807j043226j049715J342558J595963K80510q20613
21493a745848j285751l27725P23162R36708J309502J576797M2031L0521M08397
21484A667794K54837r57039l63460r7754m04122l29630p57194k607397j219008
$$ plain form
21475 -4812973 -4095501 -2251977 -1542610 -1900662 -2176858 -2602802 -4018631 -4936820 -5685117
21466 -5685117 -4609948 -2099030 -362862 681419 940185 1228253 1699824 968602 468808
21457 468808 1549402 1950356 1507641 1876068 2756659 2135675 932712 462969 863116
21448 863116 1655182 2481203 2356551 1860339 -99887 -1814958 -2134822 -2409623 -3054094
21439 -3054094 -2712107 -2589111 -3964553 -5845032 -5957405 -6688631 -6930486 -6389872 -5254173
21430 -5254173 -2576319 851291 4175258 4779470 4066139 3991077 5369429 4998426 3037682
21421 3037682 2026162 904477 525607 -203751 -597458 646117 1690473 1874558 2007230
21412 2007230 1411055 177866 -1784243 -3852510 -4897356 -3256789 -998907 81836
$$ packed form
21475d812973P17472J843524P09367l58052k76196m25944j415829r18189p48297
21466e685117J075169K510918J736168J044281K58766K88068M71571p31222m99794
21457D68808J080594M00954m42715L68427Q80591o20984j202963m69743M00147
21448H63116P92066Q26021j24652m96212j960226j715071l19864k74801o44471
21439c054094L41987J22996j375442j880479j12373p31226k41855N40614J135699
21430e254173K677854L427610L323967O04212p13331p5062J378352l71003j960744
21421C037682j011520j121685l78870p29358l93707J243575J044356J84085J32672
21412B007230n96175j233189j962109k068267j044846J640567K257882J080743
$$ plain form
21404 81836 2109493 3855837 4450543 3201979 1548893 274950 -354890 -1497073 -3323746
21395 -3323746 -4147825 -3458315 -1203609 830752 78223 -647259 92730 642772 1597400
21386 1597400 3764896 5046504 4614693 3708630 2838653 1779586 694307 610969 -615526
21377 -615526 -2673436 -3914299 -5172906 -4331344 -2596565 -154009 1618039 1355370 968780
21368 968780 384867 -1056271 -1052526 -610033 -704900 -1721885 -2319199 -737562 1017991
21359 1017991 2320340 3192480 2498995 2275121 2505115 2056115 1659758 2479826 2221366
21350 2221366 1025807 -533486 -2496854 -3616371 -2794967 -592522 1247730 873287
21342 873287 -1628931 -2244656 -1566513 -1932610 -2030535 -2189707 -1710378 -1367372 -2234193 -908552
$$ packed form
21404H1836K027657J746344N94706j248564j653086j273943o29840j142183j826673
21395c323746q24079O89510K254706K034361p52529p25482P39989N50042R54628
21386A597400K167496J281608m31811r06063q69977j059067j085279q3338j226495
21377f15526k057910j240863j258607Q41562J734779K442556J772048k62669l86590
21368I68780n83913j441138L745M42493r4867j016985n97314J581637J755553
21359A017991J302349Q72140o93485k23874K29994m49000l96357Q20068k58460
21350B221366j195559j559293j963368j119517Q21404K202445J840252l74443
21342H73287k502218o15725O78143l66097r7925j59172M79329L43006q66821J325641
$$ plain form
21332 -908552 312848 998986 1621898 1769618 696402 -314121 -610382 -2037371 -4200921
21323 -4200921 -5476744 -4410718 -4553417 -4644264 -3979436 -3284456 -1528463 389263 2707356
21314 2707356 2013732 -189045 -444740 775884 1351801 1630702 1988150 2391764 2627396
21305 2627396 2289248 1406501 -196195 -1238567 -2300277 -3199010 -3508291 -4160507 -4391238
21296 -4391238 -4662672 -3913080 -2152025 290239 633941 53476 -554777 -1083060 -1626498
21287 -1626498 -2045302 -2128662 -1115879 -472443 435631 1835185 1858698 -249890 -1853284
21278 -1853284 -1642610 -251966 1994826 2204702 1487102 879020 -508544 -3085847 -3632814
21269 -3632814 -2289953 -1670485 -2013319 -2490810 -3151244 -2609783 -1785515 -572727 64686
$$ packed form
21332i08552J221400O86138O22912J47720j073216j010523k96261j426989k163550
21323d200921j275823J066026j42699r0847O64828O94980J755993J917726K318093
21314B707356o93624k202777k55695J220624N75917K78901L57448M03614K35632
21305B627396l38148q82747j602696j042372j061710q98733l09281o52216k30731
21296d391238k71434P49592J761055K442264L43702n80465o08253n28283n43438
21287a626498m18804q3360J012783O43436R08074J399554K3513k108588j603394
21278a853284K10674J390644K246792K09876p17600o08082j387564k577303n46967
21269c632814J342861O19468l42834m77491o60434N41461Q24268J212788O37413
$$ plain form
21260 64686 198079 763886 879021 1292466 816105 450092 1799306 3214792 3350740
21251 3350740 2113233 1315579 1158236 1242581 2322621 1956647 783625 1292747 2074841
21242 2074841 2462923 3124804 2103277 138870 -733826 34327 575352 779158 2303387
21233 2303387 1508916 -559820 -2204749 -3056974 -1910197 -18383 308455 -957135 -1385291
21224 -1385291 -794027 -277039 -212984 -431793 -270508 298857 -48978 -1282885 -1653302
21215 -1653302 -1429129 -1270465 -2369905 -3162781 -623253 1489973 572430 13093 -35377
21206 -35377 -712961 -1493909 -1791878 -211895 1145782 1519693 2445973 3077045 2951576
21197 2951576 2100902 982835 615116 1990151 4380138 4700599 2593210 145764 -994703
$$ packed form
21260F4686J33393N65807J15135M13445m76361l66013J349214J415486J35948
21251C350740j237507p97654j57343Q4345J080040l65974j173022N09122P82094
21242B074841L88082O61881j021527j964407q72696P68153N41025K03806J524229
21233B303387p94471k068736j644929q52225J146777J891814L26838j265590m28156
21224a385291N91264N16988O4055k18809J61285N69365l47835j233907l70417
21215a653302K24173J58664j099440p92876K539528K113226r17543n59337m8470
21206c5377o77584p80948k97969J579983J357677L73911R26280O31072j25469
21197B951576q50674j118067l67719J375035K389987L20461k107389k447446j140467
$$ plain form
21188 -994703 -678753 212412 1465232 3076803 4010866 3486590 2436054 3294107 3955293
21179 3955293 1236992 -875405 -1596431 -1554247 -954002 -699064 -630574 181761 816791
21170 816791 570627 1347412 2462127 2870000 2501706 1823472 1372555 1426475 24036
21161 24036 -839170 -849499 -1297448 -1454822 -592153 -82235 901595 810075 1351480 1306754
21151 1306754 -516801 -2074443 -3219181 -2746546 -1809320 -2472064 -3237373 -3091905 -2703241
21142 -2703241 -2401563 -1394969 -227754 -1560250 -2895661 -2507855 -3278399 -5363183 -6292401
21133 -6292401 -5576015 -3823866 -1669358 -1551870 -1589819 303516 1214576 1151630 64753
21124 64753 -852243 -903777 -33665 952361 2596540 3792624 3560774 2311011 1251973
$$ packed form
21188i94703L15950Q91165J252820J611571R34063n24276j050536Q58053O61186
21179C955293k718301k112397p21026M2184O00245K54938O8490Q12335O35030
21170H16791k46164P76785J114715M07873l68294o78234m50917N3920j402439
21161B4036q63206j0329m47949j57374Q62669N09918R83830r1520N41405m4726
21151A306754j823555j557642j144738M72635R37226o62744p65309J45468L88664
21142b703241L01678J006594J167215j332496j335411L87806p70544k084784r29218
21133f292401P16386J752149K154508J17488l7949J893335R11060o2946j086877
21124F4753r16996n1534Q70112R86026J644179J196084k31850j249763j059038
$$ plain form
21115 1251973 995402 1031351 1447915 1700766 1250523 667274 271422 -222844 -2145304
21106 -2145304 -3915107 -4358998 -4853239 -4215870 -1056421 676629 -1097886 -2733345 -3003180
21097 -3003180 -2075715 -1030179 -1030297 -2167406 -1957778 -2617369 -3485068 -3482120 -2878002 -1999436
21087 -1999436 -1510755 -927625 -1154830 -1598779 -2275983 -1038298 -246128 -469556 -410846
21078 -410846 673605 2237876 2543317 1577606 641576 -627893 -615462 -54288 -689592
21069 -689592 17871 831385 1096265 1194535 1219686 3059036 5341106 5923576 3752968
21060 3752968 1293284 320413 -142707 86255 1364970 706617 -98219 1186986 630606
21051 630606 1698344 3819567 3756404 1879406 98476 1019158 2354037 1701118 1941816
$$ packed form
21115A251973k56571L5949M16564K52851m50243n83249l95852m94266j922460
21106b145304j769803m43891m94241O37369L159449J733050j774515j635459k69835
21097c003180R27465J045536j18j137109K09628o59591q67699K948O04118Q78566
21087a999436M88681N83130k27205m43949o77204J237685P92170k23428N8710
21078d10846J084451J564271L05441r65711r36030j269469J2431N61174o35304
21069f89592P07463Q13514K64880R8270K5151J839350K282070N82470k170608
21060C752968k459684r72871m63120K28962J278715o58353q04836J285205n56380
21051F30606J067738K121223o3163j876998j780930R20682J334879o52919K40698
$$ plain form
21042 1941816 2750320 3245962 3513832 3630694 2095457 345297 -1427597 -2271143 -1016893
21033 -1016893 -86124 196681 1036574 2627292 1777720 488468 85543 102319 417721
21024 417721 -410638 -1651292 -2366550 -1976157 17964 1016693 906219 1164172 801328
21015 801328 720646 2189820 3067870 1977518 1067228 1473105 1097360 200698 -382748
21006 -382748 -2748493 -4783121 -3919947 -3902164 -4363981 -3576120 -2428386 -1322653 -807339
20997 -807339 -194115 486689 360964 -517290 -2267053 -2718678 -2255287 -1632690 -235026
20988 -235026 -249765 -504332 -916748 -1088447 172219 442087 -4465 648427 455347 -1198282
20978 -1198282 -2696886 -2870228 -2274669 -2180061 -2805183 -2874525 -1695375 -315907 -1571076
$$ packed form
21042A941816Q08504M95642K67870J16862j535237j750160j772894q43546J254250
21033a016893R30769K82805Q39893J590718q49572j289252m02925J6776L15402
21024D17721q28359j240654p15258L90393J994121R98729j10474K57953l62844
21015H01328q0682J469174Q78050j090352r10290M05877l75745q96662n83446
21006c82748k365745k034628Q63174J7783m61817P87861J147734J105733N15314
20997h07339O13224O80804j25725q78254j749763m51625M63391O22597J397664
20988b35026j4739k54567m12416j71699J260666K69868m46552O52892j93080j653629
20978a198282j498604j73342N95559R4608o25122o9342J179150J379468j255169
$$ plain form
20969 -1571076 -3264724 -2644455 -1071160 539529 -541590 -2692214 -3140962 -2945767 -2031544
20960 -2031544 -1011047 -1364598 -1620488 -812861 588474 1673596 2156312 2525246 1868091
20951 1868091 -423894 -1881943 -2136127 -682487 325025 286542 526139 387951 -143387
20942 -143387 -872962 -1394490 -867745 664908 1387459 591565 397111 1244255 880878
20933 880878 -1281191 -3381002 -3474207 -2674474 -2689544 -2275541 -626550 43892 221359
20924 221359 251960 602440 1860419 2718835 2866075 2392728 2037238 1356472 830344 207639
20914 207639 -1132610 -1386920 -9737 2358131 3006379 2416339 686957 -1342203 -1431516
20905 -1431516 809052 2336127 2887101 2621285 2411718 2911330 2748933 2839553 2615306
$$ packed form
20969a571076j693648O20269J573295J610689j081119k150624m48748J95195R14223
20960b031544J020497l53551k55890Q07627J401335J085122M82716L68934o57155
20951A868091k291985j458049k54184J453640J007512l8483K39597j38188n31338
20942a43387p29575n21528N26745J532653P22551p95894j94454Q47144l63377
20933H80878k162069k099811r3205P99733j5070M14003J648991O70442J77467
20924B21359L0601L50480J257979Q58416J47240m73347l55490o80766n26128o22705
20914B07639j340249k54310J377183K367868O48248n90040j729382k029160q9313
20905a431516K240568J527075N50974k65816k09567M99612j62397R0620k24247
$$ plain form
20896 2615306 3602189 4625480 4845363 3999246 2562839 2460038 3384490 4018080 4345630
20887 4345630 5709362 7161550 8021947 7509828 6978936 5547260 4097183 3620485 3619518
20878 3619518 3177804 2448667 2026011 1697403 1881908 1981058 2060763 1607252 806739 903850
20868 903850 2894551 4232388 4626400 3581137 2597868 262744 -1673191 -1214123 528245
20859 528245 1134727 584692 763802 2381356 3943233 4399643 4045413 4506835 4751915
20850 4751915 3588637 2731415 1731960 1845359 3337916 3416299 1535511 1138679 974776
20841 974776 1572592 3046825 4179292 4329435 5289995 5972056 5607918 6425184 6591996
20832 6591996 7617156 9389417 10167558 9437349 9356535 10692633 12549553 14435950 17043502
$$ packed form
20896B615306R86883J023291K19883q46117j436407j02801R24452O33590L27550
20887D345630J363732J452188Q60397n12119n30892j431676j450077m76698r67
20878C619518m41714p29137m22656l28608J84505R9150P9705m53511q00513R7111
20868I03850J990701J337837L94012j045263r83269k335124j935935M59068J742368
20859E28245O06482n50035J79110J617554J561877M56410l54230M61422K45080
20850D751915j163278q57222r99455J13399J492557P8383j880788l96832j63903
20841I74776N97816J474233J132467J50143R60560O82061l64138Q17266J66812
20832F591996J025160J772261P78141p30209q0814J336098J856920J886397K607552
$$ plain form
20823 17043502 21348132 28105693 36985119 49625465 69373527 95719701 123590384
20816 123590384 129964763 106315976 75876682 53266702 38339974 28683302 21912222
20809 21912222 16099742 12954972 11230884 9408033 7958190 7240712 5929574 5143560
20801 5143560 4743155 4729378 4160728 3108445 2937372 2955950 1528040 506506 -1199346
20792 -1199346 -3222754 -1292657 560484 1813577 4892881 7100414 6453354 5696959
20784 5696959 4612106 3230010 4335016 3747224 3000816 4279864 4701354 3203948 2200099
20775 2200099 2951338 2259055 946165 524704 1309889 2585125 3351771 3973449 1954128
20766 1954128 -1360329 -2161123 -1408293 -489083 1042 515441 1796614 2694354 2550927
$$ packed form
20823A7043502M304630O757561Q879426J2640346J9748062K6346174K7870683
20816A23590384O374379k3648787l0439294k2609980j4926728r656672o771080
20809B1912222n812480l144770j724088j822851j449843p17478j311138p86014
20801E143560m00405j3777n68650j052283j71073J8578j427910j021534j705852
20792a199346k023408J930097J853141J253093L079304K207533o47060p56395
20784E696959j084853j382096J105006n87792p46408J279048M21490j497406j003849
20775B200099P51239o92283j312890m21461P85185J275236P66646O21678k019321
20766A954128l314457q00794P52830R19210M90125N14399J281173Q97740j43427
$$ plain form
20757 2550927 2007022 616465 -2166809 -3614885 -2832402 -1995796 -2327680 -2862012 -2840365
20748 -2840365 -2467389 -1815235 -1993748 -1081824 -1212108 -378056 1401125 2870231 2995993
20739 2995993 2997113 1910996 -162860 -1502001 -1844885 -2333156 -1481081 140887 -51494
20730 -51494 -938815 -330342 1078089 3554994 3519971 1787733 1684409 1568727 116360
20721 116360 -2075366 -3211363 -1656337 183038 -488709 -676876 665950 -64738 -202344
20712 -202344 1096097 1356999 1705084 1515874 -450066 -1431085 -1254569 -984068 -732398
20703 -732398 -1861256 -4511261 -5594043 -4587566 -2938609 -2597134 -3351601 -2896499 -2139082
20694 -2139082 -1201775 -1645304 -2790490 -3801373 -2934391 -1781702 -1325679 -1372382 283671
$$ packed form
20757B550927n43905j390557k783274j448076P82483Q36606l31884n34332K1647
20748b840365L72976O52154j78513R11924j30284Q34052J779181J469106J25762
20739B995993J120j086117k073856j339141l42884m88271Q52075J621968j92381
20730e1494q87321O08473J408431K476905l5023j732238j03324j15682j452367
20721A16360k191726j135997J555026J839375o71747j88167J342826p30688j37606
20712b02344J298441K60902L48085j89210j965940r81019J76516K70501K51670
20703g32398j128858k650005j082782J006477J648957L41475p54467M55102P57417
20694b139082R37307m43529j145186j010883Q66982J152689M56023m6703J656053
$$ plain form
20685 283671 1027980 -519763 -2405460 -3535902 -3177443 -2190328 -2051151 -1842489 -1420620
20676 -1420620 -361653 53831 619453 1734407 2021440 3771278 5145624 5590510 5923217
20667 5923217 6330857 6650534 5315224 3542585 3603014 4630692 5171742 4574865 3145054
20658 3145054 1785094 1709748 1364849 -638486 -1184310 -28550 432006 -666333 -1802691
20649 -1802691 -596047 81586 914522 826867 -382729 -1508141 -2164236 -3364030 -4088093
20640 -4088093 -3794222 -2204216 -2351102 -2642816 -1966716 -1481748 -186331 1613811 1978813
20631 1978813 -37616 -1257750 -736750 600763 1859750 3072435 2071273 -307028
20623 -307028 -1078901 -844968 991255 1995824 163506 -2314016 -2140946 -944590 -313627
$$ packed form
20685B83671P44309j547743j885697j130442L58459R87115J39177K08662M21869
20676a420620J058967M15484N65622J114954K87033J749838J374346M44886L32707
20667E923217M07640L19677j335310j772639O0429J027678N41050n96877j429811
20658C145054j359960p5346l44899k003335n45824J155760M60556j098339j136358
20649a802691J206644O77633Q32936q7655j209596j125412o56095j199794p24063
20640d088093K93871J590006j46886k91714O76100M84968J295417J800142L65002
20631A978813k016429j220134N21000J337513J258987J212685j001162k378301
20623c07028p71873K33933J836223J004569j832318k477522J73070J196356O30963
$$ plain form
20614 -313627 723439 1742658 2204759 1870657 252443 -153195 722831 721767 147855
20605 147855 -177735 -669148 -1193608 -1010826 -612998 1120961 1254509 292162 -525410
20596 -525410 -1496466 -1196212 -321952 649052 2260500 3343614 4612210 4729752 3431398
20587 3431398 3448037 3033386 2274611 1903195 69790 -208880 -1291485 -3206293 -3055076
20578 -3055076 -2403210 -2862431 -2783804 -475585 2218306 1848523 410915 -929292 -1284524
20569 -1284524 -421311 -122712 -716636 -1687195 -1684729 -1495918 -2017614 -1958307 92345 1604066
20559 1604066 801111 -560188 -827110 -760572 -275892 -1094830 -2321151 -1618681 -394617
20550 -394617 902292 1551587 334419 915827 1398777 61843 1015529 2649876 2015431
$$ packed form
20614c13627J037066J019219M62101l34102j618214m05638Q76026j064n73912
20605A47855l25590m91413n24460J82782L97828J733959J33548r62347q17572
20596e25410r71056L00254Q74260R71004J611448J083114J268596J17542j298354
20587C431398J6639m14651p58775l71416j833405k78670j082605j914808J51217
20578c055076O51866m59221P8627K308219K693891l69783j437608j340207l55232
20569a284524Q63213K98599n93924r70559K466J88811n21696N9307K050652J511721
20559A604066q02955j361299k66922O6538M84680q18938j226321P02470J224064
20550c94617J296909O49295j217168N81408M82950j336934R53686J634347o34445
$$ plain form
20541 2015431 473739 -1052631 -1724300 -736445 -218598 706906 1320011 1265678 -70178
20532 -70178 -1786194 -1663614 -538328 -389744 -763261 -1544080 -2296519 -1676555 486451
20523 486451 2011212 2577847 2007968 1346194 996545 980252 -859089 -2124723 -1660382
20514 -1660382 -864881 -231739 -405084 247806 212248 -571272 -32520 717427 -398664
20505 -398664 -1618198 -2183337 -2788271 -2695903 -1540994 -1197595 -2512670 -3209554 -3224596
20496 -3224596 -3625730 -4092105 -2249916 102470 -1063 -1845107 -2756681 -2604643 -1063848
20487 -1063848 731691 2529948 3439960 1705056 -1486754 -3134509 -2851648 -1189592
20479 -1189592 490449 1651303 1684702 1027461 596410 925265 2372827 3044300 2752012
$$ packed form
20541B015431j541692j526370o71669R87855N17847R25504O13105n4333j335856
20532g0178j716016J22580J125286J48584l73517p80819p52439O19964K163006
20523D86451J524761N66635n69879o61774l49649j6293j839341j265634M64341
20514a660382P95501O33142j73345O52890l5558p83520N38752P49947j116091
20505c98664j219534n65139o04934R2368J154909L43399j315075o96884j5042
20496c224596m01134m66375J842189K352386j03533j844044r11574J52038J540795
20487a063848J795539J798257R10012j734904l191810j647755K82861J662056
20479a189592J680041J160854L3399o57241m31051L28855J447562O71473k92288
$$ plain form
20470 2752012 2068804 2376882 2508438 2164689 1239130 414729 1074819 2031027 1731362
20461 1731362 1303574 1456307 894983 433904 41093 1090570 2660760 2050554 1806753
20452 1806753 2064538 1627463 1317141 470399 336419 951669 2241602 3063538 3461760
20443 3461760 3415730 3742612 3509063 2429445 1830931 1322098 1083768 1148019 45932
20434 45932 -2483848 -2263081 -668017 -83562 719907 134863 -971098 -735767 -834678
20425 -834678 -367294 -773165 -161168 1765059 1482999 369643 670752 352792 -1426040
20416 -1426040 -3113119 -3436481 -3501056 -2217133 550708 2595253 2880690 1787398 308753
20407 308753 411788 541492 685258 1078261 1487334 2945079 4946119 6342096 6439276
$$ packed form
20470B752012o83208L08078J31556l43749r25559q24401O60090R56208k99665
20461A731362m27788J52733n61324m61079l92811J049477J570190o10206k43801
20452A806753K57785m37075l10322q46742j33980O15250J289933Q21936L98222
20443C461760m6030L26882k33549j079618n98514n08833k38330O4251j102087
20434D5932k529780K20767J595064N84455Q03469n85044j105961K35331r8911
20425h34678M67384m05871O11997J926227k82060j113356L01109l17960j778832
20416a426040j687079l23362o4575J283923K767841K044545K85437j093292j478645
20407C08753J03035J29704J43766L93003M09073J457745K001040J395977R7180
$$ plain form
20398 6439276 6939870 6398101 4729903 3144573 1175420 120578 -1126984 -3268906
20390 -3268906 -3345277 -1368163 -1719499 -2872558 -3636138 -3194211 -1561304 -703298 -875899
20381 -875899 277826 1481331 1238738 1838539 -91463 -2906658 -3477285 -2256264 -870647
20372 -870647 1141309 3324536 3730607 4494139 5461793 3891242 2065423 1448173 224303
20363 224303 368690 2187461 4159917 5061136 4385850 3186962 3289930 4926418 4810695
20354 4810695 3942057 4572853 5558425 3870500 2542455 2897101 3263262 3899122 4452542
20345 4452542 3952337 3547753 2191906 1018580 929196 521996 578796 1116148 1443516
20336 1443516 2328868 1030021 -317801 112191 -922373 -1149338 451846 1937894 1406047
$$ packed form
20398F439276N00594n41769j668198j585330j969153j054842j247562k141922
20390c268906p6371J977114l51336j153059p63580M41927J632907Q58006j72601
20381h75899J153725J203505k42593N99801j930002k815195n70627J221021J385617
20372h70647K011956K183227M06071P63532R67654j570551j825819o17250j223870
20363B24303J44387J818771J972456R01219o75286j198888J02968J636488j15723
20354D810695q68638O30796R85572j687925j328045L54646L66161O35860N53420
20345D452542n00205m04584j355847j173326q9384m07200N6800N37352L27368
20336A443516Q85352j298847j347822M29992j034564k26965J601184J486048n31847
$$ plain form
20327 1406047 724130 277829 109878 211101 -328372 -1816510 -2902572 -2606315 -2533440
20318 -2533440 -3048657 -2949252 -799181 1134751 1704452 1343950 1239103 2064745 2066092 1415690
20308 1415690 2840678 3876818 2545293 1189289 437477 233697 535626 1097418 -681385
20299 -681385 -3061009 -2770434 -2435679 -3263950 -3163611 -2066921 -1055910 -1380134 -114042
20290 -114042 -44931 -1386677 -2110817 -1807534 -562859 406999 -99520 34875 1060171
20281 1060171 1107271 320503 274707 818618 268872 968464 2899248 3342470 2434608 1798186
20271 1798186 2323881 2476139 1728672 -470729 -162634 2462414 2905274 347301 -65674
20262 -65674 -503673 -1339925 -961701 908438 1425611 1101916 910133 392372 799975 1557459
$$ packed form
20327A406047o81917m46301j67951J01223n39473j488138j086062K96257P2875
20318b533440n15217R9405K150071J933932N69701l60502j04847Q25642J347o50402
20308A415690J424988J036140j331525j356004p51812k03780L01929N61792j778803
20299f81385k379624K90575L34755q28271J00339J096690J011011l24224J266092
20290a14042O9111j341746p24140L03283J244675R69858n06519J34395J025296
20281A060171M7100p86768m5796N43911n49746O99592J930784M43222r07862o36422
20271A798186N25695J52258p47467k199401L08095K625048M42860k557973m12975
20262f5674m37999q36252L78224J870139N17173l23695j91783n17761M07603P57484
$$ plain form
20252 1557459 2236128 3847234 4042134 2184073 746104 827039 993286 1746084 2667781
20243 2667781 3623472 5061342 4070280 2613585 2312111 2291082 1153959 668939 506524
20234 506524 466957 2115709 4795291 5277482 4200984 2252803 1082210 712259 410335
20225 410335 418580 965951 1024578 448957 -178091 -1191752 -1235198 614362 1868093 1578531
20215 1578531 -203584 -910366 1059874 3427851 4424413 4182564 4372733 4376532 4338807
20206 4338807 3021047 1718195 766394 140372 -32263 1543375 2740166 1862254 -192166
20197 -192166 -2711805 -2348496 -166792 64883 -693815 -1141343 -1348502 724629 4470022
20188 4470022 6755785 6933612 6995817 5656957 3993379 2780829 1434567 2397327 2683576
$$ packed form
20252A557459O78669J611106J94900j858061j437969Q0935J66247P52798R21697
20243B667781R55691J437870r91062j456695l01474k1029j137123m85020j62415
20234E06524l9567J648752K679582M82191j076498j948181j170593l69951l01924
20225D10335Q245N47371N8627n75621o27048j013661m3446J849560J253731k89562
20215A578531j782115p06782J970240K367977R96562k41849J90169L799l7725
20206D338807j317760j302852r51801o26022j72635J575638J196791q77912k054420
20197a92166k519639L63309K181704K31675p58698m47528k07159K073131L745393
20188D470022K285763J77827O2205j338860j663578j212550j346262R62760K86249
$$ plain form
20179 2683576 3790812 5114739 4745160 3658371 2739201 2900938 3509941 4051433 2315348
20170 2315348 1356531 1360930 791644 584929 253754 220702 666375 864479 2281952 3143475
20160 3143475 3163471 2099512 168512 219099 1295019 2340549 1680271 548571 1839873
20151 1839873 1799262 -151918 -60379 1580542 816726 -430353 -707687 -311060 1305994
20142 1305994 3772622 5938251 6320911 4965433 2402634 2315951 3734246 2377276 1573610
20133 1573610 2433051 2875941 2607994 3925266 4613798 3480309 3463633 4870514 5931607
20124 5931607 8329191 8890598 8889159 10537922 9752356 7275476 4685941 3554439 1978201
20115 1978201 470239 843642 2545015 3770133 3951100 2721189 2555296 2850602 2919243
$$ packed form
20179B683576J107236J323927l69579j086789r19170J61737O09003N41492j736085
20170B315348r58817M399n69286k06715l31175l3052M45673J98104J417473Q61523
20160C143475J9996j063959j931000N0587J075920J045530o60278j131700J291302
20151A839873m0611j951180R1539J640921p63816j247079k77334L96627J617054
20142A305994K466628K165629L82660j355478k562799q6683J418295j356970q03666
20133A573610Q59441M42890k67947J317272O88532j133489j6676J406881J061093
20124E931607K397584N61407j439J648763p85566k476880k589535j131502j576238
20115A978201j507962L73403J701373J225118J80967j229911j65893K95306O8641
$$ plain form
20106 2919243 2723415 2462463 1369715 1804616 2443058 2180926 2702296 2448935 2531357
20097 2531357 5055220 7932806 8267635 7474180 7505258 7805082 6429027 5282973 5018058
20088 5018058 5471251 5236831 5464718 8152370 10026234 12132367 15158911 15547007 15855871
20079 15855871 17346884 18765294 20492848 21984783 24879539 31427844 39172307 47698441
20071 47698441 57698696 72135847 95785076 131321634 181762716 245168265 295645540
20064 295645540 279558892 211865559 150447014 108908420 81926726 63964456 51021475
20057 51021475 41047803 35515596 31662100 28859675 26833533 25415082 24986515 26713451
20049 26713451 29683374 32015931 32009146 33190827 34175010 36215440 38435338 39867640 41521069
$$ packed form
20106B919243j95828k60952j092748M34901O38442k62132N21370k53361Q2422
20097B531357K523863K877586L34829p93455L1078K99824j376055j146054k64915
20088E018058M53193k34420K27887K687652J873864K106133L026544L88096L08864
20079A5855871J491013J418410J727554J491935K894756O548305P744463Q526134
20071D7698441J0000255J4437151K3649229L5536558N0441082O3405549N0477275
20064B95645540j6086648o7693333o1418545m1538594k6981694j7962270j2942981
20057E1021475r973672n532207l853496k802425k026142j418451m28567J726936
20049B6713451K969923K332557o785J181681R84183K040430K219898J432302J653429
$$ plain form
20040 41521069 45317720 51894918 60773531 73592610 92729473 121030876 163038393
20033 163038393 227451033 329030520 467801156 576798117 524191703 371381907
20027 371381907 250652304 173746917 126502963 95812911 73857815 57349946 46621147
20020 46621147 38114709 31344225 26714432 23200528 19735005 18175850 16324696 12685450
20012 12685450 9991406 9489374 9180521 8862672 9417476 12017544 13990186 15688125 18450526
20003 18450526 18505328 12964248 7366125 4369602 3484251 3633253 5335521 6397837 6838569
19994 6838569 7794878 8540477 7981760 4250030 1001088 -393071 -562898 145704 824690
19985 824690 1581138 1184062 1416468 2097991 2073461 2232227 3261966 4425127 5456452
$$ packed form
20040D1521069L796651O577198Q878613J2819079J9136863K8301403M2007517
20033A63038393O4412640J01579487J38770636J08996961n2606414j52809796
20027C71381907j20729603p6905387m7243954l0690052k1955096j6507869j0728799
20020D6621147q506438o770484m629793l513904l465523j559155j851154l639246
20012A2685450k694044n02032l08853l17849N54804K600068J972642J697939K762401
20003A8450526N4802n541080n598123k996523q85351J49002J702268J062316M40732
19994F838569R56309P45599n58717l731730l248942j394159j69827P08602O78986
19985H24690P56448l97076K32406O81523k4530J58766J029739J163161J031325
$$ plain form
19976 5456452 4894234 2836044 1436374 1190469 1389257 3247890 4094390 4867389 4982571
19967 4982571 5345522 6311113 5793907 3960902 3193305 3088029 2272712 815171 -78046
19958 -78046 176847 2302172 2922999 1528451 543880 2359922 3769971 5210091 8069216
19949 8069216 9453223 7195850 4710404 3430562 2670669 2860876 3996994 4257553 4175384
19940 4175384 2119831 198720 -327953 -236652 1010766 3061700 4075794 3764328 2358971
19931 2358971 1196899 1411258 1083361 1431993 2662138 2491029 2093385 633288 -613540
19922 -613540 123313 874000 2027485 2439192 2790070 2869388 3855806 3694286 3002166 3101932
19912 3101932 4022153 5001434 4444900 2249089 1268051 1384795 -975624 -1885121 7532
$$ packed form
19976E456452n62218k058190j399670k45905J98788J858633Q46500P72999J15182
19967D982571L62951R65591n17206j833005p67597j05276q15317j457541q93217
19958g8046K54893K125325O20827j394548r84571J816042J410049J440120K859125
19949H069216J384007k257373k485446j279842p59893J90207J136118K60559q2169
19940D175384k055553j921111n26673R1301J247418K050934J014094l11466j405357
19931B358971j162072K14359l27897L48632J230145j71109l97644j460097j246828
19922f13540P36853P50687J153485M11707L50878P9318R86418j61520o92120R9766
19912C101932R20221R79281n56534k195811r81038J16744k360419r09497J892653
$$ plain form
19903 7532 802224 295293 173924 -623700 -1105534 -1235433 -1699674 -1863119 -1973938 -2021614
19893 -2021614 -1673452 -2284249 -3141700 -4032390 -3815255 -1137167 1291247 2351477 2998164
19884 2998164 2570588 1678404 501659 551292 1343829 1633643 1709304 1398320 866172 1169768
19874 1169768 2247702 4069148 4972042 3761343 1881052 -566943 -2342231 -2684200
19866 -2684200 -4106005 -5342116 -5208342 -5002150 -3983607 -1559156 292441 1009941 189711
19857 189711 -3383 1512005 3054519 3141256 3866917 4329899 3748089 3935021 3011838
19848 3011838 1875101 1946162 2310909 1165917 364138 782438 1541600 1676244 1589023
19839 1589023 897830 -611511 -304213 -340595 -1518976 -1522355 -926922 -587143 733422
$$ packed form
19903G532P94692n06931j21369p97624m81834j29899m64241j63445j10819m7676
19893b021614L48162o10797q57451q90690K17135K678088K428414J060230O46687
19884B998164m27576q92184j176745M9633P92537K89814P5661l10984n32148L03596
19874A169768J077934J821446R02894j210699j880291k447995j775288l41969
19866b684200j421805j236111J33774K06192J018543K424451J851597P17500q20230
19857A89711j93094J515388J542514Q6737P25661M62982n81810J86932r23183
19848C011838j136737P1061L64747j144992q01779M18300P59162J34644q7221
19839A589023o91193j509341L07298l6382j178381l379N95433L39779J320565
$$ plain form
19830 733422 1472664 792627 -112497 -1393695 -265645 2202375 2749166 2960608 3660539
19821 3660539 3813016 2467781 1832681 2098688 2272052 2169091 1744452 1189788 301832
19812 301832 -1800968 -3230608 -3645922 -3391396 -2263523 -561538 432973 819099 2577232
19803 2577232 4826978 6552457 7059814 6473983 5912395 4345916 1981261 284738 356044
19794 356044 -168654 -1632747 -2951323 -3973197 -3227402 -1639884 -752429 1300714 3004583
19785 3004583 3237394 3396467 2691228 1324954 454640 893384 4532258 8096701 9486731
19776 9486731 7954128 5907562 4663437 1820935 -87214 -359594 -321964 -568755 613616
19767 613616 2116900 3362714 3278928 3386671 2810024 2571208 4934247 5979424 3555257
$$ packed form
19830G33422P39242o80037r05124j281198J128050K468020N46791K11442O99931
19821C660539J52477j345235o35100K66007J73364j02961m24639n54664q87956
19812C01832k102800j429640m15314K54526J127873J701985R94511L86126J758133
19803B577232K249746J725479N07357n85831n61588j566479k364655j696523P1306
19794C56044n24698j464093j318576j021874P45795J587518Q87455K053143J703869
19785C004583K32811J59073p05239j366274q70314M38744L638874L564443J390030
19776I486731j532603k046566j244125k842502j908149k72380L7630k46791J182371
19767F13616J503284J245814q3786J07743n76647k38816K363039J045177k424167
$$ plain form
19758 3555257 268149 660012 4139469 6114507 6326807 4857703 4138137 4375429 4473042
19749 4473042 4388930 4638185 5520366 6401416 6846651 7040361 6201716 5190498 4949450
19740 4949450 4983726 4098731 2959623 2841220 3631100 3829650 4528038 6886082 7994120
19731 7994120 7069348 6234328 6023610 7421193 8969434 9837351 10594088 11796954 11970682
19722 11970682 11748390 13297410 17374267 20408681 23477924 26234244 29753567 34386123
19714 34386123 40212630 47029087 55884569 68203752 85824494 112712878 154952775
19707 154952775 215153258 303269536 423229808 520707897 487190710 358559138 245378552
19700 245378552 169672149 121687204 90052747 68915390 52936420 40910064 32039218
$$ packed form
19758C555257l287108L91863L479457J975038K12300j469104p19566K37292R7613
19749D473042q4112K49255Q82181Q81050M45235J93710q38645j011218k41048
19740D949450L4276q84995j139108j18403P89880J98550O98388K358044J108038
19731G994120r24772q35020k10718J397583J548241Q67917P56737J202866J73728
19722A1970682k22292J549020M076857L034414L069243K756320L519323M632556
19714C4386123N826507O816457Q855482J2319183J7620742K6888384M2239897
19707A54952775O0200483Q8116278J19960272R7478089l3517187j28631572j13180586
19700B45378552p5706403m7984945l1634457k1137357j5978970j2026356q870846
$$ plain form
19693 32039218 26799544 23055315 19763471 16395167 13134996 10387031 8575870 7046352
19685 7046352 6365648 5442773 5534943 5937450 5854779 5377022 4323758 3376942 3512081 4193121
19675 4193121 3753700 2661062 1550811 1248147 1125472 1504541 2050514 1895151 564137
19666 564137 -1039800 -587717 -1117496 -2315804 -2547214 -3254660 -2143983 -796790 -677833
19657 -677833 -1499183 -1396107 -2107749 -3276732 -4489642 -6014705 -5838017 -5481937 -6105984
19648 -6105984 -7031938 -6374912 -5786016 -4909643 -4571224 -4007454 -3494605 -2488780 -2217948
19639 -2217948 -1702373 -553737 133263 -1151077 -1201530 -233091 -931405 -1942934 -2057170
19630 -2057170 -1314459 -1575655 -1963437 -754252 1614786 2324207 1686534 762759 -333555
$$ packed form
19693C2039218n239674l744229l291844l368304l260171k747965j811161j529518
19685G046352o80704r22875R2170M02507q2671m77757j053264r46816J35139O81040
19675D193121m39421j092638j110251l02664j22675L79069N45973j55363j331014
19666E64137j603937M52083n29779j198308k31410p07446J110677J347193J18957
19657f77833q21350J03076p11642j168983j212910j525063J76688L56080o24047
19648f105984r25954O57026N88896Q76373L38419N63770N12849J005825K70832
19639b217948N15575J148636O87000j284340n0453R68439o98314j011529j14236
19630b057170P42711k61196l87782J209185K369038P09421o37673r23775j096314
$$ plain form
19621 -333555 516572 2848708 3307528 2361192 2907265 3643093 4345419 3189872 1674576
19612 1674576 -377580 -1793477 -895954 1390557 2156661 1292531 -388696 -1474256 -1557136
19603 -1557136 -1367676 -2364713 -3601673 -3436305 -2759925 -2487136 -3682003 -3696452 -2325101
19594 -2325101 -1920445 -2824194 -4544322 -5251263 -4612282 -3440119 -3405434 -3554324 -2966434
19585 -2966434 -3345191 -4298842 -4426206 -3086489 -2938772 -5005259 -6976885 -7196536 -6567012
19576 -6567012 -4519467 -2754434 -311673 1974590 461049 -2434677 -3989750 -4212412
19568 -4212412 -4770281 -4305683 -2962619 -1014016 -69528 867987 2351999 3758377 3502489
19559 3502489 2427138 1394457 275444 -644023 -869055 -1273626 -1716268 -2115285 -1828991
$$ packed form
19621c33555Q50127K332136M58820r46336N46073P35828P02326j155547j515296
19612A674576k052156j415897Q97523K286511P66104q64130j681227j085560q2880
19603a557136J89460r97037j236960J65368O76380K72789j194867j4449J371351
19594b325101M04656r03749j720128p06941O38981J172163L4685j48890N87890
19585b966434l78757r53651j27364J339717J47717k066487j971626k19651O29524
19576f567012K047545J765033K442761K286263j513541k895726j555073k22662
19568d212412n57869M64598J343064J948603R44488R37515J484012J406378k55888
19559C502489j075351j032681j119013r19467k25032m04571m42642l99017K86294
$$ plain form
19550 -1828991 313985 1875707 1658448 1665748 1923612 240275 -2919372 -3427283 -2099845
19541 -2099845 -1986827 -759903 141053 552954 871734 258921 -186174 -2002380 -3406249
19532 -3406249 -2363873 -787499 -524163 -811558 -1088160 -755907 -1064458 -608993 673307
19523 673307 2219783 3546953 2996068 1891437 -404896 -737673 536817 1374528 1269430
19514 1269430 1500659 1865550 1565032 517886 -93946 -317182 -2022997 -4229857 -4504903
19505 -4504903 -4403512 -4948205 -5587879 -3965823 -1789119 -2344794 -3940589 -4622960 -3977006
19496 -3977006 -2948914 -2952801 -1781179 -846063 -321175 -31544 -208256 -1904235 -2586520
19487 -2586520 -2804292 -3229565 -2480352 -1257889 -1599769 -2451431 -1687700 -761697 -387861
$$ packed form
19550a828991K142976J561722k17259P300K57864j683337l159647n07911J327438
19541b099845J13018J226924R00956M11901L18780o12813m45095j816206j403869
19532c406249J042376J576374K63336k87395k76602L32253l08551M55465J282300
19523F73307J546476J327170n50885j104631k296333l32777J274490Q37711j05098
19514A269430K31229L64891l00518j047146o11832k23236j705815k206860k75046
19505d504903J01391n44693o39674J622056K176704n55675j595795o82371O45954
19496c977006J028092l887J171622R35116N24888K89631j76712j695979o82285
19487b586520k17772m25273P49213J222463l41880q51662P63731R26003L73836
$$ plain form
19478 -387861 -129361 529005 431586 -646305 -64983 1339225 258469 -636580 -1077482
19469 -1077482 -684294 1482261 2777708 2673073 2949416 2015482 903400 1932719 1824607
19460 1824607 2174867 2526253 1199443 77141 -408051 88732 -740550 -2667823 -3177482
19451 -3177482 -3027695 -2089426 -1904671 -2988652 -3602145 -3496147 -3248885 -2009965 -2542037
19442 -2542037 -3333861 -3365329 -3028306 -1365461 -1247922 -958161 -640898 -1546220 -1075677
19433 -1075677 638247 411913 204883 -368680 1097123 3016569 2526557 725775 -976464
19424 -976464 -1395636 -607582 -1223518 -1800553 -1620998 -937231 777383 661204 -1347088
19415 -1347088 -2072792 -1447032 -1183603 -626249 -185989 384243 -165799 -598189 283608
$$ packed form
19478c87861K58500O58366r7419j077891N81322J404208j080756q95049m40902
19469a077482L93188K166555J295447j04635K76343r33934j112082J029319j08112
19460A824607L50260L51386j326810j122302m85192M96783q29282j927273n09659
19451c177482J49787R38269J84755j083981o13493J05998K47262J238920n32072
19442b542037p91824l1468L37023J662845J17539K89761L17263r05322M70543
19433a075677J713924k26334k07030n73563J465803J919446m90012j800782j702239
19424i76464m19172P88054o15936n77035J79555O83767J714614j16179k008292
19415a347088p25704O25760K63429N57354M40260N70232n50042m32390Q81797
$$ plain form
19406 283608 814021 95586 -546511 -1001951 -415845 -734969 -927002 -848699 -556767 377345
19396 377345 329673 2047712 4865446 5376412 5207538 5166185 3579516 2313628 1645769
19387 1645769 1577545 1692835 2986519 4356519 3664143 2182140 677704 -1727804 -2583916
19378 -2583916 -2221143 -1653681 -1243903 -419964 851717 2416201 3461599 3073476 1772084
19369 1772084 -456070 -2067561 -1044075 -656913 -1133381 -330444 -287532 -758486 -39451
19360 -39451 496077 81422 320654 627501 1097165 1119443 39896 -220434 163287 33629
19350 33629 -274419 -1044320 -1119627 -897507 -1311813 -1298016 -588016 825085 992403 504486
19340 504486 689588 2167523 2645671 1690097 -34221 -828769 -54272 -76142 -428383
$$ packed form
19406B83608N30413p18435o42097m55440N86106l19124j92033P8303K91932R34112
19396C77345m7672J718039K817734N10966j68874m1353j586669j265888o67859
19387A645769o8224J15290J293684J370000o92376j482003j504436k405508q56112
19378b583916L62773N67462M09778Q23939J271681J564484J045398l88123j301392
19369A772084k228154j611491J023486L87162m76468Q02937M2912m70954P19035
19360c9451N35528m14655K39232L06847M69664K2278j079547k60330L83721j29658
19350C3629l08048p69901p5307K22120m14306J3797P10000J413101J67318m87917
19340E04486J85102J477935M78148r55574j724318p94548P74497k1870l52241
$$ plain form
19331 -428383 -416459 -134480 623200 -405379 -1161280 -672840 -1271820 -1089954 455905
19322 455905 -208469 -1069379 -243890 765672 970921 -196018 -2041993 -2784306 -3408448
19313 -3408448 -3853656 -1914659 -816429 -497650 -918513 -944744 -113782 187501 -818826
19304 -818826 -742704 1053664 2376824 2886633 3739080 3288073 1230031 -141674 163989
19295 163989 840656 766204 -66385 -653847 39068 892611 -566006 -2464857 -3844860
19286 -3844860 -3915310 -3410570 -2901823 -2143686 -1055750 -336016 457150 1060318 957717
19277 957717 -301713 -2070870 -2703840 -2397110 -2615257 -2910698 -1798252 -14219 1161521
19268 1161521 974408 724103 667902 646785 -86749 -1767022 -2111614 -1558804 -2005167 -1265410
$$ packed form
19331d28383J1924K81979P57680j028579p55901M88440n98980J81866J545859
19322D55905o64374q60910Q25489J009562K05249j166939j845975p42313o24142
19313c408448m45208J938997J098230L18779m20863k6231Q30962L01283j006327
19304h18826P6122J796368J323160N09809Q52447m51007k058042j371705L05663
19295A63989O76667p4452q32589n87462O92915Q53543j458617j898851j380003
19286c844860p0450N04740N08747P58137J087936P19734P93166O03168j02601
19277I57717j259430j769157o32970L06730k18147k95441J112446J784033J175740
19268A161521j87113k50305n6201k1117p33534j680273l44592N52810m46363P39757
$$ plain form
19258 -1265410 735058 975298 988224 861364 -288269 -751465 -1597140 -1558726 -650543
19249 -650543 307478 941980 452115 -1279231 -2279744 -2218072 -1365126 -756669 -791448 -945812
19239 -945812 -1135215 -1621884 -2232760 -1296087 213678 446895 -1002492 -2061709 -2905440
19230 -2905440 -3247389 -2367332 -2970657 -2936038 -1514812 -1427142 -2118431 -1968273 -2043654 -1237551
19220 -1237551 -781126 -1712348 -3248682 -3966719 -3393030 -2534123 -1803226 118016 889757
19211 889757 1001230 970747 1035581 522948 -1240854 -876169 -518621 -119626 483523 -242254
19201 -242254 -968288 -1266664 -3552204 -5035524 -3463300 -189047 902312 817242 1167407
19192 1167407 1367038 2448421 3249982 3584019 3933649 3528375 1408534 -1300147 -1544838
$$ packed form
19258a265410K000468K40240J2926j26860j149633m63196q45675L8414R08183
19249f50543R58021O34502m89865j731346j000513O1672Q52946O08457l4779j54364
19239i45812j89403m86669o10876R36673J509765K33217j449387j059217q43731
19230b905440l41949Q80057o03325L4619J421226Q7670o91289J50158p5381Q06103
19220a237551M56425r31222j536334p18037N73689Q58907P30897J921242P71741
19211H89757J11473l0483O4834n12633j763802L64685L57548L98995O03149p25777
19201b42254p26034k98376k285540j483320J572224L274253J091359q5070L50165
19192A167407J99631J081383Q01561L34037L49630m05274k119841k708681k44691
$$ plain form
19183 -1544838 -679288 -936430 -1635335 -2129087 -1606403 -1541086 -2547413 -2027687 -448369
19174 -448369 131847 -135107 -917038 -965155 -825096 -1974655 -2758419 -2424258 -1229218
19165 -1229218 -1272997 -2114712 -3067738 -3860305 -4404158 -3727674 -3907387 -5893346 -6996191
19156 -6996191 -5888671 -3739332 -2781414 -2376677 -1402084 -237660 1418745 3297347 2678141
19147 2678141 1672003 2536869 2767974 1995825 1493967 41737 -867687 -1958205 -3305168
19138 -3305168 -3827340 -2367145 -1124813 -21771 1262230 1305061 796535 1202973 1522329
19129 1522329 1108747 269943 -797328 -852888 1102018 1768171 877543 352548 -580328
19120 -580328 -2550396 -3208461 -2350718 -1422426 -95175 728996 113429 -1931870 -2659991
$$ packed form
19183a544838Q65550k57142o98905m93752N22684O5317j006327N19726J579318
19174d48369N80216k66954p81931m8117J40059j149559p83764L34161J195040
19165a229218m3779q41715r53026p92567n43853O76484j79713j985959j102845
19156f996191J107520K149339R57918M04737R74593J164424J656405J878602o19206
19147B678141j006138Q64866K31105p72149n01858j452230r09424j090518j346963
19138c305168n22172J460195J242332J103042J284001M2831n08526M06438L19356
19129A522329m13582q38804j067271n5560J954906O66153q90628n24995r32876
19120e80328j970068o58065Q57743R28292J327251Q24171o15567k045299p28121
$$ plain form
19111 -2659991 -3007976 -3235299 -3200372 -3072854 -3185392 -2808168 -2192141 -1547416 -1673908 -2358906
19101 -2358906 -2801871 -3125774 -3716013 -3112042 -1969989 -1277373 -1100562 -801563 -1540391
19092 -1540391 -2620302 -1626416 52450 406031 76495 -128741 -1030126 -1452473 -775202
19083 -775202 -444773 -1657658 -2054907 -2434322 -2146402 -2299521 -2489472 -1148086 -528244
19074 -528244 299577 924404 984481 1438386 523814 -1657219 -2834955 -2011746 -2282044
19065 -2282044 -3334180 -2598918 -2550680 -4120800 -4879555 -4036032 -3641901 -3679959 -3136039
19056 -3136039 -147478 3174323 4258929 3565010 1974608 1341280 667451 -288809 -70308
19047 -70308 1583477 2496981 2021101 1122530 543908 1284817 1507411 3192992 4685389
$$ packed form
19111b659991l47985k27323L4927J27518j12538L77224O16027O44725j26492o84998
19101b358906m42965l23903n90239O03971J142053O92616J76811K98999p38828
19092a540391j079911R93886J678866L53581l29536k05236r01385m22347O77271
19083g75202L30429j212885l97249l79415K87920j53119j89951J341386O19842
19074e28244Q27821O24827O0077M53905r14572k181033j177736Q23209k70298
19065b282044j052136P35262M8238j570120p58755Q43523L94131l8058N43920
19056c136039K988561L321801J084606o93919j590402o33328o73829r56260K18501
19047g0308J653785R13504m75880q98571n78622P40909K22594J685581J492397
$$ plain form
19038 4685389 3796958 2480858 1935346 1387172 957626 104175 711568 1353181 290553
19029 290553 -332446 191930 -170003 626386 -19748 -1062307 -179967 177158 874049
19020 874049 1120435 2614327 5250329 6492073 5005335 3075247 3152397 1009350 -787351
19011 -787351 -1218355 -587745 752220 911570 1280874 1856913 3319149 3791293 2915974
19002 2915974 1606947 462279 -341609 378770 1576802 738010 -110622 -506315 -339475
18993 -339475 609056 -124723 -606341 1774344 3800216 4078331 3414719 1759886 761589
18984 761589 822221 3162578 3630041 2379791 1147758 -570276 -1520672 -1749935 -1757173
18975 -1757173 -1689459 -2355036 -3041367 -3889284 -4159854 -5093581 -6533071 -4746123 -3562272
$$ packed form
19038D685389q88431j316100n45512n48174m29546q53451O07393O41613j062628
19029B90553o22999N24376l61933P96389o46134j042559Q82340L57125O96891
19020H74049K46386J493892K636002J241744j486738j930088P7150k143047j796701
19011g87351m31004O30610J339965J59350L69304N76039J462236M72144q75319
19002B915974j309027j144668q03888P20379J198032q38792q48632l95693J66840
18993c39475R48531p33779m81618K380685K025872K78115o63612j654833r98297
18984G61589O0632K340357M67463j250250j232033j718034r50396k29263p238
18975a757173O7714o65577o86331q47917k70570r33727j439490J786948J183851
$$ plain form
18966 -3562272 -3377208 -2651950 -1519780 -855333 -817043 -1671502 -1026615 515826 489316
18957 489316 -33375 -1886230 -3377878 -3232625 -2121355 -1748715 -2187835 -1704039 -2138221
18948 -2138221 -3033132 -2173067 -1671291 -1413422 -248186 71212 -677978 -1576369 -2880353
18939 -2880353 -4182129 -4517878 -4187189 -3325121 -3046884 -1664138 541204 923788 -355884
18930 -355884 -1010710 -1443930 -2509745 -2866716 -3766310 -4983082 -4192063 -2677281 -626024
18921 -626024 2054747 2589059 1683600 -218109 -2046865 -3363504 -3118779 -2050467 -1330264
18912 -1330264 -934043 -1924102 -2321052 -2532050 -2761584 -2361711 -2315281 -3850769 -3095996
18903 -3095996 -96308 1958535 3614138 3490106 3218628 1786804 -637981 -1356849 625494
$$ packed form
18966c562272J85064P25258J132170O64447L8290q54459O44887J542441k6510
18957D89316n22691j852855j491648J45253J111270L72640m39120M83796m34182
18948b138221q94911Q60065N01776K57869J165236L19398p49190q98391j303984
18939b880353j301776l35749L30689Q62068K78237J382746K205342L82584j279672
18930c55884o54826m33220j065815l56971q99594j216772P91019J514782K051257
18921f26024K680771N34312r05459j901709j828756j316639K44725J068312P20203
18912a330264L96221r90059l96950k10998k29534L99873M6430j535488P54773
18903c095996K999688K054843J655603j24032k71478j431824k424785p18868J982343
$$ plain form
18894 625494 1988738 2348831 1967981 1272350 1112359 1692124 771429 21997 -411902
18885 -411902 -1710931 -2988719 -2823446 -2232894 -1463551 99541 1723917 1634283 129472
18876 129472 -860165 29505 597039 -304377 -1950947 -1200662 440045 214397 -912041
18867 -912041 -2425844 -2956079 -2556602 -1436692 13215 1852615 1911523 1315644 2052508
18858 2052508 2102183 1312800 335921 -267662 776027 1419330 1134217 1486485 3543317
18849 3543317 4983941 4479757 2541287 1117534 468187 308385 1373093 1222321 -140549
18840 -140549 -1436735 -2584942 -3746276 -3523297 -1619673 -1341508 -2561834 -3158726 -3093407
18831 -3093407 -2549082 -942309 -20045 1254016 1694357 481807 621551 964608 387124
$$ packed form
18894F25494J363244L60093l80850o95631j59991N79765r20695p49432m33899
18885d11902j299029j277788J65273N90552P69343J563092J624376q9634j504811
18876A29472r89637Q89670N67534r01416j646570P50285J640707k25648j126438
18867i12041j513803n30235L99477J119910J449907J839400N8908n95879P36864
18858B052508M9675p89383r76879o03583J043689O43303k85113L52268K056832
18849C543317J440624n04184j938470j423753o49347j59802J064708j50772j362870
18840a40549j296186j148207j161334K22979J903624K78165j220326n96892O5319
18831c093407N44325J606773R22264J274061M40341j212550J39744L43057n77484
$$ plain form
18822 387124 129973 -936541 -1584787 -905230 -562096 -1439853 -2858428 -2584877 -1294121
18813 -1294121 -317577 -1164709 -1437283 -818444 -508876 611844 797507 -1329617 -1605524
18804 -1605524 -156395 1141761 1022474 541839 672451 170483 323528 2063569 3165592
18795 3165592 2717554 2119580 1229791 647140 899903 186505 -114717 192793 -161980
18786 -161980 54975 608413 568139 -9529 -1258702 -1821863 -2344574 -3009288 -3495098 -3766258
18776 -3766258 -3110050 -4020181 -5396657 -5188032 -2915383 -2566109 -3365663 -3189730 -3464683
18767 -3464683 -3619600 -3273226 -2480601 -251141 1732275 1739410 2831863 3356958 2358710
18758 2358710 -4856 -1679098 -2247482 -2689499 -1452573 285144 650990 -555226 -1127664
$$ packed form
18822C87124k57151j066514o48246O79557L43134q77757j418575K73551J290756
18813a294121R76544q47132k72574O18839L09568J120720J85663k127124k75907
18804a605524J449129J298156j19287m80635J30612n01968J53045J740041J102023
18795C165592m48038n97974q89789n82651K52763p13398l01222L07510l54773
18786a61980K16955N53438m0274n77668j249173n63161n22711o64714m85810k71160
18776c766258O56208r10131j376476K08625K272649L49274p99554J75933k74953
18767c464683j54917L46374P92625K229460J983416P135J092453N25095r98248
18758B358710k363566j674242n68384m42017J236926J737717L65846j206216n72438
$$ plain form
18749 -1127664 -1774424 -2371291 -1481787 233674 1082462 853516 124116 1429366 4065137
18740 4065137 4250082 3329304 3482835 3501692 3115903 2474262 2255559 3038835 3281659 2027590
18730 2027590 893072 1138900 415881 -1053485 -1139954 -189326 1177538 2499326 2775125
18721 2775125 2913711 4010053 3907060 2021386 424158 -726953 -1202558 -466865 73042
18712 73042 -521824 -456316 173061 -3099 -288411 -660964 -998899 -1565355 -2117795 -1908366
18702 -1908366 -1559200 -2993050 -5877989 -6649233 -5174192 -2993290 -1071796 849786
18694 849786 2397020 1810337 2116381 1371027 -1233585 -3043681 -2001578 -518480 -176293
18685 -176293 440715 967162 391695 -472521 -444886 -922162 -2135383 -383914 1080736
$$ packed form
18749a127664o46760n96867Q89504J715461Q48788k28946p29400J305250K635771
18740D065137J84945r20778J53531J8857l85789o41641k18703P83276K42824j254069
18730B027590j134518K45828p23019j469366q6469R50628J366864J321788K75799
18721B775125J38586J096342j02993j885674j597228j151111m75605P35693N39907
18712G3042n94866O5508O29377j76160k85312l72553l37935n66456n52440K09429
18702a908366L49166j433850k884939p71244J475041K180902J921494J921582
18694H49786J547234n86683L06044p45354k604612j810096J042103J483098L42187
18685a76293O17008N26447n75467q64216K7635m77276j213221J751469J464650
$$ plain form
18676 1080736 302398 -416595 20047 625944 -753438 -1184811 1155794 2318274 2100666
18667 2100666 2012194 -353267 -2603876 -2843206 -2351450 -1947379 -295821 1547543 2987456
18658 2987456 3312153 2419867 1797860 1089139 162227 -51035 801566 767029 953018 909027
18648 909027 616455 42596 149824 773721 -233007 368747 1098807 -289380 -1080090
18639 -1080090 -2554467 -3142527 -3538609 -2314849 -1270429 -2421456 -3427693 -4221431 -3794250
18630 -3794250 -4060509 -4124685 -3942993 -4748947 -4491001 -4169889 -2422728 -1495107 -1717187
18621 -1717187 -1908774 -688532 813298 -507544 -2120046 -3304222 -3091928 -2277360 -911339
18612 -911339 -245974 -1007720 -2822929 -4278606 -2925498 -1353089 -448371 59221 741125
$$ packed form
18676A080736p78338p18993M36642O05897j379382m31373K340605J162480k17608
18667B100666q8472k365461k250609k39330M91756M04071J651558J843364J439913
18658B987456L24697q92286o22007p08721r26912k13262Q52601l4537J85989m3991
18648I09027k92572n73859J07228O23897j006728O01754P30060j388187p90710
18639a080090j474377n88060l96082J223760J044420j151027j006237p93738M27181
18630c794250k66259o4176J81692q05954K57946L21112J747161R27621k22080
18621a717187j91587J220242J501830j320842j612502j184176K12294Q14568J366021
18612i11339O65365p61746j815209j455677J353108J572409R04718N07592O81904
$$ plain form
18603 741125 1269204 909693 2289432 2509393 2476237 1907964 1362350 1461005 1650850 1866662
18593 1866662 2552602 2465202 -195701 -2034053 -872629 -310295 -779037 -174617 544910
18584 544910 1006148 595332 -281055 -8374 1220994 2629159 3106680 1746885 1401722
18575 1401722 1938149 1161752 -155015 -529686 -45650 982049 2190350 988359 -282974
18566 -282974 -94042 -32992 -24096 56801 -14190 436313 1363339 1010811 -841516 -2353585
18556 -2353585 -2220443 -971201 344560 230862 -485343 -107306 546716 -1878300 -3084677
18547 -3084677 -2508695 -481145 778318 259312 156403 -399283 -1047999 -1288313 -774778
18538 -774778 -439381 -994779 -870300 -685515 459025 712717 472058 914966 1410161
$$ packed form
18603G41125N28079l59511J379739K19961l3156n68273n45614R8655J89845K15812
18593A866662O85940q7400k660903j838352J161424N62334m68742O04420P19527
18584E44910M61238m10816q76387K72681J229368J408165M77521j359795l45163
18575A401722N36427p76397j316767l74671M84036J027699J208301j201991j271333
18566b82974J88932O1050Q896Q0897p0991M50503R27026l52528j852327j512069
18556b353585J33142J249242J315761j13698p16205L78037O54022k425016j206377
18547c084677N75982K027550J259463n19006j02909n55686o48716k40314N13535
18538g74778L35397n55398J24479J84785J144540K53692k40659M42908M95195
$$ plain form
18529 1410161 2141916 1828662 1296074 589905 101863 -976130 -2581280 -3106152 -3428714
18520 -3428714 -3731393 -2614827 -1387894 -55748 642602 2130510 3268089 2704588 467828
18511 467828 -844028 -329809 286293 40757 175563 247186 747923 302490 -2558893
18502 -2558893 -4099897 -4549240 -4584694 -3654285 -2584906 -665368 300911 -1077075 -711315
18493 -711315 1429795 1520479 1456299 1962743 3042212 1788562 -257410 -1115171 -1705690
18484 -1705690 -2111990 -1658775 -2262533 -2861707 -2500294 -3659026 -4202583 -3604898 -1451554
18475 -1451554 -87830 1086034 3174551 3874790 2859997 1237213 42227 -736074
18467 -736074 -1739738 -2419992 -2231722 -1507099 464316 2160852 1392240 -32081 -647499
$$ packed form
18529A410161P31755l13254n32588p06169m88042j077993j605150n24872l22562
18520c428714l02679J116566J226933J332146O98350J487908J137579n63501k236760
18511D67828j311856N14219O16102k45536J34806P1623N00737m45433k861383
18502b558893j541004m49343l5454R30409J069379J919538R66279j377986L65760
18493g11315K141110R0684o4180N06444J079469j253650k045972q57761n90519
18484a705690m06300M53215o03758n99174L61413j158732n43557N97685K153344
18475a451554J363724J173864K088517P00239j014793j622784j194986p78301
18467g36074j003664o80254J88270P24623J971415J696536p68612j424321o15418
$$ plain form
18458 -647499 -1689452 -1666575 403636 2336274 1671397 1059927 859869 -26589 -1445200
18449 -1445200 -1531971 -726258 -2406936 -4242999 -4695446 -3660314 -2891822 -2734488 -2400427
18440 -2400427 -2768691 -3641906 -3819450 -1757815 357969 1626676 2133841 1153398 32986
18431 32986 -725449 -1153814 -1506087 -1872333 -2222883 -3495397 -5528299 -7417469 -8077149
18422 -8077149 -6733052 -4610474 -2081497 -474647 -668382 -2045408 -1236516 815016
18414 815016 1752585 1406796 796831 -664979 -2146010 -1466274 129676 753488 1033298
18405 1033298 -60061 -1753240 -1482927 12374 1178597 2074711 1190864 490299 423434
18396 423434 998531 432857 -2164505 -3221028 -1684317 -331088 -1831512 -4589142 -4570506
$$ packed form
18458f47499j041953K2877K070211J932638o64877o11470k00058q86458j418611
18449a445200q6771Q05713j680678j836063m52447J035132P68492J57334L34061
18440b400427l68264q73215j77544K061635K115784J268707N07165r80443j120412
18431C2986p58435m28365l52273l66246l50550j272514k032902j889170o59680
18422h077149J344097K122578K528977J606850j93735j377026Q08892K051532
18414H15016R37569l45789o09965j461810j481031O79736J595950O23812K79810
18405A033298j093359j693179K70313J495301J166223Q96114q83847p00565o6865
18396D23434N75097n65674k597362j056523J536711J353229j500424k757630J8636
$$ plain form
18387 -4570506 -2980474 -2145830 -1443949 -1370004 -1065546 -2417752 -3226154 -3419734 -5108723
18378 -5108723 -5073763 -4327891 -3179153 -2793263 -1402993 450439 980447 325977 -1938802
18369 -1938802 -3774503 -3944565 -3877710 -3852112 -3552437 -3961888 -3326909 -3311429 -3445553 -3120344
18359 -3120344 -2619871 -1718119 -1156605 -1941896 -2465895 -1828859 -1534248 -1847789 -2894625
18350 -2894625 -2560950 -2432535 -2281689 -997562 146455 2008117 3144868 3719583 3276827
18341 3276827 2560862 966785 447163 405167 320300 47097 -1080183 -2827904 -2769229
18332 -2769229 -1306902 -428513 -39507 79632 -866047 -1516026 -1025035 -604672 -557369
18323 -557369 -634122 1188988 3036929 4082732 4242191 2969417 1545306 652542 -194650
$$ packed form
18387d570506J590032Q34644P01881P3945L04458j352206q08402j93580j688989
18378e108723L4960P45872J148738L85890J390270J853432N30008o54470k264779
18369a938802j835701j70062O6855K5598K99675m09451O34979J5480j34124L25209
18359c120344N00473R01752N61514p85291n23999O37036K94611l13541j046836
18350b894625L33675J28415J50846J284127J144017J861662J136751N74715m42756
18341C276827p15965j594077n19622m1996q4867k73203j127280j747721N8675
18332b769229J462327Q78389L89006J19139r45679o49979M90991M20363M7303
18323e57369p6753J823110J847941J045803J59459j272774j424111q92764q47192
$$ plain form
18314 -194650 -479723 1306712 2699806 2097218 1010946 2042104 3015570 3135682 2466390
18305 2466390 308916 -2069506 -3583948 -4301668 -4028747 -3987944 -3971849 -3573005 -3972573
18296 -3972573 -4790301 -2196515 1471201 3913095 5896060 5904048 3914158 1613784 553857
18287 553857 811078 86755 -1945825 -3102821 -3506002 -3406915 -3345909 -3208958 -3069669 -1497407
18277 -1497407 972179 2094687 981885 154131 1176231 1992772 1402942 525002 -690215
18268 -690215 -1074594 -257064 1592108 2827381 3115771 2452959 1566225 1366425 1121830
18259 1121830 731547 423787 819262 242942 -34082 1593590 2602850 1832765 125023
18250 125023 534399 1893298 2499777 3582227 3264008 2249652 247464 -933969 559442
$$ packed form
18314a94650k85073J786435J393094o02588j086272J031158R73466J20112o69292
18305B466390k157474k378422j514442p17720K72921M0803J6095L98844l99568
18296c972573q17728K593786L667716K441894J982965P988j989890k300374j059927
18287E53857K57221p24323k032580j156996m03181R9087O1006J36951J39289J572262
18277a497407K469586J122508j112802q27754J022100Q16541n89830q77940j215217
18268f90215l84379Q17530J849172J235273K88390o62812q86734j99800k44595
18259A121830l90283l07760L95475n76320k77024J627672J009260p70085j707742
18250A25023M09376J358899O06479J082450l18219j014356k002188j181433J493411
$$ plain form
18241 559442 1456924 1192928 1620267 2534961 2536900 2353758 2117172 2109967 1545424 335487
18231 335487 416282 1008611 1069112 215138 -227288 371077 1884514 2435477 2398301 2854004
18221 2854004 656326 -1051545 -805669 186788 1120305 2027816 2423902 2654986 2005042
18212 2005042 1206877 -1451160 -2480551 -2583494 -3104061 -3402452 -3604343 -2434407 183084
18203 183084 2381907 3402148 4906055 5033819 2048272 -1239480 -1892664 -459988 2007326
18194 2007326 1853198 365756 -952823 -1626541 -1676593 -1162726 297853 1822236 4321524
18185 4321524 6081167 4941074 3698065 3148717 1736720 -270936 -472170 726623
18177 726623 1694304 3485105 3716394 2113477 -82206 -645920 -546917 -1816960 -2801637
$$ packed form
18241E59442Q97482k63996M27339R14694J939j83142k36586p205n64543j209937
18231C35487Q0795N92329O0501q53974m42426N98365J513437N50963l7176M55703
18221B854004k197678j707871K45876R92457R33517R07511L96086K31084o49944
18212B005042p98165k658037j029391j02943n20567k98391k01891J169936K617491
18203A83084K198823J020241J503907J27764k985547l287752o53184J432676K467314
18194B007326j54128j487442j318579o73718n0052N13867J460579J524383K499288
18185D321524J759643j140093j243009n49348j411997k007656k01234J198793
18177G26623R67681J790801K31289j602917k195683n63714R9003j270043r84677
$$ plain form
18168 -2801637 -1994096 -1524241 -2029715 -1456569 -1259537 -1561777 -1454920 340558 2472202
18159 2472202 2334897 1777877 1656316 583616 301400 1283924 1878889 1360125 -290831
18150 -290831 -1223070 -2085973 -2979237 -2458616 -2243733 -2040970 625 737718 47350
18141 47350 -449565 -1035030 -1303805 -1133865 -1085800 -117070 687562 200243 -844037 -4448572
18131 -4448572 -7200658 -7756027 -7684108 -6921066 -3326989 -1447711 -782598 -11986 546401
18122 546401 674148 89294 -1357009 -1867003 403737 1115158 1717570 3417582 3088423
18113 3088423 829723 1218256 1391592 86667 -458442 -553202 -743639 -1054820 -384053
18104 -384053 -774152 -1378476 -1511371 -2069405 -3244787 -3332260 -3110461 -3878661 -4740898 -4612738
$$ packed form
18168b801637Q07541M69855n05474N73146J97032l02240J06857J795478K131644
18159B472202j37305n57020j21561j072700k82216R82524N94965n18764j650956
18150b90831r32239q62903q93264N20621K14883K02763K041595P37093o90368
18141D7350m96915n85465k68775J69940M8065R68730Q04632m87319j044280l604535
18131d448572k752086n55369P1919P63042L594077J879278O65113P70612N58387
18122E46401J27747n84854j446303n09994K270740P11421O02412J700012l29159
18113C088423k258700L88533J73336j304925n45109r4760j90437l11181O70767
18104c84053l90099o04324j32895n58034j175382q7473K21799p68200q62237J28160
$$ plain form
18094 -4612738 -3860763 -2929407 -2056503 -1146356 1047954 2704457 2538060 377253 -1447461
18085 -1447461 -1285353 -356690 336407 479364 1193237 1018259 1536830 2959781 2788094
18076 2788094 1989307 1042386 1812770 2654072 1513034 1503945 1587024 988819 -90174 -877564
18066 -877564 -605418 -1368783 -2309328 -3746338 -5461260 -5524789 -4254995 -2778624 -1429500
18057 -1429500 277535 1071091 830261 13529 -815358 -532594 -1619233 -1866291 -2447391
18048 -2447391 -4831631 -5006830 -3671100 -3005064 -2646485 -1563880 -952741 -1186765 -389820
18039 -389820 -1493301 -3261169 -1877501 148984 984939 1770905 2099162 1988963 2841249
18030 2841249 3362042 2101681 2058921 4015836 3807311 2227619 183112 -1063431 339973
$$ packed form
18094d612738P51975R31356Q72904R10147K194310J656503j66397k160807j824714
18085a447461J62108R28663O93097J42957P13873j74978N18571J422951j71687
18076B788094p98787r46921P70384Q41302j141038r089Q3079n98205j078993p87390
18066h77564K72146p63365r40545j437010j714922o3529J269794J476371J349124
18057a429500J707035P93556k40830q16732q28887K82764j086639k47058n81100
18048b447391k384240j75199J335730O66036L58579J082605O11139k34024P96945
18039c89820j103481j767868J383668K026485Q35955P85966L28257j10199Q52286
18030B841249N20793j260361m2760J956915k08525j579692k044507j246543J403404
$$ plain form
18021 339973 983041 162474 109401 660750 -278184 -1737691 -1663112 -130468 1422673
18012 1422673 1392137 1244591 971544 1061228 2188536 1467960 -807244 -1417804 -1354268 -2211900
18002 -2211900 -3078271 -3112248 -1489502 1519149 3109013 2451903 2236858 2382546 3075192
17993 3075192 2616723 1919171 1557648 452035 -390765 -1248901 -2767624 -5108306 -6007858
17984 -6007858 -4558415 -1937002 -189169 804825 2866927 2260388 -325730 -1160231 -659117
17975 -659117 -207885 486756 1381589 2027010 1351718 -77235 -367336 -262974 -122409
17966 -122409 -152006 -250635 -215436 -993885 -1153314 -344824 -1438899 -2579861 -3073004 -4189945
17956 -4189945 -3993872 -2641007 -1020527 476019 847120 1136208 894885 -419290 -1855258
$$ packed form
18021C39973O43068q20567n3073N51349r38934j459507P4579J532644J553141
18012A422673l0536j47546k73047Q9684J127308p20576k275204o10560O3536q57632
18002b211900q66371l3977J622746L008651J589864o57110k15045J45688O92646
17993C075192m58469o97552l61523j105613q42800q58136j518723k340682q99552
17984f007858J449443K621413J747833R93994K062102o06539k586118q34501N01114
17975f59117M51232O94641Q94833O45421o75292j428953k90101J04362J40565
17966a22409k9597r8629L5199p78449j59429Q08490j094075j140962m93143j116941
17956d189945J96073J352865J620480J496546L71101K89088k41323j314175j435968
$$ plain form
17947 -1855258 -2270266 -1004945 227465 -370518 -1843648 -2629058 -3345412 -4700657 -4917049
17938 -4917049 -4632787 -5269608 -6165694 -6352390 -5531960 -5343196 -4157234 -2660257 -1985266
17929 -1985266 -2565022 -2372296 -2302204 -2460495 -562809 992516 1174903 -536356 -787164
17920 -787164 -13091 1399952 2212580 1526414 29551 -1989650 -3988087 -3888206 -1725360
17911 -1725360 -520219 -643040 -896771 999439 2606383 2429919 979761 -246515 -865297
17902 -865297 -698372 -117539 1009038 -221682 -762868 -332058 -439440 1522789 1953199
17893 1953199 887793 1031956 2210626 2216510 3469282 4032120 2512559 36754 -148003
17884 -148003 805501 685741 1375175 1482395 42800 -2619340 -4552658 -3707301 -2333379
$$ packed form
17947a855258m15008J265321J232410n97983j473130p85410p16354j355245k16392
17938d917049K84262o36821q96086j86696Q20430J88764J185962J496977O74991
17929a985266n79756J92726P0092j58291J897686J555325J82387j711259k50808
17920g87164P74073J413043Q12628o86166j496863k019201j998437R9881K162846
17911a725360J205141j22821k53731J896210J606944j76464j450158j226276o18782
17902h65297J66925N80833J126577j230720n41186M30810j07382J962229M30410
17893A953199j065406J44163J178670N884J252772N62838j519561k475805j84757
17884a48003R53504j19760O89434J07220j439595k662140j933318Q45357J373922
$$ plain form
17875 -2333379 -1766225 -3366481 -4489567 -4034208 -2519742 -2135476 -1000629 801345 1285106
17866 1285106 769014 -93150 -176750 1160020 2389113 805567 -1645424 -2427271 -2674488
17857 -2674488 -2620964 -1481370 -818285 218527 582744 -384667 -641155 691674 2048624
17848 2048624 1632140 101756 410015 1242568 2046689 2854537 2875630 2065430 1110441
17839 1110441 1115989 1109892 2037024 2777931 1920908 2552114 3344403 3602887 4194914 3369023
17829 3369023 2320461 2085132 483456 1016082 253461 -3665818 -4871453 -4712790 -3545347
17820 -3545347 -2364279 -2356897 -3173105 -2781151 -845202 363040 1816502 4207635 5440664
17811 5440664 5020775 3421697 3082724 3585943 4059712 4053688 3722544 3749885 3616201 3051392
$$ packed form
17875b333379N67154j600256j123086M55359J514466L84266J134847J801974M83761
17866A285106n16092q62164q3600J336770J229093j583546k450991p81847k47217
17857b674488N3524J139594O63085J036812L64217r67411k56488J332829J356950
17848B048624m16484j530384L08259Q32553Q04121Q07848K1093q10200r54989
17839A110441N548o097R27132P40907q57023O31206P92289K58484N92027q25891
17829C369023j048562k35329j601676N32626p62621l919279j205635J58663J167443
17820c545347J181068P382q16208L91954J935949J208242J453462K391133J233029
17811E440664m19889j599078l38973N03219M73769o024l31144K7341j33684n64809
$$ plain form
17801 3051392 3462320 2396835 735470 543246 561324 -472646 -1149570 -3061990 -4941248
17792 -4941248 -4173801 -2492142 -1673977 -1357503 -610937 -282196 78404 -741865 -3246999
17783 -3246999 -4590613 -4690566 -3021451 -1971160 -2588164 -2278933 -2238621 -1691645 114049
17774 114049 1296089 2186234 2016686 274440 -931249 -1655487 -1810708 -2740319 -2036142
17765 -2036142 -894494 -599798 -1055334 -105638 2862076 3067070 1076872 910732 -308036
17756 -308036 -2495588 -3122402 -562571 1418174 1271149 -97441 -228497 983843 2795373
17747 2795373 2723651 1047793 -108788 -189559 1134895 683349 623347 -44462 -748151
17738 -748151 425154 985651 872056 1018144 926494 -605441 -982307 -537170 -846219
$$ packed form
17801C051392M10928j065485j661365j92224J8078j033970o76924j912420j879258
17792d941248P67447J681659Q18165L16474P46566L28741L60600q20269k505134
17783c246999j343614r9953J669115J050291o17004L09231M0312N46976J805694
17774A14049J182040Q90145j69548j742246j205689p24238j55221r29611P04177
17765b036142J141648K94696m55536R49696K967714K04994j990198j66140j218768
17756c08036k187552o26814K559831J980745j47025j368590j31056J212340J811530
17747B795373p1722j675858j156581q0771J324454m51546o0002o67809p03689
17738g48151J173305N60497j13595J46088r1650j531935l76866M45137l09049
$$ plain form
17729 -846219 -587419 810415 1224341 410277 733193 2964598 4301427 4981055 4621541
17720 4621541 2285113 336628 -1493493 -2992073 -2851289 -2945981 -2631999 -1841411 -1473424
17711 -1473424 -738059 -444825 -716969 -1097696 -273875 1471141 2792056 2843267 727081
17702 727081 -613785 -891654 -1329924 -734013 -219319 -1196088 -1829215 -1210114 -1103775
17693 -1103775 -1848694 -2284651 -1144678 -935163 -2173814 -2753556 -1671406 -977747 -996735
17684 -996735 -1115346 77007 303815 574715 754929 2111561 3028812 2170528 1247056
17675 1247056 1611938 2807980 2088180 2071594 3681867 3845469 1539246 -461197 -552910
17666 -552910 763585 476258 -600250 928557 3043570 3043326 2576535 2534222 2878296 2522333
$$ packed form
17729h46219K58800J397834M13926q14064L22916K231405J336829O79628l59514
17720D621541k336428j948485j830121j498580J40784r4692L13982P90588L67987
17711a473424P35365K93234k72144l80727Q23821J745016J320915N1211k116186
17702G27081j340866k77869m38270N95911N14694r76769o33127O19101J06339
17693a103775p44919m35957J139973K09515j238651n79742J082150O93659j8988
17684i96735j18611J192353K26808K70900J80214J356632R17251q58284r23472
17675A247056L64882J196042p19800j6586J610273J63602k306223k000443r1713
17666e52910J316495k87327j076508J528807K115013k44m66791m2313L44074l55963
$$ plain form
17656 2522333 3653244 6024671 7286269 6397937 4191374 3060914 3241767 4245618
17648 4245618 3069560 1348529 1849151 2920450 3739580 3575606 1925670 1520892 2705711
17639 2705711 3089888 1883940 979811 1057353 288211 -404659 511207 713886 1409926
17630 1409926 2370497 1950522 2028704 1720395 1115498 459439 173480 417295 26743 -992376
17620 -992376 -1881960 -2448491 -2196563 -1989480 -2143540 -2006040 -1751031 -540168 1146705
17611 1146705 1382150 265353 -651275 -1767378 -2879456 -2720473 -2436503 -561323 2007191
17602 2007191 3193318 2379965 1452744 1928849 3728769 3000375 1465613 601058 -696979
17593 -696979 -1787442 -2514969 -2397055 -638437 985832 954743 -67204 -882913 -211763
$$ packed form
17656B522333J130911K371427J261598q88332k206563j130460J80853J003851
17648D245618j176058j721031N00622J071299Q19130j63974j649936m04778J184819
17639B705711L84177j205948r04129P7542p69142o92870R15866K02679O96040
17630A409926R60571m19975P8182l08309o04897o56059k85959K43815l90552j019119
17620i92376q89584n66531K51928K07083j54060J37500K55009J210863J686873
17611A146705K35445j116797r16628j116103j112078J58983K83970J875180K568514
17602B007191J186127q13353r27221M76105J799920p28394j534762q64555j298037
17593f96979j090463p27527J17914J758618J624269l1089j021947q15709O71150
$$ plain form
17584 -211763 433643 1172781 964038 -113101 -1526413 -2313750 -1799652 277594 1925344
17575 1925344 1784798 1016761 -186539 -957432 -1256888 -1765106 -2162236 -635129 -683543
17566 -683543 -2299513 -4137884 -4410023 -2364369 122187 2306238 2832013 3766090 4904444
17557 4904444 4917301 4764859 5360568 6385648 6547961 4829752 4431115 3793055 2336372
17548 2336372 963832 1301176 2212709 2064959 308702 -361963 -1199370 -2439413 -2403140
17539 -2403140 -704336 430788 -499598 -1273698 -913257 -958501 -954775 -1541914 -2536608 -1749417
17529 -1749417 262987 1387793 2760647 2494417 1315134 768523 624505 1321062 1564272
17520 1564272 291669 -2058641 -3582016 -4248492 -4661087 -2757915 533108 3071950
$$ packed form
17584b11763O45406P39138k08743j077139j413312p87337N14098K077246J647750
17575A925344j40546p68037j203300p70893k99456n08218l97130J527107m8414
17566f83543j615970j838371k72139K045654K486556K184051N25775R34077J138354
17557D904444J2857j52442N95709J025080J62313j718209l98637o38060j456683
17548B336372j372540L37344R11533j47750j756257o70665q37407j240043L6273
17539b403140J698804J135124r30386p74100L60441m5244L726n87139r94694P87191
17529a749417K012404J124806J372854k66230j179283n46611j44018O96557K43210
17520A564272j272603k350310j523375o66476m12595J903172L291023K538842
$$ plain form
17512 3071950 5433796 6013717 4057062 2359913 2230127 1518393 1063614 2733075 4221178
17503 4221178 4335965 4785881 5963036 6039916 3153739 422094 -47044 1631510 2617878
17494 2617878 2078872 1045731 2505971 3223323 1954568 217485 -1886976 -1760846 -176097
17485 -176097 -312467 -518290 824592 454524 -832377 -1422895 -3323859 -4065346 -2230665
17476 -2230665 46844 1713103 2466586 1717979 1517705 1866035 2136883 397404 -1005467
17467 -1005467 -859874 687681 1494216 1747626 1633660 1943278 2007952 1524397 876468
17458 876468 -117930 -546509 -768935 -384283 -98525 384833 1275478 2507180 2302794
17449 2302794 2109511 2447066 2505426 2315364 2542101 1923992 144632 -1208735 -1808797
$$ packed form
17512C071950K361846N79921j956655j697149j29786p11734m54779J669461J488103
17503D221178J14787M49916J177155P6880k886177k731645m69138J678554R86368
17494B617878n39006j033141J460240P17352j268755j737083k104461J26130J584749
17485a76097j36370k05823J342882l70068j286901n90518j900964p41487J834681
17476b230665K277509J666259P53483p48607k00274L48330K70848j739479j402871
17467a005467J45593J547555Q06535K53410j13966L09618O4674m83555o47929
17458H76468r94398m28579k22426L84652K85758M83358Q90645J231702k04386
17449B302794j93283L37555N8360j90062K26737o18109j779360j353367o00062
$$ plain form
17440 -1808797 -1925402 -1299495 -621210 -97007 557891 1372009 3417978 5408421 3994910
17431 3994910 732071 -1946103 -2882207 -2498112 -527068 843986 -306106 -1867118
17423 -1867118 -2839617 -2731595 -1162505 -594350 -485992 -275706 -1809582 -2272149 -1934324
17414 -1934324 -1497819 -559476 53809 -622485 -1002753 -542781 -271906 708267 2008622
17405 2008622 2975277 3668534 3155781 2645402 2354086 1389094 166953 -569482 -1948334
17396 -1948334 -1914132 -485992 66293 944662 1464815 673679 108049 553484 869609
17387 869609 703779 800052 862236 796848 391044 722320 2444937 3413981 4147418 4396026
17377 4396026 3294375 1759053 378697 -79203 -491408 -634739 -696721 483290 875899
$$ packed form
17440a808797j16605O25907O78285N24203O54898Q14118K045969J990443j413511
17431C994910l262839k678174r36104L84095J971044J371054j150092j561012
17423a867118r72499J08022J569090N68155J08358K10286j533876m62567L37825
17414a934324M36505R38343O13285o76294l80268M59972K70875R80173J300355
17405B008622R66655O93257n12753n10379k91316r64992j222141p36435j378852
17396a948334L4202J428140N52285Q78369N20153p91136n65630M45435L16125
17387H69609j65830R6273O2184o5388m05804L31276J722617R69044P33437K48608
17377D396026j101651j535322j380356m57900m12205j43331o1982J180011L92609
$$ plain form
17368 875899 588968 258454 327751 905447 770719 1359827 1062270 305043 735422 844352
17358 844352 202255 -1344684 -1055589 -466943 -709104 -400645 -233468 -804464 481177
17349 481177 1821700 2203359 3756387 3413306 1410991 191703 -924480 -2127329 -3154998
17340 -3154998 -3882901 -2633367 -2746139 -2831408 -1735425 -970125 -1477870 -1557304 -943345
17331 -943345 49049 360013 -302927 -1023170 -1359760 -962808 -455401 -1504563 -3290282
17322 -3290282 -3014394 -2299859 -1160732 783450 1192745 859080 1730517 1883221 1277936
$$ packed form
17368H75899k86931l30514O9297N77696j34728N89108k97557p57227M30379J08930
17358H44352o42097j546939K89095N88646k42161L08459J67177n70996J285641
17349D81177J340523L81659J553028l43081k002315j219288j116183j202849j027669
17340c154998p27903J249534j12772q5269J095983P65300n07745p9434O13959
17331i43345R92394L10964o62940p20243l36590L96952N07407j049162j785719
17322c290282K75888P14535J139127J944182M09295l33665Q71437J52704o05285
$$ [...]
##END NTUPLES=NMR SPECTRUM
##END=
