##TITLE=C13_LR-658-CuOTf-B
 D2O, 26200 sc

 2.04.2019
##JCAMPDX= 6.0         $$ Bruker NMR JCAMP-DX V2.0
##DATA TYPE= NMR SPECTRUM
##DATA CLASS= NTUPLES
##ORIGIN= UXNMR, Bruker Analytische Messtechnik GmbH
##OWNER= root
$$ XWIN-NMR		Version 3.5
$$ Wed Apr  3 13:46:11 2019 Russian Standard Time (UT+4h)  she@DPX200
##.OBSERVE FREQUENCY= 50.32789651
##.OBSERVE NUCLEUS= ^13C
##.ACQUISITION MODE= SIMULTANEOUS
##.ACQUISITION SCHEME= undefined
##.AVERAGES= 26200
##.DIGITISER RES= 17
##SPECTROMETER/DATA SYSTEM= spect
##.PULSE SEQUENCE= zgpg30
##.SOLVENT NAME= CD3CN
##.SHIFT REFERENCE= (INTERNAL, CD3CN, 0, 222.653)
##AUDIT TRAIL= $$ (NUMBER, WHEN, WHO, WHERE, WHAT)
$$ ##TITLE= Audit trail, XWIN-NMR		Version 3.5
$$ ##JCAMPDX= 5.01
$$ ##ORIGIN= Bruker BioSpin GmbH
$$ ##OWNER= she
$$ F:/spectra/data/she/nmr/c13/2/pdata/1/auditp.txt
$$ ##AUDIT TRAIL=  $$ (NUMBER, WHEN, WHO, WHERE, WHAT)
(   1,<2019-04-03 13:43:43.81 +0400>,<she>,<DPX200>,
      <created by zg, POWCHK disabled, PULCHK disabled
       terminated by command 'halt'
       configuration hash MD5:
       00 E9 B6 7A A2 85 ED C7 34 08 36 98 17 FE 4E 26
       data hash MD5: 32K
       46 C6 D0 0B C9 18 0A 52 A3 B0 A8 76 7D 28 A1 E7>)
(   2,<2019-04-03 13:44:03.18 +0400>,<she>,<DPX200>,
      <Start of raw data processing
       efp BC_mod = 2 LB = 1 FT_mod = 6 PKNL = 1 PHC0 = 1423.334 PHC1 = 17.86678 SI = 32K 
       data hash MD5: 32K
       98 B6 8F F6 24 09 33 30 38 A9 CD 9D 47 3D 5E CC>)
(   3,<2019-04-03 13:44:10.56 +0400>,<she>,<DPX200>,
      <abs ABSG = 5 
       data hash MD5: 32K
       1A E4 50 1B 0A B7 33 CF 42 23 5C 0B AC ED 54 11>)
(   4,<2019-04-03 13:44:30.35 +0400>,<she>,<DPX200>,
      <pk PHC0 = -1.762735 PHC1 = 0 
       data hash MD5: 32K
       F0 AB 26 00 33 06 AE 00 A0 C0 0A C1 77 31 38 4F>)
(   5,<2019-04-03 13:44:34.15 +0400>,<she>,<DPX200>,
      <abs ABSG = 5 
       data hash MD5: 32K
       CB 72 CA B3 A3 74 65 A5 2C 5B 20 65 DB 1F 15 F9>)
(   6,<2019-04-03 13:45:28.07 +0400>,<she>,<DPX200>,
      <abs ABSG = 5 
       data hash MD5: 32K
       12 72 ED 58 E6 4C FD 20 81 8A 7B 40 02 03 93 94>)
$$ ##END=
$$ 
$$ hash MD5
$$ 58 4F 10 E4 65 DA BB CE 63 94 A8 E2 1E 03 34 B8
##$RELAX= 
##$RELAX= 
##$RELAX= 
##$RELAX= 
##$RELAX= 
##$RELAX= 
##$RELAX= 
##$RELAX= 
$$ Bruker specific parameters
$$ --------------------------
##$DU= <F:/spectra>
##$EXPNO= 2
##$NAME= <c13>
##$PROCNO= 1
##$TYPE= <nmr>
##$USER= <she>
##$AMP= (0..31)
100 100 100 100 100 100 100 100 100 100 100 100 100 100 100 100 100 100 
100 100 100 100 100 100 100 100 100 100 100 100 100 100 
##$AQSEQ= 0
##$AQ_mod= 1
##$AUNM= <au_zg>
##$AUTOPOS= <>
##$BF1= 50.322709
##$BF2= 200.13
##$BF3= 50.322709
##$BF4= 500.13
##$BF5= 500.13
##$BF6= 500.13
##$BF7= 500.13
##$BF8= 500.13
##$BYTORDA= 1
##$CFDGTYP= 0
##$CFRGTYP= 5
##$CHEMSTR= <none>
##$CNST= (0..31)
1 1 145 1 1 1 1 1 1 1 1 1 1 1 1 1 1 1 1 1 1 1 1 1 1 1 1 1 1 1 1 1 
##$CPDPRG= <waltz16>
##$CPDPRG1= <>
##$CPDPRG2= <waltz16>
##$CPDPRG3= <>
##$CPDPRG4= <mlev>
$$ [...]
##$SUBNAM4= <"">
##$SUBNAM5= <"">
##$SUBNAM6= <"">
##$SUBNAM7= <"">
##$SUBNAM8= <"">
##$SUBNAM9= <"">
##$SW= 239.972172959595
##$SWIBOX= (0..15)
0 1 3 0 0 0 0 0 0 0 0 0 0 0 0 0 
##$SW_h= 12077.2946859903
##$TD= 32768
##$TD0= 1
##$TE= 0
##$TE2= 300
##$TE3= 300
##$TEG= 300
##$TL= (0..7)
120 120 120 120 120 120 120 120 
##$TP= (0..7)
150 150 150 150 150 150 150 150 
##$TP07= 0
##$TPNAME0= <>
##$TPNAME1= <>
##$TPNAME2= <>
##$TPNAME3= <>
##$TPNAME4= <>
##$TPNAME5= <>
##$TPNAME6= <>
##$TPNAME7= <>
##$TPOAL= (0..7)
0.5 0.5 0.5 0.5 0.5 0.5 0.5 0.5 
##$TPOFFS= (0..7)
0 0 0 0 0 0 0 0 
##$TUNHIN= 0
##$TUNHOUT= 0
##$TUNXOUT= 0
##$USERA1= <user>
##$USERA2= <user>
##$USERA3= <user>
##$USERA4= <user>
##$USERA5= <user>
##$V9= 5
##$VALIST= <valist>
##$VCLIST= <CCCCCCCCCCCCCCC>
##$VD= 0
##$VDLIST= <DDDDDDDDDDDDDDD>
##$VPLIST= <PPPPPPPPPPPPPPP>
##$VTLIST= <TTTTTTTTTTTTTTT>
##$WBST= 1024
##$WBSW= 4
##$XGAIN= (0..3)
0 0 0 0 
##$XL= 0
##$YL= 0
##$YMAX_a= 50901709
##$YMIN_a= -158069306
##$ZGOPTNS= <>
##$ZL1= 120
##$ZL2= 120
##$ZL3= 120
##$ZL4= 120
##$ABSF1= 222.6533
##$ABSF2= -17.34351
##$ABSG= 5
##$ABSL= 3
##$ALPHA= 0
##$AQORDER= 0
##$ASSFAC= 0
##$ASSFACI= 0
##$ASSFACX= 0
##$ASSWID= 0
##$AUNMP= <proc_1d>
##$AZFE= 0.1
##$AZFW= 0.5
##$BCFW= 0
##$BC_mod= 2
##$BYTORDP= 0
##$COROFFS= 0
##$CY= -3
##$DATMOD= 1
##$DC= 0
##$DFILT= <>
##$DTYPP= 0
##$F1P= 0
##$F2P= 0
##$FCOR= 0.5
##$FTSIZE= 32768
##$FT_mod= 6
##$GAMMA= 0
##$GB= 0
##$INTBC= 1
##$INTSCL= 1.329259e-09
##$ISEN= 128
##$LB= 1
##$LEV0= 0
##$LPBIN= 0
##$MAXI= 10000
##$MC2= 0
##$MEAN= 0
##$ME_mod= 0
##$MI= 0.9312502
##$NCOEF= 0
##$NC_proc= -2
##$NLEV= 6
##$NOISF1= 120.0001
##$NOISF2= 80.00006
##$NSP= 0
##$NTH_PI= 0
##$NZP= 0
##$OFFSET= 222.6533
##$PC= 1.4
##$PHC0= 1421.571
##$PHC1= 17.86678
##$PH_mod= 1
##$PKNL= yes
##$PPARMOD= 0
##$PSCAL= 0
##$PSIGN= 0
##$REVERSE= no
##$SF= 50.3227306370915
##$SI= 32768
##$SIGF1= 140
##$SIGF2= 120
##$SINO= 35.31775
##$SIOLD= 32768
##$SREGLST= <13C.CDCl3>
##$SSB= 0
##$STSI= 32768
##$STSR= 0
##$SW_p= 12077.2946859903
##$SYMM= 0
##$S_DEV= 0
##$TDeff= 32768
##$TDoff= 0
##$TI= <>
##$TILT= no
##$TM1= 0
##$TM2= 0
##$TOPLEV= 0
##$USERP1= <user>
##$USERP2= <user>
##$USERP3= <user>
##$USERP4= <user>
##$USERP5= <user>
##$WDW= 1
##$XDIM= 32768
##$YMAX_p= 204733462
##$YMIN_p= -41535292
$$ End of Bruker specific parameters
$$ ---------------------------------
##NTUPLES= NMR SPECTRUM
##VAR_NAME=  FREQUENCY,     SPECTRUM/REAL,   SPECTRUM/IMAG
##SYMBOL=    X,             R,               I
##VAR_TYPE=  INDEPENDENT,   DEPENDENT,       DEPENDENT
##VAR_FORM=  AFFN,          ASDF,            ASDF
##VAR_DIM=   32768,         32768,           32768
##UNITS=     HZ,            ARBITRARY UNITS, ARBITRARY UNITS
##FACTOR=    0.368581032318806, 1,           1
##FIRST=     11204.5222956761, 0,            0
##LAST=      -872.772390314241, 0,           0
##MIN=       -872.772390314241, -41535292,   0
##MAX=       11204.5222956761, 204733462,    0
$$ Real data points
##PAGE= N=1
##DATA TABLE= (X++(R..R)), XYDATA
$$ [...]
##PAGE= N=2
##DATA TABLE= (X++(I..I)), XYDATA
$$ plain form
4607 422505482 416154734 417436831 417291471 414118628 414240905 416895661 418061024 410856547
4599 410856547 409521994 416963951 420985458 415901532 408156786 403846913 401877076 401209486
4591 401209486 397039522 396246111 401744170 405778762 406557287 412501324 422798928 426416254
4583 426416254 429742823 430678946 428710106 424713559 418161211 416671376 419692748 419722840
4575 419722840 415053495 410907840 409451942 406432094 400914488 390535543 388178003 393585091
4567 393585091 401898955 406221532 411492189 411360496 413442817 419265673 418139338 416649997
4559 416649997 415817183 420719773 423909736 419155266 417890472 419778574 421629614 421799325
4551 421799325 418964461 418289021 426675474 430081981 423787053 416961924 418223775 418402646
$$ packed form
4607D22505482o350748J282097j45360l172843J22277K654756J165363p204477
4599D10856547j334553P441957M021507n083926p744746m309873j969837o67590
4591D01209486m169964p93411N498059M034592P78525N944037J0297604L617326
4583D26416254L326569R36123j968840l996547o552348j489835L021372L0092
4575D19722840m669345m145655j455898l019848n517606j0378945k357540N407088
4567C93585091Q313864M322577N270657j31693K082321N822856j126335j489341
4559D16649997q32814M902590L189963m754470j264794J888102J851040J69711
4551D21799325k834864o75440Q386453L406507o294928o825129J261851J78871
$$ plain form
4543 418402646 417266931 417123165 412894852 408788256 411946986 413896190 416457301 417228317
4535 417228317 413693980 419268181 426957601 432199945 432832046 429787892 424977596 424532558
4527 424532558 421314720 415162044 413401628 414439728 414006108 417007980 425029654 428720381
4519 428720381 426907262 420474717 410463281 402962211 406808838 408759534 410127516 415986634
4511 415986634 421552686 426820957 426978636 417269130 411478739 411156389 409244075 412643245
4503 412643245 421596876 427334857 434028596 439152088 435412572 424948509 420345908 423138570
4495 423138570 425469088 424929818 423592724 425164872 428567175 431158925 432751619 431522025
4487 431522025 424898676 418826228 414779245 410803180 413639669 419151322 418114271 413975095
$$ packed form
4543D18402646j135715j43766m228313m106596L158730J949204K561111P71016
4535D17228317l534337N574201P689420N242344O32101l044154m810296m45038
4527D24532558l217838o152676j760416J038100m33620L001872Q021674L690727
4519D28720381j813119o432545j0011436p501070L846627J950696J367982N859118
4511D15986634N566052N268271J57679r709506n790391l22350j912314L399170
4503D12643245Q953631N737981O693739N123492l739516j0464063m602601K792662
4495D23138570K330518n39270j337094J572148L402303K591750J592694j229594
4487D31522025o623349o072448m046983l976065K836489N511653j037051m139176
$$ plain form
4479 413975095 413378258 413222926 414046527 419800602 422783474 414954497 408287814 405548890
4471 405548890 402874357 405679584 407819741 411961281 414014865 409156631 407761097 412545672
4463 412545672 419458103 425855327 432502996 436283668 432373065 433247682 444308651 443883156
4455 443883156 433927401 422533459 419445583 421439448 418911144 419768137 422498445 416115126
4447 416115126 408677237 407055925 409637901 407988862 405983208 406376244 402979974 404755670
4439 404755670 406563530 403215013 402785598 403503529 406854475 417349226 423564941 425853198
4431 425853198 429543043 424232682 413573410 412789715 414866947 413041267 409971880 417049995
4423 417049995 422552231 415782579 412786764 411946088 410969276 410661453 414228132 420831865
$$ packed form
4479D13975095n96837j55332Q23601N754075K982872p828977o666683k738924
4471D05548890k674533K805227K140157M141540K053584m858234j395534M784575
4463D12545672O912431O397224O647669L780672l910603Q74617J1060969m25495
4455D43883156r955755j1393942l087876J993865k528304Q56993K730308o383319
4447D16115126p437889j621312K581976j649039k005654L93036l396270J775696
4439D04755670J807860l348517m29415P17931L350946J0494751O215715K288257
4431D25853198L689845n310361j0659272p83695K077232j825680l069387P078115
4423D17049995N502236o769652k995815q40676r76812l07823L566679O603733
$$ plain form
4415 420831865 419018386 416915246 415411147 420152878 416474597 413771947 411245273 410931508
4407 410931508 413818525 417166509 417282524 415445050 410903383 409093977 412123393 419801186
4399 419801186 423741802 424159021 422859501 415758602 408070495 402010859 396772734 403215076
4391 403215076 404204624 400181072 395580633 398155553 414760026 423238008 414563737 403842320
4383 403842320 399719976 405278795 411930327 407897393 410756358 409946778 408701874 412978246
4375 412978246 412760522 410860601 412056119 417144957 421916941 417084842 405988400 396674958
4367 396674958 395788503 402096319 405087423 401109685 399886232 405421876 408766833 410491009
4359 410491009 416144678 415558800 414951137 414124582 413647664 411830918 408076953 412232027 413119872
$$ packed form
4415D20831865j813479k103140j504099M741731l678281k702650k526674l13765
4407D10931508K887017L347984J16015j837474m541667j809406L029416P677793
4399D19801186L940616M17219j299520p100899p688107o059636n238125O442342
4391D03215076R89548m023552m600439K574920J6604473Q477982q674271j0721417
4383D03842320m122344N558819O651532m032934K858965q09580j244904M276372
4375D12978246k17724j899921J195518N088838M771984m832099j1096442r313442
4367C96674958q86455O307816K991104l977738j223453N535644L344957J724176
4359D10491009N653669n85878o07663q26555m76918j816746l753965M155074Q87845
$$ plain form
4350 413119872 414588845 415457657 413658810 412918729 416072347 418055204 420405051 419694557
4342 419694557 414801044 408572851 403734024 402913608 403022130 405659838 412098267 414791941
4334 414791941 417423295 416035159 407315615 406013381 407422891 408438920 407156475 403570396
4326 403570396 406911080 411840316 414274150 411911761 404730109 404581354 406909265 405679568
4318 405679568 406492294 411599199 411513033 412810175 413861510 413292067 405819221 401207201 405823459
4309 405823459 411011539 415089136 422183333 427729730 421257885 408388390 408404757 415390428
4301 415390428 413738714 407275480 405443681 407771670 406123953 403920892 405981118 398466521
4293 398466521 397830357 397934826 393157093 389116871 386607655 387905758 390458262 394257115
$$ packed form
4350D13119872J468973Q68812j798847p40081L153618J982857K349847p10494
4342D19694557m893513o228193m838827q20416J08522K637708O438429K693674
4334D14791941K631354j388136q719544j302234J409510J016029j282445l586079
4326D03570396L340684M929236K433834k362389p181652j48755K327911j229697
4318D05679568Q12726N106905q6166J297142J051335n69443p472846m612020M616258
4309D05823459N188080M077597P094197N546397o471845j2869495J6367O985671
4301D15390428j651714o463234j831799K327989j647717k203061K060226p514597
4293C98466521o36164J04469m777733m040222k509216J298103K552504L798853
$$ plain form
4285 394257115 400587345 409273312 412858653 408261334 405453244 407930116 412395053 423897437
4277 423897437 433477144 436961476 434018153 428981138 430613428 433641628 430876636 428814020
4269 428814020 435196641 436589215 427780911 419704325 416005901 415285636 411068910 406149538
4261 406149538 402903464 404120494 404464976 403119185 404672462 406728081 404466474 399079843
4253 399079843 399101149 404582838 408279517 410103061 414408261 417481543 414776763 412823052
4245 412823052 414980182 411192765 403525152 405440607 405621421 402707346 400669737 398071077
4237 398071077 401392568 403102498 407527726 409330585 413062061 419342887 414213184 409511299
4229 409511299 404895938 404710466 411288549 415516492 416454590 418115746 418626374 414982921
$$ packed form
4285C94257115O330230Q685967L585341m597319k808090K476872M464937J1502384
4277D23897437R579707L484332k943323n037015J632290L028200k764992k062616
4269D28814020O382621J392574q808304q076586l698424p20265m216726m919372
4261D06149538l246074J217030L44482j345791J553277K055619k261607n386631
4253C99079843K1306N481689L696679J823544M305200L073282k704780j953711
4245D12823052K157130l787417p667613J915455J80814k914075k037609k598660
4237C98071077L321491J709930M425228J802859L731476O280826n129703m701885
4229D09511299m615361j85472O578083M227943R38098J661156N10628l643453
$$ plain form
4221 414982921 410651575 406359822 408489296 410459228 414281973 421007241 419915500 416825461
4213 416825461 411447302 410229363 411346188 413255496 413156020 408127761 404731098 407395962
4205 407395962 407873528 398522371 398002322 404005494 408403930 408131436 410148467 412292673
4197 412292673 408721902 409039661 413692573 417049964 418532924 411381833 401709419 403771390
4189 403771390 407153881 411924113 418068136 416944676 408813738 402350844 403185189 400229317
4181 400229317 405192684 419184315 426463662 419801370 409028390 408268654 409275977 409153856
4173 409153856 409898853 409539508 405816509 405356412 407009407 408817495 410740600 413027832
4165 413027832 414226744 413963267 409740813 404897443 408956416 417983847 414777495 412966583
$$ packed form
4221D14982921m331346m291753K129474J969932L822745O725268j091741l090039
4213D16825461n378159j217939J116825J909308r9476n028259l396663K664864
4205D07395962M77566r351157n20049O003172M398436k72494K017031K144206
4197D12292673l570771L17759M652912L357391J482960p151091r672414K061971
4189D03771390L382491M770232O144023j123460q130938o462894Q34345k955872
4181D00229317M963367J3991631P279347o662292j0772980p59736J007323j22121
4173D09153856P44997l59345l722999m60097J652995J808088J923105K287232
4165D13027832J198912k63477m222454m843370M058973R027431l206352j810912
$$ plain form
4157 412966583 419737806 415585376 408629680 409714301 406424058 397846538 393618968 393907589
4149 393907589 393587103 401206398 411375405 418792630 422981556 422975268 422982477 424188643 426199053
4140 426199053 423939865 421249525 422639857 424480113 430528192 436794012 439316272 437250403
4132 437250403 435308122 435613109 427180004 418180817 416228056 417782298 421285452 423142424
4124 423142424 426095539 435064923 441182908 438070287 427603812 421202495 418599682 419896815
4116 419896815 421632889 415945775 412690816 412056104 416098125 418740838 415938423 413276159
4108 413276159 416724666 419476395 417952735 414927955 413524229 412430595 411265428 415040728
4100 415040728 419579087 420196921 420371447 421664110 421788578 421321280 416572671 415233143 411312136
$$ packed form
4157D12966583O771223m152430o955696J084621l290243q577520m227570K88621
4149C93907589l20486P619295J0169007P417225M188926o288P209J206166K010410
4140D26199053k259188k690340J390332J840256O048079O265820K522260k065869
4132D37250403j942281L04987q433105q999187j952761J554242L503154J856972
4124D23142424K953115Q969384O117985l112621j0466475o401317k602813J297133
4116D19896815J736074n687114l254959o34712M042021K642713k802415k662264
4108D13276159L448507K751729j523660l024780j403726j093634j165167L775300
4100D15040728M538359O17834J74526J292663J24468m67298m748609j339528l921007
$$ plain form
4091 411312136 415026560 414440771 414165588 418961978 417600027 410151150 407833924 409173104
4083 409173104 415189376 419641342 416020698 414818038 415826197 418283500 424274921 429620200
4075 429620200 433289892 436797839 431754907 423085989 420486590 421740712 429394708 438995587
4067 438995587 445318279 444258650 436015035 430071210 425329373 416618256 408290260 406692753
4059 406692753 408547625 408364654 410030157 410651828 416408009 426117031 425083939 416626449
4051 416626449 407782807 404075490 406920300 412643844 418668458 419713778 419254148 415491306
4043 415491306 408384166 407220927 410729946 414802563 415902032 410590845 405266086 412211876
4035 412211876 414730121 409558044 409239662 410761712 413710396 421246143 428077899 425878513
$$ packed form
4091D11312136L714424n85789k75183M796390j361951p448877k317226J339180
4083D09173104O016272M451966l620644j202660J008159K457303N991421N345279
4075D29620200L669692L507947n042932q668918k599399J254122P653996R600879
4067D38995587O322692j059629q243615n943825m741837q711117q327996j597507
4059D06692753J854872j82971J665503O21671N756181R709022j033092q457490
4051D16626449q843642l707317K844810N723544O024614J045320m59630l762842
4043D15491306p107140j163239L509019M072617J099469n311187n324759O945790
4035D12211876K518245n172077l18382J522050K948684P535747O831756k199386
$$ plain form
4027 425878513 420445486 414660253 407143641 404250983 404746965 401745920 405805519 412711932
4019 412711932 414587655 414219855 414164832 419155674 424174719 427164002 429287654 428907852 428460194
4010 428460194 426121178 421962247 408946284 395650166 399332142 406152960 407825824 406334921
4002 406334921 406260163 410046368 411459575 414841802 422296178 425079911 424937937 424744449 423142988
3993 423142988 418961893 419015525 421970978 424614018 422019126 420798834 422755246 425112448
3985 425112448 420172647 414521347 410361344 405720515 406476076 413890420 419109046 422429830
3977 422429830 425353546 423917039 415002318 413053948 416306370 416840141 419879215 424541297
3969 424541297 429211273 430953987 426485784 420527550 417992146 419516746 423884701 422905356
$$ packed form
4027D25878513n433027n785233p516612k892658M95982l001045M059599O906413
4019D12711932J875723l67800n5023M990842N019045K989283K123652l79802m47658
4010D28460194k339016m158931j3015963j3296118L681976O820818J672864j490903
4002D06334921p4758L786205J413207L382227P454376K783733j41974j93488j601461
3993D23142988m181095N3632K955453K643040k594892j220292J956412K357202
3985D25112448m939801n651300m160003m640829P55561P414344N218626L320784
3977D22429830K923716j436507q914721j948370L252422N33771L039074M662082
3969D24541297M669976J742714m468203n958234k535404J524600M367955r79345
$$ plain form
3961 422905356 412222426 405821282 403768673 401750559 405315211 407234793 407840830 406672242
3953 406672242 412856195 421158700 421940849 424284474 427987553 431433814 432738783 430333872
3945 430333872 425847843 421944940 424157801 432701069 430287597 418146988 407064528 399617785
3937 399617785 396419896 399853799 407042857 417150936 420185046 417250651 406436634 400790856
3929 400790856 407949076 419519386 426774138 426635342 425292046 422069486 414216710 409890018
3921 409890018 411852531 413427725 418724412 420417408 416194897 410876640 411427092 414196247
3913 414196247 417467383 427335280 430304173 430326483 423001639 410253832 401924478 402314189
3905 402314189 411296732 424527298 425619296 424485802 426769277 423897659 416265454 409273212
$$ packed form
3961D22905356j0682930o401144k052609k018114L564652J919582O06037j168588
3953D06672242O183953Q302505P82149K343625L703079L446261J304969k404911
3945D30333872m486029l902903K212861Q543268k413472j2140609j1082460p446743
3937C99617785l197889L433903P189058J0108079L034110k934395j0814017n645778
3929D00790856P158220J1570310P254752j38796j343296l222560p852776m326692
3921D09890018J962513J575194N296687J692996m222511n318257N50452K769155
3913D14196247L271136R867897K968893K2310p324844j2747807q329354L89711
3905D02314189Q982543J3230566J091998j133494K283475k871618p632205o992242
$$ plain form
3897 409273212 403177830 398810027 394789015 395252844 401762469 408990671 422293306 429785826
3889 429785826 428692001 415710659 405884706 408561722 410499387 413311928 415777052 412746880
3881 412746880 413582025 414750920 416003786 421150746 426910256 424471078 417972498 418522973
3873 418522973 419408629 418501622 411143721 400738956 393394088 395012205 403326751 408666743
3865 408666743 409094052 411304426 418367173 425828983 424885839 422922349 426321975 427733703
3857 427733703 431784835 437198426 435793805 425485059 416612226 413569933 421707790 425372842
3849 425372842 413905377 405672455 399811515 394685627 399820320 407021935 419433127 426697501
3841 426697501 430202113 427338565 423247766 419449013 417304610 416772040 416004391 417236640
$$ packed form
3897D09273212o095382m367803m021012M63829O509625P228202J3302635P492520
3889D29785826j093825j2981342r825953K677016J937665K812541K465124l030172
3881D12746880Q35145J168895J252866N146960N759510k439178o498580N50475
3873D18522973Q85656r07007p357901j0404765p344868J618117Q314546N339992
3865D08666743M27309K210374P062747P461810r43144j963490L399626J411728
3857D27733703M051132N413591j404621j0308746q872833l042293Q137857L665052
3849D25372842j1467465q232922n860940n125888N134693P201615J2411192P264374
3841D26697501L504612k863548m090799l798753k144403n32570p67649J232249
$$ plain form
3833 417236640 421183228 421548668 412320725 404945479 402961357 406206236 411103135 406096486
3825 406096486 399165818 402200085 412409329 413473327 413171334 413242658 409223850 407301937
3817 407301937 410828514 410977337 415768511 418179421 421358963 423869122 421196340 419576154
3809 419576154 412030888 401628692 399929201 409170352 416968668 417910766 421581001 430814358
3801 430814358 441214018 448919338 446425160 433244269 414230187 398564236 389841847
3794 389841847 384887431 388239767 393523046 397256952 395586059 396366848 402346425 402936959
3786 402936959 403162751 405289636 407874499 412612675 416598843 413596726 409969641 406617427
3778 406617427 409590509 418009691 415453766 407488139 400057960 395811573 395009320 398610229
$$ packed form
3833D17236640L946588L65440r227943p375246j984122L244879M896899n006649
3825D06096486o930668L034267J0209244J063998l01993P1324m018808j921913
3817D07301937L526577J48823M791174K410910L179542K510159k672782j620186
3809D19576154p545266j0402196j699491R241151P798316R42098L670235R233357
3801D30814358J0399660P705320k494178j3180891j9014082j5665951q722389
3794C89841847m954416L352336N283279L733906j670893P80789N979577N90534
3786D02936959K25792K126885K584863M738176L986168l002117l627085l352214
3778D06617427K973082Q419182k555925p965627p430179m246387q02253L600909
$$ plain form
3770 398610229 410391582 420857454 424669019 429791210 434507708 430766221 426347485 418850863
3762 418850863 412686141 408769796 405970154 406429073 407929456 411522663 414329781 424259030
3754 424259030 433762438 433069324 427961259 421239069 413510237 407863819 409925458 416574266
3746 416574266 419922515 414488918 418916416 421514339 410944317 404989715 403909682 408156168
3738 408156168 415857476 413653341 408578907 409390633 408019150 397710518 400861125 414269009
3730 414269009 412640764 416087972 423323990 423957589 417243387 421773933 432816876 428412190
3722 428412190 423700798 419915613 421712923 421595486 422983729 421892686 417031550 422039347
3714 422039347 428189867 428459372 423181841 429174149 434834219 433172973 428005854 416481023
$$ packed form
3770C98610229J1781353J0465872L811565N122191M716498l741487m418736p496622
3762D18850863o164722l916345k799642M58919J500383L593207K807118R929249
3754D24259030R503408o93114n108065o722190p728832n646418K061639O648808
3746D16574266L348249n433597M427498K597923j0570022n954602j080033M246486
3738D08156168P701308k204135n074434Q11726j371483j0308632L150607J3407884
3730D14269009j628245L447208P236018O33599o714202M530546J1042943m404686
3722D28412190m711392l785185J797310j17437J388243j091043m861136N007797
3714D22039347O150520K69505n277531N992308N660070j661246n167119j1524831
$$ plain form
3706 416481023 410674314 405046168 406914018 414330802 416795680 421008177 423434153 425311806
3698 425311806 427206697 428114385 430798506 426108780 423331212 425654926 418075693 411354301
3690 411354301 412680114 414828563 413707214 417682672 428552542 438900343 437732231 439974680
3682 439974680 441353187 438369322 434923752 432854144 432581679 427484146 414085318 405351861
3674 405351861 406524680 405893978 400413962 399370719 399880102 400162324 399435604 405674072 418104397
3665 418104397 423402042 425318780 428099141 431029662 428236313 423428222 422600211 419631463
3657 419631463 403932180 397135111 402372600 408650144 411879822 406716114 398574582 404694098
3649 404694098 415570292 420757016 414456632 411609088 407886041 406846652 407990546 406798326
$$ packed form
3706D16481023n806709n628146J867850P416784K464878M212497K425976J877653
3698D25311806J894891R07688K684121m689726k777568K323714p579233o721392
3690D11354301J325813K148449j121349L975458J0869870J0347801j168112K242449
3682D39974680J378507k983865l445570k069608k72465n097533j3398828q733457
3674D05351861J172819o30702n480016j043243N09383K82222p26720O238468J2430325
3665D18104397N297645J916738K780361K930521k793349m808091q28011k968748
3657D19631463j5699283o797069N237489O277544L229678n163708q141532O119516
3649D04694098J0876194N186724o300384k847544l723047j039389J143894j192220
$$ plain form
3641 406798326 409941517 415856036 426077565 421044278 411826722 407604260 401922158 398712665
3633 398712665 391525680 391869594 395000687 395401574 401818978 406735142 410097817 418483061
3625 418483061 420851309 417279666 411243185 411931588 415662968 412653694 409776821 411099450
3617 411099450 407491623 407030722 412986221 422964818 434740041 440074926 442644805 437762581
3609 437762581 426747996 417755233 421702447 429993526 427900328 419004755 415114325 417947188
3601 417947188 422771694 419221766 416516696 425385887 430017867 420598099 415511593 419154437
3593 419154437 421233086 420475501 419890278 417679496 414615563 412179154 409125904 406615607
3585 406615607 405415297 408821200 412509753 411327992 408379108 410665940 415032052 418547514
$$ packed form
3641D06798326L143191N914519J0221529n033287r217556m222462n682102l209493
3633C98712665p186985L43914L131093M00887O417404M916164L362675Q385244
3625D18483061K368248l571643o036481O88403L731380l009274k876873J322629
3617D11099450l607827m60901N955499R978597J1775223N334885K569879m882224
3609D37762581j1014585q992763L947214Q291079k093198q895573l890430K832863
3601D17947188M824506l549928k705070Q869191M631980r419768n086506L642844
3593D19154437K078649p57585n85223k210782l063933k436409l053250k510297
3585D06615607j200310L405903L688553j181761k948884K286832M366112L515462
$$ plain form
3577 418547514 420417376 415222773 410320748 410815960 414329165 415647492 417326155 419214969
3569 419214969 420372700 419140080 411223875 409479421 412312083 415624751 417749649 422228055
3561 422228055 428134405 428981927 422586962 420577776 423768386 426125549 423004285 416420645
3553 416420645 415050972 413933467 409132792 407008910 413431337 415819686 412981296 412171127
3545 412171127 415746417 419386808 411649802 401844150 402413955 409334424 406637179 392705291
3537 392705291 385445080 391126209 397380329 401668870 410038973 418481780 422595398 423443236
3529 423443236 428124276 432208662 434721881 428404228 423705348 422632490 420510277 420303943
3521 420303943 418378679 418714809 417727291 419830093 427779595 431627167 427358146 428279967
$$ packed form
3577D18547514J869862n194603m902025M95212L513205J318327J678663J888814
3569D19214969J157731j232620p916205j744454K832662L312668K124898M478406
3561D22228055N906350Q47522o394965k009186L190610K357163l121264o583640
3553D16420645j369673j117505m800675k123882O422427K388349k838390q10169
3545D12171127L575290L640391p737006r805652N69805O920469k697245j3931888
3537C92705291p260211N681129O254120M288541Q370103Q442807M113618Q47838
3529D23443236M681040M084386K513219o317653m698880j072858k122213k06334
3521D20303943j925264L36130r87518K102802P949502L847572m269021R21821
$$ plain form
3513 428279967 428224532 426559490 432731382 434812909 427512836 421730376 420781561 419633733
3505 419633733 410928982 409340699 411651892 415638864 422960001 427475783 424515468 418640249
3497 418640249 417640173 419383929 416232658 412082849 407918643 411103634 418259803 423426613
3489 423426613 425209808 426469277 426066401 423237704 420155843 414637883 407136834 404622670
3481 404622670 404916456 409459226 420065639 421735475 420395052 418893871 411095797 404375615
3473 404375615 401162346 401871468 412121867 417306898 412734608 406212007 407777180 411779625
3465 411779625 414693873 414520720 411266973 408449231 409311384 414048414 419345353 423477176
3457 423477176 422388400 411384246 406759027 405938985 407362552 414452397 415280609 414036431
$$ packed form
3513D28279967n5435j665042O171892K081527p300073n782460r48815j147828
3505D19633733q704751j588283K311193L986972P321137M515782k960315n875219
3497D18640249j000076J743756l151271m149809m164206L184991P156169N166810
3489D23426613J783195J259469m02876k828697l081861n517960p501049k514164
3481D04622670K93786M542770J0606413J669836j340423j501181p798074o720182
3473D04375615l213269P09122J0250399N185031m572290o522601J565173M002445
3465D11779625K914248j73153l253747k817742Q62153M737030N296939M131823
3457D23477176j088776j1004154m625219q20042J423567P089845Q28212j244178
$$ plain form
3449 414036431 419231967 426908628 426086969 420811370 415992676 408638635 409650632 409990276
3441 409990276 409641941 412960878 425642126 436997815 436212718 432382891 430363399 434806946
3433 434806946 438585953 436099588 427142417 419915011 417476638 415786075 413188903 404793260
3425 404793260 394185146 396506987 403057938 407033986 412285216 414531460 415551327 412256652
3417 412256652 402312082 392239300 387668985 386561660 388512098 389981716 391412599 398775268
3409 398775268 413548400 426883405 425104419 416772344 417726546 416907815 412553338 413674598
3401 413674598 410886443 407943620 409044842 413621308 424473567 426131399 421521924 416299951
3393 416299951 408843857 408929530 410561382 411259325 416057800 418263519 416558983 411152189
$$ packed form
3449D14036431N195536P676661q21659n275599m818694p354041J011997L39644
3441D09990276l48335L318937J2681248J1355689p85097l829827k019492M443547
3433D34806946L779007k486365q957171p227406k438373j690563k597172q395643
3425D04793260j0608114K321841O550951L976048N251230K246244J019867l294675
3417D12256652r944570j0072782m570315j107325J950438J469618J430883P362669
3409C98775268J4773132J3335005j778986q332075R54202q18731m354477J121260
3401D13674598k788155k942823J101222M576466J0852259J657832m609475n221973
3393D16299951p456094Q5673J631852O97943M798475K205719j704536n406794
$$ plain form
3385 411152189 403950421 404468502 401761501 401524875 410448832 413055416 406353647 403899366
3377 403899366 404338884 405395622 412010252 416345556 417090978 416764869 416920962 419237052 414557931
3368 414557931 412510632 415614483 416765200 420514970 423393576 419796428 417477497 417778284
3360 417778284 413955267 410823070 405413428 401825405 400212537 409502231 412816263 409656722
3352 409656722 409157174 404748571 398608773 395492398 401923427 410528636 422111859 430887995
3344 430887995 431719115 429030445 423892434 418857927 410296705 404859075 401775845 394175478
3336 394175478 401316432 411470047 413805962 416515443 418397080 421956824 422555059 419732009
3328 419732009 415951188 414060097 414133208 404808086 395611279 402269983 410412311 411116604
$$ packed form
3385D11152189p201768N18081k707001k36626Q923957K606584o701769k454281
3377D03899366M39518J056738O614630M335304P45422l26109J56093K316090m679121
3368D14557931k047299L103851J150717L749770K878606l597148k318931L00787
3360D17778284l823017l132197n409642l588023j612868R289694L314032l159541
3352D09656722m99548m408603o139798l116375O431029Q605209J1583223Q776136
3344D30887995Q31120k688670n138011n034507q561222n437630l083230p600367
3336C94175478P140954J0153615K335915K709481J881637L559744N98235k823050
3328D19732009l780821j891091P3111r325122r196807O658704Q142328P04293
$$ plain form
3320 411116604 409618335 409474706 407921841 411401685 415527348 418537196 423580363 426075725
3312 426075725 418945827 415479451 419432886 420819138 421001815 420615407 422411167 418181299
3304 418181299 412514873 413324536 414119073 414843761 415304957 409854371 406138061 402712579 401001701
3295 401001701 403638275 406809448 405240226 405708377 408923852 406201836 402625199 405345007
3287 405345007 408595603 409949216 409001491 406822726 404725750 398530471 395650320 396758846
3279 396758846 393918032 390396001 391998905 391921454 400104422 408707087 413921392 417321565
3271 417321565 416886081 412784381 408984404 413767808 419369197 416972715 411658068 410823833
3263 410823833 410230611 413070142 411538698 407267974 408656643 402653880 403237532 413193589
$$ packed form
3320D11116604j498269j43629j552865L479844M125663L009848N043167K495362
3312D26075725p129898l466376L953435J386252J82677l86408J795760m229868
3304D18181299n666426Q09663P94537P24688M61196n450586l716310l425482j710878
3295D01001701K636574L171173j569222M68151L215475k722016l576637K719808
3287D05345007L250596J353613r47725k178765k096976o195279k880151J108526
3279C96758846k840814l522031J602904p7451Q182968Q602665N214305L400173
3271D17321565m35484m101700l799977M783404N601389k396482n314647q34235
3263D10823833n93222K839531j531444m270724J388669o002763N83652R956057
$$ plain form
3255 413193589 418958569 417751610 415694769 414645166 412585800 404335514 407018331 422380127
3247 422380127 425574107 423371091 422329049 419751803 414759760 416258100 420350162 421648022
3239 421648022 412869358 409605795 413640520 413189860 417492930 424406543 424502009 424394637 423438954
3230 423438954 426993252 427380970 426586828 426506806 415680863 406079389 401494851 408739926
3222 408739926 415631313 417133795 413265226 406052736 408230251 409196715 406483089 410863376
3214 410863376 411907791 414684180 418238738 423716911 422465931 415548718 410147307 403232885
3206 403232885 399403749 394884460 392634151 390926659 398509629 406507872 407870077 410076982
3198 410076982 412991593 422566672 436997930 440194196 425833285 413575274 406399606 399401133
$$ packed form
3255D13193589N764980j206959k056841j049603k059366q250286K682817J5361796
3247D22380127L193980k203016j042042k577246m992043J498340M092062J297860
3239D21648022q778664l263563M034725m50660M303070O913613R5466j07372r55683
3230D23438954L554298L87718p94142q0022j0825943r601474m584538P245075
3222D08739926O891387J502482l868569p212490K177515R66464k713626M380287
3214D10863376J044415K776389L554558N478173j250980o917213n401411o914422
3206D03232885l829136m519289k250309j707492P582970P998243J362205K206905
3198D10076982K914611R575079J4431258L196266j4360911j2258011p175668o998473
$$ plain form
3190 399401133 389984772 385774899 393215049 407798063 417990499 422852155 421127474 414520287
3182 414520287 414512401 416117727 413290172 412322290 415004121 422475726 420036290 413810848 418534258
3173 418534258 428649997 437860304 442728358 442265766 440629909 436993943 424577303 412891093
3165 412891093 405795324 403078790 398135142 395200049 403857019 410787327 410891339 415676655
3157 415676655 416375077 409552138 401158268 404913092 418300287 430739341 427504890 413696721
3149 413696721 411952581 424677006 432049668 429117839 420804081 416259823 423347180 426272558
3141 426272558 417853150 405635527 401940920 406965861 418643138 425369388 424708998 424049488
3133 424049488 422141816 421849810 421835415 420947688 420674210 419484640 417992110 419054035 423466102
$$ packed form
3190C99401133r416361m209873P440150J4583014J0192436M861656j724681o607187
3182D14520287p886J605326k827555r67882K681831P471605k439436o225442M723410
3173D18534258J0115739R210307M868054m62592j635857l635966j2416640j1686210
3165D12891093p095769k716534m943648k935093Q656970O930308J04012M785316
3157D15676655O98422o822939q393870L754824J3387195J2439054l234451j3808169
3149D13696721j744140J2724425P372662k931829q313758m544258P087357K925378
3141D26272558q419408j2217623l694607N024941J1677277O726250o60390o59510
3133D24049488j907672k92006j4395q87727k73478j189570j492530J061925M412067
$$ plain form
3124 423466102 426261167 418958070 415433145 414952141 405328986 401494692 412993739 417934341
3116 417934341 416255488 419788765 422499062 421123652 417551690 412295771 405359443 401747948
3108 401747948 405360910 415614797 419225666 413260590 406461150 409875271 414093174 412420162
3100 412420162 412101757 412076873 412127054 414791298 417393776 417808101 418759473 423301964 427697732
3091 427697732 425017736 423499626 425349231 422452947 421320655 420408002 415213819 411438325
3083 411438325 407404561 405555252 407770526 411199109 414054391 416366668 414670994 415294076
3075 415294076 417669182 413862271 407726448 407095853 403102360 398830076 404419518 414752043
3067 414752043 419724194 421787426 419730507 417680584 421138905 425090152 421778083 419604795
$$ packed form
3124D23466102K795065p303097l524925m81004r623155l834294J1499047M940602
3116D17934341j678853L533277K710297j375410l571962n255919o936328l611495
3108D01747948L612962J0253887L610869n965076o799440L414121M217903j673012
3100D12420162l18405k4884N0181K664244K602478M14325R51372M542491M395768
3091D27697732k679996j518110J849605k896284j132292r12653n194183l775494
3083D11438325m033764j849309K215274L428583K855282K312277j695674O23082
3075D15294076K375106l806911o135823o30595l993493m272284N589442J0332525
3067D14752043M972151K063232k056919k049923L458321L951247l312069k173288
$$ plain form
3059 419604795 417706746 418480632 421936337 421564087 422723482 423676183 424421756 422176904 408785336
3050 408785336 400009858 400676289 404511514 405417707 403096821 406340274 407642252 407954283
3042 407954283 409464816 407217032 406186432 411422721 417383282 415913377 417187532 425226630
3034 425226630 430965290 432307742 433936799 430429010 422987880 418624782 420036747 419140418
3026 419140418 415657794 412019617 411688928 416169878 420272005 426332880 430769281 424333092
3018 424333092 417110439 413334364 409774043 407897871 415561164 423538444 426192525 416310537
3010 416310537 409734643 406382637 404429320 408298976 411492023 412404154 414012719 421519782
3002 421519782 426869753 424273939 422647400 428676364 433859508 433179709 432745383 433088499
$$ packed form
3059D19604795j898049P73886L455705l72250J159395R52701P45573k244852j3391568
3050D08785336q775478O66431L835225R06193k320886L243453J301978L12031
3042D07954283J510533k247784j030600N236289N960561j469905J274155Q039098
3034D25226630N738660J342452J629057l507789p441130m363098J411965q96329
3026D19140418l482624l638177l30689M480950M102127O060875M436401o436189
3018D24333092p222653l776075l560321j876172P663293P977280K654081r881988
3010D16310537o575894l352006j953317L869656L193047R12131J608565P507063
3002D21519782N349971k595814j626539O028964N183144o79799m34326L43116
$$ plain form
2994 433088499 428242985 421253936 414406225 416219880 423845612 431105750 432738253 431830750
2986 431830750 433200348 440673942 439199924 432535812 424265294 415814514 414793615 417522652
2978 417522652 417700923 420843658 423569193 424413965 426826087 428562134 423488599 416686825
2970 416686825 414462146 414320797 411079234 408419254 409459887 418877530 427958701 426428740
2962 426428740 420700222 422126727 421505142 424109520 426442648 427802382 433297812 426000517
2954 426000517 412813169 407012279 405072086 404884698 408077052 422141828 431174174 425892738
2946 425892738 422211313 426974644 433486566 440379008 438533136 434659781 439008185 442951616
2938 442951616 436474465 425075145 418647582 421635436 436606582 449297388 452893187 448585005
$$ packed form
2994D33088499m845514o989049o847711J813655P625732P260138J632503r07503
2986D31830750J369598P473594j474018o664112q270518q450780j020899K729037
2978D17522652J78271L142735K725535Q44772K412122J736047n073535o801774
2970D16686825k224679j41349l241563k659980J040633R417643R081171j529961
2962D26428740n728518J426505o21585K604378K333128J359734N495430p297295
2954D26000517j3187348n800890j940193j87388L192354J4064776R032346n281436
2946D25892738l681425M763331O511922O892442j845872l873355M348404L943431
2938D42951616o477151j1399320o427563K987854J4971146J2690806L595799m308182
$$ plain form
2930 448585005 439491561 432520494 426928550 418832686 415385164 418182364 423211356 427323431
2922 427323431 425114706 416467606 414246228 411615898 409073809 412019091 418226145 423384555
2914 423384555 432839936 445982597 440340941 421985024 411443909 402115813 397511357 397895883
2906 397895883 399057448 404729859 405595983 403959375 407606245 415281887 420310349 414825160
2898 414825160 410720113 411671712 412748045 412878166 419476113 431055559 434501383 427356552
2890 427356552 417397151 413440324 412338285 410844660 418909745 424961288 424487917 427003044
2882 427003044 426290250 425481910 420616186 416258490 414238517 416587076 424188269 428751255
2874 428751255 424852762 427270951 429921553 432100345 431910627 432773315 433646842 428913506
$$ packed form
2930D48585005r093444o971067n591944q095864l447522K797200N028992M112075
2922D27323431k208725q647100k221378k630330k542089K945282O207054N158410
2914D23384555R455381J3142661n641656j8355917j0541115r328096m604456L84526
2906C97895883J161565N672411Q66124j636608L646870P675642N028462n485189
2898D14825160m105047R51599J076333J30121O597947J1579446L445824p144831
2890D27356552r959401l956827j102039j493625Q065085O051543m73371K515127
2882D27003044p12794q08340m865724m357696k019973K348559P601193M562986
2874D28751255l898493K418189K650602K178792j89718Q62688Q73527m733336
$$ plain form
2866 428913506 415878923 405838872 403648178 405345261 412682157 414749122 414544356 418498181
2858 418498181 423299018 427736894 429912582 432242523 433987364 422786353 407562924 404798500
2850 404798500 406646141 409708062 412171004 414320562 412293786 415854536 422216170 418822444
2842 418822444 416468060 418036335 424292351 427961574 424431175 416792957 410810825 413358232
2834 413358232 418173917 419836366 414437224 418433827 433074561 433671109 425902361 424529495
2826 424529495 421739736 416757963 417979747 419505802 417903064 424295211 430567181 430068659
2818 430068659 430621797 437665415 443258417 439009281 432226289 423980398 421221223 420445079
2810 420445079 418790648 422515201 433383075 440316721 432290373 419112515 415301348 418584857
$$ packed form
2866D28913506j3034583j0040051k190694J697083P336896K066965k04766L953825
2858D18498181M800837M437876K175688K329941J744841j1201011j5223429k764424
2850D04798500J847641L061921K462942K149558k026776L560750O361634l393726
2842D18822444k354384J568275O256016L669223l530399p638218n982132K547407
2834D13358232M815685J662449n399142L996603J4640734N96548p768748j372866
2826D24529495k789759m981773J221784J526055j602738O392147O271970m98522
2818D30068659N53138P043618N593002m249136o782992q245891k759175p76144
2810D20445079j654431L724553J0867874O933646q026348j3177858l811167L283509
$$ plain form
2802 418584857 412982348 401077960 405215093 410321701 412933603 416881353 411505756 406746114
2794 406746114 411949471 423745061 429282382 429197308 425224502 413036981 408934829 415619988
2786 415619988 424258876 429129080 432131868 430470874 434901267 437105214 439476374 439654684
2778 439654684 438566836 435413596 424164933 422214280 428972792 430270304 423782429 421209498
2770 421209498 422211368 421457205 428618267 432948191 430372275 427563962 424899798 426667539
2762 426667539 423389229 416793065 417962103 417383560 412695130 418289037 424930891 422139009
2754 422139009 424590091 431266788 432468032 424183124 412032734 402339819 403228698 409609878
2746 409609878 412716602 408345596 408085576 408889827 405142729 404310643 406848834 418008348
$$ packed form
2802D18584857n602509j1904388M137133N106608K611902L947750n375597m759642
2794D06746114N203357J1795590N537321q5074l972806j2187521m102152O685159
2786D15619988Q638888M870204L002788j660994M430393K203947K371160J78310
2778D39654684j087848l153240j1248663j950653O758512J297512o487875k572931
2770D21209498J001870p54163P161062M329924k575916k808313k664164J767741
2762D26667539l278310o596164J169038n78543m688430N593907O641854k791882
2754D22139009K451082O676697J201244q284908j2150390r692915Q88879O381180
2746D09609878L106724m371006k60020Q04251l747098q32086K538191J1159514
$$ plain form
2738 418008348 425093322 418209641 410926674 408822500 410226650 407851601 409066853 412962664
2730 412962664 411793919 411459453 414498058 410795193 403705545 405812660 412927523 413663741
2722 413663741 413159939 417031065 420391269 424990809 422700918 424156122 426507006 421801217
2714 421801217 422136187 427339201 423984100 416691062 412789818 408374352 401455852 401832037
2706 401832037 408991445 419471769 423780003 422137494 420713876 424702282 425375638 425859217
2698 425859217 424219076 423712187 422032441 410551610 404413520 401916570 400750451 408501768
2690 408501768 412722640 412176402 409509476 412688839 424411752 427390154 416252897 412180195
2682 412180195 414156956 423036304 426363077 417588631 410038868 406621878 403984369 405887841
$$ packed form
2738D18008348P084974o883681p282967k104174J404150k375049J215252L895811
2730D12962664j168745l34466L038605l702865p089648K107115P114863P36218
2722D13663741n03802L871126L360204M599540k289891J455204K350884m705789
2714D21801217L34970N203014l355101p293038l901244m415466o918500L76185
2706D01832037P159408J0480324M308234j642509j423618L988406O73356M83579
2698D25859217j640141n06889j679746j1480831o138090k496950j166119P751317
2690D08501768M220872n46238k666926L179363J1722913K978402j1137257m072702
2682D12180195J976761Q879348L326773q774446p549763l416990k637509J903472
$$ plain form
2674 405887841 414693300 424807290 429062965 431864836 431637327 421768462 417966209 426487479
2666 426487479 432336595 437471262 441014133 435033576 429717282 426350565 422217931 427927484
2658 427927484 438706861 448504549 452099434 444741482 434980027 436704878 437579592 430502873
2650 430502873 424735388 417199356 420150151 428166313 430401280 423461373 417715116 418478998
2642 418478998 417625013 418009311 419599624 418694670 418912772 413986460 412162819 415847645 421068718
2633 421068718 431565560 431340359 425841577 424604858 426260523 424969888 420736280 419556651
2625 419556651 417494551 415116387 416959478 420001663 422770768 424689898 422052216 418936092
2617 418936092 412605444 408087849 405793614 407085931 415098179 427875841 431535590 430372642
$$ packed form
2674D05887841Q805459J0113990M255675K801871k27509r868865l802253Q521270
2666D26487479N849116N134667L542871n980557n316294l366717m132634N709553
2658D27927484J0779377R797688L594885p357952r761455J724851Q74714p076719
2650D30502873n767485p536032K950795Q016162K234967o939907n746257P63882
2642D18478998q53985L84298J590313r04954K18102m926312j823641L684826N221073
2633D21068718J0496842k25201n498782j236719J655665j290635m233608j179629
2625D19556651k062100k378164J843091L042185K769105J919130k637682l116124
2617D18936092o330648m517595k294235J292317Q012248J2777662L659749j162948
$$ plain form
2609 430372642 425846153 423817498 423334820 420421176 418998977 421276132 426249580 425074256
2601 425074256 417016921 413115683 417617544 418278807 421285344 428827411 430889462 421927673
2593 421927673 415895498 417787028 417572919 416983308 416287432 422929399 426783223 423286513
2585 423286513 424544753 429600656 435706748 438892315 439754258 436015102 430476946 427461174
2577 427461174 421692330 425445945 428746331 420672573 409670375 403881568 410022558 419079285
2569 419079285 422950531 423581845 425807611 428140261 426364570 423506627 419841262 414709983
2561 414709983 411477049 411288498 410729326 406265792 409500494 420139776 424443990 423209842
2553 423209842 419265318 409035510 400666629 398440730 412324563 425950908 426236144 427209455
$$ packed form
2609D30372642m526489k028655m82678k913644j422199K277155M973448j175324
2601D25074256q057335l901238M501861O61263L006537P542067K062051q961789
2593D21927673o032175J891530k14109n89611o95876O641967L853824l496710
2585D23286513J258240N055903O106092L185567Q61943l739156n538156l015772
2577D27461174n768844L753615L300386q073758j1002198n788807O140990R056727
2569D19079285L871246O31314K225766K332650j775691k857943l665365n131279
2561D14709983l232934j88551n59172m463534L234702J0639282M304214j234148
2553D23209842l944524j0229808q368881k225899J3883833J3626345K85236R73311
$$ plain form
2545 427209455 433470088 435163182 431919250 429019741 423992922 417010898 408896260 406403824
2537 406403824 408635508 409706005 410658627 411937279 412457116 415323974 419515055 413341129
2529 413341129 406105523 408556814 410145812 406734963 395526835 388803722 392552750 400559681
2521 400559681 401725885 395755657 398820537 406433136 408462921 416222891 428666324 433634083
2513 433634083 430022257 426492649 423575286 417462286 414273478 417992710 417233469 404008689
2505 404008689 397393043 400388094 399524221 407184585 415435510 421257956 425221913 421467616
2497 421467616 418879530 426600213 438506586 446977952 444308258 444010890 435973830 428227299
2489 428227299 428058725 427775718 433882636 434120755 428282412 421922888 418854394 424137538
$$ packed form
2545D27209455O260633J693094l243932k899509n026819o982024q114638k492436
2537D06403824K231684J070497R52622J278652N19837K866858M191081o173926
2529D13341129p235606K451291J588998l410849j1208128o723113L749028Q006931
2521D00559681J166204n970228L064880P612599K029785P759970J2443433M967759
2513D33634083l611826l529608k917363o113000l188808L719232p59241j3224780
2505D04008689o615646K995051q63873P660364Q250925N822446L963957l754297
2497D21467616k588086P720683J1906373Q471366k669694k97368q037060p746531
2489D28227299j68574k83007O106918K38119n838343o359524l068494N283144
$$ plain form
2481 424137538 427960474 428898338 423995550 420724053 418914842 413277106 411833509 421452373
2473 421452373 421502267 421280791 423662546 422600769 423153818 421657682 421310903 428842638 428763681
2464 428763681 425076517 423190361 428291056 431483328 427145143 423908611 421578148 422366965
2456 422366965 422719754 428168594 429798608 421230031 415094849 414560697 416042369 424283759
2448 424283759 428476308 420745080 413821362 409493497 411056265 411973233 416533230 422989693
2440 422989693 429272724 436112966 443853598 446309228 437256662 431182956 436095124 436691518
2432 436691518 428497124 427943306 430101387 426293477 422330758 427631197 432007241 425179333
2424 425179333 420733401 424242232 427465319 432931420 437787858 436855919 429539542 421471386
$$ packed form
2481D24137538L822936R37864m902788l271497j809211n637736j443597R618864
2473D21452373M9894k21476K381755j061777N53049j496136l46779P531735p8957
2464D28763681l687164j886156N100695L192272m338185l236532k330463P88817
2456D22366965L52789N448840J630014q568577o135182n34152J481672Q241390
2448D24283759M192549p731228o923718m327865J562768R16968M559997O456463
2440D22989693O283031O840242P740632K455630r052566o073706M912168N96394
2432D36691518q194394n53818K158081l807910l962719N300439M376044o827908
2424D25179333m445932L508831L223087N466101M856438r31939p316377q068156
$$ plain form
2416 421471386 421752545 428267268 435347288 440604317 437794767 433283845 430515198 428551864
2408 428551864 426321634 426657282 426210691 417365664 404895650 405887292 415263794 421063814
2400 421063814 413608263 402140662 393322671 394918975 399660215 407905729 416656949 419197223
2392 419197223 418942228 414209886 413534587 415339754 418940485 425447168 427880237 428482305
2384 428482305 429054339 429957360 428728240 426083638 425983500 432762368 437448673 431308694
2376 431308694 418487309 415030798 415776357 414352962 417790411 426849160 432081591 434788776
2368 434788776 430194959 419436460 412568794 416184870 418626483 415343878 412344810 413880816
2360 413880816 413261348 411886142 404853489 395786762 398576416 412400782 419979828 425799560
$$ packed form
2416D21471386K81159O514723P080020N257029k809550m510922k768647j963334
2408D28551864k230230L35648m46591q845027j2470014R91642R376502N800020
2400D21063814p455551j1467601q817991J596304M741240Q245514Q751220K540274
2392D19197223k54995m732342o75299J805167L600731O506683K433069O02068
2384D28482305N72034R03021j229120k644602j00138O778868M686305o139979
2376D31308694j2821385l456511P45559j423395L437449R058749N232431K707185
2368D34788776m593817j0758499o867666L616076K441613l282605k999068J536006
2360D13880816o19468j375206p032653r066727K789654J3824366P579046N819732
$$ plain form
2352 425799560 425904659 417084429 410085855 414017458 419365064 419396846 413829941 411304298
2344 411304298 413339156 414249303 416576589 419070092 423138916 426896375 423684489 421060308
2336 421060308 424706003 423945213 415914839 409408103 403760037 409329280 419102633 419426599
2328 419426599 416687545 420675007 423837460 419710037 412632089 417611335 419923221 412350932
2320 412350932 410038559 418385463 426733945 436058958 428819482 417796163 414884404 414171183
2312 414171183 415814811 419353280 426498498 421071502 409083850 399758140 404288267 410037538
2304 410037538 409682028 413990702 427136741 431235471 428596708 425328609 423376355 424517047
2296 424517047 424425927 423080027 418444987 410468967 406357934 412652119 422500452 421654611
$$ packed form
2352D25799560J05099q820230o998574L931603N347606L1782n566905k525643
2344D11304298K034858R10147K327286K493503M068824L757459l211886k624181
2336D21060308L645695p60790q030374o506736n648066N569243R773353L23966
2328D19426599k739054L987462L162453m127423p077948M979246K311886p572289
2320D12350932k312373Q346904Q348482R325013p239476j1023319k911759p13221
2312D14171183J643628L538469P145218n426996j1987652r325710M530127N749271
2304D10037538l55510M308674J3146039M098730k638763l268099j952254J140692
2296D24517047r1120j345900m635040p976020m111033O294185R848333q45841
$$ plain form
2288 421654611 419235125 421230337 418853413 414134319 412931015 411538250 409157103 409147186
2280 409147186 415748541 425173609 423787238 424950958 425110094 417867552 416911111 420633932
2272 420633932 421569156 422905582 422292646 420118485 415752533 414375596 420371999 425270932
2264 425270932 420831567 417443101 415085002 418027391 425624688 430428935 431139973 432296103
2256 432296103 432484109 429301694 422015799 414424547 414870506 413560435 418672991 419009165
2248 419009165 417609779 420027017 424652216 430165479 434884680 433887853 423207187 413719698
2240 413719698 408413058 406716127 405206112 404622826 407611707 415547230 423894715 428691987
2232 428691987 428021001 426929604 426399922 423345301 418035333 413517456 414472578 415738322
$$ packed form
2288D21654611k419486J995212k376924m719094j203304j392765k381147r917
2280D09147186O601355R425068j386371J163720J59136p242542r56441L722821
2272D20633932R35224J336426o12936k174161m365952j376937N996403M898933
2264D25270932m439365l388466k358099K942389P597297M804247P11038J156130
2256D32296103J88006l182415p285895p591252M45959j310071N112556L36174
2248D19009165j399386K417238M625199N513263M719201r96827j0680666r487489
2240D13719698n306640j696931j510015n83286K988881P935523Q347485M797272
2232D28691987o70986j091397n29682l054621n309968m517877R55122J265744
$$ plain form
2224 415738322 424692483 431729490 430801827 424275599 414293532 409940248 413718530 419206620
2216 419206620 420565176 424569611 424136913 416376632 412858652 411958105 414728104 417639389
2208 417639389 422268438 428789259 436962749 443002089 447338344 439733860 433409317 432846414
2200 432846414 434175989 432202163 432798712 434906154 438119040 438693535 438865509 436920149
2192 436920149 427799203 423507600 423272394 416039286 413270320 417957642 422994840 423886544
2184 423886544 429596103 435023494 434695337 428489008 421894128 422648438 430384657 434881478
2176 434881478 437282777 439973896 434831372 429702682 428356440 423431532 426526522 432333132
2168 432333132 433983473 433061451 432240021 430653803 433995702 440622696 443275261 445401993
$$ packed form
2224D15738322Q954161P037007r27663o526228r982067m353284L778282N488090
2216D19206620J358556M004435m32698p760281l517980r00547K769999K911285
2208D17639389M629049O520821Q173490O039340M336255p604484o324543n62903
2200D32846414J329575j973826N96549K107442L212886N74495J71974j945360
2192D36920149r120946m291603k35206p233108k768966M687322N037198Q91704
2184D23886544N709559N427391l28157o206329o594880P54310P736219M496821
2176D34881478K401299K691119n142524n128690j346242m924908L094990N806610
2168D32333132J650341r22022q21430j586218L341899O626994K652565K126732
$$ plain form
2160 445401993 441794235 442405346 444121686 443486332 437683601 434557666 429278071 426664769
2152 426664769 433280632 435844207 437344421 436704635 428931614 418832962 416929409 423644667
2144 423644667 438769542 448062736 453191429 459394543 452116377 436790246 424264999 420126764
2136 420126764 417618801 413706175 417123913 422456126 427873958 428045454 420587623 413373993
2128 413373993 412977598 408710804 400131843 397282619 402574670 405050434 404956005 415277225
2120 415277225 424233776 426229180 420686527 416608105 417204580 414209627 419624803 427699098
2112 427699098 429079989 420657507 413090487 416079367 422485120 423528794 417423028 416034822
2104 416034822 420705875 421192312 421062569 419943646 418901226 420283677 421351395 418970194
$$ packed form
2160D45401993l607758O11111J716340o35354n802731l125935n279595k613302
2152D26664769O615863K563575J500214o39786p773021j0098652j903553O715258
2144D23644667J5124875R293194N128693O203114p278166j5326131j2525247m138235
2136D20126764k507963l912626L417738N332213N417832J71496p457831p213630
2128D13373993l96395m266794q578961k849224N292051K475764r4429J0321220
2120D15277225Q956551J995404n542653m078422N96475k994953N415176Q074295
2112D27699098J380891q422482p567020K988880O405753J043674o105766j388206
2104D16034822M671053M86437j29743j118923j042420J382451J067718k381201
$$ plain form
2096 418970194 425711720 435062243 437357178 436277336 435543720 431607631 424361936 420056267
2088 420056267 415573305 418972519 428027520 433105863 436612155 436729839 428733562 423483196
2080 423483196 428481957 429585130 421897685 412045961 403285019 393244769 385967389 388171872
2072 388171872 397841313 406973451 417026134 420908967 415919496 406785687 402039721 407194070
2064 407194070 413649984 416145512 413318307 413784790 417382909 422653454 427442403 429687753
2056 429687753 429010852 433864888 438144154 440657590 437737581 431194334 425203749 426159413
2048 426159413 428019489 429507127 428829835 426323164 421584456 412328794 413953295 420913658
2040 420913658 423182580 426035765 432621397 443045600 454890675 453329072 440828223 435671668
$$ packed form
2096D18970194O741526R350523K294935j079842p33616l936089p245695m305669
2088D20056267m482962L399214R055001N078343L506292J17684p996277n250366
2080D23483196M998761J103173p687445r851724q760942j0040250p277380K204483
2072C88171872R669441R132138J0052683L882833m989471r133809m745966N154349
2064D07194070O455914K495528k827205M66483L598119N270545M788949K245350
2056D29687753o76901M854036M279266K513436k920009o543247n990585R55664
2048D26159413J860076J487638o77292k506671m738708r255662J624501O960363
2040D20913658K268922K853185O585632J0424203J1845075j561603j2500849n156555
$$ plain form
2032 435671668 442804178 451618288 452402001 444967381 435420039 427888625 422890347 427919795
2024 427919795 437641340 443881353 449237178 452446697 443314950 438096939 440176345 437823672
2016 437823672 434836622 434016048 428189901 423291249 419016146 411092785 399968241 397742149
2008 397742149 402953214 408265610 408061771 405678675 407095783 413212517 419403965 426975929
2000 426975929 426339023 423527767 420804649 423100721 429531473 424838119 420341293 426731391
1992 426731391 434538210 432478268 423815605 420131158 419608223 421683124 426982929 430259155
1984 430259155 425492538 424605195 431563228 433392725 426760972 419340358 418616572 415819178
1976 415819178 412866022 413472124 418018432 424949575 434750644 437873874 436480076 442088334
$$ packed form
2032D35671668P132510Q814110P83713p434620r547342p531414m998278N029448
2024D27919795R721545O240013N355825L209519r131747n218011K079406k352673
2016D37823672k987050q20574n826147m898652m275103p923361j1124544k226092
2008C97742149N211065N312396k03839k383096J417108O116734O191448P571964
2000D26975929o36906k811256k723118K296072O430752m693354m496826O390098
1992D26731391P806819k059942q662663l684447n22935K074901N299805L276226
1984D30259155m766617q87343O958033J829497o631753p420614p23786k797394
1976D15819178k953156O06102M546308O931143R801069L123230j393798N608258
$$ plain form
1968 442088334 444526955 441003308 436661313 441066166 441059230 434793571 434164723 430508206 426877089
1959 426877089 427967373 432827023 428522628 427273760 432505855 433743880 435512836 441464782
1951 441464782 446281675 450453534 457360493 458203282 448041335 436961667 432515435 427699318
1943 427699318 424077487 416451597 411241381 420426253 430930719 434146040 432791621 431077827
1935 431077827 431604146 427598290 432574992 436513388 429704650 419807708 417836525 424014873
1927 424014873 427848771 430672567 433102982 432342661 427091142 426563525 435602388 434491162
1919 434491162 428274294 427391701 426229511 422351066 419385246 418297029 411718242 410598799
1911 410598799 424472292 433929282 430838032 429744729 426418916 420944621 413862738 409158212
$$ packed form
1968D42088334K438621l523647m341995M404853o936o265659o28848l656517l631117
1959D26877089J090284M859650m304395j248868N232095J238025J768956N951946
1951D41464782M816893M171859O906959Q42789j0161947j1079668m446232m816117
1943D27699318l621831p625890n210216R184872J0504466L215321j354419j713794
1935D31077827N26319m005856M976702L938396o808738r896942j971183O178348
1927D24014873L833898K823796K430415p60321n251519n27617R038863j111226
1919D34491162o216868q82593j162190l878445k965820j088217o578787j119443
1911D10598799J3873493R456990l091250j093303l325813n474295p081883m704526
$$ plain form
1903 409158212 414341609 423378825 423826578 420838348 421152170 421093367 424515361 430251661 436732747
1894 436732747 435722589 425316916 420275443 420287192 419741527 417922589 416176915 419775597
1886 419775597 419714991 418187157 423249361 427749246 427115066 415870320 405109433 403214015
1878 403214015 406649717 406023585 406294550 405158864 405748029 408516450 417816109 416736765
1870 416736765 412202811 419486986 430004239 436180626 434741392 427755895 423142961 423956552
1862 423956552 431963905 436253284 428659866 423026338 415535323 404407019 398724159 405908092
1854 405908092 416342820 425854080 433267774 433211331 431760327 427017554 414802275 411652247
1846 411652247 411128487 420849636 438404927 450712022 452366080 452101627 452704919 443284022
$$ packed form
1903D09158212N183397R037216M47753k988230L13822n8803L421994N736300O481086
1894D36732747j010158j0405673n041473J1749n45665j818938j745674L598682
1886D19775597o0606j527834N062204M499885o34180j1244746j0760887j895418
1878D03214015L435702o26132K70965j135686N89165K768421R299659j079344
1870D16736765m533954P284175J0517253O176387j439234o985497m612934Q13591
1862D23956552Q007353M289379p593418n633528p491015j1128304n682860P183933
1854D05908092J0434728R511260P413694n6443j451004m742773j2215279l150028
1846D11652247n23760R721149J7555291J2307095J654058k64453O03292r420897
$$ plain form
1838 443284022 423862104 408935587 402290056 409727539 422873241 426545637 424662280 425574013
1830 425574013 426704965 423770131 423869641 422263921 422700484 424872565 424642323 419602015 413397660
1821 413397660 412259785 414344266 422935443 437299697 444189092 444108264 435501732 432209467
1813 432209467 436797613 442620600 445285038 443287472 442015708 434603549 427735692 428175439
1805 428175439 437990644 435977979 428099734 425474820 427360066 430207190 429787295 433182730
1797 433182730 435358490 431711293 426894642 422836550 412525148 404643552 404865267 412582801
1789 412582801 421370706 420980205 419127795 420907909 424139827 417651063 407027535 405280241
1781 405280241 416050140 421538657 417634126 412632151 408046407 413490962 413645737 412735857
$$ packed form
1838D43284022j9421918j4926517o645531P437483J3145702L672396j883357R11733
1830D25574013J130952k934834R9510j605720M36563K172081k30242n040308o204355
1821D13397660j137875K084481Q591177J4364254O889395q0828q606532l292265
1813D32209467M588146N822987K664438j997566j271764p412159o867857M39747
1805D28175439R815205k012665p878245k624914J885246K847124m19895L395435
1797D33182730K175760l647197m816651m058092j0311402p881596K21715P717534
1789D12582801Q787905l90501j852410J780114L231918o488764j0623528j747294
1781D05280241J0769899N488517l904531n001975m585744N444555J54775r09880
$$ plain form
1773 412735857 419718551 424515692 421058419 416541666 409134195 407995368 411567353 417122114
1765 417122114 418021810 414693290 416295131 426510083 436855898 438679445 431158217 430190372
1757 430190372 431408417 424472026 424493528 431531302 435811324 436103362 428243746 418289442
1749 418289442 414068621 413890693 417478295 428554728 433612059 428937385 423864031 424621731
1741 424621731 422712097 417218382 417045838 421570392 422584043 432533524 438797856 432452444
1733 432452444 427293921 414925296 409222024 410749126 414677758 420972333 425238150 423837155
1725 423837155 422102188 425838065 422584635 418241219 421479893 431732963 438240730 438782880
1717 438782880 430632128 420850157 416151536 415342843 415180915 410274593 412287142 419899038
$$ packed form
1773D12735857O982694M797141l457273m516753p407471j138827L571985N554761
1765D17122114Q99696l328520J601841J0214952J0345815J823547p521228r67845
1757D30190372J218045o936391K1502P037774M280022K92038p859616r954304
1749D18289442m220821j77928L587602J1076433N057331m674674n073354P57700
1741D24621731j909634n493715j72544M524554J013651R949481O264332o345412
1733D32452444n158523j2368625n703272J527102L928632O294575M265817j400995
1725D23837155j734967L735877l253430m343416L238674J0253070O507767N42150
1717D38782880q150752r781971m698621q08693j61928m906322K012549P611896
$$ plain form
1709 419899038 420432300 418124564 418383226 421511910 425210351 415477095 404349643 403466023
1701 403466023 412557796 424924622 427933436 420686394 421275917 426421137 432456910 436282342
1693 436282342 436095927 437399733 440527332 440501805 432494772 420130178 416391033 421760123
1685 421760123 426364622 424495947 425905915 430294513 424524881 415449694 417590995 423894826
1677 423894826 428127438 423141350 417832034 421225939 422806117 421191821 419368526 419032942
1669 419032942 415934964 411069765 406692337 402007771 412648072 418819579 407864799 402336857
1661 402336857 407501208 416181966 422853277 428685518 424579858 418123604 409670010 411121560
1653 411121560 419638024 420056926 413546470 412915930 416595916 422770051 422032980 418127884
$$ packed form
1709D19899038N33262k307736K58662L128684L698441r733256j1127452q83620
1701D03466023R091773J2366826L008814p247042N89523N145220O035773L825432
1693D36282342j86415J303806L127599k5527q007033j2364594l739145N369090
1685D21760123M604499j868675J409968M388598n769632r075187K141301O303831
1677D23894826M232612m986088n309316L393905J580178j614296j823295l35584
1669D19032942l097978m865199m377428m684566J0640301O171507j0954780n527942
1661D02336857N164351Q680758O671311N832241m105660o456254q453594J451550
1653D11121560Q516464M18902o510456o30540L679986O174135p37071l905096
$$ plain form
1645 418127884 415650700 407510665 408236842 413843257 413890118 413757083 414006778 413001103 418604038
1636 418604038 424627513 435842566 442456004 436936524 428775491 420413638 414488105 403337148
1628 403337148 396683398 401525512 406730160 412520219 418859049 427509825 433202332 430973260
1620 430973260 429013726 433497589 433158955 431198289 435481164 440109008 442077969 442058980
1612 442058980 435197389 433153858 435828992 438138498 444513980 443008007 437544863 434254894
1604 434254894 428101696 426413697 431446540 431429758 439841311 446834022 439358785 434614536
1596 434614536 432691916 433284111 435292633 433638278 429977892 428613776 429738077 428817851
1588 428817851 428125551 426569769 422937011 424821400 426697350 426110098 432826126 438852030
$$ packed form
1645D18127884k477184q140035P26177N606415M6861j33035K49695j005675N602935
1636D18604038O023475J1215053O613438n519480q161033q361853n925533j1150957
1628D03337148o653750M842114N204648N790059O338830Q650776N692507k229072
1620D30973260j959534M483863l38634j960666M282875M627844J968961j8989
1612D42058980o861591k043531K675134K309506O375482j505973n463144l289969
1604D34254894o153198j687999N032843j6782Q411553O992711p475237m744249
1596D34614536j922620N92195K008522j654355l660386j364116J124301r20226
1588D28817851o92300j555782l632758J884389J875950n87252O716028O025904
$$ plain form
1580 438852030 442445174 447587513 451178675 454902457 457324715 453289304 444710940 438898170
1572 438898170 437975882 438850562 438070473 436998986 436958693 433941994 429920405 428113070 419678644
1563 419678644 412894374 415322611 424816887 432209238 431042219 424032455 419302342 424166862
1555 424166862 426086219 419110131 411811475 410600686 410459698 413527051 420583638 425684480
1547 425684480 419332555 407921368 406916145 415861748 427265591 432111913 439534779 444218627
1539 444218627 444464727 439289133 427872620 420313379 426472115 439199190 449514222 449447445
1531 449447445 440003362 432440708 435740482 439551665 441836489 438336423 434070628 435755916
1523 435755916 433236008 426765388 423007648 423953013 428058296 429761453 429906255 432187199
$$ packed form
1580D38852030L593144N142339L591162L723782K422258m035411q578364n812770
1572D38898170r22288Q74680p80089j071487m0293l016699m021589j807335q434426
1563D19678644o784270K428237R494276P392351j167019p009764m730113M864520
1555D24166862J919357o976088p298656j210789j40988L067353P056587N100842
1547D25684480o351925j1411187j005223Q945603J1403843M846322P422866M683848
1539D44218627K46100n175594j1416513p559241O158736J2727075J0315032o6777
1531D49447445r444083p562654L299774L811183K284824l500066m265795J685288
1523D35755916k519908o470620l757740R45365M105283J703157J44802K280944
$$ plain form
1515 432187199 427932022 416153561 410712067 415205181 422893892 422421308 424471377 434765748
1507 434765748 430259946 417905607 406525882 402389798 399352718 399076133 406045711 405927505
1499 405927505 402239958 406337400 413531811 419162195 425064670 425964835 421020260 419050448
1491 419050448 421942399 429978811 430757507 427745054 426601762 428581604 426542939 423260280
1483 423260280 425332986 430860321 434020223 437099940 439867933 443629322 446435470 446892087
1475 446892087 439805600 429720498 421825622 421620890 424168084 426242719 437210721 445792133
1467 445792133 447760899 444265559 439950101 442539668 447519305 447750886 443001239 439886685
1459 439886685 441916598 440145160 432156091 424439735 422902144 427240464 433241928 431887805
$$ packed form
1515D32187199m255177j1778461n441494M493114P688711m72584K050069J0294371
1507D34765748m505802j2354339j1379725m136084l037080k76585O969578j18206
1499D05927505l687547M097442P194411N630384N902475R00165m944575j969812
1491D19050448K891951Q036412P78696l012453j143292J979842k038665l282659
1483D23260280K072706N527335L159902L079717K767993L761389K806148M56617
1475D46892087p086487j0085102p894876k04732K547194K074635J0968002Q581412
1467D45792133J968766l495340m315458K589567M979637K31581m749647l114554
1459D39886685K029913j771438p989069p716356j537591M338320O001464j354123
$$ plain form
1451 431887805 425745279 422375185 430411901 433828203 429195631 426892385 426058185 421470052
1443 421470052 416570450 414937440 412074929 409497173 412412148 420313738 422008865 416964881
1435 416964881 411104172 410089287 412275310 415778159 423911102 431118266 433702528 432051124
1427 432051124 433674157 438165010 432451213 424138626 425635334 426798443 429277001 426436062
1419 426436062 425220346 422801515 426281041 425911712 415495991 407146022 404403959 410485362
1411 410485362 413256097 414527335 418053559 421870689 425262050 426628879 423868642 422238695
1403 422238695 420563090 421453087 430316633 428543273 419545634 421738163 420478281 420785286
1395 420785286 424939791 429733360 435739105 432774192 424306347 427055475 434868562 438666030
$$ packed form
1451D31887805o142526l370094Q036716L416302m632572k303246q34200m588133
1443D21470052m899602j633010k862511k577756K914975P901590J695127n043984
1435D16964881n860709j014885K186023L502849Q132943P207164K584262j651404
1427D32051124J623033M490853n713797q312587J496708J163109K478558k840939
1419D26436062j215716k418831L479526l69329j0415721q349969k742063O081403
1411D10485362K770735J271238L526224L817130L391361J366829k760237j629947
1403D22238695j675605Q89997Q863546j773360q997639K192529j259882L07005
1395D20785286M154505M793569O005745k964913q467845K749128P813087L797468
$$ plain form
1387 438666030 438137296 426611254 414127609 413070469 418279996 421710436 423144533 423099899
1379 423099899 425522991 431032182 432532243 431990814 438310041 441297401 435291247 434236243
1371 434236243 435923126 441546398 442572680 441957778 441321132 437321731 432865269 428973371
1363 428973371 428479119 431002538 428663132 423564671 422156384 427089637 433464626 429316738
1355 429316738 416043147 407240386 406126514 406006479 409196194 415197998 416956873 415227406
1347 415227406 416113985 421124681 423418661 421725160 426747150 429076579 429267113 431269487
1339 431269487 430376453 424732317 424088097 423401203 421718237 429259846 429249727 424774192 425620510
1330 425620510 430231639 434019447 439293894 440852874 436573097 423259038 408338442 405203313
$$ packed form
1387D38666030n28734j1526042j2483645j057140N209527L430440J434097m4634
1379D23099899K423092N509191J500061n41429O319227K987360o006154j055004
1371D34236243J686883N623272J026282o14902o36646l999401m456462l891898
1363D28973371m94252K523419k339406n098461j408287M933253O374989m147888
1355D29316738j3273591q802761j113872j20035L189715O001804J758875j729467
1347D15227406Q86579N010696K293980j693501N021990K329429J90534K002374
1339D31269487q93034n644136o44220o86894j682966P541609j0119m475535Q46318
1330D25620510M611129L787808N274447J558980m279777j3314059j4920596l135129
$$ plain form
1322 405203313 410910163 419691172 423441251 422840764 424097690 428661957 436904440 436216759
1314 436216759 433296311 426028059 422163175 422212735 421767319 424970813 430627508 426881610
1306 426881610 422065051 419975380 416369278 418764555 416374641 415977355 413082771 408651602
1298 408651602 407761594 409233145 418136420 433836807 441621393 436830873 432602035 431361158
1290 431361158 430051119 430243231 432287981 439127879 443493586 445164853 441934327 436578536
1282 436578536 433127403 430893901 433634570 441179560 437226904 424840538 421135359 418935645
1274 418935645 416028686 416893971 420563112 421612618 422776375 421422633 413819147 411221400
1266 411221400 412240818 408323985 408122813 419080603 423173466 418584196 416522942 419377879
$$ packed form
1322D05203313N706850Q781009L750079o00487J256926M564267Q242483o87681
1314D36216759k920448p268252l864884M9560m45416L203494N656695l745898
1306D26881610m816559k089671l606102K395277k389914l97286k894584m431169
1298D08651602q90008J471551Q903275J5700387P784586m790520m228838j240877
1290D31361158j310039J92112K044750O839898M365707J671267l230526n355791
1282D36578536l451133k233502K740669P544990l952656j2386366l705179k199714
1274D18935645k906959Q65285L669141J049506J163757j353742p603486k597747
1266D11221400J019418l916833k01172J0957790M092863m589270k061254K854937
$$ plain form
1258 419377879 423617650 419079350 412743437 409157728 414046416 427778626 437626082 437703674
1250 437703674 435266988 437480565 438348607 440818923 442771475 447028336 451105866 444687284
1242 444687284 433648205 423525155 420967275 427160155 428378043 427245487 426070883 424408466
1234 424408466 424587615 427724787 433493211 438391751 434752219 427930954 424685084 420133195
1226 420133195 417106539 410538193 405939881 400475072 398348457 399952717 403024570 415737346
1218 415737346 421647348 424832044 420097568 411786387 411462894 413387593 414714836 415459813
1210 415459813 413984586 411857920 414612431 414487393 414978866 412207345 406179465 406209267 415132440
1201 415132440 428428580 434659258 434835120 435653334 436947913 435835731 431732132 430235049
$$ packed form
1258D19377879M239771m538300o335913l585709M888688J3732210R847456P7592
1250D37703674k436686K213577Q68042K470316J952552M256861M077530o418582
1242D44687284j1039079j0123050k557880O192880J217888j132556j174604j662417
1234D24408466J79149L137172N768424M898540l639532o821265l245870m551889
1226D20133195l026656o568346m598312n464809k126615J604260L071853J2712776
1218D15737346N910002L184696m734476q311181l23493J924699J327243P44977
1210D15459813j475227k126666K754511j25038M91473k771521o027880K9802Q923173
1201D15132440J3296140O230678J75862Q18214J294579j112182m103599j497083
$$ plain form
1193 430235049 428224623 430679060 434780106 433545551 429405497 423906058 416703013 412993591
1185 412993591 416861733 413048082 406440504 409749442 419312859 425265864 422074133 423512425
1177 423512425 427502584 428477401 425681028 423848786 426238890 423012497 423750908 428680543
1169 428680543 426395353 416584656 409403050 408311854 412173289 417665327 425615334 428194859
1161 428194859 434204892 443318990 448889239 442355446 428244923 425512380 430482487 432308573
1153 432308573 435564943 433995236 428385812 431477936 429687089 429287808 428967494 424912298
1145 424912298 431055838 437192100 439506327 440656239 434444095 430802997 435559633 442746332
1137 442746332 445113766 443170056 434176846 428336052 431853851 435627263 428176739 419186610
$$ packed form
1193D30235049k010426K454437M101046j234555m140054n499439p203045l709422
1185D12993591L868142l813651o607578L308938R563417N953005l191731J438292
1177D23512425L990159R74817k796373j832242K390104l226393P38411M929635
1169D28680543k285190r810697p181606j091196L861435N492038P950007K579525
1161D28194859O010033R114098N570249o533793j4110523k732543M970107J826086
1153D32308573L256370j569707n609424L092124j790847l99281l20314m055196
1145D24912298O143540O136262K314227J149912o212144l641098M756636P186699
1137D42746332K367434j943710q993210n840794L517799L773412p450524q990129
$$ plain form
1129 419186610 415731747 419286286 428193716 419765637 415427715 420770016 421741837 423270784
1121 423270784 425605124 428631274 427478326 420508933 418257688 419963370 424175816 424935382
1113 424935382 423199543 420001605 416435538 415452746 415390608 416647804 421334060 419890101
1105 419890101 415029492 413529431 422061167 424254915 412187819 401615729 402316838 410461506
1097 410461506 414077150 416994806 418051410 420631399 427590275 437303600 443011669 447035732
1089 447035732 446389851 441058038 436836152 431584063 423927938 419284421 423094949 429565833
1081 429565833 430259498 427793977 425694705 431685209 436716898 431541207 425247520 422920439
1073 422920439 423379569 422829383 419278106 421228676 423955719 429374001 429750851 427452417
$$ packed form
1129D19186610l454863L554539Q907430q428079m337922N342301R71821J528947
1121D23270784K334340L026150j152948o969393k251245J705682M212446P59566
1113D24935382j735839l197938l566067r82792o2138J257196M686256j443959
1105D19890101m860609j500061Q531736K193748j2067096j0572090P01109Q144668
1097D10461506L615644K917656J056604K579989O958876R713325N708069M024063
1089D47035732o45881n331813m221886n252089p656125m643517L810528O470884
1081D29565833O93665k465521k099272N990504N031689n175691o293687k327081
1073D22920439M59130n50186l551277J950570K727043N418282L76850k298434
$$ plain form
1065 427452417 431410402 437128775 435778126 428864526 428364464 435431408 437919640 433154161
1057 433154161 429324458 426363867 424161194 420605162 422313012 425794325 431827605 439255116
1049 439255116 437597312 432209072 431390843 433453486 436300714 441276379 443159222 440739230
1041 440739230 439077402 438316196 437723896 437233475 433696940 427848805 427607209 432495625 436115232
1032 436115232 436195668 442449147 446150395 446395816 440700564 435581863 437126538 430284460
1024 430284460 431605408 436904434 431169695 428113047 430890181 430945698 426709023 429241105
1016 429241105 436093654 436509974 429869451 427341628 427306399 428760555 437725926 441990836
1008 441990836 442887528 445718296 453345345 451186312 440026099 437229341 441065417 441166177
$$ packed form
1065D27452417L957985N718373j350649o913600n00062P066944K488232m765479
1057D33154161l829703k960591k202673l556032J707850L481313O033280P427511
1049D39255116j657804n388240q18229K062643K847228M975665J882843k419992
1041D40739230j661828p61206n92300m90421l536535n848135k41596M888416L619607
1032D36115232Q0436O253479L701248K45421n695252n118701J544675o842078
1024D30284460J320948N299026n734739l056648K777134N5517m236675K532082
1016D29241105O852549M16320o640523k527823l5229J454156Q965371M264910
1008D41990836Q96692K830768P627049k159033j1160213k796758L836076J00760
$$ plain form
1000 441166177 434676415 425873070 420913757 420686110 424918429 430206726 428621410 423956443
992 423956443 425043821 426485223 426734711 429461178 436890139 439388624 435824886 431295925
984 431295925 426927852 423355095 422740370 427830486 424634927 417987368 409733833 403985506
976 403985506 412165286 419653784 423180003 424713431 430394456 434601345 430473436 427077444
968 427077444 425135551 423575655 422464326 425063039 426261969 420465832 416646627 414815537
960 414815537 415135325 422216270 428694576 435037113 433551910 433684687 435121047 431704807
952 431704807 429670493 429422014 437534794 448497287 457307266 451132233 439797996 431098998
944 431098998 425621182 423393977 430750377 432615264 428283529 420906950 417397091 420237627
$$ packed form
1000D41166177o489762q803345m959313k27647M232319N288297j585316m664967
992D23956443J087378J441402K49488K726467P428961K498485l563738m528961
984D31295925m368073l572757o14725N090116l195559o647559q253535n748327
976D03985506Q179780P488498L526219J533428N681025M206889m127909l395992
968D27077444j941893j559896j111329K598713J198930n796137l819205j831090
960D14815537L19788P080945O478306O342537j485203J32777J436360l416240
952D31704807k034314k48479Q112780J0962493Q809979o175033j1334237q698998
944D31098998n477816k227205P356400J864887m331735p376579l509859K840536
$$ plain form
936 420237627 419593984 419925393 425282660 429580192 429725850 426617663 418789257 409821631 403942019
927 403942019 405117042 404037342 401645031 405169704 418261926 432893177 434626997 427546325
919 427546325 427326559 427172501 427060005 433637346 429399564 423431668 428693636 433048356 435269472
910 435269472 438040300 434077111 424717277 424550489 425662885 421648379 425000108 432592176
902 432592176 438809955 440785554 436342235 425823153 417538920 413856036 409196279 416342038
894 416342038 426578068 435797181 447942431 452632692 449933339 447603401 444944640 442027018
886 442027018 434938847 431763702 433100893 435559111 428618146 419433935 416454167 411856780
878 411856780 414987751 423279124 432735324 437666121 437533689 440416609 443428710 447557036
$$ packed form
936D20237627o43643L31409N357267M297532J45658l108187p828406q967626n879612
927D03942019J175023j079700k392311L524673J3092222J4631251J733820p080672
919D27546325k19766j54058j12496O577341m237782n967896N261968M354720K221116
910D35269472K770828l963189r359834j66788J112396m014506L351729P592068
902D32592176O217779J975599m443319j0519082q284233l682884m659757P145759
894D16342038J0236030R219113J2145250M690261k699353k329938k658761k917622
886D42027018p088171l175145J337191K458218o940965r184211k979768m597387
878D11856780L130971Q291373R456200M930797j32432K882920L012101M128326
$$ plain form
870 447557036 451667125 450164290 447031808 444661945 435123228 433460286 437896156 432783186
862 432783186 427321225 424319748 421304314 421352279 422811357 425564132 430280703 432720160
854 432720160 428577670 424412085 421728536 420723713 418574141 413575426 409604136 411995096
846 411995096 418592140 419691042 417335241 422451786 423261795 423177485 428643054 437643130 441051719
837 441051719 430751618 429086745 427221374 420649586 421290122 412076326 403854790 410277233
829 410277233 418258267 419518221 421631621 429862392 433316909 434626911 436808984 435951090
821 435951090 430035583 428920962 425261840 423249214 427171722 435502866 433697021 433026982
813 433026982 434202431 428316903 422684201 421378786 421607826 425194426 426250823 426583851
$$ packed form
870D47557036M110089j502835l132482k369863r538717j662942M435870n112970
862D32783186n461961l001477l015434M7965J459078K752775M716571K439457
854D32720160m142490m165585k683549j004823k149572m998715l971290K390960
846D11995096O597044J098902k355801N116545Q10009q4310N465569R000076L408589
837D41051719j0300101j664873j865371o571788O40536r213796q221536O422443
829D10277233P981034J259954K113400Q230771L454517J310002K182073q57894
821D35951090n915507j114621l659122k012626L922508Q331144j805845o70039
813D33026982J175449n885528n632702j305415K29040L586600J056397L33028
$$ plain form
805 426583851 428891120 424124623 422289548 421104151 426158078 429866883 426029143 428884042
797 428884042 433408158 435387661 438411683 441122692 445080464 436259980 432820184 435192368
789 435192368 430848620 421327012 416129749 414540263 408120162 407502350 412412981 420985009
781 420985009 428751055 437719592 452747333 455908881 445789590 437858521 432898727 428928670
773 428928670 436539531 441967180 438186399 433975424 432822147 432034658 427022606 429165007
765 429165007 428253859 425276383 433339171 436730194 433618857 432138948 440036306 440525266
757 440525266 432518969 428031839 425930513 431000660 433154530 432371562 428672375 428062830
749 428062830 430404754 427099596 418650104 417363976 424367782 430031835 432792247 436902396
$$ packed form
805D26583851K307269m766497j835075j185397N053927L708805l837740K854899
797D28884042M524116J979503L024022K711009L957772q820484l439796K372184
789D35192368m343748r521608n197263j589486o420101o17812M910631Q572028
781D20985009P766046Q968537J5027741L161548j0119291p931069m959794l970057
773D28928670P610861N427649l780781m210975j153277p87489n012052K142401
765D29165007r11148k977476Q062788L391023l111337j479909P897358M88960
757D40525266q006297m487130k101326N070147K153870p82968l699187o09545
749D28062830K341924l305158q449492j286128P003806N664053K760412M110149
$$ plain form
741 436902396 442557704 445316735 443389302 443559798 443019502 438460093 430093573 430344734 433813363
732 433813363 430966972 426276508 427746420 437182703 442729159 443219024 442383024 434948591
724 434948591 428835194 423989589 420324704 424885785 429225854 433212114 434626657 432385858
716 432385858 431599606 427674210 425928768 425429464 420694733 414844150 416728679 419673968
708 419673968 418812751 429862347 433990889 434870845 435494422 436951724 433804925 433085439 429131342
699 429131342 422129763 416428325 411560643 410044170 407394321 406284068 411042737 415570490
691 415570490 414503611 414168079 414969620 419467376 425674417 427448301 432049192 432435224 425910661
682 425910661 423338748 425318638 423397673 420139662 420497067 424964517 426961755 429783657
$$ packed form
741D36902396N655308K759031j927433J70496n40296m559409q366520K51161L468629
732D33813363k846391m690464J469912R436283N546456M89865q36000p434433
724D34948591o113397m845605l664885M561081M340069L986260J414543k240799
716D32385858p86252l925396j745442m99304m734731n850583J884529K945289
708D19673968q61217J1049596M128542Q79956O23577J457302l146799p19486l954097
699D29131342p001579n701438m867682j516473k649849j110253M758669M527753
691D15570490j066879l35532Q01541M497756O207041J773884M600891L86032o524563
682D25910661k571913J979890j920965l258011L57405M467450J997238K821902
$$ plain form
674 429783657 432508104 432278467 432806338 434480779 438464351 434676089 430531035 432612261
666 432612261 436889981 442988696 446242222 446293141 440300341 428638852 428301481 431318135
658 431318135 440100230 452900953 458212110 446408278 426590818 411512869 403109870 402616164
650 402616164 412538209 420879708 423224459 422373251 417759184 418485292 419770557 419936725 428476223
641 428476223 426877604 417086885 414453402 411408484 410687980 415025443 415289061 415876459 414957361
632 414957361 416700761 417248143 414452651 412234259 404851213 400595035 404853313 413844529
624 413844529 420928891 425009425 426622731 427970833 426801695 424737743 429477238 435679048
616 435679048 440075733 444284629 439210506 437336425 442597034 438634700 433343836 435894162
$$ packed form
674D29783657K724447k29637N27871J674441L983572l788262m145054K081226
666D32612261M277720O098715L253526N0919n992800j1661489l37371L016654
658D31318135Q782095J2800723N311157j1803832j9817460j5077949q402999m93706
650D02616164R922045Q341499K344751q51208m614067P26108J285265J66168Q539498
641D28476223j598619r790719k633483l044918p20504M337463K63618N87398r19098
632D14957361J743400N47382k795492k218392p383046m256178M258278Q991216
624D13844529P084362M080534J613306J348102j169138k063952M739495O201810
616D35679048M396685M208896n074123j874081N260609l962334n290864K550326
$$ plain form
608 435894162 436425471 433039223 436774466 439071930 436346854 439600959 448161271 449247120
600 449247120 446202146 447600287 444258288 436946646 431467562 427024618 420320436 418634905
592 418634905 424252544 426463174 429820278 439974033 450447223 447634347 441177910 442709128
584 442709128 441779303 441781491 443547981 440812294 438856475 437293283 436096563 431261960 425507894
575 425507894 429362135 428078330 424297405 420754591 421565489 430595671 432806112 430419630
567 430419630 432335836 431434296 435171665 437345903 428551173 423911361 427743290 430301338
559 430301338 423339085 418673841 418867505 414064307 407141276 405823245 411370031 418425397
551 418425397 421690101 423117635 425906364 426821243 420624336 415475795 413639843 416225735
$$ packed form
608D35894162N31309l386248L735243K297464k725076L254105Q560312J085849
600D49247120l044974J398141l341999p311642n479084m442944o704182j685531
592D18634905N617639K210630L357104J0153755J0473190k812876o456437J531218
584D42709128r29825K188J766490k735687j955819j563192j196720m834603n754066
575D25507894L854241j283805l780925l542814Q10898R030182K210441k386482
567D30419630J916206r01540L737369K174238q794730m639812L831929K558048
559D30301338o962253m665244J93664m803198o923031j318031N546786P055366
551D18425397L264704J427534K788729R14879o196907n148541j835952K585892
$$ plain form
543 416225735 424333877 427685254 429520945 428017629 424972277 417968723 411636705 411073669
535 411073669 408551551 404668603 404897668 409966010 413906155 418660452 423016309 427913519
527 427913519 429516484 425533260 420896869 424032803 427290558 426109639 430474593 429532215
519 429532215 425018205 421510949 413880855 410040294 409049111 408357519 401563465 402265761 403416702
510 403416702 405906975 412623801 413008055 408167786 404025250 407943254 412521481 413200143
502 413200143 416053127 417374048 412239897 411676563 409008893 403966086 405625307 408653232
494 408653232 415539266 417726943 413876922 411247608 407056854 399131223 389823189 387505031
486 387505031 390857713 396314113 400836083 403965155 396961523 393368369 402463851 412747722
$$ packed form
543D16225735Q108142L351377J835691j503316l045352p003554o332018n63036
535D11073669k522118l882948K29065N068342L940145M754297M355857M897210
527D27913519J602965l983224m636391L135934L257755j180919M364954r42378
519D29532215m514010l507256p630094l840561r91183o91592o794054P02296J150941
510D03416702K490273O716826L84254m840269m142536L918004M578227O78662
502D13200143K852984J320921n134151n63334k667670n042807J659221L027925
494D08653232O886034K187677l850021k629314m190754p925631r308034k318158
486C87505031L352682N456400M521970L129072p003632l593154R095482J0283871
$$ plain form
478 412747722 417757752 420762439 418805073 414677173 410234012 404766444 399511303 393245890
470 393245890 390427959 395695932 403793911 402691666 398667739 397700843 396386163 403700427
462 403700427 409445661 401667835 396992306 396520786 401475439 403972381 401583788 404146472
454 404146472 406072685 403729792 401910776 399619869 403273189 412935382 413554429 407059776
446 407059776 401500760 403799915 400566696 389629721 388070662 390860914 395938392 393694189
438 393694189 388352546 383982348 377358777 380672712 385595656 384396135 374433394 371810672
430 371810672 375648944 373421287 371504996 373148980 373399598 372775951 379523381 387021427
422 387021427 396645021 401152070 401029247 396334099 394193877 392143854 388080700 386889552
$$ packed form
478D12747722N010030L004687j957366m127900m443161n467568n255141o265413
470C93245890k817931N267973Q097979j102245m023927r66896j314680P314264
462D03700427N745234p777826m675529m71520M954653K496942k388593K562684
454D04146472J926213k342893j819016k290907L653320R662193O19047o494653
446D07059776n559016K299155l233219j0936975j559059K790252N077478k244203
438C93694189n341643m370198o623571L313935M922944j199521r962741k622722
430C71810672L838272k227657j916291J643984K50618o23647O747430P498046
422C87021427R623594M507049j22823m695148k140222k050023m063154j191148
$$ plain form
414 386889552 388077125 394033814 400870508 405477072 400837659 396134033 397450130 402096135
406 402096135 402166059 401281265 400780904 401142402 396869424 383730044 377859754 382743925 383631935
397 383631935 379174402 379792695 379114390 380501130 382989025 386870249 388744311 383379231
389 383379231 382697711 387878869 384523769 381411675 376450507 368855658 369646877 371515450
381 371515450 367694081 367892328 375909378 372337876 365184109 365850983 372352994 377957270
373 377957270 388744406 394016076 389747030 375734229 365610654 364336624 363534758 360744796
365 360744796 353703281 351738805 357716297 355391542 350708015 351850145 355067739 360137368
357 360137368 361667519 361283825 358928718 361651182 367480357 365284095 358064786 354199082
$$ packed form
414C86889552J187573N956689O836694M606564m639413m703626J316097M646005
406D02096135O9924q84794n00361L61498m272978j3139380n870290M884171Q88010
397C83631935m457533O18293o78305J386740K487895L881224J874062n365080
389C83379231o81520N181158l355100l112094m961168p594849P91219J868573
381C71515450l821369J98247Q017050l571502p153767O66874O502011N604276
373C77957270J0787136N271670m269046j4012801j0123575j274030q01866k789962
365C60744796p041515j964476N977492k324755m683527J142130L217594N069629
357C60137368J530151l83694k355107K722464N829175k196262p219309l865704
$$ plain form
349 354199082 357798473 355545085 352436088 353512874 356847021 359820897 361292866 363063077
341 363063077 358136490 353905818 351896107 347267496 347062894 352050545 353647775 358336384
333 358336384 357589010 358672028 362791691 371183610 376246109 373473673 363719660 358039160
325 358039160 356916241 358984255 361663893 359904374 351304399 344332484 343872709 342190060
317 342190060 335584090 328081699 325764225 324075226 324044670 322009537 318257908 318295628 324102605
308 324102605 329402342 331930900 335452553 341422804 342265445 335720621 327344002 322424259
300 322424259 315059579 308075225 304829466 304078458 308753098 314216380 313296188 310959773
292 310959773 303662200 299056439 302728360 311065535 319797719 324822470 322931708 315307918
$$ packed form
349C54199082L599391k253388l108997J076786L334147K973876J471969J770211
341C63063077m926587m230672k009711m628611k04602M987651J597230M688609
333C58336384p47374J083018M119663Q391919N062499k772436r754013n680500
325C58039160j122919K068014K679638j759519q599975o971915m59775j682649
317C42190060o605970p502391k317474j688999l0556k035133l751629L7720N806977
308C24102605N299737K528558L521653N970251Q42641o544824q376619m919743
300C22424259p364680o984354l245759p51008M674640N463282r20192k336415
292C10959773p297573m605761L671921Q337175Q732184N024751j890762p623790
$$ plain form
284 315307918 308903731 309877935 313538546 309797049 305320717 306526187 310154063 311575144
276 311575144 314262538 317055022 318066767 315640870 308719977 307213363 306941015 304959200
268 304959200 301617098 297857934 292009196 286257247 287959341 287062437 283517040 283042469
260 283042469 288950957 295188373 299294056 303536965 306837388 299253369 286185308 278332936
252 278332936 277482831 282870156 293007742 292916198 283678769 279399502 281057137 287947926
244 287947926 288706885 281746122 276871888 275547384 277399068 279932648 286478120 284528859
236 284528859 276891363 278109446 281566221 285612231 286618365 285806676 285242403 279361455
228 279361455 276208719 275497214 274406817 275745400 272263922 273676330 276856380 279944002
$$ packed form
284C15307918o404187R74204L660611l741497m476332J205470L627876J421081
276C11575144K687394K792484J011745k425897o920893j506614k72348j981815
268C04959200l342102l759164n848738n751949J702094q96904l545397m74571
260B83042469N908488O237416M105683M242909L300423p584019j3068061p852372
252B78332936q50105N387325J0137586r1544r237429m279267J657635O890789
244B87947926P58959o960763m874234j324504J851684K533580O545472j949261
236B84528859p637496J218083L456775M046010J006134q11689n64273n880948
228B79361455l152736p11505j090397J338583l481478J412408L180050L087622
$$ plain form
220 279944002 281926748 274726569 264198208 257645909 260225558 268508591 268125774 263190619
212 263190619 259442652 256378400 253475477 254206665 257914996 263238170 266001350 266575236
204 266575236 270610235 272440691 268990552 267391071 259093217 253478620 254976445 255377066
196 255377066 252788712 251034777 250041875 251384369 249387956 242793873 241244432 244725034
188 244725034 246747337 245063628 239242414 235240316 235236801 235761591 236493607 240361982 241632127
179 241632127 238932260 234299174 233045874 227703036 228089096 232815895 229355709 223345816
171 223345816 221561369 227486501 235217008 239045547 233988995 225624803 215547536 211173367
163 211173367 214930087 211328219 206297935 204781345 205505472 207167579 211247809 212512213
$$ packed form
220B79944002J982746p200179j0528361o552299K579649Q283033l82817m935155
212B63190619l747967l064252k902923P31188L708331N323174K763180N73886
204B66575236M034999J830456l450139j599481q297854n614597J497825M00621
196B55377066k588354j753935r92902J342494j996413o594083j549441L480602
188B44725034K022303j683709n821214m002098l515N24790P32016L868375J270145
179B41632127k699867m633086j253300n342838L86060M726799l460186o009893
171B23345816j784447N925132P730507L828539n056552q364192j0077267m374169
163B11173367L756720l601868n030284j516590P24127J662107M080230J264404
$$ plain form
155 212512213 206929468 201035501 197187039 196130561 198175598 197424336 197945663 199277189
147 199277189 198000412 202541186 205214243 205743447 203742417 199169332 197010613 196883849
139 196883849 194796736 195210794 194868655 192247149 188134004 184752205 174939722 168652264
131 168652264 174868350 185716406 190780758 192978178 192803483 189501215 180903978 175026765
123 175026765 171394130 170480710 174719086 172456375 166800597 168228241 171900330 174478547
115 174478547 176754778 177755833 179237382 179124464 177121413 172352227 165354736 164336173
107 164336173 160957995 158879486 157751132 151545881 148829891 153710505 156337767 158815175
99 158815175 158671311 154746194 149848533 148367974 148721236 143831066 141610758 141507980 135598098
$$ packed form
155B12512213n582745n893967l848462j056478K045037p51262N21327J331526
147A99277189j276777M540774K673057N29204k001030m573085k158719j26764
139A96883849k087113M14058l42139k621506m113145l381799r812483o287458
131A68652264O216086J0848056N064352K197420j74695l302268q597237n877213
123A75026765l632635r13420M238376k262711n655778J427644L672089K578217
115A74478547K276231J001055J481549j12918k003051m769186o997491j018563
107A64336173l378178k078509j128354o205251k715990M880614K627262K477408
99A58815175j43864l925117m897661j480559L53262m890170k220308j02778n909882
$$ plain form
90 135598098 132821697 138497938 146183716 149303724 145091479 140152336 134083677 131946240
82 131946240 132083820 133834179 134278427 133871050 130230428 126519394 127778292 123335569 115540275
73 115540275 118162672 125981467 123989207 122036239 126622149 129447963 124546160 117591655
65 117591655 112958101 110785389 105420061 98943610 92904578 90706181 96634120 101828774
57 101828774 103322797 101221740 97211891 96613402 98349791 98719067 103245739 104238850 102175996
48 102175996 96179838 93462207 94848729 92664750 87470461 85471246 84076368 77455842
40 77455842 71409431 72744384 76691058 78257650 80289638 79929476 81309324 81760140 79635859
31 79635859 71609306 66515523 69669060 72556114 69877233 69119379 69361690 68462754 71195732
$$ packed form
90A35598098k776401N676241P685778L120008m212245m939143o068659k137437
82A31946240J37580J750359M44248m07377l640622l711034J258898m442723p795294
73A15540275K622397P818795j992260j952968M585910K825814m901803o954505
65A17591655m633554k172712n365328o476451o039032k198397N927939N194654
57A01828774J494023k101057m009849n98489J736389L69276M526672R93111k062854
48A02175996n996158k717631J386522k183979n194289j999215j394878o620526
40G7455842o046411J334953L946674J566592K031988l60162J379848M50816k124281
31G9635859q026553n093783L153537K887054k678881p57854K42311q98936K732978
$$ plain form
22 71195732 73405145 71071747 68475029 66820283 63980484 64286148 61710862 57344822 56073199
13 56073199 56963041 59094287 57689380 57188305 57269913 59470593 63783138 60796912 55154403
4 55154403 55530076 60415616 62311794 61441530
0 61441530
$$ packed form
22G1195732K209413k333398k596718j654746k839799L05664k575286m366040j271623
13E6073199Q89842K131246j404907n01075Q1608K200680M312545k986226n642509
4E5154403L75673M885540J896178q70264
0F1441530
##END NTUPLES=NMR SPECTRUM
##END=
