##TITLE=C13_LR-618-R4-C1
 CDCl3,  19800 sc

 8.7.2021
##JCAMPDX= 6.0         $$ Bruker NMR JCAMP-DX V2.0
##DATA TYPE= NMR SPECTRUM
##DATA CLASS= NTUPLES
##ORIGIN= UXNMR, Bruker Analytische Messtechnik GmbH
##OWNER= root
$$ XWIN-NMR		Version 3.5
$$ Fri Jul  9 08:29:45 2021 Russian Standard Time (UT+4h)  she@DPX200
##.OBSERVE FREQUENCY= 50.327896
##.OBSERVE NUCLEUS= ^13C
##.ACQUISITION MODE= SIMULTANEOUS
##.ACQUISITION SCHEME= undefined
##.AVERAGES= 19800
##.DIGITISER RES= 17
##SPECTROMETER/DATA SYSTEM= spect
##.PULSE SEQUENCE= zgpg30
##.SOLVENT NAME= CDCl3
##.SHIFT REFERENCE= (INTERNAL, CDCl3, 0, 222.69)
##AUDIT TRAIL= $$ (NUMBER, WHEN, WHO, WHERE, WHAT)
$$ ##TITLE= Audit trail, XWIN-NMR		Version 3.5
$$ ##JCAMPDX= 5.01
$$ ##ORIGIN= Bruker BioSpin GmbH
$$ ##OWNER= she
$$ F:/spectra/data/she/nmr/c13/1/pdata/1/auditp.txt
$$ ##AUDIT TRAIL=  $$ (NUMBER, WHEN, WHO, WHERE, WHAT)
(   1,<2021-07-09 08:28:29.87 +0400>,<she>,<DPX200>,
      <created by zg, POWCHK disabled, PULCHK disabled
       terminated by command 'halt'
       configuration hash MD5:
       00 E9 B6 7A A2 85 ED C7 34 08 36 98 17 FE 4E 26
       data hash MD5: 32K
       11 DE 9A D8 2D 62 67 BC 32 77 17 3F 41 4C 24 0C>)
(   2,<2021-07-09 08:28:32.21 +0400>,<she>,<DPX200>,
      <Start of raw data processing
       efp BC_mod = 2 LB = 1 FT_mod = 6 PKNL = 1 PHC0 = -334.7379 PHC1 = 27.16238 SI = 32K 
       data hash MD5: 32K
       4A 0A 63 C6 05 09 E5 F9 9B 35 2F F3 7D 9D 54 F1>)
(   3,<2021-07-09 08:28:34.90 +0400>,<she>,<DPX200>,
      <abs ABSG = 5 
       data hash MD5: 32K
       A4 40 18 C4 87 69 BF E2 05 D9 B7 F5 EE 93 FD 24>)
(   4,<2021-07-09 08:28:56.81 +0400>,<she>,<DPX200>,
      <pk PHC0 = -2.783818 PHC1 = 3.4 
       data hash MD5: 32K
       FB C1 BD 89 93 13 7B 9A D2 88 C6 CC E4 54 1D 28>)
(   5,<2021-07-09 08:29:00.12 +0400>,<she>,<DPX200>,
      <abs ABSG = 5 
       data hash MD5: 32K
       1A 0A C0 D7 2A 32 19 C5 1F 2C 82 B5 28 96 37 87>)
$$ ##END=
$$ 
$$ hash MD5
$$ B1 75 34 78 AA 54 7B F8 1C 9B 28 09 54 2F DD 58
##$RELAX= 
##$RELAX= 
##$RELAX= 
##$RELAX= 
##$RELAX= 
##$RELAX= 
##$RELAX= 
##$RELAX= 
$$ Bruker specific parameters
$$ --------------------------
##$DU= <F:/spectra>
##$EXPNO= 1
##$NAME= <c13>
##$PROCNO= 1
##$TYPE= <nmr>
##$USER= <she>
##$AMP= (0..31)
100 100 100 100 100 100 100 100 100 100 100 100 100 100 100 100 100 100 
100 100 100 100 100 100 100 100 100 100 100 100 100 100 
##$AQSEQ= 0
##$AQ_mod= 1
##$AUNM= <au_zg>
##$AUTOPOS= <>
##$BF1= 50.322709
##$BF2= 200.13
##$BF3= 50.322709
##$BF4= 500.13
##$BF5= 500.13
##$BF6= 500.13
##$BF7= 500.13
##$BF8= 500.13
##$BYTORDA= 1
##$CFDGTYP= 0
##$CFRGTYP= 5
##$CHEMSTR= <none>
##$CNST= (0..31)
1 1 145 1 1 1 1 1 1 1 1 1 1 1 1 1 1 1 1 1 1 1 1 1 1 1 1 1 1 1 1 1 
##$CPDPRG= <waltz16>
##$CPDPRG1= <>
##$CPDPRG2= <waltz16>
##$CPDPRG3= <>
##$CPDPRG4= <mlev>
##$CPDPRG5= <mlev>
##$CPDPRG6= <mlev>
##$CPDPRG7= <mlev>
##$CPDPRG8= <mlev>
##$CPDPRGB= <>
##$CPDPRGT= <>
##$D= (0..31)
$$ [...]
##$SUBNAM4= <"">
##$SUBNAM5= <"">
##$SUBNAM6= <"">
##$SUBNAM7= <"">
##$SUBNAM8= <"">
##$SUBNAM9= <"">
##$SW= 239.972175391363
##$SWIBOX= (0..15)
0 1 3 0 0 0 0 0 0 0 0 0 0 0 0 0 
##$SW_h= 12077.2946859903
##$TD= 32768
##$TD0= 1
##$TE= 0
##$TE2= 300
##$TE3= 300
##$TEG= 300
##$TL= (0..7)
120 120 120 120 120 120 120 120 
##$TP= (0..7)
150 150 150 150 150 150 150 150 
##$TP07= 0
##$TPNAME0= <>
##$TPNAME1= <>
##$TPNAME2= <>
##$TPNAME3= <>
##$TPNAME4= <>
##$TPNAME5= <>
##$TPNAME6= <>
##$TPNAME7= <>
##$TPOAL= (0..7)
0.5 0.5 0.5 0.5 0.5 0.5 0.5 0.5 
##$TPOFFS= (0..7)
0 0 0 0 0 0 0 0 
##$TUNHIN= 0
##$TUNHOUT= 0
##$TUNXOUT= 0
##$USERA1= <user>
##$USERA2= <user>
##$USERA3= <user>
##$USERA4= <user>
##$USERA5= <user>
##$V9= 5
##$VALIST= <valist>
##$VCLIST= <CCCCCCCCCCCCCCC>
##$VD= 0
##$VDLIST= <DDDDDDDDDDDDDDD>
##$VPLIST= <PPPPPPPPPPPPPPP>
##$VTLIST= <TTTTTTTTTTTTTTT>
##$WBST= 1024
##$WBSW= 4
##$XGAIN= (0..3)
0 0 0 0 
##$XL= 0
##$YL= 0
##$YMAX_a= 125112333
##$YMIN_a= -36881671
##$ZGOPTNS= <>
##$ZL1= 120
##$ZL2= 120
##$ZL3= 120
##$ZL4= 120
##$ABSF1= 222.6899
##$ABSF2= -17.30692
##$ABSG= 5
##$ABSL= 3
##$ALPHA= 0
##$AQORDER= 0
##$ASSFAC= 0
##$ASSFACI= 0
##$ASSFACX= 0
##$ASSWID= 0
##$AUNMP= <proc_1d>
##$AZFE= 0.1
##$AZFW= 0.5
##$BCFW= 0
##$BC_mod= 2
##$BYTORDP= 0
##$COROFFS= 0
##$CY= -3
##$DATMOD= 1
##$DC= 0
##$DFILT= <>
##$DTYPP= 0
##$F1P= 0
##$F2P= 0
##$FCOR= 0.5
##$FTSIZE= 32768
##$FT_mod= 6
##$GAMMA= 0
##$GB= 0
##$INTBC= 1
##$INTSCL= 4.134877e-10
##$ISEN= 128
##$LB= 1
##$LEV0= 0
##$LPBIN= 0
##$MAXI= 10000
##$MC2= 0
##$MEAN= 0
##$ME_mod= 0
##$MI= 0.1934396
##$NCOEF= 0
##$NC_proc= 2
##$NLEV= 6
##$NOISF1= 120.0001
##$NOISF2= 80.00006
##$NSP= 0
##$NTH_PI= 0
##$NZP= 0
##$OFFSET= 222.6899
##$PC= 1.4
##$PHC0= -337.5217
##$PHC1= 30.56238
##$PH_mod= 1
##$PKNL= yes
##$PPARMOD= 0
##$PSCAL= 0
##$PSIGN= 0
##$REVERSE= no
##$SF= 50.3227282834384
##$SI= 32768
##$SIGF1= 140
##$SIGF2= 120
##$SINO= 11.81781
##$SIOLD= 32768
##$SREGLST= <13C.CDCl3>
##$SSB= 0
##$STSI= 32768
##$STSR= 0
##$SW_p= 12077.2946859903
##$SYMM= 0
##$S_DEV= 0
##$TDeff= 32768
##$TDoff= 0
##$TI= <>
##$TILT= no
##$TM1= 0
##$TM2= 0
##$TOPLEV= 0
##$USERP1= <user>
##$USERP2= <user>
##$USERP3= <user>
##$USERP4= <user>
##$USERP5= <user>
##$WDW= 1
##$XDIM= 32768
##$YMAX_p= 453582725
##$YMIN_p= -2790377
$$ End of Bruker specific parameters
$$ ---------------------------------
##NTUPLES= NMR SPECTRUM
##VAR_NAME=  FREQUENCY,     SPECTRUM/REAL,   SPECTRUM/IMAG
##SYMBOL=    X,             R,               I
##VAR_TYPE=  INDEPENDENT,   DEPENDENT,       DEPENDENT
##VAR_FORM=  AFFN,          ASDF,            ASDF
##VAR_DIM=   32768,         32768,           32768
##UNITS=     HZ,            ARBITRARY UNITS, ARBITRARY UNITS
##FACTOR=    0.368581032318806, 1,           1
##FIRST=     11206.3631092498, 0,            0
##LAST=      -870.931576740451, 0,           0
##MIN=       -870.931576740451, -2790377,    0
##MAX=       11206.3631092498, 453582725,    0
$$ Real data points
##PAGE= N=1
##DATA TABLE= (X++(R..R)), XYDATA
$$ [...]
18143 585674 354873 304484 89773 142497 404402 170212 -436466 -665489 -832991 -948333
18133 -948333 -1072688 -988534 -851564 -455850 289038 566271 50357 -324988 -421457 -443166
18123 -443166 -1022073 -1308466 -1061566 -829878 -526201 -379636 -251522 249563 698234 938182
18113 938182 1233707 1250865 1167064 934254 757082 785909 792044 413161 78594 252164
18103 252164 716059 1100939 1117776 1124572 1089190 541389 -65224 -20790 598693 904387
18093 904387 691642 205897 -113214 -66845 281754 899449 1339493 1221499 991141 956020
18083 956020 1038963 820823 207247 -81891 91933 16315 -31174 -289996 -319202 -326202 -640124
18072 -640124 -1094036 -1358390 -864747 -52788 606043 845315 1106354 1217753 1269822 1327488
18062 1327488 1359153 825891 -47232 -336189 -406523 -594390 -853868 -768071 -759373 -1108589
18052 -1108589 -1027355 -349492 82831 -220350 -453120 -494837 -661899 -726186 -748777 -1170942
18042 -1170942 -1532844 -1571681 -1616685 -1946744 -1978686 -1724979 -1259746 -862012 -600536 -187106
18032 -187106 410573 612085 358019 337673 371258 230806 306081 399165 275276 260656
18022 260656 199786 200880 -24963 -244070 -162519 -258617 -374799 167735 761524 1205711
18012 1205711 1251049 719078 171155 89597 359183 339431 67959 -285798 -308804 -111790
18002 -111790 100298 222285 76851 -35524 -155174 202356 714786 670696 -19260 -784867
17992 -784867 -885569 -485665 -181363 -483403 -872355 -769004 -625370 -603953 -290192 221704
17982 221704 336221 281669 279346 275390 306577 399835 117837 -459649 -328699 -356773 -469060
17971 -469060 -18792 621926 343858 269175 628875 503400 -203394 -665537 -1098061 -1106014
17961 -1106014 -637334 -359749 -189033 19416 316763 10036 -143355 112712 17113 10868
17951 10868 -105775 -319834 -465434 -268411 -28963 231763 90306 -34043 136774 353516
17941 353516 401786 251947 165874 174469 443333 379449 -162283 -524723 -216883 143589
17931 143589 110305 -137085 -319268 -365532 -562756 -858673 -801781 -486358 -44266 340842
17921 340842 537915 643987 183144 -277451 -225056 -167933 147637 -49439 -260998 -489610
17911 -489610 -502969 -63194 400121 317623 80879 260768 439382 558093 694073 618767
17901 618767 624068 656839 520911 300712 403825 424329 183873 -30930 -71409 -93723 -43909
17890 -43909 -159632 -268113 -109452 -65313 -75428 -39999 -181157 -820226 -1643440 -1825922
17880 -1825922 -1630557 -1541985 -1541723 -1252901 -502857 -88021 -261949 -397841 -631615 -855446
17870 -855446 -572492 -302067 -227140 -797318 -1386271 -1248788 -974386 -666678 -620801 -871468
17860 -871468 -644243 -275250 -69513 110949 91781 -137641 -329799 -152021 147955 338637
17850 338637 549866 942934 1143268 1542405 1607429 1060464 59669 -890265 -1021782 -927150
17840 -927150 -836751 -769377 -653039 -578092 -507486 -436003 -528703 -803311 -721424 -297893 -52518
17829 -52518 -243672 -598868 -1018450 -1162702 -1085842 -904854 -835010 -888632 -808583 -690420
17819 -690420 -475688 -594674 -800614 -761665 -756535 -440021 268585 466989 386711 285301
17809 285301 31208 -530633 -912778 -433268 80072 166660 82649 120052 301192 437630
17799 437630 262519 -63799 -294393 -374271 -449754 -660599 -817046 -822074 -644926 -373336
17789 -373336 -12306 143427 489696 859359 557124 251080 39295 -185512 -174296 -483911
17779 -483911 -771136 -522094 -312322 -149727 -116115 56463 440662 944858 830586 452460
17769 452460 349950 470461 434262 257602 433103 278685 -169188 -441112 -464948 -227157
17759 -227157 -99666 -225405 -695384 -861237 -843006 -643065 -676022 -821207 -844270 -929796
17749 -929796 -1109810 -956012 -807968 -664851 -447543 -338893 94579 519051 755412 382935
17739 382935 4455 -315826 -390105 -397556 -708110 -1342357 -1271252 -1020067 -861683 -554933
17729 -554933 -379735 -107403 123852 773065 1264185 825452 529016 350646 -279147 -456300
17719 -456300 -64954 71477 -141993 -600437 -994803 -884897 -633497 -765567 -651545 -199163
17709 -199163 176837 231606 89037 85808 55187 31424 107292 350912 542908 512361 401386
17698 401386 323376 183544 -102191 -279589 -424260 -461089 -590542 -310523 704633 1747537
17688 1747537 1993320 1602154 1436134 1029031 390195 128036 -185738 -691894 -711148 -93819
17678 -93819 612555 1060605 926652 178095 -578918 -862572 -1016502 -602161 -214983 70470
17668 70470 426449 562674 561507 205236 -140448 -825959 -1419520 -1053104 -356752 -122941
17658 -122941 -137901 -38330 -72780 -46382 -321478 -659376 -119755 416427 709632 949680
17648 949680 1076116 722566 177461 -292412 -887966 -1293178 -1250551 -1079451 -935534 -816586
17638 -816586 -529847 -228884 139681 619581 511545 -92302 -387917 -68908 375306 172369
17628 172369 -222322 -688911 -797502 -1086154 -1100567 -125203 449777 -145302 -805604 -812222
17618 -812222 -712956 -868127 -981909 -904489 -569464 -388372 -398168 -430010 -434292 -607059 -923739
17607 -923739 -1041568 -913050 -981175 -994172 -803718 -761822 -443881 -33680 209111 94905
17597 94905 -363335 -550229 -358177 -243136 -323161 -279481 -508212 -617174 -489730 -542475
17587 -542475 -617528 -575448 -356565 -458166 -818912 -907717 -876706 -720280 -683464 -490477
17577 -490477 -172279 -318516 -664691 -1158171 -1485456 -1170426 -585587 -233367 -156578 -445895
17567 -445895 -434985 -77892 129715 199658 -74281 -256580 -356164 -404782 -631359 -827628
17557 -827628 -462336 -285019 -177979 -152026 -89583 -53551 -236537 -359110 -281393 95901
17547 95901 301816 134117 -182924 -144021 25645 -65312 139125 167998 -113748 -297948
17537 -297948 -640876 -377808 63431 42438 -220545 -429412 -445128 -568292 -899073 -909221
17527 -909221 -374509 -150432 -342252 -465018 -662700 -864146 -956904 -822880 -207129 326805
17517 326805 60018 -475477 -745015 -971070 -1116810 -1056494 -457031 -186927 -414299 -450600
17507 -450600 -283379 56344 -45447 -197113 126807 247717 27480 -400620 -808286 -1002235
17497 -1002235 -988624 -1020542 -1024022 -1089517 -877097 -611210 -546113 -593111 -694824 -629082 -540905
17486 -540905 -515626 -481967 -240029 -119301 -278572 -80944 60646 246492 243412 209416
17476 209416 241107 -20268 -293318 -147219 -78723 145859 296348 460724 199021 -138475
17466 -138475 -179401 -258515 -390832 -513110 -619094 -619941 -514166 -230603 -441633 -1153496
17456 -1153496 -1344306 -1064545 -733756 -574324 -604889 -924274 -1118971 -1105767 -866837 -561880
17446 -561880 -490577 -278508 -149460 -105411 390696 835262 825510 413091 -74890 -135526
17436 -135526 -159336 -446931 -561019 -394588 -286366 -232254 -132443 180922 185912 83600
17426 83600 411974 603506 164821 -393623 -459392 -464610 -478911 -299529 -154325 -246633 -535511
17415 -535511 -742520 -684341 -518094 -241908 -183528 -297854 -732462 -1077243 -489871 97762
17405 97762 266611 264824 236558 273074 244010 -124023 -632154 -1121708 -1155007 -860044 -870758
17394 -870758 -870836 -884191 -1039885 -1072405 -644033 -24589 370799 443365 453401 391734 193924
17383 193924 65519 272692 583590 717006 940620 927243 937316 1076049 946261 624678
17373 624678 432153 349243 293982 -125403 -355553 -123970 12042 140138 261831 402225
17363 402225 460699 441211 244849 2769 -84238 -264998 -535592 -749253 -681799 -187288
17353 -187288 148540 308993 567363 817748 778724 557839 -282009 -821250 -844341 -556411
17343 -556411 -480123 -642417 -550798 -510600 -432161 -272964 -113080 178978 402766 143229
17333 143229 -240013 -363170 -206946 43820 -117207 -212725 340996 519231 406976 325303
17323 325303 -91413 -260064 -12949 233728 384476 290262 -241515 -428990 -465740 -254838
17313 -254838 -115365 -242519 -470208 -628508 -342810 -6950 351487 588243 239025 -131309
17303 -131309 -378082 -406402 104700 405144 318122 474476 928886 1179465 1055511 992772
17293 992772 927625 599318 532407 557215 414516 540624 1161988 1533862 1160723 610991
17283 610991 286288 273703 429015 402032 25044 -73952 144045 -36946 -401794 -786823
17273 -786823 -724087 -386502 93982 80630 -172595 -89547 -107750 8378 -248773 -673548
17263 -673548 -962352 -1069936 -1190242 -1133337 -1048514 -1044448 -613524 -113098 12424 -258021
17253 -258021 -457571 -346756 -83174 275811 819019 797354 161458 -211838 -372494 -498991
17243 -498991 -749053 -571431 -284171 -88330 80151 -26367 -361245 -554045 -494333 -375290
17233 -375290 -269623 -510807 -603857 -365483 -229232 -834957 -1146499 -828146 -737241 -558770
17223 -558770 -536488 -565633 -406587 -134277 106075 88302 -60124 -300508 -554574 -375858
17213 -375858 -61615 271612 686152 670587 396927 732374 502211 117772 -1361 -333640
17203 -333640 -124586 -43636 -324297 -305348 117145 396433 325878 83349 -477656 -761016
17193 -761016 -636347 -535415 -415616 -309700 -139745 -27062 -44262 335475 711447 776129
17183 776129 348623 -193106 -267569 -49734 146147 96781 -42984 -41207 -153805 -239322
17173 -239322 -355326 -334267 557011 1358285 1345473 1137062 1627516 1905942 1718910 1538147
17163 1538147 1115924 753817 690069 544772 382141 367717 489866 534649 627483 816698
17153 816698 871616 812031 669708 709913 1055298 1391966 1171344 1258908 1533829 1419114
17143 1419114 739698 89656 175115 487515 806638 873178 497645 -196605 -488277 -215128
17133 -215128 -101724 -357677 -256288 -110778 -102371 103485 151804 182624 296315 417891
17123 417891 599219 938448 947769 581937 58849 -186746 39489 144289 -123369 -216701
17113 -216701 -14313 166232 481211 670870 275206 -58839 3265 -11818 -156861 15207
17103 15207 169068 -17922 121859 249333 199400 534526 570733 338204 561625 840648
17093 840648 914392 909779 1246128 1230065 818297 435601 297701 135037 225499 408528
17083 408528 552081 733727 1018163 990676 831413 659525 319018 356999 784190 774661
17073 774661 644791 623935 638183 785171 804076 543565 760537 1046437 639749 241346
17063 241346 265154 597071 1007272 1165102 1351688 1337130 886579 498447 212397 291781
17053 291781 314118 400537 616927 925927 916972 413940 -304763 -473788 -294911 27639
17043 27639 217582 55775 -239370 64572 471743 623942 512734 348026 230531 420098
17033 420098 432484 91748 -321326 -382054 -74094 -103890 -190967 34956 111672 157014 118424
17022 118424 -24453 -351230 -656848 -493183 -45347 165148 350707 678671 684945 426763
17012 426763 96195 -106002 -5741 30440 245419 439946 510194 487012 202449 -140702
17002 -140702 -85610 48607 -452560 -782216 -824015 -899156 -1169252 -1225691 -1132109 -695680
16992 -695680 -457927 -473676 -595238 -740082 -952044 -779580 -292660 -60108 -74914 187024
16982 187024 396587 129779 -382042 -600518 -714996 -802349 -510525 -268115 -344368 -408942
16972 -408942 -264961 19051 168333 360116 586984 534750 179757 -165929 -232782 -161343
16962 -161343 -224869 -236230 -423831 -349086 -94942 111548 77116 -22219 36415 123536 -101325
16951 -101325 -185741 -58520 -144660 -230295 -65396 -20641 -109610 -812803 -1020925 -210811
16941 -210811 468452 646240 529450 143633 39675 93900 30541 122453 103277 132337
16931 132337 232452 108467 -81828 -133767 -287350 -341269 -409927 -371664 -605553 -741739
16921 -741739 -950321 -1300504 -1116838 -690842 -562865 -545592 -352105 -99025 13868 150797
16911 150797 335403 292453 311461 231120 182440 171117 190409 322412 537762 364029 104596
16900 104596 123072 499532 978419 1016400 1164255 1361564 1280349 1198236 1012225 913561
16890 913561 611758 112666 -276281 -563599 -383288 -199596 -464029 -762821 -778152 -733132
16880 -733132 -709273 -667566 -952424 -1110683 -549777 148067 648749 827266 934722 975717
16870 975717 837517 559352 140340 27780 583350 1118502 1098877 829936 529183 406529
16860 406529 502345 376498 137283 167336 64375 243795 292610 289718 565634 800168
16850 800168 639337 117083 -77814 16379 -79553 -144601 67882 112450 -53096 -280762
16840 -280762 -310625 -132010 -69097 85914 308689 287895 362930 777509 771931 442497 314096
16829 314096 -50242 -10205 -40384 -2695 212820 464638 875050 1189983 897846 636299
16819 636299 676527 534252 80461 -257848 75113 377602 405692 604180 805672 995440
16809 995440 744808 385124 484704 528959 497836 575915 303187 -154981 -249262 -188337 -354681
16798 -354681 -603126 -640382 -794276 -886032 -599617 -496873 -772288 -645256 -309039 -182068
16788 -182068 -274556 -106200 164151 307495 421321 319972 75039 -295800 -587567 -582542
16778 -582542 -529476 -595229 -765091 -1094352 -1125766 -892095 -573744 -540424 -338720 -148658
16768 -148658 141922 298277 242901 37657 143501 695280 1113172 1153518 979378 166100
16758 166100 -764132 -746994 -627208 -726594 -432112 22215 320197 508159 151322 107614
16748 107614 325426 50550 1799 261103 380076 254272 64024 150156 329436 391310
16738 391310 495097 575271 776474 413985 -299106 -947874 -1061916 -853442 -724899 -322914
16728 -322914 -66597 -495920 -800258 -872041 -405593 229072 422358 147269 -99039 -15748
16718 -15748 40332 -303938 -454288 -364346 -366092 40868 127896 -179215 -602143 -906844 -838703
16707 -838703 -715364 -464330 -2833 336283 248288 3171 -18947 20029 136213 531047
16697 531047 658571 678757 503555 360097 529958 687335 583820 240318 48557 301560
16687 301560 497616 164128 -112662 -226904 -259202 -41545 263813 316992 242358 282762
16677 282762 586548 776402 536439 136427 329180 385855 359687 245338 -19826 148542
16667 148542 287010 498703 513275 -103728 -355283 -373035 -406119 -376741 -213768 106952
16657 106952 577924 388247 -243292 -485531 -519540 -252375 -213194 -633633 -831955 -391640
16647 -391640 244561 352508 105023 -268172 -391335 -723839 -761781 -412572 -338569 -185012
16637 -185012 84143 509648 1299880 1859185 1666145 986463 332306 118237 282000 183345
16627 183345 186009 411114 424927 317592 364811 303295 -39541 -87144 -14736 25571 125997
16616 125997 -216020 -428331 -134719 75974 -127355 -88370 36410 212057 641349 687606
16606 687606 613523 466975 228754 29726 -303631 -276024 -146534 -544524 -536532 -713514
16596 -713514 -927131 -1054750 -972456 -859052 -552224 -427903 -527590 -765247 -1031202 -1001279
16586 -1001279 -912527 -876100 -833417 -792683 -772823 -546202 -565735 -587169 -374700 -551315 -431891
16575 -431891 -135612 -36226 -195027 -168882 -187368 -586144 -665424 -468427 -497421 -769893
16565 -769893 -1204231 -1495174 -1469332 -1330797 -858670 -371620 -302016 104302 731973 719543
16555 719543 481329 266506 -59268 -150812 -480945 -1197969 -1142076 -954926 -1008290 -893393
16545 -893393 -389941 -400250 -840335 -700675 -384846 -190667 -273683 -96010 177405 277158
16535 277158 197464 192697 151594 -62130 -57262 -226714 -246212 -13391 80287 -29261 31561
16524 31561 395009 1073967 1601309 1628426 1458282 1071382 889278 949482 825787 915227
16514 915227 949709 557967 271217 365359 309487 128371 196773 466799 457603 374992 511976
16503 511976 1062167 1178138 1111679 616702 -36929 -391661 -475154 -459568 113519 627901
16493 627901 468086 15047 -310297 -517390 -311189 81477 354502 270387 227020 299503
16483 299503 236326 381667 642405 580784 288982 174483 -28872 -113748 -18281 229978
16473 229978 395552 11037 -135164 -166834 -452276 -773388 -1014217 -1288329 -1249227 -665388
16463 -665388 -211661 -151543 -322658 -506175 -410890 -503139 -970231 -1185406 -1002733 -388432
16453 -388432 46790 236352 518802 928090 1650715 1960504 2230663 2391143 2421270 2130054
16443 2130054 1267132 579489 243902 276426 253011 -102516 -392962 -516004 -314164 206326
16433 206326 700761 898827 614783 -10198 -137729 83755 -513357 -1242008 -1362919 -828976
16423 -828976 -460488 -252509 -653395 -786435 -629159 -495083 -69739 191364 -124539 -521594
16413 -521594 -470673 -38176 271564 420151 572652 612380 497421 357273 232570 335095
16403 335095 465593 168 -484372 -802817 -771076 -586293 -340151 -281329 -476824 -705700
16393 -705700 -703988 -374113 -225717 -209990 -139224 -119901 -551719 -1271791 -1625249 -1332768
16383 -1332768 -346002 500557 555705 468198 410373 -81517 -313854 -179908 -310011 -286926
16373 -286926 -204851 -205703 -130281 -554766 -758701 -632572 -268893 130685 121712 -291632 -902633
16362 -902633 -1137383 -837929 -507050 -41076 29672 387543 693678 281983 -152134 -280672
16352 -280672 -669175 -940389 -1007386 -1323129 -1340969 -1202942 -1029102 -857733 -581980 -70470
16342 -70470 802218 1181969 1084217 644610 397735 400173 302794 29483 -315769 -177711
16332 -177711 25145 269253 437323 325583 147858 -156564 -68503 23146 -77381 -436081
16322 -436081 -654398 -387115 -70273 253810 457144 257999 29861 -46019 209396 517179
16312 517179 694261 362351 88408 -508699 -647597 -119788 407273 383116 37115 -169356
16302 -169356 -200983 -380389 -798356 -928747 -912951 -737431 -456555 -355819 -419969 -378800
16292 -378800 -314916 -249875 -197916 -381129 -457513 -720367 -1045981 -879840 -741845 -575265
16282 -575265 -503643 -593641 -349735 -240045 -198570 -267817 -381504 -389548 -492736 -492589 -72641
16271 -72641 237712 284471 472610 179046 -367821 -344090 -550200 -838406 -779479 -572109
16261 -572109 -508013 -499964 -442744 -728468 -670721 -433475 -338287 27114 585087 595561 162027
16250 162027 -16905 -122792 -351779 -539295 -533567 -766772 -772718 -300810 144196 223481
16240 223481 -215621 -661193 -328834 -274066 -132765 267985 309336 264401 235016 246119
16230 246119 100727 -183076 -530369 -198651 207292 326835 -111786 -580807 -397025 -426993
16220 -426993 -751797 -814403 -455116 32143 502941 918809 1160896 916115 630292 415489
16210 415489 747598 1103261 516969 -8386 -235978 -416744 -653183 -855095 -972969 -1277533
16200 -1277533 -1367940 -1202736 -1328109 -1175006 -796585 -433622 -303594 -320961 -395299 -299153
16190 -299153 -288492 -297209 -183756 -592926 -484343 -57277 76518 299471 782322 948390
16180 948390 715842 161171 -430796 -511901 -475741 -397514 -460801 -533802 -717780 -584671
16170 -584671 -608462 -811341 -761537 -641685 -491660 -286909 -152169 -154421 -225683 -573615
16160 -573615 -768620 -674838 -392757 -148070 -543446 -839213 -341020 4978 -192497 -129417
16150 -129417 146084 120400 227499 553838 728694 875290 969864 255784 -314347 -307548
16140 -307548 -195195 -106201 -637879 -1012365 -1048278 -1243682 -1277220 -716753 -457340 -634569
16130 -634569 -782944 -886510 -758060 -273292 20391 -471263 -881404 -776805 -674163 -429532
16120 -429532 -223712 3254 -247300 -514799 -227200 -98502 -191625 -78025 -12816 161877
16110 161877 504134 453866 208290 70457 -415351 -614130 -298411 124366 425970 472538
16100 472538 538646 567815 990276 1154142 892917 800542 671253 500309 409939 493131
16090 493131 554969 299238 -216264 -234841 676941 1318712 1157576 754320 539673 680712
16080 680712 617593 617682 709783 620044 375756 242685 361394 513199 658483 572761 229071
16069 229071 -6320 79829 221587 287365 503833 664103 786468 848085 669346 580969
16059 580969 145696 79021 363067 310223 149017 -74781 -355332 -450508 -525302 -708257
16049 -708257 -567402 -265296 22030 68364 93634 116303 30951 203996 513345 67323
16039 67323 -15477 492842 946782 882338 592237 392464 -94215 -259307 -165184 -196874
16029 -196874 -63674 41561 -45612 -372530 -238192 -27999 110401 -26409 -145601 36803
16019 36803 232280 713465 553718 136738 55578 520564 930474 736807 792050 1302636
16009 1302636 1865388 2139883 2198938 2089034 1914063 1849136 1851432 2212249 2272626 1769486
15999 1769486 1064342 981503 869357 482048 200477 -34445 -556809 -862597 -956003 -1085447
15989 -1085447 -1306376 -1732230 -1761698 -1343623 -989240 -563032 84280 731620 1105666 971822
15979 971822 613209 297915 134472 349544 257847 -261459 -525802 -534414 -389787 -369638
15969 -369638 -574671 -335144 430397 749456 576152 21356 -496686 -649562 -520182 -54113
15959 -54113 308909 415470 428785 456280 347851 148474 247090 773535 1013455 1071560
15949 1071560 1246357 1302404 1182967 734810 402812 266686 40223 -300325 -121477 135290
15939 135290 351647 312776 350279 258255 -46023 -234654 -307031 -214644 -83356 -406849
15929 -406849 -612021 -681813 -783838 -479551 -423959 -444380 -171449 54209 257374 200089
15919 200089 23583 -168537 -334206 -542816 -712620 -644568 -791564 -670918 -305634 -219384
15909 -219384 -226272 -9972 -96235 -203289 -45261 65181 -46489 59672 183003 288643
15899 288643 559337 627426 249702 38481 212182 618848 908397 770912 625779 292099
15889 292099 -92962 -151355 -89596 -154617 151465 365371 314553 288427 223967 47512 -98724
15878 -98724 147 40594 33030 25053 148249 309287 -74630 -420726 -300904 -71092 41576
15867 41576 -239831 -616048 -658788 -463907 -356762 -619390 -834688 -635986 -567830 -786187
15857 -786187 -732739 -282693 137229 469777 436553 160892 113671 -4788 -267638 -415296
15847 -415296 -349271 -97134 -221768 -293055 -206118 -35045 -191084 -539726 -818631 -900460
15837 -900460 -475227 68948 291221 282416 134612 -148730 -400223 -374740 -170622 35044
15827 35044 97502 -49901 -258007 -333369 -2523 276357 102048 -120018 -261448 -459701
15817 -459701 -343072 -5075 105475 -3546 -100993 -121133 20139 -116151 -253315 -130778
15807 -130778 73423 295541 469112 426738 749719 923578 491807 289326 86259 -186714
15797 -186714 79553 730450 1215393 1587275 1482416 1247707 909532 565765 240752 322727
15787 322727 446219 760502 692714 650393 720442 899811 1038271 1196771 1311676 1274108
15777 1274108 1173332 960847 618260 371747 320908 181915 133501 36483 -93273 153733
15767 153733 -34386 -504136 -736054 -945924 -580249 -167043 -94219 -203654 -30486 140175
15757 140175 205634 132855 -152068 -559979 -1112448 -1287067 -1326187 -1506680 -1110397 -395449
15747 -395449 -82787 -153382 -82333 -202162 -312064 252839 841506 609985 6870 -280970
15737 -280970 -180940 55373 -37530 -29633 -121217 -576863 -484999 60174 545180 648753
15727 648753 183281 -330971 -380963 -392663 -382280 -790011 -1165235 -1091219 -997986 -1094252 -1373923
15716 -1373923 -1230523 -1115117 -1055423 -563672 -404272 -383948 -682233 -977419 -984538 -1357552
15706 -1357552 -2061809 -2562045 -2546694 -2228523 -1996473 -1864017 -1691981 -1303474 -919641 -822577
15696 -822577 -1117741 -1346428 -1149809 -884129 -851272 -950626 -888171 -569395 -356837 -142400
15686 -142400 -173066 -127166 -442540 -1056944 -1595746 -1714170 -1257905 -548939 -334235 -102557
15676 -102557 -75716 -526552 -807484 -633491 -458215 -466659 -200421 47723 313991 214916
15666 214916 68125 228894 213463 -180470 -616416 -832820 -546141 -292501 -243922 -471519
15656 -471519 -983162 -1303361 -1388641 -1300266 -1067228 -758512 -479281 -566195 -664756 -770236
15646 -770236 -906895 -667143 -626328 -631923 -943521 -1475160 -1793968 -2026436 -1668943 -1150925
15636 -1150925 -999031 -885656 -924128 -1048049 -856283 -372018 -80974 -349800 -516055 -639785
15626 -639785 -731836 -852681 -1215501 -1133203 -598029 -420956 -396676 -581594 -1031789 -1329563
15616 -1329563 -1440405 -1038762 -432559 -423750 -427066 -191020 70690 140670 200955 715567
15606 715567 1086768 1288683 1371798 1416222 1191424 952788 605424 479565 461219 24283
15596 24283 -487992 -535252 -313131 -379913 -525587 -646573 -308987 184706 164923 -210846
15586 -210846 -320547 180651 448599 229945 312061 213669 5936 168719 109535 20891
15576 20891 -445530 -976737 -689712 -41463 518307 1139660 1749799 1618520 947042 446087
15566 446087 300136 93811 -218308 -177914 -266676 -635931 -592756 -573657 -350483 246765
15556 246765 804705 495129 -15497 -189181 -233315 -733993 -913694 -434397 -213550 -281436
15546 -281436 -389791 -618143 -521111 -98748 8859 -389340 -645735 -603915 -434457 -312947
15536 -312947 -285996 -443678 -756103 -921950 -1023158 -846442 -490204 -609151 -349306 187883
15526 187883 431292 155928 -433333 -769716 -426054 -134806 -454460 -609360 -506051 -905255
15516 -905255 -1297322 -1255368 -798479 -450930 -603542 -903307 -877654 -501233 -12126 348490
15506 348490 30483 -282493 -39976 33583 92384 241627 68250 -131579 -329702 -494363
15496 -494363 -577373 -779215 -964017 -1116965 -1013913 -398436 -131425 -354669 -360902 148241
15486 148241 668301 871305 756013 668187 623521 469391 -535932 -1408725 -1426724 -861716
15476 -861716 -480240 -66043 -204570 -368975 12762 275360 -3471 -380980 -354068 -126290
15466 -126290 -95180 42738 143824 5400 -329456 -536184 -598370 -767936 -441370 459051
15456 459051 779151 576383 528045 105685 -144839 -267483 -385103 282551 1173221 1397319
15446 1397319 1245739 799741 151877 -329603 -685602 -963379 -974909 -789248 -763976 -1049160
15436 -1049160 -1188606 -1050928 -738249 -434323 -362361 -100017 38906 -348638 -889164 -974164
15426 -974164 -1012597 -1041822 -858162 -536224 -27868 -19079 -562263 -876114 -756582 -722055
15416 -722055 -649639 -594506 -690047 -880379 -853356 -794968 -1069591 -1388545 -1380906 -1167425 -972818
15405 -972818 -682201 -564658 -551391 -860682 -1080089 -849095 -440035 133678 7710 -371285
15395 -371285 -683130 -712331 -755821 -755712 -855198 -922087 -786853 -564281 -393393 -229285 22680
15384 22680 181262 186723 153793 332423 -47460 -768 320524 407146 344852 304281 220500
15373 220500 367320 404511 37019 -234077 -96377 24271 -507149 -1051848 -1181506 -1267957
15363 -1267957 -1407508 -1473977 -1350742 -937236 -405848 -456260 -511962 -279479 -242692 -395419
15353 -395419 -135957 -29950 -281419 -482666 -733270 -595448 -391030 -116150 271428 522962
15343 522962 367087 498878 609841 540886 283655 -237238 -726737 -429998 121856 201993
15333 201993 67144 -186221 -583330 -967135 -992259 -568173 -401872 -608333 -440218 -419049
15323 -419049 -884898 -1063988 -1444202 -1706677 -1445742 -900373 -558709 -713902 -991684 -874474
15313 -874474 -396346 -590316 -859254 -444574 -225946 -274267 -298206 -214505 -2481 46358
15303 46358 -34859 -186199 67572 452027 961551 967500 785978 414666 -264417 -401199
15293 -401199 -77403 386759 628330 559991 246472 274818 463710 73819 -247437 -546336
15283 -546336 -931682 -1315817 -1371425 -989258 -814702 -457722 110856 35590 -333215 -336979
15273 -336979 -460101 -786167 -962358 -988002 -940256 -924284 -874854 -782627 -479654 -560703 -787754
15262 -787754 -566232 -315999 -214191 -479953 -1241485 -2220724 -2478585 -2152054 -1757733 -1493181
15252 -1493181 -993122 -388815 -36203 -24143 -451837 -752602 -970340 -970893 -534830 -88966
15242 -88966 34890 34636 -66561 -158162 -159643 25699 365143 -6099 -513296 -922352 -1055162
15231 -1055162 -1059208 -849525 -198331 80870 -93594 -261701 -377926 -697897 -766715 -599406
15221 -599406 -574323 -467145 -139189 -299075 -638925 -682855 -720308 -836992 -637120 -702767
15211 -702767 -861146 -629543 -397112 -180312 -181387 -23811 153531 108060 -426602 -1022056
15201 -1022056 -1034084 -643687 -645638 -1021754 -1030737 -945711 -714450 -392446 -234556 -269223 -324371
15190 -324371 -416267 -455307 -259482 110198 296349 260434 136708 -42858 34804 519973
15180 519973 528748 129038 -212309 12676 242355 -257003 -469353 -291572 21634 198281
15170 198281 37965 -49191 -9181 -247821 -464512 -385896 3006 272474 569783 750296
15160 750296 659883 382060 65621 -343682 -885345 -838023 -569938 -227397 126354 112271
15150 112271 -1312 119685 303548 317042 306897 160239 56975 -123412 -344634 -345915
15140 -345915 -244635 -580415 -713459 -951187 -1306020 -1029912 -191601 -12461 -624335 -746995
15130 -746995 -714519 -641001 -780926 -967572 -763941 -325731 -171521 -324498 -325283 -203702
15120 -203702 -216343 -188571 -472517 -786538 -704255 -98295 233908 87832 -12889 -86817
15110 -86817 -388360 -1150141 -1728418 -1678142 -1349200 -1241259 -1010253 -729119 -279111 -362256
15100 -362256 -469138 -216173 -294558 -397449 -312061 -405505 -422335 -242506 154773 250256
15090 250256 -32079 -209076 -313107 -361304 -612030 -742741 -1118787 -1531183 -1590120 -1283827
15080 -1283827 -684554 -242948 -42956 288337 309659 60285 -503 222448 613956 726816
15070 726816 399190 22138 24887 36547 -134714 -676555 -1128678 -1258784 -1094142 -810284
15060 -810284 -142108 547438 628901 393733 -95806 -426115 -687459 -883503 -595145 -170281
15050 -170281 180930 301099 181026 -14719 76766 237829 404198 212198 -144035 -341118
15040 -341118 -400724 -198204 -123568 -242402 -659335 -1204621 -1639083 -1441531 -849694 -626880
15030 -626880 -720602 -631611 -750734 -797994 -326255 431839 848374 1131315 889561 458726
15020 458726 -13201 -310427 -526503 -584426 -314048 -394860 -526396 73622 576793 544763
15010 544763 354378 -130126 -434582 -875257 -928808 -689485 -917994 -1040155 -983583 -597166
15000 -597166 -200765 29499 147256 20233 -278049 -657321 -672650 -537647 -544695 -593269
14990 -593269 -378645 387010 1209151 1317507 814275 375290 720571 736310 255190 151250
14980 151250 612824 1002471 1108707 822774 380110 135612 -47382 81884 203063 443510
14970 443510 748047 463670 -131932 -567815 -678048 -1001289 -1202526 -1178255 -1419022 -1626696
14960 -1626696 -1402528 -941369 -293432 -109675 -289335 -378061 -418007 -521221 -430215 -130324
14950 -130324 -20514 -109152 -10156 187317 197629 -3894 -33476 156040 107577 -79755
14940 -79755 86655 337275 631939 456300 132789 83769 181152 382011 457726 599926
14930 599926 769577 620909 -25485 -559631 -666002 -495811 74193 278313 220971 273737
14920 273737 30147 -267406 -539984 -493524 -151239 172048 135756 -182132 -50883 144958
14910 144958 -288097 -535964 -727427 -925332 -894209 -840054 -844448 -881089 -841682 -692578 -751947
14899 -751947 -830326 -834829 -788705 -962392 -1024452 -1051849 -875931 -810325 -769439 -501213 -212367
14888 -212367 -60435 -129546 -105707 3195 -21016 -219530 -620105 -842514 -849598 -373208
14878 -373208 -220291 -1911 488418 587338 268786 -137282 225585 249217 251329 455664
14868 455664 232858 -18570 -301754 -654586 -934828 -667614 -435481 -483650 -304464 95989
14858 95989 74175 -95016 -44684 -84741 -267762 -888715 -1715656 -2023172 -1639955 -839651
14848 -839651 -268333 -499589 -712674 -538194 -672134 -576089 -362725 -440624 -598849 -713362
14838 -713362 -707831 -701750 -806049 -982532 -972876 -890297 -652333 -319561 -387818 -330107 -318027
14827 -318027 -69546 320918 514027 607202 600271 602246 492397 347607 166145 -1084
14817 -1084 105677 506694 186138 -705482 -789729 -91748 606058 714418 538442 501253
14807 501253 208515 -262649 -505865 -753806 -933332 -1112384 -1006378 -833872 -592784 -364246
14797 -364246 -336311 114713 406209 54727 -229132 -81385 -74826 -208556 -41860 125812
14787 125812 -92223 -289440 -345641 -382657 -31864 322755 61821 -258831 -361762 -83157
14777 -83157 -74075 -325000 -425756 -546968 -656588 -588896 -395545 9490 255554 186553
14767 186553 -147903 -354722 -400454 -540434 -639083 -423089 -89202 -80411 7378 29537 -204463
14756 -204463 -538193 -627238 -798741 -915189 -752684 -435442 -222215 -376358 -354642 -531521
14746 -531521 -734476 -534643 -76291 -240689 -622783 -664424 -622903 -809015 -1213790 -1136477
14736 -1136477 -1082774 -1034143 -747629 -374870 -270310 -81734 423966 764698 882062 1063718
14726 1063718 805836 -249526 -893768 -698377 -797580 -1187489 -1015062 -673973 -430532
14717 -430532 -363311 -385134 -360662 -106628 -61837 -134884 -259999 -267086 159068 196969 135166
14706 135166 129091 76712 107762 87822 -271429 -781654 -836021 -757583 -742307 -668954 -658792
14695 -658792 -730925 -711137 -933631 -1266169 -971403 -747374 -569026 -452696 -482955 -548768
14685 -548768 -252888 290289 586054 514428 474097 132327 -291766 -171404 -124441 -139408
14675 -139408 -379605 -179744 -85202 -239946 -251491 -151914 -47738 229966 497188 433791
14665 433791 99716 -211243 -306138 -44979 426853 390001 73060 -118708 -259945 -397439
14655 -397439 -650188 -942576 -1078894 -1401955 -1809016 -1540671 -816149 -263819 4454 23616
14645 23616 -85094 8788 123460 198954 206409 -165346 -226416 379405 647312 637297 545978
14634 545978 446169 482672 535273 531436 224914 5078 -177454 -381372 -439380 -308884 -130948
14623 -130948 71498 378408 479119 566612 330596 -157810 -554670 -505931 -399818 -505591
14613 -505591 -406295 -318728 -498195 -730162 -996173 -1300155 -1432984 -887450 198484 732730
14603 732730 748182 772862 1017497 1557433 1456874 884065 536415 422419 201458 -339862
14593 -339862 -265927 560144 1185350 931749 688663 514178 56329 -98777 -284114 -421935
14583 -421935 -634078 -826216 -1058528 -1044983 -1019293 -800418 -792301 -1153989 -1463332 -1346421
14573 -1346421 -807168 -410618 -94240 224271 529653 1000711 1209625 888843 88018
14564 88018 -517463 -618068 -594388 -672075 -793328 -964232 -1124424 -1347724 -1486867 -1446237
14554 -1446237 -1509348 -1574414 -1763685 -1448614 -920218 -471864 -190855 -432037 -965729 -911205
14544 -911205 -498908 -585235 -860317 -925537 -833989 -600847 -298325 6674 -3290 -372005
14534 -372005 -335371 -376286 -628473 -569782 -222944 317099 733309 626704 177576 -247762
14524 -247762 -485721 -340852 -536535 -814391 -884259 -753757 -579007 -448416 -241983 -363347
14514 -363347 -141723 232956 119300 92326 35464 45250 44257 191403 391050 341229 70819
14503 70819 -69422 194462 805180 1345498 1671983 867438 219136 215675 583806 1119882
14493 1119882 899405 279912 152650 349914 37369 -375198 -699303 -1223057 -1162055 -389826
14483 -389826 546066 774407 145249 86476 24087 -152036 273783 444477 -27800 -678071
14473 -678071 -926669 -882008 -401948 -90247 -506898 -999943 -898162 -177341 239615 245112
14463 245112 181766 412303 531935 231804 74315 10049 -92265 -542762 -726913 -405660
14453 -405660 -117010 -90370 -350644 -500601 -425414 -384100 -449719 -462203 -267398 -232812 -248376
14442 -248376 -163536 -192495 -142519 -341541 -773215 -1133261 -1397616 -1712113 -1618194 -1224959
14432 -1224959 -903441 -739442 -808172 -1136790 -1113739 -1117213 -1421342 -1352185 -928958 -753499
14422 -753499 -763689 -864502 -893315 -870582 -1355745 -1404053 -952956 -286837 189938 148804
14412 148804 61801 -5100 -176153 60349 467623 240209 -319087 -417864 -405725 -415886
14402 -415886 -395867 -470398 -714660 -746908 -543256 -390193 -438086 -215642 140506 101117
14392 101117 117768 -66354 -350603 -733975 -1074728 -1169029 -1135001 -835023 -294508 166530
14382 166530 326096 373039 426197 544436 502799 477941 363477 -34094 -450903 -307012
14372 -307012 -9406 -163618 -798795 -1064886 -956551 -1138809 -857010 -503762 -636304 -862470
14362 -862470 -910600 -818585 -949059 -1104369 -1075732 -701457 -223731 120058 251601 220886
14352 220886 327825 -5280 -396348 -457172 -147525 176155 -80797 -315150 -105661 199817
14342 199817 509656 544700 344217 240776 232753 211253 530135 552781 91545 -659967
14332 -659967 -1142272 -1145897 -891211 -506514 -370006 -407106 -431055 -217517 -336273 -661368
14322 -661368 -916596 -1013019 -875731 -639629 -305686 52946 -212342 -683546 -924116 -738461
14312 -738461 -405688 -462208 -482121 -302792 -226058 -251318 42025 265176 269989 72917 -90237
14301 -90237 207843 553276 518430 460371 250273 -85230 -312785 -164642 130600 -396770
14291 -396770 -1218342 -1257354 -1182935 -1273856 -1201592 -730495 -244874 -87596 -466685 -1063215
14281 -1063215 -1179876 -1142570 -1110966 -598770 -228089 -169994 -122100 -215320 -467726 -701480
14271 -701480 -593485 -234710 429099 878430 909299 652332 143289 -310957 -775211 -859431
14261 -859431 -721947 -918355 -742617 -528727 -280836 91964 431266 367812 179943 341669
14251 341669 290878 253129 363166 713837 811475 743459 703606 393226 109847 -88790
14241 -88790 -61476 388991 385559 90913 268694 845138 1383399 1236499 652521 -4066
14231 -4066 -335657 -308111 -525150 -975058 -741928 35651 345155 255247 276412 461424
14221 461424 480003 205532 -351444 -1098633 -735571 302330 631099 467259 159077 92387
14211 92387 52266 117518 245014 55128 -546504 -1043335 -1208441 -1369983 -1078459 -117211
14201 -117211 280843 -93877 -140167 437472 968484 1108813 703763 -51568 -453800 -600156
14191 -600156 -588230 -724012 -692866 -611881 -382387 -265682 -376470 -180677 -64496 -198739
14181 -198739 -515902 -811585 -968685 -1338187 -1401208 -868508 124091 401864 258476 590417
14171 590417 436189 325062 292495 -15935 -161037 -113609 -211347 -269468 -376141 -169989
14161 -169989 -142414 -422020 -511596 -468237 -506688 -600664 -642918 -635563 -386550 224725 732261
14150 732261 481523 -29039 -712624 -1343817 -1077391 -577513 -554270 -498812 -173991 -156257
14140 -156257 -189378 5973 219412 78183 33551 -152438 -484456 -474010 -342367 -435214
14130 -435214 -886891 -689452 66906 224380 -92647 -401785 -452191 -282767 110082 300056
14120 300056 92766 -180656 -126303 -53806 -378773 -628273 -715899 -884397 -1107706 -1057305
14110 -1057305 -818485 -299913 205028 556866 844749 567906 159327 138457 216983 -31313
14100 -31313 -363218 -455398 -546479 -824367 -1195862 -1150642 -968340 -901570 -920383 -719663 -256168
14089 -256168 45115 16522 -30513 -32869 69393 131398 437660 787734 577612 387128
14079 387128 731591 719034 347323 5546 -391551 -299097 -248224 -336479 -355392 -455815
14069 -455815 -347101 -125561 43928 20874 -437544 -655625 -897609 -1192314 -1088750 -925656
14059 -925656 -687960 -380567 -172533 -1399 -254820 -477409 -678408 -917602 -1026064 -1067676
14049 -1067676 -979496 -678345 -346433 -77303 155790 -168685 -835300 -916000 -459896 -355829
14039 -355829 -394660 -95078 286793 406081 92807 -111491 -290263 -548225 -266421 345371
14029 345371 658620 422881 -115348 -163340 97223 -66375 -475918 -836952 -738530 -492702
14019 -492702 -187663 -36874 182025 758161 976548 565268 583984 445353 288246 255901
14009 255901 313349 425262 355959 296705 140632 -465605 -1043964 -1015281 -626535 -411126
13999 -411126 -246677 -347209 -118609 67009 55848 317980 737887 1072971 1176414 1016737
13989 1016737 393941 -395958 -962689 -1011376 -650961 -426191 -542474 -1029345 -1288834 -1041401
13979 -1041401 -882237 -866533 -1005217 -777054 -436621 -131285 -188123 -236472 327492 392806
13969 392806 -153500 -486473 -609655 -815077 -731027 -642596 -596095 -507562 -1105089 -1711516
13959 -1711516 -1924212 -1723792 -1659584 -1440252 -998652 -877864 -932304 -748759 -702616 -868549
13949 -868549 -993317 -884372 -586949 -488047 -509913 -415225 -499550 -967054 -1083586 -814737
13939 -814737 -396981 -119406 251255 433970 234938 -124442 -690242 -1104421 -1208446 -970756
13929 -970756 -660170 -228106 78014 304675 493031 441549 391896 213092 312601 491110
13919 491110 182796 -129380 -94481 201852 38113 -304142 -440418 -526287 -591181 -653550
13909 -653550 -640493 -731931 -814940 -650759 -311943 31722 -82980 -444456 -839922 -940636
13899 -940636 -622943 -100339 258895 369772 121141 29390 2300 91199 -81021 -608230
13889 -608230 -631840 -230762 26691 -387694 -767841 -574776 -432710 -545480 -539506 -559190
13879 -559190 -860979 -993648 -828320 -623772 -541967 -497042 -342284 -251926 -191373 8001
13869 8001 520586 244692 -341757 -374207 137723 494547 1007008 1133449 839883 823269
13859 823269 433707 18167 120513 497641 572022 575430 625623 1015937 1165472 851308
13849 851308 814458 764225 325881 -126758 -606203 -889463 -898187 -593680 -315158 -505264
13839 -505264 -548043 -199944 -119922 -132467 -5134 -89569 -394970 -379359 -155693 213475
13829 213475 728772 876405 596541 346930 250758 191708 228851 250819 -55863 -589783
13819 -589783 -724867 -851600 -1060943 -925639 -720450 -614844 -876477 -855686 -702221 -472357
13809 -472357 -411594 -651612 -921774 -696303 -104836 240989 733459 459158 252298 487322
13799 487322 475679 365033 554657 344854 207141 231580 214488 262111 559865 781471
13789 781471 864124 818268 951006 745578 195464 15927 -329219 -320878 -182678 -125300
13779 -125300 193740 237980 121342 -60228 -269261 -215452 -138371 123477 707834 925880
13769 925880 685285 789947 655089 51308 -168304 -442 501268 91165 -333494 -74890
13759 -74890 109168 599715 776291 678302 306558 30555 1249 -149946 -403069 -324308
13749 -324308 8071 -101294 -174193 208183 450910 275681 -38277 -421828 -895092 -1217158
13739 -1217158 -1378332 -1111105 -737684 -345806 -196408 -176057 -192236 -134614 -185831 -464942
13729 -464942 -677188 -265961 249498 388966 312360 171491 96527 -69074 -254782 -288501
13719 -288501 -118023 -293982 -555815 -741303 -674114 -229789 354030 420775 474848 732758
13709 732758 1008425 1206127 979146 433667 132661 106139 -17158 33733 168370 -31974
13699 -31974 48914 635568 484490 116939 44721 92613 118013 -136875 -116132 -250451 -29762
13688 -29762 43105 -242700 -296583 -240188 -171701 -78041 -135496 -228927 -228282 -232598 293178 692845
13676 692845 543915 372421 343281 189703 -77895 95342 113984 -45518 -111112 -69262
13666 -69262 195149 301545 -1638 91907 533906 1073418 1455049 1681679 1724593 1269779
13656 1269779 799124 316667 173110 89700 -172091 -371958 -380553 -228769 -298255 -347476
13646 -347476 -383722 -618579 -657008 -372143 -276038 -328512 -507679 -1063456 -1535502 -1614658
13636 -1614658 -1462551 -1005668 -27705 233553 492317 848202 763912 244676 -109673 -36853
13626 -36853 216478 4969 -283849 -501332 -401319 144573 502322 394595 99778 -46441
13616 -46441 229084 310971 310511 324627 121693 95496 277510 49917 -430146 -294206 -121008
13605 -121008 -165250 -502119 -713952 -768460 -1232852 -1515424 -1705234 -1586810 -1465764 -1482243
13595 -1482243 -1111867 -633908 -379146 -235585 -603767 -1059982 -1187302 -1106133 -889303 -745111
13585 -745111 -558950 -311356 412661 1216691 1009702 266138 -62962 -132491 -535042 -1188771
13575 -1188771 -1377764 -1097991 -492403 182228 509485 596674 663367 416236 466870 737024
13565 737024 826819 618578 426383 342682 567722 482787 362704 494009 720050 1046043
13555 1046043 1281746 1069569 682841 512194 511097 496734 404457 82503 -50393 113366
13545 113366 -90464 -559198 -841811 -872844 -800207 -604133 -255139 -174634 -214474 -111041
13535 -111041 89403 353016 589487 1007045 1096053 986127 887935 706711 255143 -189108
13525 -189108 -356180 -574974 -695380 -579962 -159439 27401 -273770 -432688 -219108 -102689
13515 -102689 -358040 -570025 -342971 13579 111915 -288119 -625729 -504527 -223968 170907
13505 170907 206396 -200886 -71479 626506 875618 524103 534497 448030 296058 391874
13495 391874 582738 813227 695175 653909 236418 -106930 250453 196017 139605 315204
13485 315204 283475 294032 316418 -192963 -615336 -838470 -968795 -1076860 -899961 -416298
13475 -416298 85342 499826 515991 391302 -319210 -786254 -854675 -587047 -446321 -491596
13465 -491596 -677228 -1010954 -1323969 -1505246 -1297167 -742399 -250576 342066 815323 899093
13455 899093 924725 919664 960597 843909 433091 -90846 -567120 -668451 -413928 -372453
13445 -372453 -357524 224380 609765 576943 325378 359223 580711 421535 310011 73987
13435 73987 -126098 -151115 18407 61214 121728 -65375 -346893 -335686 80498 187106
13425 187106 -279633 -160393 217802 78538 -217484 -22422 66901 -20552 -253005 -249548
13415 -249548 -118757 -62179 175966 145534 -285785 -1023893 -1042619 -525297 -20489 151949
13405 151949 -120262 -652453 -773913 -458118 65390 430947 472173 458890 203620 110071
13395 110071 -61245 -239234 -171833 -174055 -452202 -747000 -855498 -494701 -262967 13552
13385 13552 -143560 -626238 -695830 -277347 2083 226414 619539 1018776 987700 565539
13375 565539 442792 234325 122357 223868 318995 135256 -41220 -153538 -220552 -152090
13365 -152090 151799 146598 18609 -173502 -449154 -375303 -423780 -335091 -347246 -322185 -132820
13354 -132820 63803 76285 -175803 -485495 -594580 -466218 -661695 -968049 -959515 -641401
13344 -641401 -670362 -968896 -1093955 -1322376 -1376616 -1136524 -1016266 -949613 -1014093 -1117685
13334 -1117685 -983812 -826596 -984409 -1149984 -995216 -852938 -692881 -471826 -250731
13325 -250731 -217729 -595855 -771095 -752627 -1122899 -1660485 -1979993 -1898940 -1567420 -1196056
13315 -1196056 -962152 -496541 251126 470831 258657 270302 209845 60851 61277 -273556
13305 -273556 -136188 115923 -300382 -309929 -140602 -433802 -794246 -741553 -658824 -683706
13295 -683706 -693774 -803781 -779621 -1104160 -1191239 -783440 -529920 -124175 284131 580338
13285 580338 635679 518288 596200 460813 395140 593820 949193 672941 220720 -185555
13275 -185555 -256276 -131317 328288 867867 1119002 1157020 755529 516278 837893 703043
13265 703043 418594 516077 1043358 1493821 1222681 922332 936511 630323 -249195 -298720
13255 -298720 296037 647472 698200 586786 605351 251203 -149105 426172 882050 931568
13245 931568 907489 815789 884935 1011899 1058097 956575 993691 1088559 985054 596063 120366
13234 120366 353341 640379 692696 529089 514190 662980 415029 -105153 -70481 230489
13224 230489 263026 556015 1076780 1645994 1797595 1516892 1430329 1487327 1481713 1362730
13214 1362730 869462 399958 214011 109954 390739 851413 821762 677684 808024 1274571
13204 1274571 1417070 953218 480607 -70620 42473 639536 865919 823681 764202 1045189
13194 1045189 1269975 1313039 959634 649035 709234 1009837 1056274 736945 250739 -302473
13184 -302473 -191754 220068 640655 1068854 1249115 1237202 1011789 586571 392691 693799
13174 693799 970474 1012866 862903 607524 607559 240141 -63615 -178625 -96956 284017 438446
13163 438446 381228 339512 305569 246903 368357 973614 1054370 502716 435860 1032271 1574041
13152 1574041 1504986 1050947 832738 777505 509696 428669 814781 1486845 1981376 1814130
13142 1814130 1219097 1105608 1312909 1252870 1237590 1181856 978249 694045 927389 1442455
13132 1442455 1992928 2028359 1705213 1214473 741644 813436 951824 704780 564179 836943
13122 836943 1171105 1324120 1446627 1347762 1178704 1045319 724354 908764 1123453 1516606
13112 1516606 2009415 2273634 2643507 2745646 2425786 2372926 2525450 2406843 2009963 1822650
13102 1822650 1564952 1314852 1511703 1625729 1569580 1624826 1134106 500097 90632 76495
13092 76495 533073 1231454 1511078 1358414 896380 1090743 1700731 1970788 1973970 1726603
13082 1726603 1351654 942239 942443 1199385 1298244 1665077 2205340 2315940 2486238 2630197
13072 2630197 2537999 2601380 2648547 2866988 2927438 2545655 2178077 1892430 2045959 2019330
13062 2019330 2117577 2503677 2567232 2530648 2094641 1674073 2029911 2494735 2654855 2888687
13052 2888687 2915738 3081250 3272483 3462783 3940213 4356475 4043483 3755742 3713600 3324608
13042 3324608 2942819 2493681 2192923 2334025 2844334 3506898 4357338 5176981 5679561
13033 5679561 5692176 5540883 5486510 5593520 6071229 6445900 6505808 6647085 6780732 6607767
13023 6607767 6245939 6049478 6183410 6580803 6880515 7413904 7819329 8131269 8529489
13014 8529489 9742230 11124234 11926125 12604474 13478118 14200856 14795677 16045611 17508258
13005 17508258 18840400 20281723 22147797 24226746 26903244 30337356 34212828 38591585
12997 38591585 43393932 49493988 57037893 66029110 76955953 89808844 105135936 123972295
12989 123972295 148016058 179401591 220365740 272886107 336460971 399989242 436552338
12982 436552338 422771145 368260133 301982750 243175845 196039130 159335725 131270010
12975 131270010 109638685 93019506 80191604 69934185 61297749 54015373 47847082
12968 47847082 42523749 37871318 34124748 31222334 28555454 26297468 24492161 22878000
12960 22878000 21595831 20235630 19254555 18447439 17891807 17141496 16227932 15564859 15266998
12951 15266998 15224559 15022671 14497820 14075877 13732789 13542133 13743964 14043405 14506739
12942 14506739 15017116 15474779 16068305 16501178 16937327 17938320 19530543 21224897 22915301
12933 22915301 25328227 28416828 32187844 36632658 42401445 49998894 60049481 73190345
12925 73190345 88982493 103786679 109037106 101360414 86893152 73001388 62425864
12918 62425864 54955445 49863534 46933496 45428284 44940553 45677967 47473978 50064869
12910 50064869 53958442 59368757 65795121 73714856 83741175 96124607 111095375 129799870
12902 129799870 153970517 185509261 227089204 281975658 349576208 416792272 453582725
12895 453582725 435335684 374339705 303189524 241576271 193691297 157500866 129890039
12888 129890039 108609360 91985122 78566101 67575459 58993555 52181364 46140547
12881 46140547 41021543 37088529 33939139 30952859 28533302 26647176 24573036 22562314
12873 22562314 20672181 18751611 17385601 16709999 16006076 15464492 15096089 14316614 13475846
12864 13475846 13095417 12942773 12376259 11730192 11168196 10965116 11020229 10982390 11377667 11565022
12854 11565022 11296034 10663719 10081049 10052600 10077501 9877540 9759056 9836338 10162173 10771539
12844 10771539 11307087 11605903 11619636 12204686 13161158 13434515 13450077 13820936 14503261 15490111
12834 15490111 16629253 17814998 19190504 20691846 22442135 24395175 26656268 29517102
12826 29517102 33158474 36975726 41137937 46535989 53107764 60843412 69830778 80173191
12818 80173191 92814247 108519754 127821974 152661783 184876971 226762127 280773115
12811 280773115 345363007 407062159 437715249 417040893 358568371 292020130 234149805
12804 234149805 188456873 153082065 125675990 104786244 88755067 75936368 65092860
12797 65092860 56243431 48828466 42764841 37908017 33721306 30500089 27472425 24433492
12789 24433492 22010282 20505093 19161929 17810425 16698373 15212853 13875503 12523300
12781 12523300 10949411 9994735 9291870 8447824 8297578 8268738 7838706 7310378 6909794
12772 6909794 6448312 5904853 5472233 5156993 5351293 5666121 5684625 5264166 4365368 3735759
12762 3735759 3843796 4057394 3812889 3464595 3351307 3684976 3756679 3422557 3397421 3630532
12752 3630532 4087432 4404123 3971836 3882385 3825534 3549672 3338396 2922743 2678657 2383219
12742 2383219 2239000 2267360 2102053 2043401 1960036 1980971 2136445 2082056 1823826 1521196
12732 1521196 1094476 774463 859378 1116060 1364529 1400338 1295537 978187 334306 120608
12722 120608 340810 431031 386262 731209 1121948 1379374 1672296 1622578 1042574 596630
12712 596630 538646 845336 1323260 1273160 818623 563662 590540 734603 945352 979386
12702 979386 866041 535405 394014 614262 518810 276521 84507 -108844 200857 502612
12692 502612 644858 543923 331565 136960 -235350 -691072 -409254 393997 955504 932663
12682 932663 1210481 1710354 1479901 925075 282009 -68585 193392 391427 317715 73580
12672 73580 -438021 -556007 -267261 -89717 161254 239033 -110756 -503634 -399897 5790
12662 5790 96881 -6514 4328 -22720 268599 327842 369687 340870 190441 14443 -248548
12651 -248548 -13774 -124232 -260241 -63070 190387 196649 -23266 -24115 83694 381575
12641 381575 538187 835802 789492 388314 58968 -51600 79289 44647 19594 128167
12631 128167 178158 -83819 -136706 -401233 -270023 652596 1170228 956536 1016065 1076520
12621 1076520 520093 -145854 -225849 143302 590777 751248 566726 177420 182126 495887
12611 495887 689239 833360 847132 850486 1217805 1677511 1349839 712914 308002 260926
12601 260926 199312 -103755 -124079 -249277 -286168 -121067 -368302 -620250 -856867 -834713
12591 -834713 -432021 22456 161262 185612 378500 520440 583803 487074 553850 543506
12581 543506 174485 -25021 63372 246312 506845 673706 864623 971584 1166520 1211887
12571 1211887 771538 474338 550603 647155 674635 441554 173390 9639 -208206 -135593
12561 -135593 325252 393295 341090 614222 919401 882650 313829 -411155 -876234 -837130
12551 -837130 -420385 -254611 -86513 75099 -17978 -200945 69434 477527 271516 -53817
12541 -53817 -182202 -365255 -389738 -168033 -125992 38026 -94518 -388801 -421786 -27845
12531 -27845 200606 243461 620654 828115 620910 82366 -226388 -306154 -34009 434236
12521 434236 370406 171987 -73729 -176796 213759 204590 91977 456028 806332 729797
12511 729797 683594 781091 744361 606244 634269 671553 733545 859083 695774 556049 418176
12500 418176 487708 197617 -451541 -897144 -842523 -576648 -38640 450817 716346 482210
12490 482210 -2570 -143999 84305 240037 141264 -20454 -177772 -395964 -590276 -496878
12480 -496878 -272756 -337936 -182652 95282 189768 284987 149923 52596 209703 380203
12470 380203 669818 845800 860864 945456 780097 368168 175880 56045 -593367 -1280131
12460 -1280131 -1177391 -931382 -740029 -452106 -216026 -45165 -81810 -152811 -179467 -525496
12450 -525496 -781104 -594452 -470592 -691565 -926656 -870907 -742948 -253651 235948 606588
12440 606588 891199 530249 15018 -11533 197424 352775 76635 -448144 -579190 -435820
12430 -435820 -91894 302084 544537 565311 216377 -594552 -677973 -84895 185378 35061
12420 35061 -41799 -167497 -106705 -181042 -263409 -37336 388952 323661 111237 398495 558111
12409 558111 317429 73097 174503 31118 -140443 -201787 -190976 -201 109785 -127976
12399 -127976 -266715 -129348 200969 248697 -112297 -210395 -274585 -150053 12756 -191425
12389 -191425 -504186 -670661 -439271 -162134 272877 342077 310918 626789 463018 77607
12379 77607 -267232 -705692 -884897 -543625 -352705 -527160 -739875 -927454 -725719 -526219
12369 -526219 -409684 -90388 -124291 -242035 -551103 -873415 -647325 -462471 -251368 19955
12359 19955 -14694 -204377 -374240 -440224 -506502 -795107 -984183 -820069 -529200 -482541
12349 -482541 -455783 -347038 -664161 -990594 -638107 -442606 -583227 -567375 -156495 27633
12339 27633 21948 162706 133436 -423620 -882109 -934287 -722758 -705343 -637493 -227933 108788
12328 108788 186958 387854 199027 -46491 457338 749263 670298 632063 722601 899391
12318 899391 1012263 1137264 957476 861474 985245 863629 830211 998457 697884 103614
12308 103614 -309792 -79592 280804 49230 -312744 -401316 -745604 -877717 -513896 -148966
12298 -148966 -164474 -466672 -749784 -985581 -1016606 -789528 -668867 -592613 -579907 -505764
12288 -505764 -288673 -110463 34215 320286 390759 91945 85758 -102727 -549689 -430551
12278 -430551 -268516 -486212 -531214 -788154 -1191807 -1563470 -1467632 -1416690 -1364196 -799280
12268 -799280 -368411 -214919 -313383 -324996 -131114 178129 492350 356779 -130841 5695
12258 5695 309852 264684 179854 38021 163423 739756 1082508 778661 492382 437553
12248 437553 609659 316642 -128588 -386009 -372825 -184648 -248083 -632090 -1017607 -728674
12238 -728674 -117362 295061 420605 163374 -123820 -170397 -202868 -68549 -17212 -373045
12228 -373045 -287132 -48706 -137031 63879 -45757 -231465 -96108 383817 766962 757078
12218 757078 645819 417862 23768 -381795 -226732 -24799 -76397 170757 290297 -343854
12208 -343854 -912882 -927224 -817689 -925522 -1140198 -772957 -96366 40745 176844 110675
12198 110675 396867 509287 111564 223019 415587 446346 122776 -104575 -361205 -508482
12188 -508482 -637716 -533970 -312202 -61437 -90434 -100128 53377 375004 749886 558262
12178 558262 140996 117819 171883 373865 357596 -98275 -403160 -248675 102299 -21015
12168 -21015 178033 331006 225376 129362 -69737 -283369 -258667 -208842 -100439 193195
12158 193195 328670 -6235 -39435 97943 79778 68035 -300100 -989793 -1063134 -788498
12148 -788498 -462439 -223765 -233069 22898 -20557 53987 192643 -9085 -394270 -1151846
12138 -1151846 -1329981 -1306061 -1034714 139033 756433 688893 1052086 1473969 1764023 1641329
12128 1641329 808491 425228 441832 614655 -326689 -1414082 -1740468 -2025526 -1635158
12119 -1635158 -1122146 -565373 -362161 -219248 -209606 -308336 -456813 -470970 -436100 -457902
12109 -457902 -205971 -288615 -616432 -518449 48463 -2445 -227442 -424465 -572890 -345850
12099 -345850 17234 77935 -411353 -703266 -632606 -584559 -517648 -399141 -340871 -448410
12089 -448410 -525884 -542399 -861836 -711967 -232008 -53644 68412 489571 512728 189895
12079 189895 -36377 -42054 -194634 -350291 7298 562601 873263 819044 331175 -352989
12069 -352989 -660611 -316552 120769 133785 265638 356800 273964 215956 200228 -97385
12059 -97385 -1008122 -1378896 -817897 -457168 -616145 -476656 -896540 -1148118 -663685 -72777
12049 -72777 321181 397986 393422 79793 -85668 -240953 -653499 -1180038 -1116321 -923773
12039 -923773 -566231 -279885 -287701 -238064 -333259 -726545 -1171660 -1002555 -511171 -312050
12029 -312050 -203474 -57166 -182005 -208782 -275299 -351935 -303675 -185021 460324 679343
12019 679343 290794 127728 639353 1144214 854756 322499 -388070 -976061 -1081443 -1211847
12009 -1211847 -958250 -336157 71675 95946 -54147 134463 109018 -367671 -456217 -545193
11999 -545193 -347190 -270694 -590400 -340553 35216 25433 -38553 -131544 -163460 -132062 24030
11988 24030 428936 874426 1118218 853508 464757 581361 855802 1124558 1262041 1351316
11978 1351316 1214790 1059919 838399 613571 336401 115599 296627 558107 524514 305127
11968 305127 314292 157474 -132574 -244218 -116470 100251 -94498 -764673 -1107089 -1244337
11958 -1244337 -852584 -295137 5656 182254 145016 265433 430961 490076 403683 118192
11948 118192 -213516 -431856 -647646 -641330 -675611 -977142 -947594 -768421 -592903 -402809
11938 -402809 204133 773597 1176121 1200572 662521 -58147 -622341 -1084469 -972334 -293744
11928 -293744 239435 256756 379657 481173 295649 261391 271688 423415 737785 903990
11918 903990 638629 162170 -434483 -363837 54921 327625 646377 622771 397886 136175
11908 136175 130751 -64795 -354244 -69435 85167 9251 129793 247274 36011 -629157
11898 -629157 -997835 -836024 -458034 -225181 -12535 88272 356266 606015 544691 143159
11888 143159 -93235 -206637 -250924 -377676 -527953 -611851 -626001 -524626 -199672 -232545
11878 -232545 -563927 -789923 -757239 -642068 -753577 -657184 -634317 -796357 -897471 -729360
11868 -729360 -653988 -530046 -114322 308756 490572 926114 1181532 885208 428635 -112579
11858 -112579 -344085 47963 393961 420380 103141 -249215 -549198 -772031 -682410 -413268
11848 -413268 -46049 -121876 -147292 1848 -219121 -736577 -648895 -292258 -537785 -840817
11838 -840817 -939845 -1080605 -1147068 -786388 -63452 177633 95512 62517 3202 -28999 -369841
11827 -369841 -487853 -697708 -797119 -398982 -84280 -233833 -306008 -120771 362636 240824
11817 240824 -221077 -435897 -363810 -348865 -182892 -288162 -287856 8516 305686 658028
11807 658028 756763 829176 961253 534722 491154 726837 654745 219236 -360291 -665568
11797 -665568 -298993 62868 -4709 62719 68235 257707 103392 -103347 34287 -10838
11787 -10838 -105365 -162715 -304696 -605600 -749608 -591446 -133049 233751 72340 -744873
11777 -744873 -1157091 -814417 -639571 -1345996 -2253110 -2050854 -1373466 -758179 -337972 -528584
11767 -528584 -914525 -1282061 -1469777 -1270528 -931229 -639602 -266092 31199 -5602 -294029
11757 -294029 -517707 -705721 -1014973 -857696 -1042442 -1566925 -2031346 -2510751 -2497352 -1569852
11747 -1569852 -1012942 -947993 -828971 -768591 -211806 459439 242703 -896786 -1431248 -1241690
11737 -1241690 -1332520 -1336586 -734101 -136674 -241208 -366019 -80246 286338 563154 472025
11727 472025 152336 -393351 -408147 189774 523274 599677 640799 955628 1181831 873223
11717 873223 399887 97407 11740 -369683 -537454 -544329 -409228 -189359 112805 698414
11707 698414 963664 924330 862089 1034791 758082 128618 -121773 92152 599604 1092762
11697 1092762 1303980 1512968 1473454 1020513 578085 542154 834796 817499 437838 138810
11687 138810 -39635 166713 749871 1043897 723219 324099 132749 239907 592405 937443
11677 937443 827260 290673 347188 521659 295824 270714 326860 199269 97446 204008
11667 204008 303473 746264 812090 419849 -240090 -855288 -1106417 -860844 -598332 -615613
11657 -615613 -576062 -627947 -840552 -857702 -597982 -844276 -1196651 -1284921 -1634348 -1821918
11647 -1821918 -1686078 -1345229 -851824 -659709 -669953 -546569 -423348 -269953 3954 176878
11637 176878 21105 -120973 -152346 -237938 -359506 -706037 -865623 -383738 203160 406691
11627 406691 489084 316463 80207 -71362 -204699 -477291 -621876 -773440 -782558 -574175
11617 -574175 -337660 -145174 -429057 -842157 -762601 -355119 31215 166961 201807 53634
11607 53634 -222539 -518366 -453867 -256175 -575545 -654586 -780936 -1060607 -982279 -686068
11597 -686068 -284257 -151470 -139651 -351383 -582403 -464450 -553879 -302641 400834 769635
11587 769635 416849 -23853 -56393 247399 278473 255765 398974 121620 250817 519591
11577 519591 436475 582014 627346 317248 -245699 -531795 -468771 -489824 -605646 -330537
11567 -330537 -114615 -153369 18370 140255 -86338 -101455 -262402 -464537 -408641 -356527
11557 -356527 -724665 -998866 -938096 -560544 -391129 -250140 109435 123251 74260 -182334
11547 -182334 -351314 -231604 78902 171831 -200963 -485735 -455920 -474333 -332754 -211261
11537 -211261 -158328 -417421 -960489 -921675 -852012 -734101 -625304 -630878 -433399 -198278
11527 -198278 102552 153462 -29130 120667 298396 326803 453171 414148 592270 715918
11517 715918 603514 416394 221145 -332687 -631233 -608834 -543716 -679333 -562187 -328594
11507 -328594 -240396 -164225 -115456 -453362 -481557 8635 -173162 -617154 -557192 -342967
11497 -342967 -353373 -560555 -451890 -503816 -458251 -24128 676469 1148447 1137911 613969
11487 613969 -366244 -805321 -609473 -207113 127774 609393 688569 486247 607594 730514
11477 730514 609159 709975 786327 514629 4823 -169555 196530 469378 261059 170831
11467 170831 295654 425815 222664 -147745 -198119 18229 -34253 -546151 -955467 -467066
11457 -467066 306070 736723 709951 395012 578238 943849 563291 -332443 -1111517 -774930
11447 -774930 -413693 -369122 -580138 -631232 -704767 -1435316 -2245406 -2597273 -2397255 -1938363
11437 -1938363 -1552230 -1239324 -1283576 -1592558 -1314152 -807801 -360463 32451 -67391 -427407
11427 -427407 -572239 -740191 -818348 -768723 -852900 -666605 -555761 -626549 -348241 -376685
11417 -376685 -364961 -190709 -106966 123288 232686 596507 814384 675916 356855 -177413
11407 -177413 -821769 -868892 -229975 84726 -158252 -433934 -615036 -702510 -761443 -970408
11397 -970408 -1181861 -1042910 -615231 -813610 -993748 -988102 -847125 -544432 -223248 99171
11387 99171 -79218 -412213 -327961 13473 -48635 -403360 -450862 -271577 19920 412774
11377 412774 871901 672412 -256614 -1027066 -827881 -577433 -577432 -691365 -837588 -768546 -736940
11366 -736940 -847834 -683950 -286616 234262 563929 350838 13191 -85800 -220283 -467375
11356 -467375 -280372 -136609 -528336 -579540 -586959 -928848 -897971 -657105 -508980 -661563
11346 -661563 -823536 -1194310 -1522006 -1308244 -868582 -601498 -645509 -771137 -1133451 -1136411
11336 -1136411 -1042201 -1290817 -1518903 -1127517 -610619 -125359 385757 233372 -161439 -521717
11326 -521717 -928893 -681203 -101703 52196 -115129 79837 403259 604812 511230 145281
11316 145281 -299242 -322657 -5431 158381 15461 -640220 -849350 -717734 -824172 -886117
11306 -886117 -858591 -837563 -786244 -793405 -734225 -367182 290232 596320 501622 537353 700941
11295 700941 790286 527577 317125 145369 -262159 -560129 -425935 -197472 -392469 -651805
11285 -651805 -618617 -441934 -538898 -538985 -488042 -447768 -461826 -456272 -264164 -285046 -441607 -380978
11273 -380978 -232770 -250156 -323006 -398332 -290737 70435 199286 -20883 -232326 -745092
11263 -745092 -648311 -167877 -287379 -511221 -727392 -844017 -723797 -512209 -758478 -1121240
11253 -1121240 -809461 -470033 -155006 -38516 235164 675577 954924 794763 502733
11244 502733 262569 189141 146752 -22989 -9291 26652 -165505 224445 576950 514764
11234 514764 330050 293240 507656 415606 27144 -149067 -131043 -103795 -144471 -339466
11224 -339466 -292615 -422677 -551541 -363898 9815 240336 95290 164383 455619 344905
11214 344905 251768 41277 -65015 -146554 -292087 163512 640865 462414 158101 47544
11204 47544 201179 97653 -128005 -206694 -525896 -757325 -752130 -845985 -1035114 -656072
11194 -656072 84168 330072 230714 216023 -46561 -337933 -140170 -124406 -237035 -381123
11184 -381123 -488643 -231243 199618 271435 -356955 -837026 -582287 -282183 -117325 -36894
11174 -36894 -49950 -247312 -205116 130698 417999 561045 512689 515836 699998 560609 216007
11163 216007 203122 263596 687398 997458 810953 318324 332309 435109 209452 -255947
11153 -255947 -197833 119533 317151 332979 12804 -257784 -212760 63310 164968 282528
11143 282528 278461 198233 -108331 -20458 -69575 -332936 -603807 -541775 -343962 -141634 -215750
11132 -215750 -429305 -672591 -566207 -420122 -75416 296303 216085 273962 486211 566762
11122 566762 676848 594304 514243 267794 47343 246451 646052 708625 324098 28131
11112 28131 -268190 -608669 -883386 -1194620 -1183210 -1261225 -1180696 -256973 454929 662211
11102 662211 710438 710806 455240 496274 770505 1154371 1011434 345552 113365 -56451
11092 -56451 -338092 -668006 -427248 -22658 75333 -162273 -265249 -117860 -30436 342069
11082 342069 904130 1054849 1288462 1246544 1109515 816858 401360 90270 -55977 -340327
11072 -340327 -529565 -318101 -492402 -281569 264367 123035 143904 638854 843597 588101
11062 588101 399055 319225 349143 492819 178384 -219990 -459466 -403896 -538134 -509978
11052 -509978 -58931 391271 530424 675894 984773 718426 90493 -86846 -115755 -559670
11042 -559670 -607088 43883 438756 236905 -214988 -338238 59249 519299 968353 1258023
11032 1258023 1310957 860199 371038 328772 474467 693573 542776 545296 645275 488467
11022 488467 480102 570859 571582 748786 1185391 1209176 959287 739590 887770 1046603 1048220
11011 1048220 1089700 1081702 1024679 1099496 901544 572483 763951 1170608 1131990 821841
11001 821841 635082 695383 883833 838361 731429 838898 1320428 1697227 1774545 1460227
10991 1460227 1328095 1214547 1448129 1592979 1498605 1819573 2347595 2560571 2764117 3138713
10981 3138713 3576525 3886954 3599528 2941101 2457126 2565522 3032999 3277746 3182678 3085958
10971 3085958 3106370 3038976 2809869 2673158 2762619 2931328 2842098 2437470 2457858 2945472
10961 2945472 2925365 2640649 2668857 2747555 2933600 2832965 2992955 3124865 2961676 2478606
10951 2478606 2308772 2401155 2470791 2606682 2408697 2171785 2170786 2270697 2173243 2040847 2015245
10940 2015245 2226080 2239679 2166636 2110176 2124413 2079082 2116189 2552417 3125816 3022875
10930 3022875 2277073 1893445 1565879 1496134 1826860 2454974 3030493 3312707 3120139 2867664
10920 2867664 3194530 3727106 3861403 3642018 3526515 3433198 3185418 2991117 3017074 3015310
10910 3015310 2588546 2336800 2462187 2486919 2669255 2867548 2994494 3361807 3961021 4186104
10900 4186104 3804205 3452927 3444213 3534594 3224528 2975373 3168436 3648298 4316452 4938272
10890 4938272 5530030 5894650 6140175 6261567 6182390 6261906 6420591 6270465 6065961 5623076
10880 5623076 5723576 6744165 7263065 7484692 7830944 8544964 9164114 9864197 10501042
10871 10501042 10959502 11280195 11495739 11931598 11500611 9924983 8762188 8433193 8554368
10862 8554368 8555733 8400662 8114559 7761420 7945616 8564010 8869327 9420023 10554994 11825617
10852 11825617 11728020 10590716 9458431 8650644 8376264 8376325 8262046 8045252 7893030 7335224
10842 7335224 6740533 6249429 5851251 5708789 5704762 5774080 5639893 5488676 5384077 5834415
10832 5834415 6263869 5993414 5615022 5274407 5154390 5270976 5647987 6056095 6010060 5678513
10822 5678513 5701420 5840344 5960640 6092093 5710164 5371424 5646362 5802849 5693383 5479786
10812 5479786 5564105 6061443 6505277 6632354 6523380 6600258 6738588 6861841 7094764 7338675
10802 7338675 7456950 7437971 7245602 7096555 7271811 7398636 7629653 8048636 8039210 7593847
10792 7593847 7571348 7557554 7240304 7212194 7456363 7514738 7799009 7945059 8205844 8317946
10782 8317946 8059216 8077132 8440092 8482133 8242186 8117108 8319470 9008928 9832421 10507035
10772 10507035 11041515 11047958 11354780 11996435 12377274 12711248 13286592 14281725 15498472
10763 15498472 16387957 16797762 17769316 19754176 21623620 23263875 24964105 26229181
10755 26229181 27237944 28021049 29077923 30381231 31531440 32747322 33972096 34872270
10747 34872270 35220651 35291936 34907787 34510278 34002782 33304669 32311324 31130516 30052098
10738 30052098 28751418 26706569 24973782 24023228 23098564 22131395 21326651 20711701 20190803
10729 20190803 19687629 19304566 19207508 19656851 20315574 20966869 21327685 21235785 21642146 22718574
10719 22718574 24323343 26007601 27506635 28805083 30167838 31726826 33164334 35010314
10711 35010314 37590653 40584811 44136993 47863569 51992728 56704374 62108035 68173187
10703 68173187 74075956 78512406 82299445 86951316 91498426 92922834 89834735 84260634
10695 84260634 78303663 73066933 68831002 64865910 60681361 55787286 50445963 45734177
10687 45734177 42257007 39727908 37918259 36313927 34862483 34159288 34037132 33847787
10679 33847787 32509114 30460161 28783094 27570784 26896354 26449889 25477867 24233763
10671 24233763 22964352 21888267 21406274 21303057 21159853 21372460 21383774 20812746 19954042
10662 19954042 19545265 19814148 20328329 20808559 21683839 22905922 24390838 25628664 26907384
10653 26907384 28718367 30820679 33085352 35384979 37957745 40733293 43067887 44820439
10645 44820439 45938583 46283299 45799988 44462701 43028928 42251174 42333262 42781213 43797946
10636 43797946 45348072 47119598 48823430 50212155 51917134 54639735 58307966 63134699
10628 63134699 69275704 76651869 85661628 96048938 107068230 117709461 125063072 127127431
10620 127127431 124621226 118540186 111026655 104537079 100394293 98852097 98596665 96354565
10612 96354565 90419685 81426293 71142393 61267020 52712418 45531380 39175985 33444609
10604 33444609 29189283 25721182 22457777 19578028 17187884 15141279 13630580 12482798
10596 12482798 11486320 10567664 9592787 8500223 7623693 7208869 6745942 6385065 6334885
10587 6334885 6191316 5350660 3794998 2910037 2839612 2596903 2222505 2214374 2787521 3174568
10577 3174568 3541821 4039713 4058462 3893188 3329094 2843063 2459785 2196267 2041871 1821518
10567 1821518 2007968 2543860 2842921 2546272 2178327 2087805 2193168 2201832 2052870 1685891
10557 1685891 1516588 1414824 1290233 1389985 1677663 1767605 1704630 1621901 1620879 1738047
10547 1738047 1961041 1648011 1075678 868425 1143280 1235657 1062083 782110 576706 502394
10537 502394 460557 593354 925720 1264685 1077622 453677 159216 86278 -220439 -398488
10527 -398488 -465331 -655437 -646518 -509198 -235604 -272563 -502671 -342517 -198387 -505921
10517 -505921 -522333 -288237 -186614 -199468 -151180 167561 581003 989616 1354965 1150109
10507 1150109 898581 1005131 1115074 1061663 909081 780680 783585 516609 310749 27211
10497 27211 349638 560168 575441 632089 677799 527497 485292 640055 579654 409599 343222
10486 343222 169774 -52953 -144727 -276244 -419674 -155817 202751 305542 13783 125899
10476 125899 402129 452095 855403 1271156 1345779 975475 510384 68283 -417671 -593256
10466 -593256 -364149 -265706 24403 353389 636464 966584 1117275 705070 -1254 -237093
10456 -237093 79495 303821 123221 147467 301542 470382 705174 705773 544487 296230
10446 296230 285405 -202350 -665743 -566559 53260 608366 700430 630029 621122 406884 -20075
10435 -20075 -217087 -447439 -603753 -461744 -133711 -12518 -84599 -467315 -566749 -317342
10425 -317342 -59743 146789 -70549 -275900 -370153 -417663 -66773 608533 1157510 1213366
10415 1213366 1112494 971340 561386 325225 233507 279100 667695 1058938 1077266 1005334
10405 1005334 970821 623533 204020 560796 698468 544247 420271 -20913 -304375 -28969
10395 -28969 -26949 -184685 -222681 -259721 -8628 424227 1041689 1044400 640596 633133 559831
10384 559831 247083 -106678 -433107 -383893 -161228 153271 342007 64723 27836 -34014
10374 -34014 -180462 -80835 -29935 -87192 -245705 -221412 252094 625429 754195 960146
10364 960146 1222629 1309384 684995 -102379 -259703 56751 -2287 189207 669683 805339
10354 805339 419465 184884 -33310 -31143 116365 41213 -57892 -330271 -583947 -330995
10344 -330995 -158053 -137046 186563 544062 616230 225911 -238534 7706 553343 833703
10334 833703 807359 304193 -76770 -244534 -433684 -139186 326652 287255 -26510 -201954
10324 -201954 -326158 -394930 -323126 113359 538370 411347 -14721 -437154 -587884 -286015
10314 -286015 166613 330519 504794 233326 347591 35753 -189381 247330 939558 1202396
10304 1202396 966320 1000280 1402954 2030235 2599235 3066396 3756947 4028148 3535589 2777484
10294 2777484 2004149 1215858 1200019 779469 -46469 -57611 222825 548755 466758 161546
10284 161546 69184 -68159 -372048 -731021 -628704 -257522 1512 248358 443490 559261
10274 559261 780628 1076372 936122 492502 213869 367288 346697 -107933 -267469 -209198
10264 -209198 -217461 9043 653892 671705 483532 120833 -102128 228046 650185 809134
10254 809134 584400 125702 -229564 -473761 -402082 -54290 196191 124051 -70980 -435217
10244 -435217 -997790 -1176753 -1183413 -1139325 -777962 -576105 -254689 217722 197316 -156846
10234 -156846 -734773 -633983 -334882 64715 371015 781446 1181676 882297 343053 41152
10224 41152 150831 19722 8049 603349 1288609 1841921 2119456 1898252 1944388 2149343
10214 2149343 2004813 2080710 2070684 1789478 1751870 1437714 1114527 1112575 1047546 659633
10204 659633 458163 856072 1512606 1723000 1418568 1102088 957036 928359 1387054 1946557
10194 1946557 2277702 2111620 1757357 1592339 1811067 1994871 1972574 1942403 1828836 1890511
10184 1890511 1707270 1560988 1407541 1628494 1697297 1107192 546354 175023 19408 -335277
10174 -335277 -295194 531283 664511 513563 511798 602714 871543 974588 785697 194374
10164 194374 -264855 -386320 -344334 -275779 -184354 -164860 -320975 -148214 80779 370812
10154 370812 280736 226563 236396 226188 109896 -84617 -326463 -317312 161252 598599 719977
10143 719977 672193 946445 984555 629094 540597 522451 147680 -128110 -251011 -375907
10133 -375907 -345211 -154281 244834 -349417 -1120145 -588965 297630 734582 575442 304055
10123 304055 693631 735061 -122002 -867511 -1174222 -1498841 -1656629 -1301395 -960573 -781327
10113 -781327 -698254 -338795 1505 -270608 -198671 -122358 -516091 -1008026 -1644729 -1873832
10103 -1873832 -1775711 -1615745 -1289749 -1081612 -1225576 -1393171 -986488 -681514 -757072 -1070574
10093 -1070574 -1346205 -1077047 -721553 -796003 -633974 -632754 -810117 -1127718 -1068090 -671761
10083 -671761 -237149 -360765 -304932 -218393 -57670 -33037 -274015 -406212 -287660 97899
10073 97899 -106478 -609130 -751507 -481976 -480906 -718761 -725699 -898339 -962221 -548496 -82000
10062 -82000 196256 -156935 -782839 -971458 -796988 -726005 -571951 -203165 376352 1069095
10052 1069095 1228607 447712 -160751 -69875 -144696 -376964 -593692 -1192164 -1115087 -678577
10042 -678577 -574147 -539265 -1098440 -1477089 -1254003 -802725 -394470 -198197 106080 -85872
10032 -85872 -399680 -453080 -509026 -571619 -607741 -654187 -1080383 -1438298 -1229114 -972291 -651203
10021 -651203 -448433 -132123 282134 131246 -457719 -1038441 -1620840 -1564281 -1087099 -742576
10011 -742576 -473616 -390822 -101671 452471 745989 887180 713526 130104 -222825 -237300
10001 -237300 -608928 -1143079 -1202397 -1128285 -1269122 -1039773 -582358 -695883 -931614 -997882
9991 -997882 -943447 -938029 -1070476 -922923 -1177381 -1337196 -1441222 -1578300 -1288361 -519143
9981 -519143 16869 71070 110011 224879 500340 903756 963570 694407 455122 73718
9971 73718 -157215 -16632 424412 376168 90104 -31951 -26653 -260602 -362824 -411635 -456247
9960 -456247 -170098 205609 481155 646384 746582 554408 222719 -191743 -481392 -410761
9950 -410761 -244390 -227156 -521826 -413228 -46666 -56162 -38675 28755 14144 102394 71673
9939 71673 -45898 -9232 -177691 -634063 -600828 -44931 412626 521334 392755 304917
9929 304917 173075 -95866 -414745 -978471 -1289199 -1153717 -713047 -361330 -710720 -622506
9919 -622506 -395533 -634826 -1059460 -1234525 -1196953 -1477185 -1599435 -1137925 -316980 116039
9909 116039 -87953 -242534 -160101 -446841 -1011883 -1107625 -1141932 -1194486 -1042450 -1099129 -1349472
9898 -1349472 -1228985 -945827 -965683 -1369488 -1541455 -1708864 -1367156 -933479 -577446 -345824
9888 -345824 -380007 -337397 -42564 -211039 -386312 -379247 -228104 284067 516483 455098 281511
9877 281511 -139717 -330189 -128852 -367117 -541541 -33892 624056 337545 139180 112768
9867 112768 -291224 -866503 -1085632 -1118855 -1241981 -937017 -423980 -415579 -142621 320534
9857 320534 336217 381128 392665 590382 931688 882317 1037868 1436672 1519111 1315916 935949
9846 935949 457685 54110 206291 421703 261161 120716 574888 716965 460818 671216
9836 671216 1027777 1064558 791300 915831 987708 877701 719756 212477 -169880 244367
9826 244367 618709 571386 614142 889605 1163135 973129 514189 317342 189182 -115383
9816 -115383 -297377 -199009 144807 409618 -158437 -834134 -951581 -730261 -540653 -582917
9806 -582917 -389268 361490 653496 919324 1195715 1247542 752480 242795 137125 113891
9796 113891 383188 735056 1180249 1222265 1149301 1145742 951791 501394 22492 -125391
9786 -125391 139964 187124 -16131 -111791 228141 507555 521528 361240 198172 -205298
9776 -205298 -256114 644 167580 342930 466816 720835 697496 389313 86574 420499
9766 420499 603307 246317 170416 -91363 -107406 433478 472516 192591 -107964 -298669
9756 -298669 -154415 -85484 -292154 -159985 210748 468479 126458 -346065 -567447 -304783
9746 -304783 137515 186148 -205180 -759602 -673631 -372617 -380177 -366469 -371139 -547005 -543322
9735 -543322 -387824 -375250 -190231 -122895 -61678 -125053 -381072 -42201 422264 86845
9725 86845 -591876 -708514 -160231 449199 389442 -263332 -592950 -238801 304086 565956
9715 565956 155099 -226958 -58085 -75185 -494522 -677328 -838852 -742577 -1010152 -784578
9705 -784578 -443123 -438384 -269037 -395852 -512193 -222761 -212820 -613493 -831871 -792344 -740686
9694 -740686 -287934 180421 194792 76655 187631 844275 1230861 766859 281508 -165313
9684 -165313 -338218 -213956 -197224 -204506 -296952 -533025 -616362 -713331 -734777 -761324 -880204
9673 -880204 -592677 -178436 442120 720306 296586 -456298 -814081 -818572 -982686 -1021767
9663 -1021767 -830794 -605116 -275926 154408 380041 -44736 -428664 -221200 339100 644001
9653 644001 351994 -183519 -253106 -204350 -259715 -427347 -572174 -606412 -218635 -122191 -411936
9642 -411936 -392687 -554783 -925608 -1164499 -1146485 -913147 -974849 -1239091 -1169757 -922176
9632 -922176 -976039 -1129421 -1142636 -776680 -292632 -537 73954 -71275 -165765 -105842 -314371
9621 -314371 -558201 -817972 -849549 -741372 -545626 -235921 -95220 -62524 501606 908873
9611 908873 778045 571408 409157 520960 479792 331414 409469 320782 21762 -375983
9601 -375983 -1160159 -1330566 -664185 85590 285877 347556 32865 -284842 -108092 -15040
9591 -15040 -362874 -468538 -215884 -16708 115521 29798 -382409 -500335 -729599 -1053094
9581 -1053094 -1102321 -1111990 -752635 -236292 -367451 -972062 -1327214 -1104176 -690782 -436745
9571 -436745 -223184 -180821 -285302 -74866 260613 426331 97269 -145708 -100944 -348616
9561 -348616 -785095 -973142 -521929 33239 425558 758519 682825 412068 261041 70726
9551 70726 -162770 -110597 153026 142739 179068 190009 162958 586942 952405 784533 731370
9540 731370 324697 -72996 -328439 -486965 -593210 -301011 -331059 -601307 -436268 -302530
9530 -302530 -281257 -430119 -669512 -716620 -792444 -801131 -543054 -458078 -326071 -311734 16387
9519 16387 -35527 -277433 -594452 -924011 -539880 -78815 297200 256411 -45947 -249940
9509 -249940 -478038 -570131 -630744 -288326 111222 375843 -61601 -698757 -719140 -346750
9499 -346750 -84712 227184 274829 364445 728212 1184005 1430533 1244708 940768 977793
9489 977793 1061274 1086553 790045 349103 567993 903711 1160855 1257811 942934 739487
9479 739487 242838 -62492 76103 393507 847267 978879 781109 363460 -377572 -701103
9469 -701103 -685546 -959243 -657596 -452338 -431316 -344075 -38022 309022 828196 724937
9459 724937 109901 -184198 10298 114068 112802 453192 863308 896482 808426 611053
9449 611053 369947 246368 -97367 -122718 -13557 -364644 -76933 334563 390504 260744
9439 260744 182549 368416 328832 -39998 -177845 29678 410107 244235 109451 245170
9429 245170 443135 420359 404123 416763 345910 354538 126849 107443 359801 640922 613272
9418 613272 605291 629850 391453 -244529 -457595 110841 418971 468470 660666 865783
9408 865783 708741 1418 -232098 359657 462718 777477 1022367 716589 653366 520804
9398 520804 615016 608749 502485 279547 58655 -125639 -294133 -146583 -141835 -149940 196113
9387 196113 366081 142703 73406 19599 164334 266561 145196 -182794 -512082 -806004
9377 -806004 -917734 -910183 -933504 -849645 -935755 -1056276 -1096445 -702355 -337136 -268461 -360145
9366 -360145 -325275 -1114 185983 366715 994093 1878070 1983254 1778681 1601246 1282372
9356 1282372 866726 319560 299890 482339 524901 636812 555909 184155 41060 -91623
9346 -91623 -119744 -63321 -436767 -544242 -295800 -65180 -27552 86583 216389 32491
9336 32491 -168828 -366359 -281370 -213111 -27238 510317 705023 164328 -335493 -503946
9326 -503946 -436299 -356601 65177 304258 170318 32683 205730 501065 330201 6300
9316 6300 -359837 -674950 -692164 -533914 -208059 88744 118028 168851 350063 556493 874725
9305 874725 935857 974534 670165 216328 334471 455040 433572 359611 371249 462568 557013
9294 557013 507711 185654 -108725 -513653 -479273 36156 204783 63499 -181700 -344930
9284 -344930 -192691 436293 1181887 1256609 803740 522223 590487 544481 499971 365206
9274 365206 158636 528316 864784 959109 1284136 1183498 787880 958651 1056063 598499
9264 598499 -15614 -306843 -165663 -100995 -64178 208989 501038 428202 567072 772603
9254 772603 625827 721627 1296025 1625539 1573096 1647169 1725502 1937728 1771415 1522809
9244 1522809 1580972 1521857 1580067 2031109 2467591 2650906 2538268 1716089 805124 600927
9234 600927 593408 807889 944213 521355 268719 500852 701613 399404 72656 -280715
9224 -280715 -361175 167502 839101 1092321 884619 591426 108156 -39913 144907 446946
9214 446946 532303 422392 626078 1231276 1422534 1195970 817719 317856 183917 469074
9204 469074 443819 529133 847224 427743 300319 469985 410285 262567 240169 286161 349820
9193 349820 631460 808089 930613 888823 922170 807595 263149 110378 491820 1005440
9183 1005440 1137243 975774 697514 674087 789809 1005231 1520820 1725456 1557334 1422387
9173 1422387 1708293 1794466 1561052 1479410 1371740 1231082 1348501 1266544 870338 701651
9163 701651 729779 716544 489865 465923 566869 477191 272704 134958 384158 704603
9153 704603 826223 1253907 1693891 1990341 2508613 2709094 2389816 2303172 2498271 2401176
9143 2401176 1735632 1227377 1221212 1293624 1632259 1766903 1680749 1396435 1143892 1056514
9133 1056514 986140 894878 925135 706107 516028 349148 -147052 -387901 -199353 140724
9123 140724 191887 283414 581410 1074020 1377540 1323422 988180 426718 180043 233833
9113 233833 286736 153870 -51045 -266888 -412682 -667200 -368753 -89866 -396211 -273978
9103 -273978 128305 433963 612029 231703 80465 290128 353826 625816 672194 210350
9093 210350 -224691 -78705 64832 109669 417423 1103205 1434144 1060113 273581 -149044
9083 -149044 -88506 -148868 -471603 -616721 -143566 402700 561970 574043 484768 31235
9073 31235 -182944 61363 297467 416272 512423 571697 676998 772796 890261 1170835
9063 1170835 1171289 1192405 910042 616408 624743 923659 1020228 1088067 1257997 1166277 1135915
9052 1135915 1042972 923725 936575 951108 1118426 1123417 1014111 1179557 1371745 1469520 1261689
9041 1261689 746232 386407 314822 524241 869258 757405 337318 268526 636029 735126
9031 735126 660891 755973 1285355 1243338 478098 199029 564247 1187456 1358686 924316
9021 924316 594065 480371 390845 761701 1205819 1078470 977819 1014092 1086290 1006764
9011 1006764 787751 761183 512142 296440 278821 403179 243056 -53182 -61970 -27727
9001 -27727 175977 326154 146757 -182428 71717 429427 859381 1262689 1152110 764896
8991 764896 302104 91278 -88836 -193588 -421592 -582434 -438108 72631 317748 127925
8981 127925 -377713 -588598 -510212 -713762 -756601 -551971 -268428 5945 -31255 199327
8971 199327 806811 919420 769690 661992 959115 1491971 2347824 2615547 2548823 2549441
8961 2549441 2628942 2739710 2904509 3091399 3117159 2584436 2096844 1957415 1603136 1380511
8951 1380511 1236001 1096741 914096 879389 994147 1152253 1180297 1087689 966663 1136760
8941 1136760 1295888 1055050 483629 307164 699330 1240577 1712121 2143903 1872178 1150328
8931 1150328 778162 627887 590007 989571 1247455 817501 344535 242270 209501 253206
8921 253206 628491 642749 596253 754711 688286 715221 986168 1122932 1003889 550376
8911 550376 -87544 -339981 -79737 -54992 -14542 281625 465674 794937 901269 695630
8901 695630 471191 347314 428689 466651 264626 -16041 96204 224842 36115 -238633
8891 -238633 -429804 -254062 206821 316567 22602 -352683 -395692 -566349 -329207 158139
8881 158139 370738 441571 390780 179206 305520 489216 173956 11047 37201 80889
8871 80889 404296 792447 835547 687340 644171 733222 982343 1125840 1333198 1552079
8861 1552079 1738413 1712454 1773324 1680267 1418074 940202 732064 391170 -18534 -13258
8851 -13258 -255278 -466288 -243110 -264368 -556979 -126261 193246 169780 192552 116417 -92066
8840 -92066 -61565 150640 488781 605147 359664 -254725 -739579 -689864 -451752 -396801
8830 -396801 9448 59821 -129498 -407745 -567403 -302090 91561 420624 488819 110705
8820 110705 -687247 -1173248 -1092996 -941451 -688834 -456939 -657135 -637172 -675239 -728980
8810 -728980 -625755 -292056 6966 96036 117097 337775 419837 425105 264066 -26068 -200719
8799 -200719 -560895 -866107 -1180204 -1220151 -858792 -345270 92165 211610 287500 332762
8789 332762 254323 462228 610047 1110204 1292657 687315 6983 -437704 -390454 14528
8779 14528 222612 279900 246680 421339 719029 1086392 1006268 540602 2594 -362002
8769 -362002 -205743 12509 114550 -27390 -184001 -310015 -474007 -273210 134103 565070
8759 565070 864567 949027 745610 344740 -19822 -593810 -1235650 -1395031 -991677 -146596
8749 -146596 123539 -179019 -258915 -238454 -197787 58676 115828 -48871 -345627 -790949
8739 -790949 -1003027 -1102281 -624422 114287 286214 260853 186380 -25921 -57099 480556
8729 480556 960241 1057484 886571 472381 330571 465622 407022 -31834 -300999 -133387
8719 -133387 229175 746099 1031867 842918 877033 696968 374018 290248 236563 160276
8709 160276 -250040 -579499 -649426 -662614 -423962 -247513 -91616 -82869 -478025 -467928 -42046
8698 -42046 70143 216474 178580 60992 162039 89240 -178896 -168986 -276906 -907872 -1311082
8687 -1311082 -682707 106435 106303 390102 778274 724008 244840 -1717 -259305 -513485
8677 -513485 -588134 -322391 86386 341567 67277 -436000 -596837 -727520 -1115763 -1094840
8667 -1094840 -1203011 -1528600 -1585550 -1316675 -818292 -342155 26308 297832 555299 462295
8657 462295 -14480 -242063 -73490 -229510 -520929 -476342 -99196 48024 343833 449145
8647 449145 603885 783518 388574 -244187 -499215 -402875 -459694 -276508 -184986 -74863
8637 -74863 186354 310019 139357 -207457 -325659 -565010 -798662 -715507 -651751 -651637 -408601
8626 -408601 -341659 -828452 -1050504 -842735 -931412 -920894 -680270 -438786 -562800 -930442
8616 -930442 -1343106 -1062982 -408984 -154520 -32281 351094 141062 -711303 -1236329 -1101418
8606 -1101418 -854198 -1113427 -904503 -310600 33742 13941 -410912 -665007 -514420 -261678
8596 -261678 -54349 -152788 -384640 -641518 -813551 -246099 260976 96974 44184 -12576
8586 -12576 -270396 -335421 -33060 -159004 -429055 -792618 -912272 -721899 -668256 -599611
8576 -599611 -603184 -773165 -598978 -538712 -559365 -396625 -240582 283537 329300 131880 372882
8565 372882 493638 147242 -59590 -339474 -653359 -836737 -832298 -901023 -785771 -537032
8555 -537032 -512426 -648626 -653550 -518334 -632818 -878034 -751112 -761031 -1033273 -1026908 -606233
8544 -606233 -495831 -901975 -1403484 -1490853 -1407902 -1789592 -1994201 -1350605 -389069 -125336
8534 -125336 -491913 -671897 -737167 -687268 -625445 -585395 -466126 -140561 17918 -311221
8524 -311221 -648590 -967018 -1066082 -943214 -671027 -575819 -906247 -1044858 -1025761 -1096070
8514 -1096070 -1226326 -1176158 -1043749 -994434 -1447608 -1490006 -1350649 -1204230 -1550038 -1745246
8504 -1745246 -1109943 -213601 219879 232165 350580 382697 334710 131500 155395 -9735
8494 -9735 -201186 -310579 -679300 -481144 -36788 -9841 86547 -3362 -109240 -208678 -190247
8483 -190247 112539 373707 338044 56352 -169047 -337366 -450403 -186975 97833 -551
8473 -551 -408154 -593730 -467253 -395828 -293809 -388954 -875908 -835703 -116048 241311 -27019
8462 -27019 -233527 -495794 -956853 -1119402 -735045 -649851 -759460 -810281 -650925 -493073
8452 -493073 -424059 -470517 -711935 -737923 -469259 -430520 -586981 -260416 80579 -188030
8442 -188030 -413536 -561619 -1077051 -1240605 -674519 -249825 -119934 -466521 -556601 -225266
8432 -225266 -349666 -530551 -530843 -629653 -590961 -316387 -496622 -506419 -687832 -882613 -709809
8421 -709809 -500993 148192 755711 656115 273764 9588 -45498 299839 224625 -276424
8411 -276424 -552985 -193416 307348 432863 303343 441190 528947 59407 -406983 -310343
8401 -310343 316129 747021 902194 1059768 1177282 1367326 1142843 871932 418018 6738
8391 6738 169857 340994 127943 -157865 -210697 -8192 232098 474392 491225 144345
8381 144345 -170113 -555092 -845908 -922529 -939693 -728871 -542931 -380486 -661378 -774404
8371 -774404 -305783 24177 175 -168213 -359235 -692953 -1158226 -1416620 -1625090 -1826660
8361 -1826660 -1799369 -1911462 -1733112 -1407727 -1163165 -919512 -569627 -225709 -66545 -96745
8351 -96745 281529 589852 456105 245367 -2895 -278279 -563179 -834828 -711637 -382517
8341 -382517 -91402 -30328 -62415 -284279 -507221 -416648 -579913 -905827 -1049458 -950866
8331 -950866 -1023970 -620083 84045 347460 170655 172769 769233 1042440 959250 756018
8321 756018 209921 -227156 -373660 -120363 -25090 256234 486160 365291 93074 -228484
8311 -228484 -566112 -804447 -903516 -974671 -1114498 -1214324 -1202846 -1378094 -1151681 -853203
8301 -853203 -500501 -189382 -304107 -265626 -29167 126434 389634 399369 435301 672157
8291 672157 684096 651368 612588 378390 -74316 -495573 -385821 31645 762509 1168037
8281 1168037 664143 -45631 -314133 123865 617899 698649 115327 -549862 -642396 -552702
8271 -552702 -538318 -862078 -867898 -177579 383160 504983 443584 199439 3797 2158 -267044
8260 -267044 -625038 -543549 -139079 -38961 -90811 117557 286858 557687 777872 411637
8250 411637 -64025 -277169 -276016 79332 144750 59527 -108322 -540663 -1411573 -1617680
8240 -1617680 -1194540 -700474 -393324 -300117 232643 868953 871022 459217 230138 -11616
8230 -11616 -419891 -908896 -961380 -476953 -172067 -328527 -532858 -437035 -259934 -123196
8220 -123196 -370328 -960848 -1188190 -806999 -151911 239975 93845 87510 295966 310603
8210 310603 161782 45469 -140750 -221968 -448913 -342943 -39580 227824 200281 -279561
8200 -279561 -606336 -789492 -902436 -545651 -32190 444947 997727 1154696 1118220 1333919
8190 1333919 1627958 1855915 2165959 2241392 2061731 1737305 2025771 2488800 2334682 2384532
8180 2384532 2890635 2910960 3087235 3493808 3453241 3365754 3246149 2950581 2893883 2896544 3135439
8169 3135439 3837743 4252759 4313358 4402311 4590007 4564698 4239458 4270412 4641437 5237974
8159 5237974 5919657 6363528 6822558 7221945 7560591 8009942 8483478 9187611 9856539 9999331
8149 9999331 9886103 10322229 10868473 11396779 12001888 12940056 13450283 13875962 14603012 15049167
8139 15049167 15551691 16072177 16601365 16595473 16391551 16236528 15809680 15009653 14307106 13704619
8129 13704619 12972099 12469195 12211467 11607230 10194716 8836442 8090192 7887107 7430603
8120 7430603 6823287 6343670 6020633 5630704 5491933 5389440 4907171 4543457 3902239 3388216
8110 3388216 3080805 2830177 2558574 2179788 2003067 1511795 1360585 1481126 1759019 1650546
8100 1650546 1478042 1800204 1894066 1965385 2024018 2425779 2560104 2049227 1564232 1349132
8090 1349132 1299640 1101984 1020923 1113612 829599 884765 931134 1231994 1715107 1548028
8080 1548028 1289019 1172044 1213452 1275692 783591 415929 612997 493119 368408 256881
8070 256881 444144 790086 866464 625626 362386 483808 680377 532557 418612 355005
8060 355005 164327 103098 38685 -17612 237713 817305 1033514 723926 615421 541099
8050 541099 844270 1528998 1578811 1247799 1379874 1800095 1514320 855878 662005 1113447
8040 1113447 1208115 751675 466621 462025 764184 827819 996269 1408160 1579275 1616390
8030 1616390 1202189 831041 1081520 1455989 1243030 908106 895353 708379 423734 317407
8020 317407 328982 765193 955870 938493 1060375 1567094 2062768 2159190 2113844 1991537
8010 1991537 1959422 2075386 2130001 2126009 2067669 1891326 1571901 1735060 2170786 2315218
8000 2315218 2528020 2742448 2998867 3052055 3014615 3320827 3798635 3880711 3749875 3800544
7990 3800544 3890610 3937352 3882967 2921912 2011911 1494574 1727631 2272133 2745690 3217517
7980 3217517 3349252 3197918 3171075 3044041 2721690 2551934 2276889 2213972 2274233 2472234
7970 2472234 2610848 2769985 2742121 2417243 2256157 2224527 2613751 2806630 2697768 2707383
7960 2707383 2618600 2742183 2699925 2683067 2854718 2602771 2178448 2186147 1991270 1515572
7950 1515572 1053105 738516 806965 834314 1090778 1324461 896091 429667 299260 403960
7940 403960 601261 471946 358549 519908 526479 572903 623297 653552 757929 939314 608413
7929 608413 8699 -138131 374914 496860 -8899 -336430 -354147 -136603 132389 107141
7919 107141 354466 616478 194685 -298654 -455240 -370237 -186904 44782 327583 488107
7909 488107 464860 172781 -356970 -675641 -1127255 -1136646 -635155 -75109 205798 66422
7899 66422 8767 255320 868878 678337 202428 94700 272431 314383 133412 132701 88259
7888 88259 30003 101600 118314 36755 -126407 -393970 -559916 -452598 -421311 -469122 -71971
7877 -71971 472707 583631 420845 225036 -219075 -524650 -595376 -495017 -797960 -932187
7867 -932187 -779731 -423806 -115447 34840 109857 7528 147632 311787 76987 -328031
7857 -328031 -145775 -8107 148866 159229 290125 345612 175414 146759 125936 41936 -63098
7846 -63098 -22572 367166 546199 152321 149899 654586 1064059 1138761 1124699 1088695 719221
7835 719221 276943 65840 65240 198812 194375 2543 -366399 -131205 190406 -97543 -230727
7824 -230727 -325109 -177460 -112428 -293843 -543905 -251258 50545 -2890 200264 229950
7814 229950 -150890 -75205 131216 460272 480847 119272 169363 319819 250458 356760
7804 356760 660412 692871 226272 -52207 53011 -121031 47333 238241 48485 -66739
7794 -66739 133522 109166 94671 -48263 -230482 -306983 -277755 -251622 -63545 -44599 -258663
7783 -258663 -433223 -236544 66817 222155 43012 324311 728004 390892 -237587 -502344
7773 -502344 -224857 -21355 -302367 -322366 -182931 -64961 -87762 307527 383937 -71636
7763 -71636 -191864 105482 339337 290251 381817 272562 183847 244831 168625 171178 485914
7752 485914 667851 640303 700854 1564145 2016560 1861821 1866377 1866462 2146789 2584995 3044881
7741 3044881 2891614 2332838 2136824 2601211 2811113 2755950 2906807 2959294 3285370 3210893
7731 3210893 2690587 2411676 2884606 3073961 2636048 2387967 2087029 2090060 2325260 2245888
7721 2245888 2066058 2069271 2270269 2181826 1811940 1783070 2180952 2502041 2977512 3166351
7711 3166351 3335062 3206478 3189938 3512749 3164765 3003295 3055757 3108717 3319791 3386141
7701 3386141 3292854 3060492 2895049 2851325 2814907 3066906 3324943 3251023 3269854 3266633 3035310
7690 3035310 3146433 3255781 2757473 2196206 2260749 2214275 1995975 2311178 2579207 2709106
7680 2709106 3259833 3054636 2529887 2223214 2264403 2435268 2364588 2225445 2363957 2821928
7670 2821928 3542426 3730172 3687033 3801433 4227910 4881484 4959775 5021927 5012471 4838538
7660 4838538 4741273 5015494 5216412 5179775 5255839 5403001 5615354 5502402 5629041 5863542
$$ [...]
##END NTUPLES=NMR SPECTRUM
##END=
