##TITLE=C13_LR-618-R3-CR7-2
 CDCl3, 1100 sc

 30.6.2021
##JCAMPDX= 6.0         $$ Bruker NMR JCAMP-DX V2.0
##DATA TYPE= NMR SPECTRUM
##DATA CLASS= NTUPLES
##ORIGIN= UXNMR, Bruker Analytische Messtechnik GmbH
##OWNER= root
$$ XWIN-NMR		Version 3.5
$$ Wed Jun 30 13:01:21 2021 Russian Standard Time (UT+4h)  she@DPX200
##.OBSERVE FREQUENCY= 50.327896
##.OBSERVE NUCLEUS= ^13C
##.ACQUISITION MODE= SIMULTANEOUS
##.ACQUISITION SCHEME= undefined
##.AVERAGES= 1100
##.DIGITISER RES= 17
##SPECTROMETER/DATA SYSTEM= spect
##.PULSE SEQUENCE= zgpg30
##.SOLVENT NAME= CDCl3
##.SHIFT REFERENCE= (INTERNAL, CDCl3, 0, 222.653)
##AUDIT TRAIL= $$ (NUMBER, WHEN, WHO, WHERE, WHAT)
$$ ##TITLE= Audit trail, XWIN-NMR		Version 3.5
$$ ##JCAMPDX= 5.01
$$ ##ORIGIN= Bruker BioSpin GmbH
$$ ##OWNER= she
$$ F:/spectra/data/she/nmr/c13/1/pdata/1/auditp.txt
$$ ##AUDIT TRAIL=  $$ (NUMBER, WHEN, WHO, WHERE, WHAT)
(   1,<2021-06-30 12:59:01.82 +0400>,<she>,<DPX200>,
      <created by zg, POWCHK disabled, PULCHK disabled
       terminated by command 'halt'
       configuration hash MD5:
       00 E9 B6 7A A2 85 ED C7 34 08 36 98 17 FE 4E 26
       data hash MD5: 32K
       59 A6 B5 A7 46 BA C6 EF A6 2E E3 66 D3 DB FB 20>)
(   2,<2021-06-30 12:59:04.14 +0400>,<she>,<DPX200>,
      <Start of raw data processing
       efp BC_mod = 2 LB = 1 FT_mod = 6 PKNL = 1 PHC0 = -342.743 PHC1 = 41.56237 SI = 32K 
       data hash MD5: 32K
       6C 92 AB 7A 1B 04 2F 75 AA E0 00 6C C6 FB 24 A5>)
(   3,<2021-06-30 12:59:07.67 +0400>,<she>,<DPX200>,
      <abs ABSG = 5 
       data hash MD5: 32K
       D4 2F E3 12 DE B1 5D F9 5D 02 16 BC A2 C9 E9 22>)
(   4,<2021-06-30 13:00:32.71 +0400>,<she>,<DPX200>,
      <pk PHC0 = -3.305558 PHC1 = 3.199998 
       data hash MD5: 32K
       31 B5 5E E0 76 F5 06 33 1E A5 1D 8F 4D BE 1F D8>)
(   5,<2021-06-30 13:00:36.04 +0400>,<she>,<DPX200>,
      <abs ABSG = 5 
       data hash MD5: 32K
       BC 12 17 29 AB E1 37 B0 5C 53 10 D7 3C 6E AD 30>)
$$ ##END=
$$ 
$$ hash MD5
$$ A6 4F 79 9C CA E6 28 42 F3 23 7A 00 8F BA 14 1F
##$RELAX= 
##$RELAX= 
##$RELAX= 
##$RELAX= 
##$RELAX= 
##$RELAX= 
##$RELAX= 
##$RELAX= 
$$ Bruker specific parameters
$$ --------------------------
##$DU= <F:/spectra>
##$EXPNO= 1
##$NAME= <c13>
##$PROCNO= 1
##$TYPE= <nmr>
##$USER= <she>
##$AMP= (0..31)
100 100 100 100 100 100 100 100 100 100 100 100 100 100 100 100 100 100 
100 100 100 100 100 100 100 100 100 100 100 100 100 100 
##$AQSEQ= 0
##$AQ_mod= 1
##$AUNM= <au_zg>
##$AUTOPOS= <>
##$BF1= 50.322709
##$BF2= 200.13
##$BF3= 50.322709
##$BF4= 500.13
##$BF5= 500.13
##$BF6= 500.13
##$BF7= 500.13
##$BF8= 500.13
##$BYTORDA= 1
##$CFDGTYP= 0
##$CFRGTYP= 5
##$CHEMSTR= <none>
##$CNST= (0..31)
1 1 145 1 1 1 1 1 1 1 1 1 1 1 1 1 1 1 1 1 1 1 1 1 1 1 1 1 1 1 1 1 
##$CPDPRG= <waltz16>
##$CPDPRG1= <>
##$CPDPRG2= <waltz16>
##$CPDPRG3= <>
##$CPDPRG4= <mlev>
##$CPDPRG5= <mlev>
##$CPDPRG6= <mlev>
##$CPDPRG7= <mlev>
##$CPDPRG8= <mlev>
##$CPDPRGB= <>
##$CPDPRGT= <>
##$D= (0..31)
$$ [...]
##$SUBNAM4= <"">
##$SUBNAM5= <"">
##$SUBNAM6= <"">
##$SUBNAM7= <"">
##$SUBNAM8= <"">
##$SUBNAM9= <"">
##$SW= 239.972175391363
##$SWIBOX= (0..15)
0 1 3 0 0 0 0 0 0 0 0 0 0 0 0 0 
##$SW_h= 12077.2946859903
##$TD= 32768
##$TD0= 1
##$TE= 0
##$TE2= 300
##$TE3= 300
##$TEG= 300
##$TL= (0..7)
120 120 120 120 120 120 120 120 
##$TP= (0..7)
150 150 150 150 150 150 150 150 
##$TP07= 0
##$TPNAME0= <>
##$TPNAME1= <>
##$TPNAME2= <>
##$TPNAME3= <>
##$TPNAME4= <>
##$TPNAME5= <>
##$TPNAME6= <>
##$TPNAME7= <>
##$TPOAL= (0..7)
0.5 0.5 0.5 0.5 0.5 0.5 0.5 0.5 
##$TPOFFS= (0..7)
0 0 0 0 0 0 0 0 
##$TUNHIN= 0
##$TUNHOUT= 0
##$TUNXOUT= 0
##$USERA1= <user>
##$USERA2= <user>
##$USERA3= <user>
##$USERA4= <user>
##$USERA5= <user>
##$V9= 5
##$VALIST= <valist>
##$VCLIST= <CCCCCCCCCCCCCCC>
##$VD= 0
##$VDLIST= <DDDDDDDDDDDDDDD>
##$VPLIST= <PPPPPPPPPPPPPPP>
##$VTLIST= <TTTTTTTTTTTTTTT>
##$WBST= 1024
##$WBSW= 4
##$XGAIN= (0..3)
0 0 0 0 
##$XL= 0
##$YL= 0
##$YMAX_a= 6288884
##$YMIN_a= -1461734
##$ZGOPTNS= <>
##$ZL1= 120
##$ZL2= 120
##$ZL3= 120
##$ZL4= 120
##$ABSF1= 222.6533
##$ABSF2= -17.34351
##$ABSG= 5
##$ABSL= 3
##$ALPHA= 0
##$AQORDER= 0
##$ASSFAC= 0
##$ASSFACI= 0
##$ASSFACX= 0
##$ASSWID= 0
##$AUNMP= <proc_1d>
##$AZFE= 0.1
##$AZFW= 0.5
##$BCFW= 0
##$BC_mod= 2
##$BYTORDP= 0
##$COROFFS= 0
##$CY= -3
##$DATMOD= 1
##$DC= 0
##$DFILT= <>
##$DTYPP= 0
##$F1P= 0
##$F2P= 0
##$FCOR= 0.5
##$FTSIZE= 32768
##$FT_mod= 6
##$GAMMA= 0
##$GB= 0
##$INTBC= 1
##$INTSCL= 4.134877e-10
##$ISEN= 128
##$LB= 1
##$LEV0= 0
##$LPBIN= 0
##$MAXI= 10000
##$MC2= 0
##$MEAN= 0
##$ME_mod= 0
##$MI= 0.1934396
##$NCOEF= 0
##$NC_proc= -2
##$NLEV= 6
##$NOISF1= 120.0001
##$NOISF2= 80.00006
##$NSP= 0
##$NTH_PI= 0
##$NZP= 0
##$OFFSET= 222.6533
##$PC= 1.4
##$PHC0= -346.0486
##$PHC1= 44.76237
##$PH_mod= 1
##$PKNL= yes
##$PPARMOD= 0
##$PSCAL= 0
##$PSIGN= 0
##$REVERSE= no
##$SF= 50.3227301278049
##$SI= 32768
##$SIGF1= 140
##$SIGF2= 120
##$SINO= 11.81781
##$SIOLD= 32768
##$SREGLST= <13C.CDCl3>
##$SSB= 0
##$STSI= 32768
##$STSR= 0
##$SW_p= 12077.2946859903
##$SYMM= 0
##$S_DEV= 0
##$TDeff= 32768
##$TDoff= 0
##$TI= <>
##$TILT= no
##$TM1= 0
##$TM2= 0
##$TOPLEV= 0
##$USERP1= <user>
##$USERP2= <user>
##$USERP3= <user>
##$USERP4= <user>
##$USERP5= <user>
##$WDW= 1
##$XDIM= 32768
##$YMAX_p= 524877553
##$YMIN_p= -8781036
$$ End of Bruker specific parameters
$$ ---------------------------------
##NTUPLES= NMR SPECTRUM
##VAR_NAME=  FREQUENCY,     SPECTRUM/REAL,   SPECTRUM/IMAG
##SYMBOL=    X,             R,               I
##VAR_TYPE=  INDEPENDENT,   DEPENDENT,       DEPENDENT
##VAR_FORM=  AFFN,          ASDF,            ASDF
##VAR_DIM=   32768,         32768,           32768
##UNITS=     HZ,            ARBITRARY UNITS, ARBITRARY UNITS
##FACTOR=    0.368581032318806, 1,           1
##FIRST=     11204.5221822817, 0,            0
##LAST=      -872.772503708586, 0,           0
##MIN=       -872.772503708586, -8781036,    0
##MAX=       11204.5221822817, 524877553,    0
$$ Real data points
##PAGE= N=1
##DATA TABLE= (X++(R..R)), XYDATA
$$ [...]
$$ plain form
15684 3500860 4120202 3571452 1849247 529048 104218 1490845 2186606 1063262 -71981
15675 -71981 -505597 -1432225 -2184461 -1816427 -1889968 -3740599 -4028555 -2463334 -1173543
15666 -1173543 334338 1797081 2034330 1423420 763864 -492720 376879 1093268 2008175
15657 2008175 3313794 3964781 4158553 3042721 754644 -885995 -281332 588046 5290
15648 5290 -1063218 -1426483 -825255 -1325280 -895620 -161642 -1404251 -3217231 -3186260 -2630299
15638 -2630299 -1601656 -525295 -1689969 -2572429 -1931961 -1844902 -294303 2602420 3468495
15629 3468495 2864835 2593180 777520 -1064157 -2400587 -2338991 -932327 901291 1918903
15620 1918903 2290154 1828627 1183752 189610 -1465266 -1845520 -610433 -239047 -83512
$$ packed form
15684C500860O19342n48750j722205j320199m24830J386627O95761j123344j135243
15675g1981m33616r26628p52236L68034p3541j850631k87956J565221J289791
15666a173543J507881J462743K37249o10910o59556j256584Q69599P16389R14907
15657B008175J305619O50987J93772j115832k288077j640639O04663Q69378n82756
15648E290j068508l63265O01228n00025M29660P33978j242609j812980L0971N55961
15638b630299J028643J076361j164674q82460O40468Q7059J550599K896723Q66075
15629C468495o03660k71655j815660j841677j336430O1596J406664J833618J017612
15620A918903L71251m61527o44875r94142j654876l80254J235087L71386J55535
$$ plain form
15611 -83512 974027 -204522 -2725592 -3740838 -3005667 -1986081 -684089 -91378 454986
15602 454986 584367 641914 784310 590391 1113832 810255 1450023 3221447 3108570 2627335
15592 2627335 2056612 1613614 1840672 2219131 1767942 1812079 2109793 2577706 1795029 819248
15582 819248 -121616 -1453678 -1849623 -702478 1208653 679436 -500877 -1514729 -2103486
15573 -2103486 -3343522 -4830215 -3150395 -797996 -107184 -739473 -1196492 -2227966 -3041298
15564 -3041298 -2798739 -1417669 125556 2134737 2260864 974288 470708 1570236 3708280
15555 3708280 6198714 7179118 7217767 4964577 2693477 1791280 1616278 2084113 2102085
15546 2102085 2386589 3228172 2705168 1119062 -723364 404431 1769292 1021415 -746957
$$ packed form
15611h3512J057539j178549k521070j015246P35171J019586J301992N92711N46364
15602D54986J29381N7547J42396j93919N23441l03577O39768J771424j12877m81235
15592B627335n70723m42998K27058L78459m51189M4137K97714M67913p82677r75781
15582H19248r40864j332062l95945J147145J911131n29217j180313j013852n88757
15573b103486j240036j486693J679820K352399O90812o32289m57019j031474q13332
15564c041298K42559J381070J543225K009181J26127j286576n03580J099528K138044
15555C708280K490434R80404L8649k253190k271100r02197j75002M67835J7972
15546B102085K84504Q41583n23004j586106j842426J127795J364861p47877j768372
$$ plain form
15537 -746957 -439464 288252 -34093 -304507 -88559 341732 1172359 2038282 2595116 1333509
15527 1333509 221794 -308023 -1049497 467896 2148432 2788461 3674611 4875346 4772944
15518 4772944 3646772 1950280 -106735 -194765 272671 14686 -349855 -514713 -405405
15509 -405405 366665 205065 -836487 -241763 1465142 2098027 1571570 1529912 3587989
15500 3587989 4291053 3888391 3354944 1563687 455511 1040552 1757398 2211757 1203871
15491 1203871 -61943 485558 756482 254474 334526 107338 -529053 -1345281 -2547917
15482 -2547917 -2061792 -907701 413105 1730062 1976273 1044859 202849 379948 112554
15473 112554 -821266 -1290252 -911002 -744288 -827029 169420 850934 860431 -718445 -2942564
$$ packed form
15537g46957L07493P27716l22345k70414K15948M30291Q30627Q65923N56834j261607
15527A333509j111715n29817p41474J517393J680536O40029Q86150J200735j02402
15518D772944j126172j696492k057015q8030M67436k57985l64541j64858J09308
15509d05405P72070j61600j041552N94724J706905O32885n26457m1658K058077
15500C587989P03064m02662n33447j791257j108176N85041P16846M54359j007886
15491A203871j265814N47501K70924n02008Q0052k27188o36391q16228j202636
15482b547917M86125J154091J320806J316957K46211r31414q42010J77099k67394
15473A12554r33820m68986L79250J66714q2741R96449O81514R497j578876k224119
$$ plain form
15463 -2942564 -5421807 -6402831 -5517187 -3460124 -2487843 -3174333 -4175600 -4460897 -3429828
15454 -3429828 -3531053 -3317767 -3139997 -3215043 -3350441 -2652357 -2865516 -3838052 -2698506
15445 -2698506 -1153143 136216 734928 585098 -1643038 -3084818 -3512978 -4597817 -4638673
15436 -4638673 -2257124 891771 2610636 2039596 893870 935827 1163765 1324636 506549
15427 506549 1045695 1766690 1161516 942228 1145646 261603 -1459518 -1235074 -441690
15418 -441690 252866 298541 -286136 -65094 -960936 -2205130 -1872622 -2003152 -3189046
15409 -3189046 -3451888 -1120935 1623787 2967579 3309083 1964864 -463256 -2715100
15401 -2715100 -3039960 -2330299 -1897557 -2056917 -1846626 59960 1499551 2512476 1833625
$$ packed form
15463b942564k479243r81024Q85644K057063R72281o86490j001267k85297J031069
15454c429828j01225K13286J77770p5046j35398O98084k13159r72536J139546
15445b698506J545363J289359N98712j49830k228136j441780m28160j084839m0856
15436d638673K381549L148895J718865n71040j145726M1957K27938J60871q18087
15427E06549N39146P20995o05174k19288K03418q84043j721121K24444P93384
15418d41690O94556M5675n84677K21042q95842j244194L32508j30530j185894
15409c189046k62842K330953K744722J343792L41504j344219k428120k251844
15401b715100l24860P09661M32742j59360K10291J906586J439591J012925o78851
$$ plain form
15392 1833625 1555832 2759122 4086630 4153887 1140135 -1697898 -1691176 -762728 -708370
15383 -708370 -355386 694915 1158172 -342248 -2043810 -1711871 -178710 2222186 3004422
15374 3004422 3030475 2963816 863041 -628240 145479 648781 -57925 -352740 -705682
15365 -705682 -1698480 -1460513 -1025201 -1352132 -1448902 -1124812 -218873 808655 1192220 1602902
15355 1602902 997159 -86801 1485755 2056649 1771449 1500220 2194042 2964227 2699406
15346 2699406 2266596 710361 -869445 -530287 269464 500571 1551603 1681377 935780
15337 935780 768324 492604 337929 1102145 2125459 2432795 2436712 2017133 871647 665066
15327 665066 759937 1015946 966397 805879 232908 -961 379872 564477 1938073 3001472
$$ packed form
15392A833625k77793J203290J327508O7257l013752k838033O722R28448N4358
15383g08370L52984J050301M63257j500420j701562L31939J533161K400896P82236
15374C004422K6053o6659k100775j491281P73719N03302p06706k94815l52942
15365g05682r92798K37967M35312l26931r6770L24090R05939J027528L83565M10682
15355A602902o05743j083960J572556N70894k85200k71229O93822P70185k64821
15346B699406m32810j556235j579806L39158P99751K31107J051032J29774p45597
15337I35780j67456k75720j54675P64216J023314L07336L917m19579j145486k06581
15327F65066R4871K56009m9549j60518n72971k33869L80833J84605J373596J063399
$$ plain form
15317 3001472 1830300 312255 -860676 -77061 973238 450527 619426 851925 841117
15308 841117 1115970 858995 899310 -9274 -1018064 -2253472 -2487969 -787986 613671
15299 613671 -1355542 -2980475 -1058062 -259559 -2576189 -3844190 -3840355 -3823241 -4342588
15290 -4342588 -3777370 -2796348 -967125 1407035 1910695 1841025 1121696 -549554 -1567891
15281 -1567891 -1563252 -1399981 -1537364 -1769709 -1332655 -517077 -349266 -580872 -1535660 -1661276
15271 -1661276 -1374277 -1646270 -1522931 -658275 -187589 -391539 -1610771 -3761899 -4870674
15262 -4870674 -4756919 -3729350 -3663620 -4899812 -5280982 -4311548 -3515584 -2819127 -2092246
15253 -2092246 -3827198 -4361665 -2779476 -1691005 -1833749 -2268975 -2168930 -541359 582059
$$ packed form
15317C001472j171172j518045j172931P83615J050299n22711J68899K32499j0808
15308H41117K74853k56975M0315r08584j008790j235408k34497J699983J401657
15299F13671j969213j624933J922413P98503k316630j268001L835J7114n19347
15290d342588N65218R81022J829223K374160N03660o9670p19329j671250j018337
15281a567891M639J63271j37383k32345M37054Q15578J67811k31606r54788j25616
15271a661276K86999k71993J23339Q64656M70686k03950j219232k151128j108775
15262d870674J13755J027569O5730j236192l81170R69434P95964O96457P26881
15253b092246j734952n34467J582189J088471j42744m35226J00045J627571J123418
$$ plain form
15244 582059 -761576 -2016875 -2623403 -2962482 -2318710 -675526 -22319 74503 -471078
15235 -471078 -562905 -543351 -1747627 -2561954 -2027476 -3208957 -4398131 -2632517 -1259056
15226 -1259056 -1102192 -1871828 -2693990 -2845832 -2967385 -1914214 -835541 -264563 -464982
15217 -464982 -940382 -824777 -1025033 -2248246 -1619791 130939 1256918 884957 156082
15208 156082 -309812 -450010 104070 875321 1026262 1081053 1595280 678144 -546959 1198904
15198 1198904 3051329 3867882 2807158 1958379 1729038 189513 -1174268 -2228488 -2261977
15189 -2261977 -759983 -1057485 -1100928 -1030529 -2025929 -3201862 -4410371 -5158415 -4371444
15180 -4371444 -3997965 -3623896 -2515852 -1220584 -1710840 -2923319 -1944478 858796 2255960
$$ packed form
15244E82059j343635j255299o06528l39079O43772J643184O53207R6822n45581
15235d71078r1827J9554j204276q14327N34478j181481j189174J765614J373461
15226a259056J56864p69636q22162j51842j21553J053171J078673N70978k00419
15217d64982m75400J15605k00256j223213O28455J750730J125979l71961p28875
15208A56082m65894j40198N54080P71251J50941N4791N14227r17136j225103J745863
15198A198904J852425Q16553j060724q48779k29341j539525j363781j054220l3489
15189b261977J501994k97502m3443P0399r95400j175933j208509p48044P86971
15180d371444L73479L74069J108044J295268m90256j212479R78841K803274J397164
$$ plain form
15171 2255960 845660 -333094 -115246 1239639 2246769 3301774 3573256 2727028 2269267
15162 2269267 4102365 5175250 3641248 1723146 -560904 -656931 9337 -81248 486822
15153 486822 239405 127387 -53613 68604 536365 299271 153657 -1085450 -2453424
15144 -2453424 -2244095 -1316452 23318 838445 608831 206143 -790036 -1623004 -1603957
15135 -1603957 -1476394 -1875401 -2614267 -2761805 -1748841 -1440657 -1802433 -2266875 -3127388
15126 -3127388 -2241685 -37928 512334 -1213914 -1773113 -1291860 -718935 -1263885 -100208
15117 -100208 516004 -755639 -2143303 -1598841 -1296016 -1111859 -1912550 -1773561 513664
15108 513664 1928063 1941412 1231943 1432138 2720687 3603656 1925766 -974901 -1628952
$$ packed form
15171B255960j410300j178754K17848J354885J007130J055005K71482q46228m57761
15162B269267J833098J072885j534002j918102k284050r6027O66268r0585N68070
15153D86822k47417j12018j81000J22217M67761k37094j45614j239107j367974
15144b453424K09329R27643J339770Q15127k29614m02688r96179q32968J9047
15135a603957J27563l99007p38866j47538J012964L08184l61776m64442q60513
15126c127388Q85703K203757N50262j726248n59199M81253N72925n44950J163677
15117a00208O16212j271643j387664N44462L02825J84157q00691J38989K287225
15108E13664J414399J3349p09469K00195J288549Q82969j677890k900667o54051
$$ plain form
15099 -1628952 -1053300 159453 137815 -1871140 -3896485 -3507518 -1441704 -136809 356317
15090 356317 620169 1159524 2509841 4157688 5738781 5890727 3977808 1134134 -372095
15081 -372095 -826775 -1579984 -2400560 -3294116 -3464033 -3216465 -3603541 -4500762 -5352434 -6202718
15071 -6202718 -5171970 -2507940 -646432 813445 1168397 912031 1579405 1905256 1702425
15062 1702425 1519375 2188050 2291146 1288123 -185110 -826908 17436 781890 1758750
15053 1758750 1610866 191599 -1185332 -2551171 -2796110 -2764123 -3200500 -5176791 -5689421
15044 -5689421 -3289951 -1802187 -1328984 -661405 -447025 -1290736 -1567561 -2042948 -3180374
15035 -3180374 -3238100 -3074055 -2353958 -2812966 -3296441 -3512075 -4966182 -6591316 -5875566
$$ packed form
15099a628952N75652J212753k1638k008955k025345L88967K065814J304895M93126
15090C56317K63852N39355J350317J647847J581093J51946j912919k843674j506229
15081c72095m54680p53209q20576q93556j69917K47568l87076q97221q51672q50284
15071f202718J030748K664030J861508J459877L54952k56366O67374L25851k02831
15062A702425j83050O68675J03096j003023j473233o41798Q44344P64454R76860
15053A758750j47884j419267j376931j365839k44939L1987m36377j976291n12630
15044e689421K399470J487764M73203O67579K14380q43711k76825m75387j137426
15035c180374n7726J64045P20097m59008m83475k15634j454107j625134P15750
$$ plain form
15026 -5875566 -4174023 -1838571 565482 2700583 3681967 1601287 -525661 -1438313
15018 -1438313 -1490537 -745359 696300 3569668 5949758 4963045 460059 -2222085 -2735423
15009 -2735423 -3457346 -4162317 -2658284 -1349164 -1559884 -1117410 -509676 761043 1631819
15000 1631819 962072 1865214 2448881 951645 411611 103528 238048 -125792 -725189
14991 -725189 841602 3519652 3365209 -263718 -2591265 -3007808 -1340042 962986 2531777
14982 2531777 997349 -2142088 -2715023 -1173507 -35469 -364967 -1350746 -2554635 -3117569
14973 -3117569 -2126597 -608271 -232808 -1276109 -1199861 -1701721 -1621924 -1839723 -3432947
14964 -3432947 -2956259 -1766189 -1235823 100272 1946296 949723 -324560 -176734 -1125095
$$ packed form
15026e875566J701543K335452K404053K135101R81384k080680k126948r12652
15018a438313n2224P45178J441659K873368K380090r86713m502986k682144n13338
15009b735423p21923p04971J504033J309120k10720M42474O07734J270719Q70776
15000A631819o69747R03142N83667j497236n40034l08083J34520l63840n99397
14991g25189J566791K678050j54443l628927k327547m16543J667766K303028J568791
14982B531777j534428l139437n72935J541516J138038l29498r85779j203889n62934
14973c117569R90972J518326L75463j043301P6248n01860P9797k17799j593224
14964c432947M76688J190070N30366J336095J846024r96573j274283J47826r48361
$$ plain form
14955 -1125095 -2036420 -2360847 -1877652 -2140804 -1338092 370535 1324497 914682 1428846
14946 1428846 2557686 1821813 1537010 2306225 1814833 -85842 -918604 67728 333860
14937 333860 64135 120622 -1352856 -2341860 -1495867 -343278 -717763 -1225695 -2305198
14928 -2305198 -3439636 -4087378 -2762896 -1109699 -488642 -653892 -835994 -981687 -1571359
14919 -1571359 -1938489 -702481 -59247 -1621230 -1400839 424462 1546169 1318097 806413
14910 806413 799549 1436164 2482200 3968898 4257301 1371761 -683245 -1731731 -2833113
14901 -2833113 -1370306 426978 362674 -535266 -407041 379373 41315 505523 2029554
14892 2029554 3284653 3857006 4531691 3747541 2538137 2497419 2149681 1164470 818959
$$ packed form
14955a125095r11325l24427M83195k63152Q02712J708627R53962m09815N14164
14946A428846J128840p35873k84803P69215m91392j900675q32762R86332K66132
14937C33860k69725N6487j473478r89004Q45993J152589l74485n07932j079503
14928b305198j134438o47742J324482J653197O21057j65250j82102j45693n89672
14919a571359l67130J236008O43234j561983K20391J825301J121707k28072n11684
14910H06413o864O36615J046036J486698K88403k885540k055006j048486j101382
14901b833113J462807J797284o4304q97940J28225P86414l38058M64208J524031
14892B029554J255099N72353O74685p84150j209404m0718l47738r85211l45511
$$ plain form
14883 818959 180336 -689541 75105 795476 181396 174723 932641 1228370 349362 -579979
14873 -579979 -95505 957508 680847 219682 33181 372325 -596041 -182889 1513820
14864 1513820 1395494 902125 982637 1953851 2742025 2116470 1010543 -596068 -1995521
14855 -1995521 -1794463 -1564529 -1513346 -942380 -365611 -803844 -2486173 -3364171 -3112441
14846 -3112441 -3127879 -2034773 -2048064 -1798661 -1103372 -1524649 -479409 1043027 1785854
14837 1785854 1265695 22664 -239366 2125646 3793291 3684623 2296968 1383746 756821
14828 756821 291859 -192040 -710661 190062 -1271008 -3247231 -3351125 -2691249 -2328644
14819 -2328644 -2139409 -2694404 -3462064 -3413074 -3394935 -2269963 -412790 527995 1240014
$$ packed form
14883H18959o38623q69877P64646P20371o14080o673P57918K95729q79008r29341
14873e79979M84474J053013k76661m61165j86501L39144r68366M13152J696709
14864A513820j18326m93369Q0512R71214P88174o25555j105927j606611j399453
14855a995521K01058K29934N1183N70966N76769m38233j682329q77998K51730
14846c112441j5438J093106j3291K49403O95289m21277J045240J522436P42827
14837A785854n20159j243031k62030K365012J667645j08668j387655r13222o26925
14828G56821m64962m83899n18621R00723j461070j976223j03894O59876L62605
14819b328644J89235n54995p67660M8990J8139J124972J857173R40785P12019
$$ plain form
14810 1240014 1299268 1372686 720703 457678 680329 1818665 2241890 2374647 2933114 3005030
14800 3005030 2272416 751093 -29011 403720 244776 -936656 -1745384 -1480291 84362
14791 84362 1702440 2077085 2312479 1591965 20794 -341286 -681471 -1370899 -1431694 -1252056
14781 -1252056 -1514792 -743526 472796 1826489 2419726 2178587 1649104 1840746 2678043
14772 2678043 1242150 579114 1311298 1594679 2279629 3669248 5256989 4691087 2666702
14763 2666702 792464 980125 1861042 2484123 2905051 3744095 3318320 1529312 -451052
14754 -451052 -2115666 -1040023 98831 446744 1384928 2127554 2435030 3244536 4272343
14745 4272343 5443987 5118488 3014506 1929752 1915297 213719 -751915 -579053 483080
$$ packed form
14810A240014N9254P3418o51983k63025K22651J138336M23225J32757N58467P1916
14800C005030p32614j521323p80104M32731j58944j181432q08728K65093J564653
14791H4362J618078L74645K35394p20514j571171l62080l40185o89428o0795J79638
14781a252056k62736P71266J216322J353693N93237k41139n29483J91642Q37297
14772B678043j435893o63036P32184K83381O84950J389619J587741n65902k024385
14763B666702j874238J87661Q80917O23081M20928Q39044m25775j789008j980364
14754d51052j664614J075643J138854L47913R38184P42626L07476Q09506J027807
14745D272343J171644l25499k103982j084754j4455j701578r65634J72862J062133
$$ plain form
14736 483080 2670251 4110048 3669404 1458479 -274471 -152228 1820138 2147478 766363
14727 766363 406455 1149318 2772102 4729848 5267629 3522484 1738790 495183 -181203
14718 -181203 -660624 -1040964 -408132 -181933 55206 -485490 -963238 -600390 923065
14709 923065 2348573 2558705 1910462 519271 -656074 -1877352 -2943634 -3703938 -3768298
14700 -3768298 -2567921 -1347439 -581708 -8240 1358696 2358388 1390403 528524 278137
14691 278137 1210499 2069704 1840379 1654252 2177649 2236791 1403698 1170677 712602 451226
14681 451226 296170 -50238 445671 728066 -1001358 -1420224 -779214 -265408 -684466
14672 -684466 -1435421 -1775650 -864276 151058 143 674799 2490415 2955995 3161699
$$ packed form
14736D83080K187171J439797m40644k210925j732950J22243J972366L27340j381115
14727G66363l59908P42863J622784J957746N37781j745145j783694j243607o76386
14718a81203m79421l80340O32832K26199K37139n40696m77748L62848J523455
14709I23065J425508K10132o48243j391191j175345j221278j066282p60304o4360
14700c768298J200377J220482P65731N73468J366936R99692r67985q61879k50387
14691B78137R32362Q59205k29325j86127N23397N9142q33093k33021m58075k61376
14681D51226j55056l46408M95909K82395j729424m18866O41010N13806m19058
14672f84466p50955l40229R11374J015334j50915O74656J815616M65580K05704
$$ plain form
14663 3161699 2519850 1229333 -416954 -1666204 -2517290 -1865097 -1206441 -1281637 -805902
14654 -805902 -1054897 -1102002 -1246934 -1352415 -699894 129954 1765178 2324238 1492717 1521381
14644 1521381 1319734 381500 -354225 208198 470456 1081959 727407 1263039 2607632
14635 2607632 2012792 1957470 2387979 2931008 3631501 3159887 1178088 -33999 -687400
14626 -687400 -1335584 -1189925 -373324 -1067716 -1859909 -2175035 -1939876 -1681348 -2845833
14617 -2845833 -3165894 -1981184 219347 1877747 2928622 4044560 3285723 2084722
14609 2084722 3073922 3995255 3556564 3142924 3600923 2794330 581931 -675701 -174513
14600 -174513 683287 -892874 -2766351 -2535749 -2530844 -4022463 -7149636 -8305756 -6790766
$$ packed form
14663C161699o41849j290517j646287j249250q51086O52193O58656p5196M75735
14654h05902k48995m7105j44932j05481O52521Q29848J635224N59060q31521K8664
14644A521381k01647r38234p35725N62423K62258O11503l54552N35632J344593
14635B607632n94840n5322M30509N43029P00493m71614j981799j212087o53401
14626f87400o48184J45659Q16601o94392p92193l15126K35159K58528j164485
14617b845833l20061J184710K200531J658400J050875J115938p58837j201001
14609B084722R89200R21333m38691m13640M57999q06593k212399j257632N01188
14600a74513Q57800j576161j873477K30602M905j491619l127173j156120J514990
$$ plain form
14591 -6790766 -4926568 -3041402 -2490705 -3302576 -4237895 -4774210 -5590776 -4460097 -2794864
14582 -2794864 -773735 387613 1174084 2014057 1712280 1094848 63242 1617312 2406104
14573 2406104 2995306 3923232 3607630 2385191 2099244 1489046 1135690 387840 -673254
14564 -673254 -88551 1359590 2297756 2447628 2068612 2521910 3961688 5670483 6198865
14555 6198865 4433876 1282340 -878541 -1128331 -561294 89310 1892842 1104665 16300
14546 16300 597241 348421 -134672 -1628867 -4297592 -5353122 -3921163 -2926808 -3553073
14537 -3553073 -3095578 -1418515 -366352 -643055 -647579 -372957 -1313669 -2067135 -2736219
14528 -2736219 -2025057 -743718 581303 272158 -538269 1002869 1315302 -42978 -1743808
$$ packed form
14591f790766J864198J885166N50697q11871r35319n36315q16566J130679J665233
14582b794864K021129J161348P86471Q39973l01777o17432j031606J554070P88792
14573B406104N89202R27926l15602j222439k85947o10198l53356p47850j061094
14564f73254N84703J448141R38166J49872l79016M53298J439778J708795N28382
14555F198865j764989l151536k160881k49790N67037O50604J803532p88177j088365
14546A6300N80941k48820m83093j494195k668725j055530J431959R94355o26265
14537c553073M57495J677063J052163k76703m524K74622r40712p53466o69084
14528b736219P11162J281339J325021l09145q10427J541138L12433j358280j700830
$$ plain form
14519 -1743808 -3663418 -4436367 -4026649 -3676858 -2979584 -1451939 -1016897 -1307707 -1364406
14510 -1364406 -817215 -305770 -13595 620267 120024 428952 1556056 820657 517446
14501 517446 -170515 -1501228 -1320591 -1037742 -2097681 -3326623 -4076996 -2979774 -2036568
14492 -2036568 -2642567 -2576231 -3033676 -2312476 -475427 1094434 1218877 615534 436938
14483 436938 905368 1279044 1443072 210158 -1118634 -1745373 -251810 198217 -920602
14474 -920602 -930378 -158903 494606 788921 1360434 574695 -1041769 -1105123 -414989 1047844
14464 1047844 2262926 1070810 997256 2385998 1908666 850088 818919 447708 1310846
14455 1310846 1522480 506546 -686822 -2186587 -2512455 -849683 528952 1192925 999284
$$ packed form
14519a743808j919610p72949M09718L49791O97274J527645M35042k90810n6699
14510a364406N47191N11445K92175O33862n00243L08928J127104p35399l03211
14501E17446o87961j330713J80637K82849j059939j228942p50373J097222R43206
14492b036568o05999O6336m57445P21200J837049J569861J24443o03343j78596
14483D36938M68430L73676J64028j232914j328792o26739J493563M50027j118819
14474i20602r776P71475O53509K94315N71513p85739j616464o3354O90134J462833
14464A047844J215082j192116p3554J388742m77332j058578l1169l71211Q63138
14455A310846K11634j015934j193368j499765l25868J662772J378635O63973j93641
$$ plain form
14446 999284 -611397 -551076 681143 1633929 1642832 1234656 318859 898152 1547593 2435061
14436 2435061 3912263 4732383 4097344 1709079 346101 -1245119 -2818767 -3684489 -2441068
14427 -2441068 -301969 -128811 -688355 -881728 -892130 -24920 -892965 -2607922 -2606445 -3516298
14417 -3516298 -4401776 -3870828 -2119983 -849228 -2079199 -2772569 -1767745 -563680 -821551
14408 -821551 -2128966 -3602785 -3517007 -1655793 -1236047 -1365924 -1579088 -1776540 -1705866
14399 -1705866 -1855232 -157882 1446884 2114049 2320269 2651611 3215568 1836753 -631929
14390 -631929 -2490602 -2163904 -1011707 -691382 -846675 136131 2579099 4522834 5024137
14381 5024137 3940012 4001243 3485567 1948105 1855211 2733049 3797773 3484732 2128848
$$ packed form
14446I99284j610681O0321J232219R52786Q903m08176r15797N79293O49441Q87468
14436B435061J477202Q20120o35039k388265j362978j591220j573648q65722J243421
14427b441068K139099J73158n59544j93373j0402Q67210q68045j714957J477r09853
14417c516298q85478N30948J750845J270755j229971o93370J004824J204065k57871
14408h21551j307415j473819Q5778J861214M19746j29877k13164j97452P0674
14399a705866j49366J697350J604766O67165K06220L31342N63957j378815k468682
14390f31929j858673L26698J152197L20325j55293R82806K442968J943735N01303
14381E024137j084125O1231n15676j537462r2894Q77838J064724l13041j355884
$$ plain form
14372 2128848 1312238 563635 -1075443 -2901987 -4127465 -2452317 312730 2817603
14364 2817603 4760704 5085610 4589183 4081197 1754630 -531536 -102709 680493 452194
14355 452194 597354 2461472 4786411 6820425 7836033 6796902 5428781 3425239
14347 3425239 1750912 197310 -1496794 -2298939 -2172255 -913189 -323407 324616 683513
14338 683513 1175080 1361671 807336 -312144 -944020 27436 1131423 1887184 2748903
14329 2748903 2837562 2794738 1996318 1537453 1978152 2686355 2319395 1914973 1575667 564173
14319 564173 -926551 -2174449 -1744564 168593 976391 -1550839 -3970022 -3805220 -3273234
14310 -3273234 -2818977 -2240614 -1132267 -932149 -1232761 -1201656 -1184387 -1548153 -3224807
$$ packed form
14372B128848q16610p48603j639078j826544j225478J675148K765047K504873
14364B817603J943101L24906m96427n07986k326567k286166M28827P83202k28299
14355D52194J45160J864118K324939K034014J015608j039131j368121k003542
14347C425239j674327j553602j694104q02145J26684J259066N89782O48023L58897
14338F83513M91567J86591n54335j119480o31876R71456J103987P55761Q61719
14329B748903Q8659m2824p98420m58865M40699P08203l66960m04422l39306j011494
14319E64173j490724j247898M29885J913157Q07798k527230k419183J64802N31986
14310c273234M54257N78363J108347K00118l00612L1105J7269l63766j676654
$$ plain form
14301 -3224807 -3919530 -2902438 -1818718 -265923 611103 2097297 2974362 2312205 2036233
14292 2036233 3153997 2999417 2332306 2178771 1924987 1343837 2816756 4125137 3188711
14283 3188711 1976173 1485409 754403 963318 969640 1120099 815054 206430 -213485 298615
14273 298615 1762159 1043984 -762464 -1802751 -1629598 -1795236 -2175281 -2552069 -1992825
14264 -1992825 -182779 -361145 -992551 -642983 -368629 -1299309 -2989277 -3004631 -2637339
14255 -2637339 -1882446 -798321 1653321 3523524 4679050 5474454 4460811 2541739
14247 2541739 3050602 4032428 3301011 2132088 2322636 1450925 280687 -500308 715576
14238 715576 2857675 2980702 1560283 -365274 -834817 59955 906076 -63828 -966394
$$ packed form
14301c224807o94723J017092J083720J552795Q77026J486194Q77065o62157k75972
14292B036233J117764j54580o67111j53535k53784n81150J472919J308381r36426
14283C188711j212538m90764p31006K08915O322J50459l05045o08624m19915N12100
14273B98615J463544p18175j806448j040287J73153j65638l80045l76788N59244
14264a992825J810046j78366o31406L49568K74354r30680j689968j5354L67292
14255b637339P54893J084125K451642J870203J155526P95404j013643j919072
14247B541739N08863R81826p31417j168923J90548q71711j170238p80995J215884
14238G15576K142099J23027j420419j925557m69543Q94772Q46121r69904r02566
$$ plain form
14229 -966394 -1237525 -1238686 -903057 -1174591 -2154281 -1041773 210997 -113307 1510668
14220 1510668 2867332 2329387 2068407 936392 -190823 269331 -70958 -777388 -1644532
14211 -1644532 -2539669 -2186104 -2144614 -2525625 -1590529 -679487 -2736742 -3453602 -3291887
14202 -3291887 -3940003 -2360414 -1782108 -2989964 -3118294 -2364958 -2842515 -2653916 -882095
14193 -882095 1326074 2507188 1342095 -1249081 -2773595 -1359760 -256853 -1488355
14185 -1488355 -3460182 -4916729 -4598539 -2317986 -1320158 -1579155 -424338 326592 -53427
14176 -53427 -1376309 -2129449 -2051908 61491 2170540 3410894 2219395 332351 422868
14167 422868 929263 2007333 3053838 3127503 1150743 853899 979526 997648 1019629 -269804
$$ packed form
14229i66394k71131j161L35629k71534r79690J112508J252770l24304J623975
14220A510668J356664n37945k60980j132015j127215M60154l40289p06430q67144
14211a644532q95137L53565M1490l81011R35096R11042k057255p16860J61715
14202c291887o48116J579589N78306j207856j28330P53336m77557J88599J771821
14193h82095K208169J181114j165093k591176j524514J413835J102907j231502
14185a488355j971827j456547L18190K280553R97828k58997J154817P50930l80019
14176e3427j322882p53140P7541K113399K109049J240354j191499j887044R0517
14167D22868N06395J078070J046505P3665j976760k96844J25627J8122K1981j289433
$$ plain form
14157 -269804 -278483 -1361416 -2307666 -2739258 -1501741 -50541 -59006 -340049 -1903925 -3759499
14147 -3759499 -4145162 -4250004 -4606834 -3097927 -1794189 -1212655 -1606293 -2521962 -2085020
14138 -2085020 -500645 4305 -460625 -839438 -2146219 -2459972 -2320363 -3379939 -3512598
14129 -3512598 -2337837 -1703461 -1763467 -589697 821954 1890022 627534 -1061465 -724395
14120 -724395 -133420 -663593 -2205353 -3368428 -4184122 -4148098 -4070150 -5093068 -6042498
14111 -6042498 -5395137 -4266053 -2810480 -3011950 -4856364 -4402276 -3491052 -3735510 -4160782
14102 -4160782 -3912118 -3094879 -1359447 -127134 327739 425492 781490 1367398 1071994
14093 1071994 1836968 2295777 1988998 1395295 303264 -81486 -1270242 -1736471 -1958013
$$ packed form
14157b69804q679j082933r46250m31592J237517J451200q465k81043j563876j855574
14147c759499l85663j04842l56830J508907J303738N81534l93638r15669M36942
14138b085020J584375N04950m64930l78813j306781l13753J39609j059576j32659
14129c512598J174761O34376o0006J173770J411651J068068j262488j688999L37070
14120g24395N90975n30173j541760j163075q15694L6024P7948j022918r49430
14111f042498O47361J129084J455573k01470j844414M54088R11224k44458m25272
14102d160782K48664Q17239J735432J232313M54873R7753L55998N85908k95404
14093A071994P64974M58809l06779n93703j092031l84750j188756m66229k21542
$$ plain form
14084 -1958013 -1812797 -1357699 -538276 -908132 -2262603 -1673043 -1183159 -2610852 -2701894
14075 -2701894 -1226698 -667099 -699913 -1139824 -2248083 -2485812 -2017143 -1852341 -2313068
14066 -2313068 -2379727 -1527161 -994861 -877105 -712418 234485 1385250 758290 -206132
14057 -206132 -519813 -1086783 -1175432 -762042 -1466078 -3414735 -4059980 -3277917 -3142129 -4500157
14047 -4500157 -3477058 -1280285 909737 2159215 2874048 1910176 493496 192913 -679876
14038 -679876 -2510655 -3284759 -2472434 -1102541 -1085807 -1630739 -1018727 -320048 1104605
14029 1104605 2793765 2151022 988504 1577559 2627469 3128128 1441644 713657 1436457
14020 1436457 1891567 842654 -1901211 -2364950 -2221698 -3030305 -1508730 1482019 2687539
$$ packed form
14084a958013J45216M55098Q19423l69856j354471N89560M89884j427693r1042
14075b701894J475196N59599l2814m39911j108259k37729M68669J64802m60727
14066b313068o6659Q52566N32300J17756J64687R46903J150765o26960r64422
14057b06132l13681n66970q8649M13390p04036j948657o45245P82063J35788j358028
14047d500157J023099K196773K190022J249478P14833r63872j416680l00583q72789
14038f79876j830779p74104Q12325J369893J6734n44932O12012O98679J424653
14029A104605J689160o42743j162518N89055J049910N00659j686484p27987P22800
14020A436457M55110j048913k743865m63739J43252q08607J521575K990749J205520
$$ plain form
14011 2687539 3076015 2833939 2523871 2631481 1606330 437833 548913 -999987 -2104519
14002 -2104519 -2078656 -1447554 -1399301 -45815 1663063 1421890 2341103 3641621 4639616
13993 4639616 5000578 2872150 860946 392365 -337645 -1291718 -335753 20745 -591259
13984 -591259 -1433706 -1443868 79012 1723169 1273412 636384 1486072 2574314 3402362
13975 3402362 2986032 1612828 -562078 -1358214 -1380638 -2695745 -3824888 -4831877 -6011502
13966 -6011502 -4679868 -2933851 -1304121 1061751 1894462 995342 -305042 -1346965
13958 -1346965 -702351 -310775 -2014724 -3777033 -3560662 -1066229 967704 1637375 818458
13949 818458 -671285 -799327 -302547 -1289044 -1840650 -1721719 -1354919 -643891 55125
$$ packed form
14011B687539L88476k42076l10068J07610j025151j168497J11080j548900j104532
14002b104519K5863O31102M8253J353486J708878k41173R19213J300518R97995
13993D639616L60962k128428k011204m68581p30010r54073R55965L56498o12004
13984e91259q42447j0162J522880J644157m49757o37028Q49688J088242Q28048
13975C402362m16330j373204k174906p96136k2424j315107j129143j006989j179625
13966f011502J331634J746017J629730K365872Q32711q99120j300384j041923
13958a346965O44614L91576j703949j762309K16371K494433K033933O69671q18917
13949H18458j489743j28042M96780r86497n51606J18931L66800P11028O99016
$$ plain form
13940 55125 1200467 1612096 1275101 -394513 -2560060 -3258572 -2441575 -2358432 -2685695
13931 -2685695 -3436248 -3517445 -3024638 -1438139 263132 1357244 702543 -1259028 -2522295
13922 -2522295 -2811703 -3245706 -3676108 -2212690 -1217519 450155 2195724 2381303 547878
13913 547878 -940819 -2107930 -1591194 506161 2727629 4139099 3019812 1269976
13905 1269976 -325851 -481012 -247549 -67962 706682 1331747 1278207 73625 -154002
13896 -154002 715979 1983076 2471149 1106955 -309227 -716769 -1359629 -2462401 -2919848
13887 -2919848 -1647311 1146667 2139259 3409863 2689561 467331 -1803641 -2908855
13879 -2908855 -1155040 390503 625739 678363 -2195 -738455 -451750 -803654 -1549276
$$ packed form
13940E5125J145342M11629l36995j669614k165547o98512Q16997Q3143l27263
13931b685695p50553q1197M92807J586499J701271J094112o54701j961571j263267
13922b522295k89408m34003m30402J463418R95171J667674J745569J85579j833425
13913E47878j488697j167111N16736K097355K221468J411470j119287j749836
13905A269976j595827j55161K33463J79587P74644O25065n3540j204582k27627
13896a54002Q69981J267097M88073j364194j416182m07542o42860j102772m57447
13887b919848J272537K793978R92592J270604p20302k222230k270972j105214
13879b908855J753815J545543K35236N2624o80558p36260K86705l51904p45622
$$ plain form
13870 -1549276 -1870127 -694493 309593 92065 -459753 -1007897 26840 668714 894384
13861 894384 2382611 3555002 2485942 815656 -329135 -1928262 -2358888 -1052601
13853 -1052601 -75397 463182 -709611 -1815544 -2233536 -3160889 -3750357 -4282454 -3392671
13844 -3392671 -688130 2018556 3232483 2608748 882757 940781 3034418 2702688 244779
13835 244779 -1734518 -2341955 -3513720 -2699539 40395 1653485 3099611 2977888 2330222
13826 2330222 720123 220313 686731 -428508 -1612694 -604698 1556077 1647680 1952930
13817 1952930 2876353 1617963 -273829 -2382493 -3449931 -880705 1469232 3365879
13809 3365879 3618997 3057252 1642202 1149018 2176996 1806940 130214 -392840 462716
$$ packed form
13870a549276l20851J175634J004086k17528n51818n48144J034737O41874K25670
13861H94384J488227J172391j069060j670286j144791j599127m30626J306287
13853a052601R77204N38579j172793j105933m17992r27353n89468n32097Q89783
13844c392671K704541K706686J213927o23735j725991N8024K093637l31730k457909
13835B44779j979297o07437j171765Q14181K739934J613090J446126j21723o47666
13826B330222j610099m99810M66418j115239j184186J007996K160775R1603L05250
13817A952930R23423j258390j891792k108664j067438K569226K349937J896647
13809C365879K53118n61745j415050m93184J027978l70056j676726n23054Q55556
$$ plain form
13800 462716 1061303 1625077 2076852 1781041 279951 -522593 -494212 365158 295279 -1101562
13790 -1101562 -1633328 -1576519 436512 2597351 2543619 1124079 -541235 177629 1784251
13781 1784251 2387627 2504539 2110465 2018071 2492818 1692699 -787728 -2571125 -3857568
13772 -3857568 -5022447 -4008165 -1635589 1160053 2945039 2784163 2563104 2395400 1929476
13763 1929476 1202585 -1004411 -2806822 -3263259 -4292283 -4900586 -3356443 -1267278 -46922
13754 -46922 516916 -142863 -1578825 -1460408 -1426190 -2181476 -2080673 -1999147 -1029127 -6440
13744 -6440 1307917 2145226 2200719 664712 -1276319 -2391398 -2436826 -1430835 -66875
13735 -66875 1072426 842360 83407 1348809 2075310 1144997 -448028 -952367 -1319714
$$ packed form
13800D62716N98587N63774M51775k95811j501090q02544K8381Q59370o9879j396841
13790a101562n31766N6809K013031K160839n3732j419540j665314P18864J606622
13781A784251O03376J16912l94074r2394M74747q00119k480427j783397j286443
13772c857568j164879J014282K372576K795642J784986j60876k21059j67704m65924
13763A929476p26891k206996j802411m56437j029024o08303J544143K089165J220356
13754d6922N63838o59779j435962J18417L4218p55286J00803Q1526R70020J022687
13744f440J314357Q37309N5493j536007j941031j115079m5428J005991J363960
13735f6875J139301k30066p58953J265402P26501r30313j593025n04339l67347
$$ plain form
13726 -1319714 -2077285 -2324102 -734948 1064287 1229433 819948 -1084872 -2231753 -1589059
13717 -1589059 -1049356 -1810835 -1926843 -1063502 -1267903 -1357680 -542600 13678 -181072 439085
13707 439085 1554708 1266762 457596 383597 1200345 178963 -812728 -1127662 -2282966
13698 -2282966 -3258017 -2391928 -2251875 -3464946 -3774578 -2748399 -1124439 -775749 -1576652
13689 -1576652 -2119501 -3152030 -2511815 -2097962 -3085037 -2212289 -1194309 -1187210 -1438759
13680 -1438759 -2602592 -2690558 -2207762 -2572457 -1661639 -1255478 -1331536 42090 1857792
13671 1857792 2259554 1227562 -418369 -1106861 -200183 -1003706 -3162210 -3477665 -1678546
13662 -1678546 -488871 -1069335 -2168127 -2348072 -3446995 -4739147 -4429770 -4471567 -4628714
$$ packed form
13726a319714p57571k46817J589154J799235J65146m09485j904820j146881O42694
13717a589059N39703p61479j16008Q63341k04401q9777Q15080N56278j94750O20157
13707D39085J115623k87946q09166p3999Q16748j021382r91691l14934j155304
13698b282966r75051Q66089J40053j213071l09632J026179J623960L48690q00903
13689a576652n42849j032529O40215M13853r87075Q72748J017980P099k51549
13680a438759j163833q7966M82796l64695R10818M06161p6058J373626J815702
13671A857792M01762j031992j645931o88492R06678q03523k158504l15455J799119
13662a678546J189675n80464j098792j79945j098923j292152L09377m1797j57147
$$ plain form
13653 -4628714 -3222872 -1867537 -665832 179511 -389382 917797 1614076 777876 495165
13644 495165 669167 1521726 1675129 1822903 2354440 2483251 2399243 1613210 630829 683717
13634 683717 1650264 383002 -569371 -635248 1166607 3738642 3660791 1520244 -220072
13625 -220072 -170042 300923 318695 1609951 2237127 2260752 2940278 2689100 2552933 1588144
13615 1588144 1063544 411348 199277 -992986 -2955187 -3380242 -3680403 -2060374 587167
13606 587167 502124 -574288 3380 738456 -150478 -536721 385818 1056796 48205
13597 48205 -1936582 -4041626 -6547393 -6865692 -4380377 -2076916 -710733 -506894 -1505875
13588 -1505875 -2309614 -1520670 -623020 -598844 331726 1229505 1241683 1820046 1491894 -104380
$$ packed form
13653d628714J405842J355335J201705Q45343n68893J307179O96279q36200k82711
13644D95165J74002Q52559J53403J47774N31537J28811q4008p86033r82381N2888
13634F83717R66547j267262r52373o5877J801855K572035p7851k140547j740316
13625b20072N0030M70965J7772J291256O27176K3625O79526k51178j36167r64789
13615A588144n24600o52196k12071j192263j962201m25055l00161J620029K647541
13606E87167q5043j076412N77668P35076q88934l86243R22539O70978j008591
13597D8205j984787k105044k505767l18299K485315K303461J366183K03839r98981
13588a505875q03739P88944Q97650K4176R30570Q97779J2178N78363l28152j596274
$$ plain form
13578 -104380 -1401431 -1536979 -457854 549051 256539 -441217 -171859 252935 1228590
13569 1228590 1514138 362948 184670 720833 1353200 450308 755997 2763041 4285844
13560 4285844 4808353 2474022 -568136 -433931 1236659 2903660 3901729 4074831 3358832
13551 3358832 3658841 4767876 4989718 4557768 2943145 1640158 1800721 2311841 1982241
13542 1982241 1212299 2305432 3891505 2522096 279961 860261 1913558 2169903 2334453
13533 2334453 1966599 1276498 351666 -424722 -1318331 -2183488 -3678767 -4780657 -4817952
13524 -4817952 -4249266 -3493051 -2824581 -2038500 -1768738 -1804035 -2333979 -2457518 -869632
13515 -869632 938851 -89366 -409939 1734922 3296485 2630960 1289155 5091 -629259
$$ packed form
13578a04380j297051j35548J079125J006905k92512o97756K69358M24794R75655
13569A228590K85548j151190j78278N36163O32367r02892L05689K007044J522803
13560D285844N22509k334331l042158J34205J670590J667001R98069J73102p15999
13551C358832L00009J109035K21842m31950j614623j302987J60563N11120l29600
13542A982241p69942J093133J586073j369409k242135N80300J053297K56345J64550
13533B334453l67854o90101r24832p76388q93609q65157j495279j101890l7295
13524d817952N68686P56215O68470P86081K69762l5297n29944j23539J587886
13515h69632J808483j028217l20573K144861J561563o65525j341805j284064o34350
$$ plain form
13506 -629259 -702409 -582561 -482029 -86358 -573247 -1211522 -1586493 386585 1136514 1887362
13496 1887362 2923914 3482866 2271863 1147551 988955 1994228 3263698 3845610 2748581
13487 2748581 1157537 1629009 1843501 398647 -586637 -201635 117923 -187704 389924
13478 389924 1085089 1189153 934753 1653745 3001140 1346921 96537 1263433 1957168
13469 1957168 1894564 3142074 2476508 325686 -1339217 -861663 -511318 -589192 -126059
13460 -126059 -1186000 -1943175 -952833 696802 1295260 1715421 2575999 2205691 1368410
13451 1368410 -9291 623127 2083662 394953 -2207753 -1372772 73860 -2234973
13443 -2234973 -3700326 -3646190 -4330270 -2738702 -1132389 -1063456 -1524909 -1602556 -287706
$$ packed form
13506f29259p3150J19848J00532L95671m86889o38275l74971J973078P49929P50848
13496A887362J036552N58952j211003j124312j58596J005273J269470N81912j097029
13487B748581j591044M71472K14492j444854r85284L85002L19558l05627N77628
13478C89924O95165J04064k54400P18992J347395j654219j250384J166896O93735
13469A957168o2604J247510o65566k150822j664903M77554L50345p7874M63133
13460a26059j059941p57175R90342J649635N98458M20161Q60578l70308q37281
13451A368410j377701O32418J460535j688709k602706Q34981J446632k308833
13443b234973j465353N4136o84080J591568J606313O8933m61453p7647J314850
$$ plain form
13434 -287706 421761 -149251 -175004 455870 1294602 950927 -322271 -1210267 -2053283 -3083165
13424 -3083165 -2914633 -1802346 72853 1182261 871484 296212 -1020592 -1938830 -2348963
13415 -2348963 -2949611 -1806417 -694023 245592 625098 404971 -268579 -931098 -1029510
13406 -1029510 -1680116 -542204 326389 -1123866 -1685402 -1767944 -1324812 -226488 402670
13397 402670 581099 2848216 4610639 3247320 1956253 1223814 -282427 473018 986322
13388 986322 1564036 1865834 1021192 634588 -37994 -112544 1524990 2305081 1026886
13379 1026886 349662 368765 -211187 -959701 130837 1538556 1494686 1321258 1888345
13370 1888345 1447782 947690 2001073 2131037 1019540 -266313 -512675 -277272 813471
$$ packed form
13434b87706P09467n71012k5753O30874Q38732l43675j273198q87996q43016j029882
13424c083165J68532J112287J875199J109408l10777n75272j316804r18238m10133
13415b348963o00648J143194J112394R39615L79506k20127o73550o62519r8412
13406a029510o50606J137912Q68593j450255n61536q2542M43132J098324O29158
13397D02670J78429K267117J762423j363319j291067p32439j506241P55445N13304
13388I86322N77714L01798q44642l86604o72582p4550J637534P80091j278195
13379A026886o77224J9103n79952p48514J090538J407719m3870j73428N67087
13370A888345m40563n00092J053383J29964j111497j285853k46362K35403J090743
$$ plain form
13361 813471 2256643 3292253 2230203 441403 -848319 -2311820 -3300724 -3096435 -3282400
13352 -3282400 -3079225 -2730614 -1727716 -99304 776757 247723 -711433 -1466986 -1508027
13343 -1508027 -248180 622152 -220243 -149268 2573290 2914497 2761727 2657323 1484895
13334 1484895 1200432 1731691 2478066 2551522 2180940 1325619 -761387 -3395186 -3876450
13325 -3876450 -2514395 -199906 2208478 4026085 4387055 3574827 2571947 1844223 2419860
13316 2419860 1576020 -327365 -1310625 -2425828 -2594808 -2594972 -3619824 -3554001 -1512636
13307 -1512636 -497720 17587 -499727 -726017 -316893 -294267 -965139 -2524369 -3209946
13298 -3209946 -2824692 -3544040 -4177813 -2916202 -803406 416326 794643 574306 493619
$$ packed form
13361H13471J443172J035610j062050j788800j289722j463501r88904K04289j85965
13352c282400K03175L48611J002898J628412Q76061n29034r59156p55553m1041
13343a508027J259847Q70332q42395P0975K722558L41207j52770j04404j172428
13334A484895k84463N31259P46375P3456l70582q55321k087006k633799m81264
13325c876450J362055K314489K408384J817607L60970q12228j002880p27724N75637
13316B419860q43840j903385r83260j115203j68980j64j024852O5823K041365
13307a512636J014916N15307n17314k26290M09124K2626o70872j559230o85577
13298c209946L85254p19348o33773J261611K112796J219732L78317k20337q0687
$$ plain form
13289 493619 -25874 -32874 -103117 204897 -818577 -2110474 -1305147 790665 2608789
13280 2608789 3648905 4242982 4688438 5330920 4375641 2164797 1181153 1342957 539828
13271 539828 1817713 3735308 3986097 3009486 2162163 1403462 681348 299310 -171186
13262 -171186 -463961 680249 927729 -920443 -1920227 -2047921 -3279265 -5328216 -4821018
13253 -4821018 -1774079 -691162 -652599 -1244330 -1426870 -66449 1842266 2788778 3821466
13244 3821466 4259137 4010253 2235778 -444208 -2628179 -2602138 -2032980 -1733061 -1518905
13235 -1518905 -1060102 -830606 -1894069 -2280005 -518693 198569 1283195 1915916 866480
13226 866480 1041039 1542016 1444905 1579605 1452854 13694 -833082 -550046 415101 881192
$$ packed form
13289D93619n19493p000p0243L08014j023474j291897Q05327K095812J818124
13280B608789J040116N94077M45456O42482r55279k210844r83644J61804q03129
13271E39828J277885J917595K50789r76611q47323p58701p22114l82038m70496
13262a71186k92775J144210K47480j848172r99784j27694j231344k048951N07198
13253d821018L046939J082917L8563n91731j82540J360421J908715R46512J032688
13244C821466M37671k48884j774475k679986k183971K6041N69158K99919K14156
13235a518905M58803K29496j063463l85936J761312P17262J084626O32721j049436
13226H66480J74559N00977r7111J34700j26751j439160q46776K83036R65147M66091
$$ plain form
13216 881192 612722 736609 791094 636537 -11694 -667164 -981780 -1446894 -1717841 -1649975
13206 -1649975 -2097782 -1621258 -152217 -338535 -1475738 -2276347 -1815518 -948969 -1142787
13197 -1142787 -970405 -1114545 -1314119 -1688971 -1383939 520950 1826459 2600948 4017529
13188 4017529 5502935 4636435 2508627 1650160 1158583 385760 1171206 1981493 1515839
13179 1515839 1814579 2300389 1895563 2458483 3346847 4161098 4867224 4802575 4219108 4185695
13169 4185695 5186280 6295231 5127540 3112312 1716672 2035479 2155143 2860944 4608038
13160 4608038 4204189 3635135 3731041 3665579 3025308 3817134 4436383 3106894 2545437 3720486
13150 3720486 3334763 2130480 1936181 1088331 956527 1926108 1214030 1086974 2632512
$$ packed form
13216H81192k68470J23887N4485j54557o48231o55470l14616m65114k70947O7866
13206a649975m47807M76524J469041j86318j137203q00609M60829Q66549j93818
13197a142787J72382j44140j99574l74852L05032J904889J305509P74489J416581
13188D017529J485406q66500k127808q58467m91577p72823P85446Q10287m65654
13179A515839K98740M85810m04826N62920Q88364Q14251P06126o4649n83467l3413
13169D185695J000585J108951j167691k015228j395640L18807J19664P05801J747094
13160D608038m03849n69054R5906o5462o40271P91826O19249j329489n61457J175049
13150C720486l85723j204283j94299q47850j31804R69581p12078j27056J545538
$$ plain form
13141 2632512 4994942 6333297 5550542 4105055 3273290 3251890 2856367 3032683 2651041
13132 2651041 1279439 685654 702607 870075 1155482 -2759 509413 1279392 132496
13123 132496 -1326928 -1925436 -1635740 -780058 402067 1461245 2799931 3420623 4098205
13114 4098205 3571892 2105519 1246104 -398648 -1266638 -1374767 -1937126 -1323269 -324172
13105 -324172 2034547 3073384 2146678 1563689 657242 -632502 -1310830 -1054626 -339480
13096 -339480 680899 1642781 1582324 218011 -917082 -760660 176826 1164845 1501405
13087 1501405 1043668 1388146 2069093 2171554 3050301 2074240 330494 -798839 -973902
13078 -973902 -281287 -2329 -812160 -446208 609998 1727349 1664488 1793915 1165799
$$ packed form
13141B632512K362430J338355p82755j445487q31765k1400l95523J76316l81642
13132B651041j371602n93785J6953J67468K85407j158241N12172P69979j146896
13123A32496j459424n98508K89696Q55682J182125J059178J338686O20692O77582
13114D098205n26313j466373q59415j644752q67990j08129n62359O13857R99097
13105c24172K358719J038837r26706n82989r06447j289744o78328K56204P15146
13096c39480J020379R61882o0457j364313j135093J56422R37486R88019L36560
13087A501405m57737L44478O80947J02461Q78747r76061j743746j129333j75063
13078i73902O92615K78958q09831L65952J056206J117351o2861J29427o28116
$$ plain form
13069 1165799 -1700945 -2841835 -1846370 -2393895 -2462503 -1761724 -1160768 155672 967155
13060 967155 1373110 1727831 3222804 5087189 6457802 6418257 6257939 5607365 4139922
13051 4139922 3452047 3187087 1590329 316988 -211037 1122545 3934556 5756275 6250574
13042 6250574 5799922 5541717 6929686 8560238 9137698 8981736 8752357 9014422 9559471
13033 9559471 8474393 7247068 7887613 8215565 7776400 7912024 9285706 10162453 9516695
13024 9516695 8993668 8254371 6815134 6782682 8196559 9398885 8929817 9097273 10888642
13015 10888642 11924964 12157180 13622652 15810636 16866236 16958687 17548953 18789525 19677631
13006 19677631 20630703 22784149 25847347 28583564 31321650 35949397 40988190 45745221
$$ packed form
13069A165799k866744j140890R95465n47525o8608P00779O00956J316440Q11483
13060I67155M05955L54721J494973J864385J370613l9545j60318o50574j467443
13051D139922o87875k64960j596758j273341n28025J333582K812011J821719M94299
13042F250574m50652k58205J387969J630552N77460j55962k29379K62065N45049
13033I559471j085078j227325O40545L27952m39165J35624J373682Q76747o45758
13024I516695n23027p39297j439237l2452J413877J202326m69068J67456J791369
13015A0888642J036322K32216J465472K187984J055600R2451N90266J240572Q88106
13006A9677631R53072K153446L063198K736217K738086M627747N038793M757031
$$ plain form
12998 45745221 52945952 62614222 75156819 89013971 105824287 128397670 153731761
12991 153731761 187034901 230152946 283662635 349094688 420071040 481239602 506355928
12984 506355928 477380228 407931739 331174447 266068444 214693028 174142887 142537258
12977 142537258 118381263 100130303 84673779 71674840 61988764 56204711 52842186
12970 52842186 48875528 42767156 35881892 30913175 27928094 26248479 24461494 22291611
12962 22291611 20231519 19041713 18324226 17422833 17653101 17195171 15476850 14380367 13716588
12953 13716588 13609693 13364914 13559624 11671229 9329308 8357158 8773142 9394037 9210771
12944 9210771 9582169 11537381 13440378 14360980 13746129 12389848 10141656 7701833 7797220
$$ packed form
12998D5745221P200731R668270J2542597J3857152J6810316K2573383K5334091
12991A53731761L3303140M3118045N3509689O5432053P0976352O1168562K5116326
12984E06355928k8975700o9448489p6757292o5106003n1375416m0550141l1605629
12977A42537258k4155995j8250960j5456524j2998939r686076n784053l362525
12970E2842186l966658o108372o885264m968717k985081j679615j786985k169883
12962B2291611k060092j189806p17487r01393K30268m57930j718321j096483o63779
12953A3716588j06895k44779J94710j888395k341921r72150M15984O20895j83266
12944I210771L71398J955212J902997R20602o14851j356281k248192k439823R5387
$$ plain form
12935 7797220 8760008 9894339 11438534 13312308 14592374 15543225 16742045 16759742 17160927
12926 17160927 18593916 20111210 21611909 20650299 19795340 20723896 21556521 22045434 23653587
12917 23653587 25794326 28029350 31241588 37452641 43896280 49572717 56682548 66883591
12909 66883591 79119803 91752975 107319236 125732698 150219779 183064820 227244634
12902 227244634 285841191 356477494 432659957 497665409 524877553 492833333 417364960
12895 417364960 334092173 263416875 208931898 167345669 136531827 114212405 96100887
12888 96100887 81773052 69966649 61359026 54135095 49047581 43725396 38196818 33912233
12880 33912233 29104247 24986563 22442941 22021116 21681418 20106124 19131843 18288163 16575111
$$ packed form
12935G797220R62788J134331J544195J873774J280066R50851J198820J7697M01185
12926A7160927J432989J517294J500699r61610q54959R28556Q32625M88913J608153
12917B3653587K140739K235024L212238O211053O443639N676437P109831J0201043
12909F6883591J2236212J2633172J5566261J8413462K4487081L2845041M4179814
12902B27244634N8596557P0636303P6182463O5005452K7212144l2044220p5468373
12895D17364960q3272787p0675298n4484977m1586229l0813842k2319422j8111518
12888I6100887j4327835j1806403q607623p223931n087514n322185n528578m284585
12880C3912233m807986m117684k543622m21825l39698j575294r74281q43680j713052
$$ plain form
12871 16575111 16234739 16246360 16247370 15397538 13209812 12111474 11005971 10448978 10577757
12862 10577757 9543458 7945132 7128794 6439360 4793528 4986386 6514279 7148871 6824564
12853 6824564 7557287 8204456 7457814 8002783 9241775 11167114 13362949 14147905 13441931
12844 13441931 12383176 12069065 11837650 11542973 11253051 10978124 11194341 11770859 12709004
12835 12709004 13764619 16526489 19216128 21046904 23876982 26328872 28213804 30059133
12827 30059133 33324101 39752337 47597421 55350759 63966189 75712731 91159063 108448091
12819 108448091 127985067 152975163 185918307 228822317 283730790 351201652 424226335
12812 424226335 485411464 509042179 476941239 404748935 324205222 254870887 201812071
$$ packed form
12871A6575111l40372J1621J010q49832k187726j098338j105503n56993J28779
12862A0577757j034299j598326q16338o89434j645832J92858J527893O34592l24307
12853F824564P32723O47169p46642N44969J238992J925339K195835P84956p05974
12844A3441931j058755l14111k31415k94677k89922k74927K16217N76518R38145
12835A2709004J055615K761870K689639J830776K830078K451890J884932J845329
12827C0059133L264968O428236P845084P753338Q615430J1746542J5446332J7289028
12819A08448091J9536976K4990096L2943144M2904010N4908473O7470862P3024683
12812D24226335O1185129K3630715l2100940p2192304q0543713o9334335n3058816
$$ plain form
12805 201812071 163295837 133043165 110789824 93978422 80171997 69304638 59276932
12798 59276932 51173513 45844723 41602203 36939314 32827569 28982715 25107331 21904336
12790 21904336 20293530 19047657 17703532 15738490 13586356 11826613 10288642 8601791
12782 8601791 8584433 8058285 7789696 9178966 9036291 8839756 9422323 9821704 9042570
12773 9042570 7850954 8137237 9213427 10683229 10673348 9311378 7459487 6339070 4718222
12764 4718222 4349262 3946061 3977946 4944411 5311622 5834585 4824375 3800166 3768964
12755 3768964 3213262 2627206 1584040 -89691 -787009 -674074 484078 1182647 1710649
12746 1710649 790883 -980725 -1805275 -2639501 -2014366 -2018025 -978516 1193670 1094748
$$ packed form
12805B01812071l8516234l0252672k2253341j6811402j3806425j0867359j0027706
12798E9276932q103419n328790m242520m662889m111745l844854l875384l202995
12790B1904336j610806j245873j344125j965042k152134j759743j537971j686851
12782H601791j7358n26148k68589J389270j42675j96535N82567L99381p79134
12773I042570j191616K86283J076190J469802r881j361970j851891j120417j620848
12764D718222l68960m03201L1885R66465L67211N22963j010210j024209l1202
12755C768964n55702n86056j043166j673731o97318J12935J158152O98569N28002
12746A710649r19766j771608q24550q34226O25135l659J039509K172186r8922
$$ plain form
12737 1094748 460943 651641 1398514 1655306 911414 -538358 -1201132 -6884 502881
12728 502881 534413 1198891 2351838 3129749 2614894 3191826 4016720 2899236 1875194
12719 1875194 623700 770937 1411457 910593 1335265 1974239 1403317 1188191 3009767
12710 3009767 4878265 4584277 3039867 2372593 1942894 1760857 1726359 910548 831884
12701 831884 2001567 2766554 3260999 2933847 1490158 407043 675237 2078480 2430956
12692 2430956 2274589 -100012 -4236557 -4331666 -2691545 -2451388 -2599355 -1674493 -960959
12683 -960959 -655128 -1866426 -2667170 -2223686 -932177 635019 923834 1170940 2541863
12674 2541863 1478361 717928 655922 962216 1346692 -689674 -3636157 -3752067 -1778541
$$ packed form
12737A094748o33805J90698P46873K56792p43892j449772o62774J194248N09765
12728E02881L1532O64478J152947P77911n14855N76932Q24894j117484j024042
12719A875194j251494J47237O40520n00864M24672O38974n70922k15126J821576
12710C009767J868498k93988j544410o67274m29699j82037l4498q15811p8664
12701H31884J169683P64987M94445l27152j443689j083115K68194J403243L52476
12692B430956j56367k374601m136545r5109J640121K40157j47967R24862P13534
12683i60959L05831j211298q00744M43484J291509J567196K88815K47106J370923
12674B541863j063502p60433o2006L06294L84476k036366k946483j15910J973526
$$ plain form
12665 -1778541 -612911 -279692 360560 660651 -1153349 -3252099 -5173755 -6190764 -5133752
12656 -5133752 -3735750 -2463687 -1083539 -135147 -499606 -807406 -951757 -1041380 -387183
12647 -387183 385246 244663 345084 514776 487699 1124115 615566 -211602 1120715 2630954
12637 2630954 2441825 1614960 1603715 2354672 1273532 -1515798 -2155941 -1102329 385283
12628 385283 1165764 712233 959850 1122442 628777 -640709 -3513386 -4127759 -2939662
12619 -2939662 -2326560 -2489719 -1381647 556341 1966481 2990984 3430818 3133007 1955643
12610 1955643 285108 -939994 229607 1696428 1522198 -641355 -2804206 -2612474
12602 -2612474 -3276583 -4609214 -4192647 -2811138 -1226302 -2041534 -2950257 -3585574 -3843039
$$ packed form
12665a778541J165630L33219O40252L00091j814000k098750j921656j017009J057012
12656e133752J398002J272063J380148R48392l64459l07800j44351q9623O54197
12647c87183P72429j40583J00421J69692k7077O36416n08549q27168J332317J510239
12637B630954j89129q26865j1245P50957j081140k789330o40143J053612J487612
12628C85283P80481m53531K47617J62592m93665j269486k872677o14373J188097
12619b939662O13102j63159J108072J937988J410140J024503M39834k97811j177364
12610A955643j670535j225102J169601J466821j74230k163553k162851J91732
12602b612474o64109j332631M16567J381509J584836q15232r08723o35317k57465
$$ plain form
12593 -3843039 -3398632 -3147822 -2920503 -3027882 -4332102 -4727829 -2630818 -1459522 -2420253
12584 -2420253 -1780169 418455 409543 -1877442 -2517834 -2549715 -3055135 -2488093 -1535997 -1547032
12574 -1547032 -2145666 -1175794 -920257 55984 1373732 1089434 1334593 2742958 3751402
12565 3751402 2368484 121810 -1061953 -1368307 -1443628 -2343959 -3368685 -3388437 -1561979
12556 -1561979 -56954 522961 171382 -1641839 -3583283 -3581898 -3042608 -2019605 -2356264
12547 -2356264 -2627049 -2217147 -2297665 -1984727 -1689174 -619816 -705996 -1537738 -2386359 -2626289
12537 -2626289 -1344598 -165131 652834 975933 985155 -324598 -2028609 -2509271 -1977380
12528 -1977380 -1348826 -1966205 -2079611 -1753417 -1572109 -35922 2023845 3223463 3181251
$$ packed form
12593c843039M44407K50810K27319j07379j304220l95727K097011J171296r60731
12584b420253O40084K198624q912k286985o40392l1881n05420N67042R52096j1035
12574a547032n98634R69872K55537R76241J317748k84298K45159J408365J008444
12565C751402j382918k246674j183763l06354p5321r00331j024726j9752J826458
12556a561979J505025N79915l51579j813221j941444J385N39290J023003l36659
12547b356264k70785M09902q0518L12938K95553J069358q6180q31742q48621k39930
12537b626289J281691J179467Q17965L23099R222j309753j704011m80662N31891
12528a977380O28554o17379j13406L26194J81308J536187K059767J199618m2212
$$ plain form
12519 3181251 2847493 3710002 3999658 3217715 1664725 3627 -1412534 -2127143 -1519728
12510 -1519728 -1949847 -3482247 -3564942 -2724755 -2207781 -1257579 -1062152 -1348381 -2550654
12501 -2550654 -3043305 -2690789 -2335688 -1377010 -1148460 -1176940 -590757 1113913 2383685
12492 2383685 3172155 2274727 -938784 -2385498 -1805572 -1690579 -803499 -947073 -2119454
12483 -2119454 -1414643 101065 -193448 61401 1538925 2472502 3099430 5319568 5219699
12474 5219699 2155623 203679 -187852 1337007 1638500 316355 103540 1019472 923759
12465 923759 -296463 -432301 292112 -255052 -1735469 -1404352 -638584 940737 3356613
12456 3356613 4236820 3345979 2682788 1946866 2178523 3415190 3609438 3950473 4711235
$$ packed form
12519C181251l33758Q62509K89656p81943j552990j661098j416161p14609O07415
12510a519728m30119j532400q2695Q40187N16974R50202J95427k86229j202273
12501b550654m92651L52516L55101R58678K28550k8480N86183J704670J269772
12492B383685P88470q97428l213511j446714N79926J14993Q87080j43574j172381
12483b119454P04811J515708k94513K54849J477524R33577O26928K220138r9869
12474E219699l064076j951944l91531J524859L01493j322145k12815R15932r5713
12465I23759j220222j35838P24413n47164j480417L31117P65768J579321K415876
12456C356613Q80207q90841o63191p35922K31657J236667J94248L41035P60762
$$ plain form
12447 4711235 3963145 3632387 4173111 5062533 4785938 3820815 4114633 4696177 4412106
12438 4412106 3855605 4699774 4274698 2700020 1548673 243915 220278 914895 1507993
12429 1507993 238153 -1943719 -4319328 -5210843 -4946345 -4636078 -3784349 -3129489 -1795445
12420 -1795445 404628 3257890 4453000 4009022 3212041 2062897 1667905 2153351 2015405
12411 2015405 1703546 1750359 1155231 779056 977876 859336 873545 257255 -1128994 -1051081
12401 -1051081 1020926 2648414 2606939 1495082 -87143 -2294072 -1729592 899338 1337410
12392 1337410 889741 1719301 2722976 2304515 2145944 2844316 1194448 403798 1744895
12383 1744895 1492440 1067182 2236040 2577407 2421366 2713537 3277166 2739420 2470560
$$ packed form
12447D711235p48090l30758N40724Q89422k76595r65123K93818N81544k84071
12438D412106n56501Q44169m25076j574678j151347j304758k3637O94617N93098
12429A507993j269840k181872k375609q91515K64498L10267Q51729O54860J334044
12420a795445K200073K853262J195110m43978p96981j149144l94992M85446j37946
12411B015405l11859M6813n95128l76175J98820j18540J4209o16290j386249P7913
12401a051081K072007J627488m1475j111857j582225k206929N64480K628930M38072
12392A337410m47669Q29560J003675m18461j58571O98372j649868p90650J341097
12383A744895k52455m25258J168858L41367j56041K92171N63629n37746k68860
$$ plain form
12374 2470560 2355887 386771 -1178590 -1034651 -797215 -271351 1017073 1504904 296460
12365 296460 -1105600 -2082325 -1586599 420235 1420675 1244398 -365348 -1381924 -1541881
12356 -1541881 -100727 1470021 1517042 112798 435237 1785467 2299748 2550553 2603817
12347 2603817 2273379 1845330 1474023 211774 -351405 -517630 -762436 -521273 -1073870
12338 -1073870 -2129711 -1377982 -275163 792881 2149198 2785083 1911723 1421093 1272734
12329 1272734 1461415 890093 833923 2050341 1690830 1500859 2083648 1345168 1816935
12320 1816935 3013105 1566376 -725936 -3426885 -4068935 -3147238 -2007896 -1476323 -2551699
12311 -2551699 -4101862 -5006639 -4010485 -1064411 -732158 -1496437 -288211 378438 1305053
$$ packed form
12374B470560j14673j969116j565361J43939K37436N25864J288424M87831j208444
12365B96460j402060r76725M95726K006834J000440j76277j609746j016576j59957
12356a541881J441154J570748M7021j404244L22439J350230N14281K50805N3264
12347B603817l30438m28049l71307j262249n63179j66225k44806K41163n52597
12338a073870j055841P51729J102819J068044J356317O35885q73360m90630j48359
12329A272734J88681n71322n6170J216418l59511j89971N82789p38480M71767
12320A816935J196170j446729k292312k700949o42050R21697J139342N31573j075376
12311b551699j550163r04777R96154K946074L32253p64279J208226O66649R26615
$$ plain form
12302 1305053 2277676 1335442 -776809 -2221483 -2354600 -1851346 -2230579 -3939491 -5032961
12293 -5032961 -4002922 -2159789 -1043078 746054 1737831 735814 -866715 -1454312
12285 -1454312 -1253398 -1098077 -554364 -289248 711501 1932457 2242434 2266071 2158093
12276 2158093 1917664 2345053 2737615 1638246 87058 -484700 602322 1337940 1628
12267 1628 -1844657 -875338 708848 1597462 2134704 1877612 1160243 1604942 2481273 2807211
12257 2807211 1364285 624205 155026 1411987 2628026 2693820 2767948 1749068 488404
12248 488404 -566657 -792367 43799 1642385 2523172 2131380 1636448 2029360 4022497
12239 4022497 5694043 4826066 5125672 6011017 3928105 1232254 -136996 -145572 432184
$$ packed form
12302A305053R72623r42234k112251j444674j33117N03254l79233j708912j093470
12293e032961J030039J843133J116711J789132R91777j002017j602529n87597
12285a454312K00914J55321N43713K65116J000749J220956L09977K3637j07978
12276B158093k40429M27389L92562j099369j551188n71758J087022P35618j336312
12267A628j846285R69319J584186Q88614N37242k57092p17369M44699Q76331L25938
12257B807211j442926p40080m69179J256961J216039O5794P4128j018880j260664
12248D88404j055061k25710Q36166J598586Q80787l91792m94932L92912J993137
12239D022497J671546q67977K99606Q85345k082912k695851j369250q576N77756
$$ plain form
12230 432184 -202809 -181878 -614800 -1785348 -2337293 -669928 1506337 1502991 689198 1350003
12220 1350003 1536250 1543544 683183 659971 1477130 209406 -2849521 -4813310 -4941542
12211 -4941542 -4895915 -4988893 -4176509 -2640401 -2241619 -2901689 -3547306 -3575341 -2335814 -1950931
12201 -1950931 -3031717 -3231619 -2921597 -2719893 -1928736 -739122 -69726 -286735 -342251
12192 -342251 -698877 -1502298 -487648 1263847 1216652 1248341 1888987 1522802 12008
12183 12008 -1165391 -486652 354755 604309 -279768 98517 621266 1987120 4205445
12174 4205445 3969755 3123064 3972561 4654760 4916296 5498690 5686787 4085636 1447028
12165 1447028 807945 1277642 235310 -1721327 -2162745 -693319 765989 1133633 1599272
$$ packed form
12230D32184o34993K0931m32922j170548n51945J667365K176265l346q13793O60805
12220A350003J86247P294q60361k3212Q17159j267724l058927j963789j28232
12211d941542M5627r2978Q12384J536108L98782o60070o45617k8035J239527L84883
12201a950931j080786j99902L10022K01704P91157J189614O69396k17009n5516
12192c42251l56626q03421J014650J751495m7195L1689O40646l66185j510794
12183A2008j177399O78739Q41407K49554q84077L78285N22749J365854K218325
12174D205445k35690q46691Q49497O82199K61536N82394J88097j601151k638608
12165A447028o39083M69697j042332j956637m41418J469426J459308L67644M65639
$$ plain form
12156 1599272 273842 -719343 -739469 -1566781 -3532100 -4465423 -3562167 -3339838 -3256919
12147 -3256919 -3255224 -3229145 -1894687 -644309 -1197621 -828272 113517 463048 1497832
12138 1497832 1291878 384226 562477 1263720 735615 215939 -553127 -1519566 -1251340
12129 -1251340 157261 334060 -320789 -258222 248999 468631 -826602 -1432487 -445565
12120 -445565 23609 1075000 1598955 1143379 359178 310180 1707571 3582202 3755976
12111 3755976 3035325 871700 -1574315 -2176673 -2893584 -4272015 -3024432 -1008741 -950223
12102 -950223 -1033664 -1474 2255334 3494957 3334356 3213887 3498716 3131553 1176721
12093 1176721 -818217 -962375 -129306 -348400 -674347 -1571108 -1398892 -331073 -600598
$$ packed form
12156A599272j325430r93185k0126q27312j965319r33323R03256K22329Q2919
12147c256919J695K6079J334458J250378n53312L69349R41789L49531J034784
12138A497832k05954r07652J78251P01243n28105n19676p69066r66439K68226
12129a251340J408601J76799o54849O2567N07221K19632j295233o05885R86922
12120d45565M69174J051391N23955m55576p84201m8998J397391J874631J73774
12111C755976p20651k163625k446015o02358p16911j378431J247583K015691N8518
12102i50223q3441J032190K256808J239623j60601j20469K84829l67163j954832
12093A176721j994938j44158Q33069k19094l25947q96761J72216J067819k69525
$$ plain form
12084 -600598 -1023639 966483 4576956 6134396 5494419 4014412 1311262 -1181437 -2134425
12075 -2134425 -1711736 -1397539 -1585293 -1580825 -2671 1733850 1381360 1337768 2676306
12066 2676306 3643285 2803802 1724549 813616 424499 1043286 1023150 66279 -1081284
12057 -1081284 -1589404 -1865809 712195 2558838 1338392 -438678 -2057809 -2316092 -3018311
12048 -3018311 -3081890 -2302288 -1853049 -943581 548253 442612 830771 707180 -516583
12039 -516583 -2220391 -3328025 -2590643 -745854 -504458 -357213 -548545 -833846 -1129825
12030 -1129825 194747 1271775 1132761 49654 -191384 657634 1203390 1277871 139836
12021 139836 -438957 491673 2779109 4181773 4958050 5379024 5404234 4158275 3127429
$$ packed form
12084f00598m23041J990122L610473J557440o39977j480007k703150k492699r52988
12075b134425M22689L14197j87754M468J578154J736521l52490m3592J338538
12066B676306R66979q39483j079253r10933l89117O18787k0136r56871j147563
12057a081284n08120k76405K578004J846643j220446j777070j619131k58283p02219
12048c018311o3579P79602M49239R09468J491834j05641L88159j23591j223763
12039e16583j703808j107634P37382J844789K41396J47245j91332k85301k95979
12030a129825J324572J077028j39014j083107k41038Q49018N45756P4481j138035
12021A39836n78793R30630K287436J402664P76277M20974K5210j245959j030846
$$ plain form
12012 3127429 2404392 3275608 4016122 4425153 3708232 1962958 806530 -253536 -1318720
12003 -1318720 -2461942 -2300810 -1643678 -923781 -259301 170192 291644 1657266 2011018
11994 2011018 561406 -1055052 -1475138 -566507 363815 1904905 3759142 3541112 2733036
11985 2733036 2394643 1710587 1397369 569464 227187 1007339 1195394 872953 1085124
11976 1085124 -109105 -1377568 -967735 1528074 3623518 4127338 4739433 3104773 -223956
11967 -223956 -272528 746950 2034484 2607706 899088 -1348161 -2284434 -2747572 -2889788
11958 -2889788 -1862295 -582465 -113908 1026241 989494 1011418 1889658 2193125 1973705
11949 1973705 1701259 1822135 1315852 905220 447626 -253739 -926887 -2564753 -3557498
$$ packed form
12012C127429p23037Q71216P40514M09031p16921j745274j156428j060066j065184
12003a318720j143222J61132O57132P19897O64480M29493J21452J365622L53752
11994B011018j449612j616458m20086R08631R30322J541090J854237k18030q08076
11985B733036l38393o84056l13218q27905l42277P80152J88055l22441K12171
11976A085124j194229j268463M09833K495809K095444N03820O12095j634660l328729
11967b23956m8572J019478J287534N73222j708618k247249r36273m63138j42216
11958b889788J027493J279830M68557J140149l6747K1924Q78240L03467k19420
11949A973705k72446J20876n06283m10632m57594p01365o73148j637866r92745
$$ plain form
11940 -3557498 -2399029 -1080899 -1015509 -843487 16071 776953 201711 -295579 -133603
11931 -133603 423584 1807296 1853967 2623456 3873849 2948801 1349361 2013202 1794777
11922 1794777 809756 8231 -874121 -1162335 -1241521 -866959 -1719697 -2757557 -2284617
11913 -2284617 -2756355 -2219171 -1149623 -55424 1281535 1143661 -729356 -1561141 -682241
11904 -682241 -849805 -2537615 -3751754 -4057959 -2929113 -1716750 -1041049 -1505277 -2858544
11895 -2858544 -3644756 -3376088 -2405300 -209000 1440855 1886515 1627525 1837223 2577974
11886 2577974 2214199 684128 -1355940 -3055255 -4674281 -4666325 -3691210 -3458011 -1872765
11877 -1872765 -376991 702905 2234266 2658389 1400212 -175736 -1287164 -1083220
$$ packed form
11940c557498J158469J318130O5390J72022Q59558P60882n75242m97290J61976
11931a33603N57187J383712M6671P69489J250393r25048j599440O63841k18425
11922A794777r85021q01525q82352k88214p9186L74562q52738j037860M72940
11913b284617m71738N37184J069548J094199J336959j37874j873017q31785Q78900
11904f82241j67564j687810j214139l06205J128846J212363O75701m64228j353267
11895b858544p86212K68668R70788K196300J649855M45660k58990K09698P40751
11886B577974l63775j530071k040068j699315j619026P956R75115K33199J585246
11877a872765J495774J079896J531361M24123j258177j575948j111428K03944
$$ plain form
11869 -1083220 1731934 4454697 5322449 5504392 3807696 1855638 788195 227732 309482
11860 309482 583182 -57547 -289866 21821 -370356 -2677855 -4632156 -5567288 -4408373
11851 -4408373 -605575 1522546 624427 -742869 -803624 746024 2028917 1567543 -318523
11842 -318523 -3198614 -3922899 -2524365 -1564958 -1446043 -218973 1248951 1069592 38524
11833 38524 -787575 -828739 -1069168 -2340134 -2077543 -745829 -381503 -353876 -203859 -215752
11823 -215752 -1865671 -3778968 -4197779 -3508358 -1783984 -1006845 -153791 702203 1316825
11814 1316825 907743 -693013 -2523930 -2960929 -1610932 -1257 -66696 -2190804 -4086265
11805 -4086265 -4347053 -2214615 -95973 1113681 2067983 2391694 2291875 1788996 429616
$$ packed form
11869a083220K815154K722763Q67752J81943j696696j952058j067443n60463Q1750
11860C09482K73700o40729k32319L11687l92177k307499j954301r35132J158915
11851d408373L802798K128121q98119j367296o0755J549648J282893m61374j886066
11842c18523k880091p24285J398534R59407J18915J227070J467924j79359j031068
11833C8524q26099m1164k40429j270966K62591J331714L64326K7627J50017j1893
11823b15752j649919j913297m18811O89421J724374P77139Q53054Q55994O14622
11814A316825m09082j600756j830917m36999J349997J609675o5439k124108j895461
11805d086265k60788K132438K118642J209654R54302L23711r9819n02879j359380
$$ plain form
11796 429616 -872580 418856 1833532 1872406 2234649 1671205 -219320 -1892287 -2799931
11787 -2799931 -3032231 -3812771 -3204168 -1855653 -1166070 -1103410 -1945750 -3929600 -4782734
11778 -4782734 -3474986 -1292555 -754770 -1643005 -2347088 -1852249 -244654 1276985 1118463
11769 1118463 4085 -696344 -1014190 165849 2232663 2509539 2424297 2556519 1304286
11760 1304286 1082557 822925 576651 996869 1214970 840799 1121082 2337264 2745690
11751 2745690 804277 -1186431 -1751586 -1627557 -2758055 -3338701 -2845179 -1387224 -347879
11742 -347879 192354 -662379 -615521 102508 -1638249 -3717884 -5058399 -5535015 -4797481
11733 -4797481 -1825191 -488653 -1847249 -2806371 -1753740 27120 383842 -487215 -1744039
$$ packed form
11796D29616j302196J291436J414676L8874L62243n63444j890525j672967r07644
11787b799931k32300p80540O08603J348515O89583O2660q42340j983850q53134
11778d782734J307748K182431N37785q88235p04083M94839J607595J521639j58522
11769A118463j114378p00429l17846J180039K066814K76876q5242J32222j252233
11760A304286k21729k59632k46274M20218K18101l74171K80283J216182M08426
11751B745690j941413j990708n65155J24029j130498n80646M93522J457955J039345
11742c47879N40233q54733M6858P18029j740757k079635j340515m76616P37534
11733d797481K972290J336538j358596r59122J052631J780860L56722q71057j256824
$$ plain form
11724 -1744039 -2898255 -2476988 -238017 1219903 889402 1236372 2286409 3062736 2728538
11715 2728538 1394336 92391 -428519 1151109 2250385 2392399 983635 -938682
11707 -938682 -1994331 -1783201 -466243 516101 1207190 1031945 307497 547110 407801
11698 407801 465932 466335 -769130 -1001924 50571 708152 377959 -14498 857086 1408838
11688 1408838 2267933 1536148 214906 -187279 -339550 -110104 527425 -152468 -1856657
11679 -1856657 -2628420 -2919616 -2540037 -898843 944678 1613795 1568890 253147 -156196
11670 -156196 610134 313612 -1917820 -1520271 811193 607689 -590685 -233719 112947
11661 112947 -239682 -639446 400715 2264102 3273877 2429541 1176971 -151426 166311
$$ packed form
11724a744039j154216M21267K238971J457920l30501L46970J050037P76327l34198
11715B728538j334202j301945n20910J579628J099276J42014j408764j922317
11707i38682j055649K11130J316958R82344O91089j75245p24448K39613j39309
11698D07801N8131M03j235465k32794J052495O57581l30193l92457Q71584N51752
11688A408838Q59095p31785j321242m02185j52271K29446O37529o79893j704189
11679a856657p71763k91196L79579J641194J843521O69117m4905j315743m09343
11670a56196P66330k96522k231432L97549K331464k03504j198374L56966L46666
11661A12947l52629l99764J040161J863387J009775q44336j252570j328397L17737
$$ plain form
11652 166311 1279487 1569565 352982 -103596 662295 441215 -852431 -770895 -263608
11643 -263608 817821 2142648 2238994 2108550 1509566 137446 -912782 -825094 112818
11634 112818 706662 989706 618988 388157 125587 -1435673 -3166464 -3744960 -3505967
11625 -3505967 -3026624 -3024641 -1491564 -655644 -422341 802590 761513 182693 -493513 -1136207
11615 -1136207 -1713464 -3069286 -2765031 -3008175 -3304365 -2367427 -1375870 -578978 -1001006
11606 -1001006 -1836496 -1854623 -2115193 -2992833 -2346744 -559439 964795 216438 -1251605
11597 -1251605 -1451767 -257056 1982967 2770180 3172416 2900155 994097 -146066 1908000
11588 1908000 2759038 1095412 -529806 -2501008 -2922760 -1309959 -33011 249960 71937
$$ packed form
11652A66311J113176K90078j216583m56578P65891k21080j293646Q1536N07287
11643b63608J081429J324827R6346j30444n98984j372120j050228Q7688R37912
11634A12818N93844K83044l70718k30831k62570j561260j730791n78496K38993
11625c505967M79343J983J533077Q35920K33303J224931m1077n78820o76206o42694
11615a136207n77257j355822L04255k43144k96190R36938R91557P96892m22028
11606a001006q35490j8127k60570q77640O46089J787305J524234p48357j468043
11597a251605k00162J194711K240023P87213M02236k72261j906058j140163K054066
11588A908000Q51038j663626j625218j971202m21752J612801J276948K82971j78023
$$ plain form
11579 71937 275099 1553046 2615295 2676804 2208981 1098833 372594 42529 -646008
11570 -646008 -114137 -163894 -1695929 -3742470 -2507687 -1415654 -1885973 -1351432 -548704
11561 -548704 103706 196045 726076 -75279 -526938 347250 -222308 -143178 -38439 -81939
11551 -81939 159379 84696 959450 1717220 2065663 2524934 2462774 1543021 -258396 -2170216
11541 -2170216 -2829137 -2405689 -1554101 -940756 184247 690429 768265 903535 129104
11532 129104 -1040979 -838959 836114 1780646 3195519 4626146 4421571 4012138 2745759
11523 2745759 499367 -141806 65971 -289748 -1843716 -2703209 -2518363 -1410208 -296315
11514 -296315 966435 1729097 836889 1053045 476443 -2132911 -3549218 -3793733 -4571009
$$ packed form
11579G1937K03162J277947J062249O1509m67823j110148p26239l30065o88537
11570f46008N31871m9757j532035k046541J234783J092033m70319N34541Q02728
11561e48704O52410R2339N30031q01355m51659Q74188n69558P9130J04739m3500
11551h1939K41318p4683Q74754P57770L48443M59271o2160r19753j801417j911820
11541b170216o58921M23448Q51588O13345J125003N06182P7836J35270p74431
11532A29104j170083K02020J675073R44532J414873J430627k04575m09433j266379
11523B745759k246392o41173K07777l55719j553968q59493J84846J108155J113893
11514b96315J262750P62662q92208K16156n76602k609354j416307k44515p77276
$$ plain form
11505 -4571009 -5397479 -6107846 -5707334 -4035089 -3370137 -2856358 -2179724 -1705273 -1340277
11496 -1340277 -1127554 -1349224 -1608022 -1020276 -351900 -1228586 -2263932 -2328974 -3237004
11487 -3237004 -5012837 -5091321 -3717724 -2005697 -2200090 -1661004 -713027 -447182 210909
11478 210909 -945789 -2755983 -4121965 -4813058 -4562383 -3037007 -2612510 -3706191 -3819755
11469 -3819755 -2556489 -2089949 -2183584 -1603654 -1528488 -2254225 -3273651 -3365017 -2266793
11460 -2266793 -540330 566256 2131477 2730591 2640585 872131 -2538806 -4228017 -4592884
11451 -4592884 -3572051 -1937225 -1126263 -1568356 -1297240 -2123442 -2606119 -2993175 -2654402
11442 -2654402 -1893866 -2208006 -2757071 -2648899 -1634850 -2069214 -2619795 -2161604 -2215955
$$ packed form
11505d571009q26470p10367M00512J672245O64952N13779O76634M74451L64996
11496a340277K12723k21670k58798N87746O68376q76686j035346o5042r08030
11487c237004j775833p8484J373597J712027j94393N39086R47977K65845O58091
11478B10909j156698j810194j365982o91093K50675J525376M24497j093681j13564
11469c819755J263266M66540r3635N79930P5166p25737j019426r1366J098224
11460b266793J726463J106586J565221N99114r0006j768454l410937j689211l64867
11451d592884J020833J634826Q10962m42093K71116q26202m82677l87056L38773
11442b654402P60536l14140n49065J08172J014049m34364n50581M58191n4351
$$ plain form
11433 -2215955 -2557718 -2614899 -3245572 -2024810 -1141642 -2774917 -3937414 -4035717 -4770716
11424 -4770716 -4631101 -3010465 658299 796400 -1328844 -2677028 -2056076 -301118 775105
11415 775105 1905439 813167 160538 449910 -494021 -3483632 -6005296 -6422867 -5806293
11406 -5806293 -4057427 -1727713 -1107243 -1143655 -1472899 -2459839 -3359526 -3896866 -3511574
11397 -3511574 -2819097 -1330275 871056 889519 -348703 -649458 -801550 -31352 274170
11388 274170 -951571 -2363804 -3957319 -4138564 -3547744 -3525003 -2821757 -2029696 -1281713
11379 -1281713 174904 883792 639155 41154 334148 948495 861302 1373984 1769381
11370 1769381 2228235 3288476 2793677 1911121 2228211 2580615 1746246 1515073 1512578 420142
$$ packed form
11433b215955l41763n7181o30673J220762Q83168j633275j162497r8303p34999
11424d770716J39615J620636L668764J38101k125244j348184O20952J754958J076223
11415G75105J130334j092272o52629K89372r43931k989611k521664m17571O16574
11406e806293J748866K329714O20470l6412l29244r86940q99687n37340L85292
11397c511574O92477J488822K201331J8463j238222l00755j52092P70198L05522
11388B74170j225741j412233j593515j81245N90820K2741P03246P92061P47983
11379a281713J456617P08888k44637n98001K92994O14347q7193N12682L95397
11370A769381M58854J060241m94799q82556L17090L52404q34369k31173k495j092436
$$ plain form
11360 420142 974377 1888344 1709473 1355956 2238898 1491923 -56908 -1468208 -2463731
11351 -2463731 -2319828 -2969529 -3839442 -4838729 -5838902 -5662751 -4663616 -4442849 -4430598
11342 -4430598 -4744517 -5696152 -4848838 -3305549 -2603162 -2234082 -1857862 -2538383 -2612148
11333 -2612148 -2183174 -1811542 -1238106 208776 940747 81615 -1420464 -2665311 -2463074
11324 -2463074 -1786885 -2209330 -1629154 -311950 238736 88932 -572981 -564777 -338978 348737
11314 348737 722085 921496 1329730 1313027 278805 -1174445 -1803845 -1872275 -1776516 -758561
11304 -758561 -727271 -1231826 -901886 124426 1215874 436952 -826104 -1923016 -2757092
11295 -2757092 -3601458 -2724280 -310972 -221305 -2155768 -3071504 -2827071 -2019390 -1453118
$$ packed form
11360D20142N54235R13967j78871l53517Q82942p46975j548831j411300r95523
11351b463731J43903o49701q69913r99287j000173J76151R99135K20767J2251
11342d430598l13919r51635Q47314J543289P02387L69080L76220o80521p3765
11333b612148M28974L71632N73436J446882P31971q59132j502079j244847K02237
11324b463074O76189m22445N80176J317204N50686j49804o61913Q204K25799O87715
11314C48737L73348J99411M08234j6703j034222j453250o29400o8430R5759J017955
11304g58561L1290n04555L29940J026312J091448p78922j263056j096912q34076
11295b757092q44366Q77178K413308Q9667j934463r15736K44433Q07681N66272
$$ plain form
11286 -1453118 -303543 -590514 -1849383 -1060555 203026 466499 574146 348121 110893
11277 110893 -76912 -1005947 -1918592 -3702106 -3781798 -1794880 -1173895 -2135813 -3408167
11268 -3408167 -3294029 -1921794 -2304960 -2274667 -1544663 -710382 339830 38570 -245411
11259 -245411 -139291 271044 1042626 1716192 1670457 1694609 1228272 139871 -429021 -719124
11249 -719124 -210241 393023 917600 429370 230674 976021 1451929 362372 -764141
11240 -764141 -2129203 -4254867 -4963708 -3818876 -3936247 -3667729 -1511707 -1158314 -2470526
11231 -2470526 -3025063 -2253341 -1790065 -1807727 -1692326 -1676807 142075 778875 1509551 2768980
11221 2768980 2906394 2111918 2427271 2982734 3721419 4388713 4189834 4103965 3352708 2443665
$$ packed form
11286a453118J149575k86971j258869P88828J263581K63473J07647k26025k37228
11277A10893j87805r29035r12645j783514p9692J986918O20985r61918j272354
11268c408167J14138J372235l83166L0293P30004Q34281J050212l01260k83981
11259b45411J06120M10335P71582O73566m5735K4152m66337j088401n68892k90103
11249g19124N08883O03264N24577m88230j98696P45347M75908j089557j126513
11240g64141j365062k125664p08841J144832j17371K68518K156022L53393j312212
11231b470526n54537P71722M63276j7662J15401J5519J818882O36800P30676J259429
11221B768980J37414p94476L15353N55463P38685O67294j98879q5869p51257r09043
$$ plain form
11211 2443665 1117587 -859043 -1742210 -908435 -535961 -523873 -310400 -462368 188928
11202 188928 1104854 91253 -818971 333301 1764040 2812324 3626055 3655502 2449701
11193 2449701 1415985 619068 953178 1477148 1138662 611184 176173 -1387406 -2513431
11184 -2513431 -2517031 -1591444 -1851579 -3525063 -4209199 -3345521 -2137084 -2115819 -1854228 -764980
11174 -764980 891791 1879816 2271335 1447304 -566749 -564269 1112941 1312023 -592162
11165 -592162 -2044475 -2966380 -3817421 -4052033 -3622729 -3236055 -3527353 -2173218 -526020
11156 -526020 -921218 -1967128 -2805477 -3303771 -2347669 -1487966 -1507266 -1029099 -523411 -711724
11146 -711724 -89493 479343 -233979 -1692194 -2124155 -1598234 -1815332 -1752890 -1527795 -548359
$$ packed form
11211B443665j326078j976630q83167Q33775L72474J2088K13473j51968O51296
11202A88928R15926j013601r10224J152272J430739J048284Q13731K9447j205801
11193B449701j033716p96917L34110N23970l38486n27478m35011j563579j126025
11184b513431l600R25587k60135j673484o84136Q63678J208437K1265K61591J089248
11174g64980J656771R88025L91519q24031k014053K480J677210J99082j904185
11165e92162j452313r21905q51041k34612M29304L86674k91298J354135J647198
11156e26020l95198j045910q38349m98294R56102Q59703j9300M78167N05688j88313
11146g11724O22231N68836p13322j458215m31961N25921k17098O2442K25095R79436
$$ plain form
11136 -548359 367355 -311946 -1240617 15605 842734 -332105 -1765914 -2459541 -1780279
11127 -1780279 -1578302 -2762690 -2820539 -1650963 -2070522 -3344717 -3150881 -1671335 -1271877
11118 -1271877 93070 1631089 1132328 463284 1358429 184491 -1827213 -3015693 -2437882
11109 -2437882 47074 -47263 -917141 -1810407 -1656214 -744907 296707 2105724 3352312
11100 3352312 3637849 5146840 5942654 3983005 1942665 1770535 1316728 1024533 3195219
11091 3195219 4369266 4373997 3464338 2958760 2936720 2089099 2087065 2065816 1260588 1416124
11081 1416124 767818 216349 604068 -1816 -412567 95721 -271961 -1804757 -2571244
11072 -2571244 -819576 776635 1859966 2691856 1770370 -336407 -957356 -384375 1190222
$$ packed form
11136e48359R15714o79301r28671J256222Q27129j174839j433809o93627O79262
11127a780279K01977j184388n7849J169576m19559j274195J93836J479546L99458
11118a271877J364947J538019m98761o69044Q95145j173938k011704j188480N77811
11109b437882K484956r4337q69878q93266J54193R11307J041614J809017J246588
11100C352312K85537J508991P95814j959649k040340j72130m53807k92195K170686
11091C195219J174047M731r09659n05578k2040q47621k034k1249q05228J55536
11081A416124o48306n51469L87719o05884m10751N08288l67682j532796p66487
11072b571244J751668J596211J083331Q31890r21486k106777o20949N72981J574597
$$ plain form
11063 1190222 1230007 -1206058 -1932847 -957542 706158 521683 -1435017 -834835 818641
11054 818641 461951 -185634 -331219 158920 18752 -1525477 -2127964 -1645722 -421109
11045 -421109 367106 -411798 -416998 -441757 135314 693397 1301218 1197475 113885 209184
11035 209184 1633009 2142529 1899573 3144980 4783015 5169705 5093759 5758103 4254611
11026 4254611 957568 -1361124 -1581660 796816 3359462 3885995 3000024 1523444 2554096
11017 2554096 4115407 3950488 3077417 2856150 3081911 2704322 498400 -812853 -638466
11008 -638466 984773 2852068 3743584 4655754 4689573 4174449 2974495 1410479 357655
10999 357655 -262846 275656 1115194 1058478 1233820 1189771 840222 1347734 1619394 2380855
$$ packed form
11063A190222L9785k436065p26789R75305J663700j84475j956700O00182J653476
11054H18641l56690o47585j45585M90139j40168j544229o02487M82242J224613
11045d21109P88215p78904n200k4759N77071N58083O07821j03743j083590R5299
11035B09184J423825N09520k42956J245407J638035L86690p5946O64344j503492
11026D254611l297043k318692k20536K378476K562646N26533q85971j476580J030652
11017B554096J561311j64919q73071k21267K25761l77589k205922j311253J74387
11008f38466J623239J867295Q91516R12170L3819n15124j199954j564016j052824
10999C57655o20501N38502Q39538n6716J75342m4049l49549N07512K71660P61461
$$ plain form
10989 2380855 2618262 2814934 3842300 5818217 6479538 6182559 6825185 6251388 5077355
10980 5077355 4563689 3052863 2215592 2653971 3811859 4967332 4424686 3676417 3639698
10971 3639698 3540666 2673395 2081359 1319503 1953456 2219340 2030330 1626223 2409296 3923517
10961 3923517 3730025 4545943 6481533 6702879 5886797 5944290 5905327 6401999 6497118 6656776
10951 6656776 8107530 8519961 6529757 4487543 4587897 6240532 7463260 6376208
10943 6376208 6052828 7361573 7712949 6679848 4433021 2872191 2866132 4045592 5559598
10934 5559598 5404865 4012934 4638542 5286149 4125151 3048110 2939140 3855470 4675948
10925 4675948 4918939 3270425 1090503 365766 675479 883281 1672912 2901575 2816844
$$ packed form
10989B380855K37407J96672J027366J975917O61321k96979O42626n73797j174033
10980E077355n13666j510826q37271M38379J157888J155473n42646p48269l6719
10971C639698r9032q67271n92036p61856O33953K65884j89010m04107P83073J514221
10961C923517j93492Q15918J935590K21346q16082N7493l8963M96672R5119J59658
10951F656776J450754M12431j990204k042214J00354J652635J222728j087052
10943F376208l23380J308745L51376j033101k246827j560830o059J179460J514006
10934E559598j54733j391931O25608O47607j160998j077041j08970R16330Q20478
10925D675948K42991j648514k179922p24737L09713K07802P89631J228663q4731
$$ plain form
10916 2816844 2761106 2736393 3119929 3924220 4632562 5698951 6107706 4502564 1224190
10907 1224190 38540 1673251 3149228 2892240 3672866 5882024 6390263 5259377 5560029
10898 5560029 6142691 5892415 6156730 6525806 6134127 3961833 2377995 2005922 2721800
10889 2721800 3494787 3746858 3857917 3914213 3726986 3953973 4411342 5708023 7342970
10880 7342970 7713282 7166804 6896401 6582853 5806389 6192540 7792270 8686333 8403187
10871 8403187 8871517 9536043 10158948 9948141 7215803 5811338 6836269 6394005 5787301
10862 5787301 5238259 5419580 4432118 2457980 771482 1178997 3179650 4337525 4784947
10853 4784947 5082990 4904184 5106371 5640230 6652580 7624738 8450854 8562002 9683339
$$ packed form
10916B816844n5738k4713L83536Q04291P08342J066389M08755j605142l278374
10907A224190j185650J634711J475977k56988P80626K209158N08239j130886L00652
10898E560029N82662k50276K64315L69076l91679k172294j583838l72073P15878
10889B721800P72987K52071J11059N6296j87227K26987M57369J296681J634947
10880G342970L70312n46478k70403l13548p76464L86151J599730Q94063k83146
10871H403187M68330O64526O22905k10807k732338j404465J024931m42264o06704
10862E787301n49042J81321r87462j974138j686498M07515K000653J157875M47422
10853D784947K98043j78806K02187N33859J012350R72158Q26116J11148J121337
$$ plain form
10844 9683339 10118246 10971842 12324186 12655349 12278165 11171924 9423334 8215442 8100978
10835 8100978 8366427 7830283 5514789 3244443 1930358 1917455 3432609 4972722 5849812
10826 5849812 4898454 3121055 3040120 3249277 3645600 4550370 5244598 5706235 5117769
10817 5117769 3646724 2695216 2873803 3947177 4558443 5414538 7069272 8572858 8412251
10808 8412251 7556949 6472781 4761130 3315293 4140087 4381944 3789901 3565568 4481461
10799 4481461 6582799 7375911 5977124 4412265 3671617 4090742 4924705 5962129 6536281
10790 6536281 6478798 6835013 6780109 5776926 4654061 5593033 6089011 4596112 3578277
10781 3578277 3554224 3756715 5421077 7655424 8857280 8756460 8074518 8244688 8350932
$$ packed form
10844I683339M34907Q53596J352344L31163l77184j106241j748590j207892j14464
10835H100978K65449n36144k315494k270346j314085j2903J515154J540113Q77090
10826E849812r51358j777399q0935K09157L96323R04770O94228M61637n88466
10817E117769j471045r51508J78587J073374O11266Q56095J654734J503586j60607
10808H412251q55302j084168j711651j445837Q24794K41857n92043k24333R15893
10799D481461K101338P93112j398787j564859p40648M19125Q33963J037424N74152
10790F536281n7483L56215n4904j003183j122865R38972M95978j492899j017835
10781C578277k4053K02491J664362K234347J201856j00820o81942J70170J06244
$$ plain form
10772 8350932 8720876 9777586 9862959 9306009 8431416 6664491 6525322 8323408 9290924
10763 9290924 9404466 10169620 9888255 10819218 13035870 14950228 15742077 14254478 12260236
10754 12260236 12050773 13463794 15284725 16408624 17894633 18362068 17519446 16519120
10746 16519120 16160731 16656866 17080336 17462476 18056622 18609050 18986444 19851810 21082648
10737 21082648 23380242 24445154 23914302 23085968 23123406 23009371 22235208 21335652 19841688
10728 19841688 18256848 17316048 16058365 14385162 13477518 14250926 15508673 16299274 17569610
10719 17569610 18784541 20420000 20398863 18186242 18250057 19935755 20689523 21422365 23054824
10710 23054824 24806818 26889125 29296188 31684121 33484721 35723841 39613472 43287403
$$ packed form
10772H350932L69944J056710Q5373n56950q74593j766925j39169J798086R67516
10763I290924J13542P65154k81365R30963K216652J914358P91849j487599j994242
10754A2260236k09463J413021J820931J123899J486009M67435q42622j000326
10746A6519120l58389M96135M23470L82140N94146N52428L77394Q65366J230838
10737B1082648K297594J064912n30852q28334L7438j14035p74163q99556j493964
10728A9841688j584840r40800j257683j673203r07644P73408J257747P90601J270336
10719A7569610J214931J635459k1137k212621O3815J685698P53768P32842J632459
10710B3054824J751994K082307K407063K387933J800600K239120L889631L673931
$$ plain form
10702 43287403 46239665 50533238 55766894 60921495 66868283 73586604 81721504 92449813
10694 92449813 104389561 110952898 111080498 106722731 99416991 90607126 80856575 72439462
10686 72439462 65351063 59672373 55626136 51781528 47673864 44149167 41947388 38955493
10678 38955493 35438268 30999186 27231651 25237679 23488520 21036841 19630907 19951889
10670 19951889 19812812 17543243 14967927 13482007 13515044 12920139 12252729 12989289 15238568
10661 15238568 17414756 19291951 21793866 23113099 23006596 22188589 22225318 24062482 26692329
10652 26692329 29568709 32059241 35024715 39515645 43934416 47216910 50486670 52029553
10644 52029553 52094379 52614633 52525319 53041744 53569950 53000491 51732728 48994385 46123577
$$ packed form
10702D3287403K952262M293573N233656N154601N946788O718321Q134900J0728309
10694I2449813J1939748O563337J27600m357767p305740q809865r750551q417113
10686G2439462p088399n678690m046237l844608m107664l524697k201779k991895
10678C8955493l517225m439082l767535j993972j749159k451679j405934L20982
10670A9951889j39077k269569k575316j485920L3037n94905o67410P36560K249279
10661A5238568K176188J877195K501915J319233j06503q18007L6729J837164K629847
10652B6692329K876380K490532K965474M490930M418771L282494L269760J542883
10644E2029553O4826N20254q9314N16425N28206n69459j267763k738343k870808
$$ plain form
10635 46123577 46423963 47132306 47267684 46830340 45898650 46310073 49153576 52780089 56440706
10626 56440706 60945884 66513677 74212869 84820344 97293164 112352493 129273462
10619 129273462 143339915 145821950 136077117 124643486 116931986 112690852 111276066 112059130
10611 112059130 112288196 104833460 93304465 81744518 69941220 60678825 52777599 44087599
10603 44087599 35596055 29977212 26102529 21563265 17847882 15610736 14148605 11906159
10595 11906159 9944089 9521116 9281895 8695432 8768766 7128588 5000509 3286594 316520
10586 316520 -870795 -628922 -38749 1112585 1174013 580509 29051 -326606 587383
10577 587383 1555731 1582278 745797 -229115 -1061987 -799392 1606731 2763471 2779165 2716948
$$ packed form
10635D6123577L00386P08343J35378m37344r31690M11423K843503L626513L660617
10626E6440706M505178N567793P699192J0607475J2472820J5059329J6920969
10619A29273462J4066453K482035r744833j1433631p711500m241134j414786P83064
10611A12059130K29066p454736j1528995j1559947j1803298r262395p901226q690000
10603D4087599q491544n618843l874683m539264l715383k237146j462131k242446
10595A1906159j962070m22973k39221n86463P3334j640178k128079j713915k970074
10586C16520j187315K41873N90173J151334O1428n93504n51458l55657R13989
10577E87383R68348K6547q36481r74912q32872K62595K406123J156740J5694o2217
$$ plain form
10567 2716948 3041899 4294366 4981644 5184180 4171169 3127373 3512889 2530960 860807
10558 860807 -150466 1034768 1694767 1544664 1921096 1640411 1397183 146851 -212608
10549 -212608 70939 414666 1046457 2093414 4473289 5404955 4128928 2585424 2445872
10540 2445872 3000053 2835491 1459230 859563 1836051 506189 -1417842 -2165982 -1628539
10531 -1628539 -1442139 -891666 -742110 -1456037 -3154270 -4626862 -5099090 -3431860 -1381016
10522 -1381016 -948221 -1114244 -2296839 -2934208 -3445440 -2981707 -1895768 -1269089 -1285632
10513 -1285632 -589161 554782 1219019 935850 -544978 -2021840 -1967510 -2964961 -3954417
10504 -3954417 -3098264 -3129495 -3551717 -3025313 -2754386 -1892199 -43294 1437764 1217729
$$ packed form
10567B716948L24951J252467O87278K02536j013011j043796L85516r81929j670153
10558H60807j011273J185234O59999j50103L76432k80685k43228j250332l59459
10549b12608K83547L43727O31791J046957K379875R31666j276027j543504j39552
10540B445872N54181j64562j376261n99667R76488j329862j924031p48140N37443
10531a628539J86400N50473J49556p13927j698233j472592m72228J667230K050844
10522a381016M32795j66023j182595o37369n11232M63733J085939O26679j6543
10513a285632O96471J143943O64237k83169j480828j476862N4330r97451r89456
10504c954417Q56153l1231m22222N26404K70927Q62187J848905J481058k20035
$$ plain form
10495 1217729 -226655 -1300691 -1702396 -1931107 -3161317 -4363718 -4769467 -3889807 -4448079
10486 -4448079 -5104828 -3187819 -1479946 -1516948 -865663 -543019 -1319244 -1465557 -843845
10477 -843845 -756516 -863747 847490 1817183 349590 -1041040 -842693 197679 317656
10468 317656 363286 484986 539806 906983 -570677 -1452945 170551 1178510 1303860
10459 1303860 1142989 1220689 139071 -1752975 -2783825 -3068765 -2859098 -2069764 -1139776
10450 -1139776 -508767 -446260 -86719 -396910 -947988 -916028 -2686606 -3359771 -2352382
10441 -2352382 -1967429 -2584959 -2917161 -1457493 1386964 2827812 2858829 1928378 1060781
10432 1060781 213656 1029271 2116313 1927588 1708689 2067732 2502748 2398315 1077277
$$ packed form
10495A217729j444384j074036m01705k28711j230210j202401m05749Q79660n58272
10486d448079o56749J917009J707873l7002O51285L22644p76225j46313O21712
10477h43845Q7329j07231J711237R69693j467593j390630J98347J040372J19977
10468C17656M5630J21700N4820L67177j477660q82268J623496J007959J25350
10459A303860j60871P7700j081618j892046j030850k84940K09667P89334R29988
10450a139776O31009O2507L59541l10191n51078L1960j770578o73165J007389
10441b352382L84953o17530l32202J459668K844457J440848L1017r30451q67597
10432A060781q47125Q15615J087042j88725k18899L59043M35016j04433j321038
$$ plain form
10423 1077277 983637 2414476 1148811 -308115 -142840 -364120 -268126 -491056 -731337
10414 -731337 -115870 -188591 -383052 268413 189172 -235506 -585464 -591503 607926 211266
10404 211266 -774854 -559357 -869066 -2031687 -2197598 -2239420 -1997435 -1221027 -2300144
10395 -2300144 -4521081 -5219351 -2716320 26303 640809 1054575 2090117 3035081 2074258
10386 2074258 1675670 3069093 3305402 1975826 1661253 2368016 3372408 2306580 642028
10377 642028 338068 -76485 -240099 -139321 -156470 233438 791511 1420149 720600 -223926
10367 -223926 -959937 -1580624 -1251272 -679084 1216506 3191833 2882941 1214519 544981
10358 544981 376599 2346660 3459432 3363127 2518138 691133 -816949 -626581 1737977
$$ packed form
10423A077277r3640J430839j265665j456926J65275k21280R5994k22930k40281
10414g31337O15467p2721j94461O51465p9241m24678l49958o039J199429l96660
10404B11266r86120K15497l09709j162621j65911m1822K41985P76408j079117
10395b300144k220937o98270K503031K742623O14506M13766J035542R44964r60823
10386B074258l98588J393423K36309j329576l14573P06763J004392j065828j664552
10377F42028l03960m14553j63614J00778j7149L89908N58073O28638o99549r44526
10367b23926p36011o20687L29352N72188J895590J975327l08892j668422o69538
10358E44981j68382J970061J112772r6305q44989j827005j508082J90368K364558
$$ plain form
10349 1737977 3750405 4871542 4864535 3738955 2790800 2475528 2122966 1385758 289158
10340 289158 -895064 -2830470 -3806527 -3405551 -3460376 -2604725 -2006500 -2810487 -3260472
10331 -3260472 -1649689 139597 2229134 2527571 1859736 1824158 1555743 1540843 283696
10322 283696 -1353010 -1412911 -958853 -1888252 -2618722 -1314167 637700 1507116 2371959
10313 2371959 2203700 800955 -194511 -500777 -1108752 -1387925 -2464740 -2832475 -3008423
$$ packed form
10349A737977K012428J121137p007j125580r48155l15272l52562p37208j096600
10340B89158j184222j935406r76057M00976n4825Q55651N98225q03987m49985
10331c260472J610783J789286K089537K98437o67835l5578k68415j4900j257147
10322B83696j636706n9901M54058r29399p30470J304555J951867Q69416Q64843
10313B371959j68259j402745r95466l06266o07975k79173j076815l67735j75948
$$ [...]
##END NTUPLES=NMR SPECTRUM
##END=
