##TITLE=C13_LR-618-R3-CR18
 CDCl3, 19700 sc

 30.6.2021
##JCAMPDX= 6.0         $$ Bruker NMR JCAMP-DX V2.0
##DATA TYPE= NMR SPECTRUM
##DATA CLASS= NTUPLES
##ORIGIN= UXNMR, Bruker Analytische Messtechnik GmbH
##OWNER= root
$$ XWIN-NMR		Version 3.5
$$ Thu Jul  1 08:38:29 2021 Russian Standard Time (UT+4h)  she@DPX200
##.OBSERVE FREQUENCY= 50.327896
##.OBSERVE NUCLEUS= ^13C
##.ACQUISITION MODE= SIMULTANEOUS
##.ACQUISITION SCHEME= undefined
##.AVERAGES= 19700
##.DIGITISER RES= 17
##SPECTROMETER/DATA SYSTEM= spect
##.PULSE SEQUENCE= zgpg30
##.SOLVENT NAME= CDCl3
##.SHIFT REFERENCE= (INTERNAL, CDCl3, 0, 222.653)
##AUDIT TRAIL= $$ (NUMBER, WHEN, WHO, WHERE, WHAT)
$$ ##TITLE= Audit trail, XWIN-NMR		Version 3.5
$$ ##JCAMPDX= 5.01
$$ ##ORIGIN= Bruker BioSpin GmbH
$$ ##OWNER= she
$$ F:/spectra/data/she/nmr/c13/1/pdata/1/auditp.txt
$$ ##AUDIT TRAIL=  $$ (NUMBER, WHEN, WHO, WHERE, WHAT)
(   1,<2021-07-01 08:31:07.18 +0400>,<she>,<DPX200>,
      <created by zg, POWCHK disabled, PULCHK disabled
       terminated by command 'halt'
       configuration hash MD5:
       00 E9 B6 7A A2 85 ED C7 34 08 36 98 17 FE 4E 26
       data hash MD5: 32K
       63 28 C1 9F 03 29 B8 10 A9 40 EB 71 DD F8 ED 9D>)
(   2,<2021-07-01 08:31:47.31 +0400>,<she>,<DPX200>,
      <Start of raw data processing
       efp BC_mod = 2 LB = 1 FT_mod = 6 PKNL = 1 PHC0 = -346.0486 PHC1 = 44.76237 SI = 32K 
       data hash MD5: 32K
       F3 B5 F2 E4 CC E4 52 C5 5D FD C7 95 72 8D E2 6F>)
(   3,<2021-07-01 08:33:27.15 +0400>,<she>,<DPX200>,
      <abs ABSG = 5 
       data hash MD5: 32K
       06 E1 53 DF 25 EF 61 CF 9A 62 47 61 3F B9 8C A0>)
(   4,<2021-07-01 08:34:16.82 +0400>,<she>,<DPX200>,
      <abs ABSG = 5 
       data hash MD5: 32K
       68 65 B0 4A 7E 00 B0 EA D7 5D 15 4D DC 27 99 A9>)
(   5,<2021-07-01 08:37:20.81 +0400>,<she>,<DPX200>,
      <pk PHC0 = 12.03787 PHC1 = -16.6 
       data hash MD5: 32K
       12 64 7F 01 19 3C 7E 6C D5 90 26 8E D8 6A 8D FF>)
(   6,<2021-07-01 08:37:24.87 +0400>,<she>,<DPX200>,
      <abs ABSG = 5 
       data hash MD5: 32K
       9A 28 CA F0 AB F6 1B 96 FA DB 91 F2 BF D0 35 EC>)
$$ ##END=
$$ 
$$ hash MD5
$$ 60 EA AB 99 47 38 F0 86 FE 23 7A 20 B2 15 81 9B
##$RELAX= 
##$RELAX= 
##$RELAX= 
##$RELAX= 
##$RELAX= 
##$RELAX= 
##$RELAX= 
##$RELAX= 
$$ Bruker specific parameters
$$ --------------------------
##$DU= <F:/spectra>
##$EXPNO= 1
##$NAME= <c13>
##$PROCNO= 1
##$TYPE= <nmr>
##$USER= <she>
##$AMP= (0..31)
100 100 100 100 100 100 100 100 100 100 100 100 100 100 100 100 100 100 
100 100 100 100 100 100 100 100 100 100 100 100 100 100 
##$AQSEQ= 0
##$AQ_mod= 1
##$AUNM= <au_zg>
##$AUTOPOS= <>
##$BF1= 50.322709
##$BF2= 200.13
##$BF3= 50.322709
##$BF4= 500.13
##$BF5= 500.13
##$BF6= 500.13
##$BF7= 500.13
##$BF8= 500.13
##$BYTORDA= 1
##$CFDGTYP= 0
##$CFRGTYP= 5
##$CHEMSTR= <none>
##$CNST= (0..31)
1 1 145 1 1 1 1 1 1 1 1 1 1 1 1 1 1 1 1 1 1 1 1 1 1 1 1 1 1 1 1 1 
##$CPDPRG= <waltz16>
##$CPDPRG1= <>
##$CPDPRG2= <waltz16>
##$CPDPRG3= <>
##$CPDPRG4= <mlev>
$$ [...]
##$SUBNAM4= <"">
##$SUBNAM5= <"">
##$SUBNAM6= <"">
##$SUBNAM7= <"">
##$SUBNAM8= <"">
##$SUBNAM9= <"">
##$SW= 239.972175391363
##$SWIBOX= (0..15)
0 1 3 0 0 0 0 0 0 0 0 0 0 0 0 0 
##$SW_h= 12077.2946859903
##$TD= 32768
##$TD0= 1
##$TE= 0
##$TE2= 300
##$TE3= 300
##$TEG= 300
##$TL= (0..7)
120 120 120 120 120 120 120 120 
##$TP= (0..7)
150 150 150 150 150 150 150 150 
##$TP07= 0
##$TPNAME0= <>
##$TPNAME1= <>
##$TPNAME2= <>
##$TPNAME3= <>
##$TPNAME4= <>
##$TPNAME5= <>
##$TPNAME6= <>
##$TPNAME7= <>
##$TPOAL= (0..7)
0.5 0.5 0.5 0.5 0.5 0.5 0.5 0.5 
##$TPOFFS= (0..7)
0 0 0 0 0 0 0 0 
##$TUNHIN= 0
##$TUNHOUT= 0
##$TUNXOUT= 0
##$USERA1= <user>
##$USERA2= <user>
##$USERA3= <user>
##$USERA4= <user>
##$USERA5= <user>
##$V9= 5
##$VALIST= <valist>
##$VCLIST= <CCCCCCCCCCCCCCC>
##$VD= 0
##$VDLIST= <DDDDDDDDDDDDDDD>
##$VPLIST= <PPPPPPPPPPPPPPP>
##$VTLIST= <TTTTTTTTTTTTTTT>
##$WBST= 1024
##$WBSW= 4
##$XGAIN= (0..3)
0 0 0 0 
##$XL= 0
##$YL= 0
##$YMAX_a= 118636181
##$YMIN_a= -30796690
##$ZGOPTNS= <>
##$ZL1= 120
##$ZL2= 120
##$ZL3= 120
##$ZL4= 120
##$ABSF1= 222.6533
##$ABSF2= -17.34351
##$ABSG= 5
##$ABSL= 3
##$ALPHA= 0
##$AQORDER= 0
##$ASSFAC= 0
##$ASSFACI= 0
##$ASSFACX= 0
##$ASSWID= 0
##$AUNMP= <proc_1d>
##$AZFE= 0.1
##$AZFW= 0.5
##$BCFW= 0
##$BC_mod= 2
##$BYTORDP= 0
##$COROFFS= 0
##$CY= -3
##$DATMOD= 1
##$DC= 0
##$DFILT= <>
##$DTYPP= 0
##$F1P= 0
##$F2P= 0
##$FCOR= 0.5
##$FTSIZE= 32768
##$FT_mod= 6
##$GAMMA= 0
##$GB= 0
##$INTBC= 1
##$INTSCL= 4.134877e-10
##$ISEN= 128
##$LB= 1
##$LEV0= 0
##$LPBIN= 0
##$MAXI= 10000
##$MC2= 0
##$MEAN= 0
##$ME_mod= 0
##$MI= 0.1934396
##$NCOEF= 0
##$NC_proc= 2
##$NLEV= 6
##$NOISF1= 120.0001
##$NOISF2= 80.00006
##$NSP= 0
##$NTH_PI= 0
##$NZP= 0
##$OFFSET= 222.6533
##$PC= 1.4
##$PHC0= -334.0107
##$PHC1= 28.16237
##$PH_mod= 1
##$PKNL= yes
##$PPARMOD= 0
##$PSCAL= 0
##$PSIGN= 0
##$REVERSE= no
##$SF= 50.3227301278049
##$SI= 32768
##$SIGF1= 140
##$SIGF2= 120
##$SINO= 11.81781
##$SIOLD= 32768
##$SREGLST= <13C.CDCl3>
##$SSB= 0
##$STSI= 32768
##$STSR= 0
##$SW_p= 12077.2946859903
##$SYMM= 0
##$S_DEV= 0
##$TDeff= 32768
##$TDoff= 0
##$TI= <>
##$TILT= no
##$TM1= 0
##$TM2= 0
##$TOPLEV= 0
##$USERP1= <user>
##$USERP2= <user>
##$USERP3= <user>
##$USERP4= <user>
##$USERP5= <user>
##$WDW= 1
##$XDIM= 32768
##$YMAX_p= 518858406
##$YMIN_p= -2262421
$$ End of Bruker specific parameters
$$ ---------------------------------
##NTUPLES= NMR SPECTRUM
##VAR_NAME=  FREQUENCY,     SPECTRUM/REAL,   SPECTRUM/IMAG
##SYMBOL=    X,             R,               I
##VAR_TYPE=  INDEPENDENT,   DEPENDENT,       DEPENDENT
##VAR_FORM=  AFFN,          ASDF,            ASDF
##VAR_DIM=   32768,         32768,           32768
##UNITS=     HZ,            ARBITRARY UNITS, ARBITRARY UNITS
##FACTOR=    0.368581032318806, 1,           1
##FIRST=     11204.5221822817, 0,            0
##LAST=      -872.772503708586, 0,           0
##MIN=       -872.772503708586, -2262421,    0
##MAX=       11204.5221822817, 518858406,    0
$$ Real data points
##PAGE= N=1
##DATA TABLE= (X++(R..R)), XYDATA
$$ [...]
$$ plain form
15825 -265393 -447569 -583472 -430553 -157604 4886 41919 -20465 26612 6244 -74135
15815 -74135 -8031 -247570 -399459 -433521 -529643 -278622 40652 169633 304586 77627
15805 77627 -227891 -375776 -266445 -102636 481042 945585 1167369 884878 383929 309069
15795 309069 216966 495316 796509 721030 357907 71339 -10693 242376 260570 -36900
15785 -36900 40599 -136410 -529755 -1151567 -1202365 -775781 -432603 -282948 -387463 -336014
15775 -336014 -111058 366272 662019 763094 621086 232359 46479 238940 281454 88836
15765 88836 319312 357679 -90686 -679506 -630738 -109566 294130 281566 51783 -236744
15755 -236744 -440918 -226454 125359 82158 -350662 -481113 -609692 -788725 -825683 -683162
$$ packed form
15825b65393j82176j35903J52919K72949J62490L7033o2384M7077k0368q0379
15815g4135O6104k39539j51889l4062r6122K51021L19274J28981J34953k26959
15805G7627l05518j47885J09331J63809N83678M64543K21784k82491n00949p4860
15795C09069r2103K78350L01193p5479l63123k86568q2032K53069J8194k97470
15785c6900P7499j77009l93345o21812n0798M26584L43178J49655j04515N1449
15775c36014K24956M77330K95747J01075j42008l88727j85880J92461M2514j92618
15765H8836K30476L8367m48365n88820M8768N21172M03696j2564k29783k88527
15755b36744k04174K14464L51813m3201m32820j30451j28579j79033l6958J42521
$$ plain form
15745 -683162 -446246 -662463 -895012 -928399 -607353 -196197 -61568 -78758 -30681 80005
15735 80005 386964 719798 726738 701896 568310 471047 23244 -298830 -259398 -247789 -319556
15724 -319556 -154397 344293 229140 -118182 -261989 171480 508543 465195 224049 71775
15714 71775 63342 139367 530924 1028578 1156035 1022700 710978 677819 490694 -27991
15704 -27991 -509876 -814719 -824761 -507772 -205703 18345 -12010 138626 -134662 -412783
15694 -412783 -178277 -60136 -132897 -360006 -573229 -818847 -586913 -159785 241088 256128
15684 256128 -81074 -35917 216475 400804 362519 303863 168367 -203155 -302812 -117057
15674 -117057 220638 575853 1011877 1284360 845078 290719 -329132 -747462 -778793 -429311
$$ packed form
15745f83162K36916k16217k32549l3387L21046M11156J34629j7190M8077J10686
15735H0005L06959L32834O940k4842j33586r7263m47803l22074L9432J1609p1767
15724c19556J65159M98690j15153l47322j43807M33469L37063m3348k41146j52274
15714G1775q433P6025L91557M97654J27457j33335l11722l3159j87125n18685
15704b7991m81885l04843j0042L16989L02069K24048l0355J50636k73288k78121
15694d12783K34506J18141p2761k27109k13223k45618K31934M27128M00873J5040
15684B56128l37202M5157K52392J84329l8285n8656j35496l71522r9657J85755
15674a17057L37695L55215M36024K72483m39282n54359o19851m18330l1331L49482
$$ plain form
15664 -429311 -144401 111429 363438 200358 -175864 -203859 -134986 -259352 -68761 231253
15654 231253 483301 346027 71629 74421 33343 27306 -79729 -169045 100871 132813 52146
15643 52146 226629 608914 617604 283946 -184617 -45111 507560 314701 -65711 -32365
15633 -32365 183587 408308 673897 810561 594998 458937 557343 885827 1201890 1248475
15623 1248475 1447481 1276319 821860 571972 415343 -26030 -481747 -405730 -86290 162256
15613 162256 277400 89020 24483 443386 463607 268940 376112 397305 170340 37637
15603 37637 -178986 -21678 590974 877044 1134024 1390675 1345241 1205685 1189269 1123675
15593 1123675 671610 235545 110490 -65811 -585856 -1211078 -1588528 -1295798 -958788
$$ packed form
15664d29311K84910K55830K52009j63080l76222k7995O8873j24366J90591L00014
15654B31253K52048j37274k74398K792m1078o037j07035q9316K69916L1942q0667
15643E2146J74483L82285Q690l33658m68563J39506N52671j92859l80412L3346
15633c2365K15952K24721K65589J36664k15563j36061R8406L28484L16063M6585
15623A248475J99006j71162m54459k49888j56629m41373m55717P6017L19440K48546
15613A62256J15144j88380o4537M18903K0221j94667J07172K1193k26965j32703
15603C7637k16623J57308O12652K86070K56980K56651m5434j39556j6416o5594
15593A123675m52065m36065j25055j76301n20045o25222l77450K92730L37010
$$ plain form
15584 -958788 -190160 702704 936559 906322 832186 588904 297883 490471 736228 612267
15574 612267 40847 -255178 -65619 -15708 276796 263149 -112272 -62582 299775 567916
15564 567916 611966 326945 75992 45678 308620 252992 -284731 -462360 -309691 255140
15554 255140 974276 1591654 1426591 792946 627374 494805 260664 -68725 -492818 -764133
15544 -764133 -388304 -257243 -300389 -368415 -880689 -1232967 -1211641 -700854 -142019 87746
15534 87746 331767 383511 170955 16146 213144 594151 1244567 1634954 1053263 711987
15524 711987 588370 12506 -165410 -80636 -328553 -429564 -491984 -577534 -396434 -265746
15514 -265746 -497728 -1028471 -1126296 -955808 -1173792 -1532206 -2035050 -2193962 -2160998 -2198399
$$ packed form
15584i58788P68628Q92864K33855l0237p4136k43282k91021J92588K45757j23961
15574F12267n71420k96025J89559M9911K92504j3647l75421M9690L62357K68141
15564E67916M4050k85021k50953l0314K62942n5628n37723j77629J52669N64831
15554B55140P19136O17378j65063o33645j65572j32569k34141l29389m24093k71315
15544g64133L75829J31061m3146o8026n12274l52278K1326N10787N58835K29765
15534H7746K44021N1744k12556j54809J96998L81007O50416L90387n81691l41276
15524G11987j23617n75864j77916Q4774k47917j01011o2420q5550J81100J30688
15514b65746k31982n30743r7825J70488k17984l58414n02844j58912L2964l7401
$$ plain form
15504 -2198399 -2054035 -1723496 -1740243 -1932218 -1487585 -665069 -205275 58931 73009 -542288
15494 -542288 -757993 -629886 -161819 298325 382932 51199 27977 127913 247036 448272
15484 448272 453995 314563 283500 -76557 -772827 -1018037 -570600 37637 -152601 -328838
15474 -328838 -307246 -272023 -512485 -915240 -1022116 -1209042 -1525938 -1574273 -1326632 -1247021
15464 -1247021 -1143029 -827822 -380853 -239536 -129053 -105776 256500 693885 496728 -172871
15454 -172871 -485994 -310030 -255663 -329284 -347854 -414751 -298461 -43118 149625 449216
15444 449216 473839 276199 -47802 -292056 -384005 -394839 -472277 -347467 -531133 -355913
15434 -355913 149640 527589 611229 501887 297310 343897 431417 257643 12774 -17024
$$ packed form
15504b198399J44364L30539j6747j91975M44633Q22516M59794K64206J4078o15297
15494e42288k15705J28107M68067M60144Q4607l31733k3222R9936J19123K01236
15484D48272N723j39432l1063l60057o96270k45210M47437O08237j90238j76237
15474c28838K1592L5223k40462m02755j06876j86926l16896m8335K47641P9611
15464a247021J03992L15207M46969J41317J10483K3277L62276M37385j97157o69599
15454a72871l13123J75964N4367p3621j8570o6897J16290K55343J92743K99591
15444D49216K4623j97640l24001k44254r1949j0834p7438J24810j83666J75220
15434c55913N05553L77949Q3640j09342k04577M6587Q7520j73774k44869k9798
$$ plain form
15424 -17024 247502 338633 285027 150385 -144262 -402439 -199887 -111272 -103398 228753 521210
15413 521210 892723 1051196 1117147 995391 854271 691058 580489 701308 753194 748827
15403 748827 428367 -48085 -224332 -171398 -280695 -484577 -787109 -1099353 -1439602 -1356688
15393 -1356688 -895524 -272463 -58469 -28971 -213152 -224820 23345 77996 -41542 22459
15383 22459 62899 -88113 -353265 -71308 569213 907324 821657 527791 141791 -326511
15373 -326511 -565107 -730790 -695792 -304749 74296 -75654 -634083 -1050195 -870133 -204023
15363 -204023 198213 6735 -559362 -1081721 -1561959 -1747681 -1312828 -1064306 -1012131 -861712
15353 -861712 -799460 -1053789 -1079344 -912312 -770917 -411974 -166296 -579878 -812132 -846394
$$ packed form
15424a7024K64526R1131n3606j34642k94647k58177K02552Q8615P874L32151K92457
15413E21210L71513J58473O5951j21756j41120j63213j10569J20819N1886m367
15403G48827l20460m76452j76247N2934j09297k03882l02532l12244l40249Q2914
15393a356688M61164O23061K13994K9498j84181j1668K48165N4651j19538O4001
15383B2459M0440j51012k65152K81957O40521L38111q5667k93866l86000m68302
15373c26511k38596j65683L4998L91043L79045j49950n58429m16112J80062O66110
15363b04023M02236j91478n66097n22359m80238j85722M34853K48522N2175J50419
15353h61712O2252k54329k5555J67032J41395L58943K45678m13582k32254l4262
$$ plain form
15343 -846394 -469437 265746 575347 667596 927250 839057 408177 92145 -219674 -402842
15333 -402842 -250429 -71052 -55081 283099 459098 183075 -73638 -368368 -551941 -553855
15323 -553855 -725718 -617491 62083 327622 325923 425708 477721 237124 -77443 -354685
15313 -354685 -735876 -551492 -310752 -380012 -438825 -154663 145834 267757 -37876 -489440
15303 -489440 -518846 -400709 -442424 -641585 -748874 -844848 -642108 -389956 -40924 257090
15293 257090 188105 -26890 -257663 -466442 -605909 -530297 -250802 290400 738621 732558
15283 732558 547166 -16347 -374909 -392024 42350 342264 208426 -126992 -377990 -295935
15273 -295935 -317126 -429664 -322064 79812 289982 466960 580767 -16211 -597188 -974232
$$ packed form
15343h46394L76957P35183L09601R2249K59654q8193m30880l16032l11819j83168
15333d02842J52413J79377J5971L38180J75999k76023k56713k94730j83573j914
15323e53855j71863J08227O79574K65539j699R9785N2013k40597l14567k77242
15313c54685l81191J84384K40740o9260n8813K84162L00497J21923l05633m51564
15303d89440k9406J18137m1715j99161j07289r5974K02740K52152L49032K98014
15293B57090o8985k14995k30773k08779j39467P5612K79495N41202M48221o063
15283G32558j85392n63513l58562j7115M34374K99914j33838l35418k50998Q2055
15273b95935k1191j12538J07600M01876K10170J76978J13807n96978n80977l77044
$$ plain form
15263 -974232 -1019901 -928700 -978976 -997127 -825372 -647521 -581168 -291108 389589 644174
15253 644174 417893 67749 -361481 -700522 -799367 -718061 -838543 -577872 68766 364853
15243 364853 545163 218467 5073 -72110 -220908 -88428 79457 482972 660925 632800
15233 632800 299190 131549 -471973 -912149 -554358 -2627 686180 987652 894064 1177401
15223 1177401 1040424 495575 308732 239088 -37219 -114520 48547 -337581 -604899 -452925
15213 -452925 -387415 -272994 73596 50480 -625193 -1072452 -568567 -71113 86570 84169
15203 84169 -35209 -34654 90797 133909 -14364 49315 342856 571701 454722 50109 -130644
15192 -130644 -24264 -176626 -529545 -432291 -234965 -189710 -283660 -417422 -205103 41149
$$ packed form
15263i74232m5669R1201n0276j8151J71755J77851O6353K90060O80697K54585
15253F44174k26281l50144m29230l39041r8845Q1306j20482K60671O46638K96087
15243C64853J80310l26696k13394p7183j48798J32480J67885M03515J77953k8125
15233F32800l33610j67641o03522m40176L57791N51731O88807L01472r3588K83337
15223A177401j36977n44849j86843o9644k76307p7301J63067l86128k67318J51974
15213d52925O5510J14421L46590k3116o75673m47259N03885M97454J57683k401
15203H4169j19378N55J25451M3112j48273O3679K93541K28845j16979m04613j80753
15192a30644J06380j52362l52919R7254J97326M5255r3950j33762K12319K46252
$$ plain form
15182 41149 86333 -94068 -143761 -18788 191987 265561 285918 459308 461494 600303 510656
15171 510656 169525 -88902 -222456 -37312 -74978 -358841 -616790 -574617 -362215 -182343
15161 -182343 -209914 -116074 -186498 -574524 -876358 -892399 -855983 -225725 425387 553577
15151 553577 445700 97209 -100036 233537 435277 231314 -341554 -779048 -1104741 -1236568
15141 -1236568 -1008903 -664302 -349146 -39519 250879 97300 -110421 -392882 -588779
15132 -588779 -516052 -513319 -618257 -456402 -21606 110176 -215943 -380822 -263389 -367064
15122 -367064 -542199 -386581 -140959 -125319 -21853 193653 205454 -202606 -432750 -225747
15112 -225747 -97033 -242364 -8086 620146 632270 91745 -626578 -882619 -529321 -343468
$$ packed form
15182D1149M5184j80401m9693J24973K10775P3574K0357J73390K186J38809q9647
15171E10656l41131k58427j33554J85144l7666k83863k57949M2173K12402J79872
15161a82343k7571R3840p0424l88026l01834j6041L6416O30258O51112J28190
15151E53577j07877l48491j97245L33573K01740k03963n72868m37494l25693j31827
15141a236568K27665L44601L15156L09627K90398j53579k07721k82461j95897
15132e88779P2727K733j04938J61855M34796J31782l26119j64879J17433j03675
15122c67064j75135J55618K45622J5640J03466K15506J1801m08060k30144K07003
15112b25747J28714j45331K34278O28232J2124n40525p18323k56041L53298J85853
$$ plain form
15102 -343468 -622589 -1119895 -1352694 -1167133 -911804 -613878 -246221 -266264 -477032 -497378
15092 -497378 -588261 -707862 -763825 -303986 142404 -198474 -530155 -529999 -537935 -349023 -276326
15081 -276326 -91893 -241396 -360076 -304152 -354099 -45916 161698 218239 87331 -145839
15071 -145839 55223 502057 349143 105854 349581 345349 459934 415078 627385 876652
15061 876652 871028 818001 607372 441077 67215 -245516 -216747 -131097 32250 223872
15051 223872 318768 178986 92590 -27568 -247972 -358839 -59994 -6437 -297611 -48002
15041 -48002 369748 35730 -411682 -804691 -919225 -1114571 -1459595 -1287879 -597879 -161038
15031 -161038 -111943 -94669 -187186 -381583 -593409 -356987 29915 208022 179809 -159714
$$ packed form
15102c43468k79121m97306k32799J85561K55329K97926L67657k0043k10768k0346
15092d97378r0883j19601n5963M59839M46390l40878l31681J56p936J88912P2697
15081b76326J84433j49503j18680N5924m9947L08183K07614N6541j30908k33170
15071a45839K01062M46834j52914k43289K43727m232J14585m4856K12307K49267
15061H76652n624n3027k10629j66295l73862l12731K8769Q5650J63347J91622
15051B23872R4896j39782q6396j20158k20404j10867K98845N3557k91174K49609
15041d8002M17750l34018m47412l93009j14534j95346l45024J71716O90000M36841
15031a61038M9095J7274r2517j94397k11826K36422L86902J78107k8213l39523
$$ plain form
15021 -159714 -113378 168080 224835 266740 251633 153169 -240506 -560595 -1108535 -1654543
15011 -1654543 -1522508 -809744 -150488 9720 -413364 -587885 -514176 -428244 -84533 26202
15001 26202 -95068 -304536 -590516 -430664 -11975 167771 288797 393269 328806 156717
14991 156717 268228 488821 429797 375667 438618 305164 -98345 -319053 -300333 -91390
14981 -91390 -345267 -618061 -710426 -997881 -1084211 -708721 -563227 -548848 -830714 -772079
14971 -772079 -457016 -359522 -82607 -26431 -23385 61903 -148778 -459655 -655595 -483064
14961 -483064 -551552 -699418 -712248 -424652 -182199 40888 369226 294285 -79080 -343740
14951 -343740 -462796 -298148 -221547 -284880 -20047 205023 4471 196833 465514 420452
$$ packed form
15021a59714M6336K81458N6755M1905j5107r8464l93675l20089n47940n46008
15011a654543J32035P12764O59256J60208m23084j74521P3709Q5932L43711J10735
15001B6202j21270k09468k85980J59852M18689J79746J21026J04472o4463j72089
14991A56717J11511K20593n9024n4130O2951j33454m03509k20708J8720K08943
14981i1390k53877k72794r2365k87455q6330L75490J45494J4379k81866N8635
14971g72079L15063R7494K76915N6176L046Q5288k10681l10877j95940J72531
14961d83064o8488j47866j2830K87596K42453K23087L28338p4941l73365k64660
14951c43740j19056J64648P6601o3333K64833K25070k00552J92362K68681m5062
$$ plain form
14941 420452 119226 -154201 188663 541152 349066 217944 293733 84740 -389090 -774982
14931 -774982 -687865 -394496 112675 229095 -61554 -181379 -43451 -158573 -650091 -859055
14921 -859055 -784480 -562084 -258332 81601 369396 443896 49153 -461287 -336605 -331708
14911 -331708 -515711 -424366 -262009 -13284 260541 272088 -185966 -476432 -200936 240831
14901 240831 383681 414431 219770 -123129 -133329 148161 316537 146615 116112 6955
14891 6955 109754 220323 220109 32013 -29513 -219272 -500683 -640824 -665607 -651785 -640972
14880 -640972 -687796 -722481 -600993 -623396 -796826 -666226 -558801 -1132298 -1161587 -540848
14870 -540848 -222677 7457 -140621 -6320 306404 362032 415398 661785 682395 126393
$$ packed form
14941D20452l01226k73427L42864L52489j92086j31122P5789k08993m73830l85892
14931g74982Q7117K93369N07171J16420k90649j19825J37928j15122m91518k08964
14921h59055P4575K22396L03752L39933K87795P4500l94743n10440J24682M897
14911c31708j84003R1345J62357K48725K73825J1547m58054k90466K75496M41767
14901B40831J42850L0750j94661l42899j0200K81490J68376j69922l0503j09157
14891F955J02799J10569k14j88096o1526j89759k81411j40141k4783J3822J0813
14880f40972m6824l4685J21488k2403j73430J30600J07425n73497k9289O20739
14870e40848L18171K30134j48078J34301L12724N5628N3366K46387K0610n56002
$$ plain form
14860 126393 -353387 -892081 -1052614 -838289 -592035 -318828 97229 250087 134183 48682
14850 48682 -67916 37353 81788 -187260 -287637 -167638 638073 1343019 1460761 1263902
14840 1263902 714960 249272 112657 298799 382365 502911 999678 1362774 1184145 632114
14830 632114 -696 -344123 -371690 -187510 -86321 -316762 -542676 -740231 -645341 -123057
14820 -123057 486640 520031 -59869 -580176 -917046 -1162463 -1326145 -1176275 -775765 -794452
14810 -794452 -1131400 -1065099 -692662 -320048 -225479 -389313 -458922 -413061 -508896 -1041902
14800 -1041902 -1112045 -669311 -678221 -686643 -899715 -961621 -596307 -421037 -292065 -31021
14790 -31021 197116 175087 9965 151820 563260 941557 1122764 1212261 641785 121574
$$ packed form
14860A26393m79780n38694j60533K14325K46254K73207M16057J52858j15904q5501
14850D8682j16598J05269M4435k69048j00377J19999Q05711P04946J17742j96859
14840A263902n48942m65688j36615J86142Q3566J20546M96767L63096j78629n52031
14830F32114o32810l43427k7567J84180J01189k30441k25914j97555R4890N22284
14820a23057O09697L3391n79900n20307l36870k45417j63682J49870M00510j8687
14810g94452l36948O6301L72437L72614R4569j63834o9609M5861r5835n33006
14800a041902p0143M42734q910q422k13072o1906L65314J75270J28972K61044
14790c1021K28137k2029j65122J41855M11440L78297J81207Q9497n70476n20211
$$ plain form
14780 121574 416287 595430 516601 207086 64447 213292 78186 -249419 -231118 -258393
14770 -258393 -548079 -707622 -906958 -745403 -331621 -297965 -757262 -1094956 -790544 -263320
14760 -263320 213236 628282 799143 910161 604232 71627 -305281 -143546 311578 460302
14750 460302 436569 191976 -465275 -832213 -758066 -974959 -1157518 -1374305 -1252189 -871638
14740 -871638 -186251 457473 617500 222265 -386046 -495922 -461963 -134375 464354 652613
14730 652613 180118 -331932 -539677 -601778 -405122 -210744 -163951 68861 536111 514416
14720 514416 548185 723490 370112 22150 -108783 -249946 -222021 -275987 -490007 -562406
14710 -562406 -470169 -280801 -436253 -683103 -330068 455225 899451 954255 540239 229750
$$ packed form
14780A21574K94713J79143p8829l09515j42639J48845j35106l27605J8301k7275
14770b58393k89686j59543j99336J61555M13782L3656m59297l37694L04412N27224
14760b63320M76556M15046J70861J11018l05929n32605l76908J61735M55124J48724
14750D60302k3733k44593o57251l66938P4147k16893j82559k16787J22116L80551
14740h71638O85387O43724J60027l95235o08311j09876L3959L27588N98729J88259
14730F52613m72495n12050k07745o2101J96656J94378M6793K32812M67250k1695
14720E14416L3769J75305l53378l47962j30933j41163K7925n3966k14020p2399
14710e62406R2237J89368j55452k46850L53035P85293M44226N4804m14016l10489
$$ plain form
14700 229750 182132 246408 428690 475702 382461 175116 -394153 -465150 -570452 -793233
14690 -793233 -900994 -1080397 -914277 -813438 -778477 -809441 -685247 -391970 -373087 -325597
14680 -325597 -269489 2260 198580 644765 1149922 1048549 761569 641101 529772 284217
14670 284217 170896 135912 71624 49951 295852 330285 190090 -6116 -332570 -759842
14660 -759842 -881549 -1012654 -1195351 -905016 -905271 -903286 -600497 -391490 -245332 -44048
14650 -44048 -189776 -355533 -330535 -383717 -396078 -266451 -282790 -337870 -627456 -708794 -483357
14639 -483357 -339153 -511509 -673315 -426791 -39274 401762 726746 463055 -50447 -206188
14629 -206188 210764 625583 794283 758685 829705 1054552 1049806 729998 430928 356265
$$ packed form
14700B29750m7618O4276J82282M7012r3241k07345n69269p0997j05302k22781
14690g93233j07761j79403J66120J00839L4961l0964J24194K93277J8883M7490
14680c25597N6108K71749J96320M46185N05157j01373k86980j20468j11329k45555
14670B84217j13321l4984o4288k1673K45901L4433j40195j96206l26454m27272
14660g59842j21707j31105j82697K90335k55J985L02789K09007J46158K01284
14650d4048j45728j65757K4998n3182j2361J29627j6339n5080k89586q1338K25437
14639d83357J44204j72356j61806K46524L87517M41036L24984k63691n13502j55741
14629b06188M16952M14819J68700l5598P1020K24847m746l19808k99070p4663
$$ plain form
14619 356265 459205 831324 442413 -213237 -426948 -463841 -268382 -214963 -761627 -1330259
14609 -1330259 -1129192 -422504 159724 453273 570460 320735 -279851 -463186 -283843
14600 -283843 258244 704775 1081253 785452 88501 -550052 -662769 99758 570026 70404
14590 70404 -260703 -174735 -393934 -666732 -503649 -321184 -334730 -321418 72110 209928
14580 209928 268514 274214 73281 -67319 30473 -344917 -829822 -567032 -45427 558757
14570 558757 803391 292695 -567695 -517682 -198348 -285962 -362406 -611956 -648175 -540354
14560 -540354 -730606 -751004 -664547 -502455 -379268 -361184 -315741 -148435 -282301 -460023
14550 -460023 -560753 -340544 -88045 -121197 -516924 -681627 -349811 -527432 -686508 -925784
$$ packed form
14619C56265J02940L72119l88911o55650k13711l6893J95459N3419n46664n68632
14609a330259K01067P06688N82228K93549J17187k49725o00586j83335J79343
14600b83843N42087M46531L76478k95801o96951o38553j12717P62527M70268m99622
14590G0404l31107Q5968k19199k72798J63083J82465j3546J3312L93528J37818
14580B09928N8586N700k00933j40600R7792l75390m84905K62790N21605O04184
14570E58757K44634n10696q60390N0013L19334q7614p6444k49550l6219J07821
14560e40354j90252k0398Q6457J62092J23187J8084M5443J67306j33866j77722
14550d60023j00730K20209K52499l3152l95727j64703L31816j77621j59076k39276
$$ plain form
14540 -925784 -1558713 -1709469 -1190904 -936993 -801498 -375973 -145950 -452694 -571527 -210898
14530 -210898 -94330 -323627 -579843 -435238 -88130 -33380 -176892 -368212 -430934 -227838
14520 -227838 106885 146634 -311050 -479228 -176183 318697 527012 190337 -236775 -361447
14510 -361447 -201175 -122713 -361007 -730349 -602421 -468915 -933717 -1013570 -492929 54794
14500 54794 45630 83228 183516 -86919 116964 411407 652230 1062694 1373546 1011471
14490 1011471 332333 -147864 -86868 7637 -154112 196874 124106 -245701 -96360 -149844
14480 -149844 -269486 -315415 -689802 -1184940 -1380492 -1167494 -590631 -237062 -90523 -63515
14470 -63515 32200 273764 966348 1330148 892410 542332 579228 449358 174915 49003
$$ packed form
14540i25784o32929j50756N18565K53911J35495M25525K30023l06744j18833L60629
14530b10898J16568k29297k56216J44605L47108N4750j43512j91320o2722K03096
14520b27838L34723L9749m57684j68178L03045M94880K08315l36675m27112j24672
14510c61447J60272P8462k38294l69342J27928J33506m64802p9853N20641N47723
14500E4794r164L7598J00288k70435K03883K94443K40823M10464L10852l62075
14490A011471o79138m80197O0996R4505j61749L50986p2768l69807J49341n3484
14480a49844j19642m5929l74387m95138j95552K12998N76863L53569J46539K7008
14470f3515R5715K41564O92584L63800m37738l50078L6896j29870k74443j25912
$$ plain form
14460 49003 -27288 78711 -71184 -326168 -537444 -849300 -1206407 -861841 -419210 -120263
14450 -120263 222628 84995 -279378 -658767 -976553 -896285 -262677 209846 27068 -218659
14440 -218659 -162059 73952 401770 250989 20541 -422654 -917387 -939980 -685245 -503261
14430 -503261 -386308 -488972 -605995 -56280 611556 809998 907419 566341 -97581 -743457
14420 -743457 -703865 -151924 133082 527706 1091829 1110843 512308 -169131 -476293 -274262
14410 -274262 87753 74617 -173884 39207 14554 19673 92258 -1802 -39613 -9787 232609
14399 232609 291241 -115978 -417299 -488215 -66690 307767 30213 304689 908363 932029
14389 932029 622632 323283 305326 342479 426635 254349 80828 145271 -116040 -269078
$$ packed form
14460D9003p6291J05999j49895k54984k11276l11856l57107L44566M42631K98947
14450a20263L42891j37633l64373l79389l17786Q0268O33608M72523j82778k45727
14440b18659N6600K36011L27818j50781k30448m43195m94733k2593K54735J81984
14430e03261J16953j02664j17023N49715O67836J98442R7421l41078o63922o45876
14420g43457L9592N51941K85006L94624N64123J9014n98535o81439l07162K02031
14410b74262L62015j3136k48501K13091k4653N119P2585r4060l7811K9826K42396
14399B32609N8632m07219l01321p0916M21525L74457k77554K74476O03674K3666
14389I32029l09397k99349j7957L7153Q4156j72286j73521O4443k61311j53038
$$ plain form
14379 -269078 -221806 -228936 -284367 -70396 108035 232682 396730 575560 461072 283883
14369 283883 -87519 -514461 -870094 -1410815 -1455081 -753433 -392132 -280645 -132668 79109
14359 79109 381045 255022 -11210 -434027 -655870 -280659 -284938 -391511 -477712 -800760
14349 -800760 -713450 -339606 -16672 65572 -40254 -480629 -963000 -920550 -741791 -194352
14339 -194352 371272 572260 791133 468039 -155418 -441423 -281943 -58501 247139 526491
14329 526491 697001 607643 388668 218175 -37748 -57142 153994 -21772 -216302 88639
14319 88639 406582 644920 578027 490374 229267 -99792 -198629 -368138 -258980 -47581
14309 -47581 -261435 -261667 284698 542208 761592 527266 315060 113590 -316915 -723682
$$ packed form
14379b69078M7272p130n5431K13971J78431J24647J64048J78830j14488j77189
14369B83883l71402m26942l55633n40721m4266P01648L61301J11487J47977K11777
14359G9109L01936j26023k66232m22817k21843L75211m279j06573q6201l23048
14349h00760Q7310L73844L22934Q2244j05826m40375m82371M2450J78759N47439
14339a94352N65624K00988K18873l23094o23457k86005J59480K23442L05640K79352
14329E26491J70510q9358k18975j70493k55923j9394K11136j75766j94530L04941
14319H8639L17943K38338o6893q7653k61107l29059r8837j69509J09158K11399
14309d7581k13854k32N46365K57510K19384k34326k12206k01470m30505m06767
$$ plain form
14299 -723682 -833852 -1006956 -910547 -267239 107579 143883 190617 -279376 -747905 -475403
14289 -475403 159758 377825 -67213 -319432 -20093 213506 146142 116445 28160 -72070
14279 -72070 -305394 -573278 -651256 -465384 -31305 526232 1052101 841970 322764 177300
14269 177300 213676 337570 541167 176746 -364974 -420164 -511803 -748425 -753839 -527334
14259 -527334 -542964 -384694 -131319 13830 197039 152319 104952 121926 -190103 -570370
14249 -570370 -343365 -106418 -353907 -696397 -852942 -481890 91949 54495 96490 266981
14239 266981 462471 479058 516397 759949 840020 603052 359565 -110068 -232299 49203
14229 49203 219188 308944 20043 -437440 -785718 -851055 -777306 -531792 80182 562541
$$ packed form
14299g23682j10170j73104R6409O43308L74818L6304M6734m69993m68529K72502
14289d75403O35161K18067m45038k52219K99339K33599o7364k9697q8285j00230
14279g2070k33324k67884p7978J85872M34079N57537N25869k10131n19206j45464
14269A77300L6376J23894K03597l64421n41720n5190r1639k36622n414K26505
14259e27334j5630J58270K53375J45149J83209m4720m7367J6974l12029l80267
14249e70370K27005K36947k47489l42490j56545L71052N73839l7454M1995J70491
14239B66981J95490J6587L7339K43552Q0071k36968k43487m69633j22231K81502
14229D9203J69985Q9756k88901m57483l48278o5337P3749K45514O11974M82359
$$ plain form
14219 562541 688983 753536 404059 -61426 -534822 -1025474 -1095607 -893493 -393391 1739
14209 1739 185113 16369 -132551 -272641 -362711 47545 532329 664509 829409 1101615
14199 1101615 711851 173163 109057 142706 321906 563603 1113598 1148763 460589 188222
14189 188222 -118522 -150953 34186 -113196 -218276 2493 97900 281355 472092 210956
14179 210956 -324273 -602556 -581759 -662351 -679867 -538889 -329439 -150136 130427 43903
14169 43903 203797 931099 874804 653718 417374 -270667 -618495 -294810 -189290 -337926
14159 -337926 36962 251124 232489 112135 -147063 -314148 -435710 -367210 -273183 -347923
14149 -347923 -113914 312052 362190 224081 251034 234993 150052 -394899 -846339 -829402
$$ packed form
14219E62541J26442O4553l49477m65485m73396m90652p0133K02114N00102L95130
14209A739J83374j68744j48920j40090r0070M10256M84784J32180J64900K72206
14199A101615l89764n38688o4106L3649J79200K41697N49995L5165o88174k72367
14189A88222l06744l2431J85139j47382j05080K20769R5407J83455J90737k61136
14179B10956n35229k78283K0797q0592j7516J40978K09450J79303K80563q6524
14169D3903J59894P27302n6295k21086k36344o88041l47828L23685J05520j48636
14159c37926L74888K14162j8635j20354k59198j67085j21562O8500R4027p4740
14149c47923K34009M25966N0138j38109K6953j6041q4941n44951m51440J6937
$$ plain form
14139 -829402 -777431 -391443 -175533 -207809 89225 462778 334185 -93619 -155704 11057
14129 11057 -264768 -239647 -190021 -281245 -428552 -629666 -650043 -615932 -528017 -749017 -885024
14118 -885024 -602702 -170193 244088 334888 -274456 -960676 -763237 -461732 -466369 -763072
14108 -763072 -1190611 -1390040 -1276209 -1258079 -1151148 -963135 -809259 -576076 -615302 -972518
14098 -972518 -1142321 -1276271 -1148352 -1141024 -1144360 -887238 -707531 -938170 -842794 -345803
14088 -345803 -285588 -647771 -985797 -1029863 -861918 -484696 -120996 275667 462510 431775
14078 431775 204656 -203557 -492839 -472818 -124115 203310 412882 119991 -230338 -108083
14068 -108083 118432 508209 817247 730822 719683 925733 1109491 1056536 785720 90796
$$ packed form
14139h29402N1971L85988K15910l2276K97034L73553j28593m27804o2085J66761
14129A1057k75825K5121M9626r1224j47307k01114k0377L4111Q7915k21000j36007
14118h85024K82322M32509M14281R0800o09344o86220J97439L01505m637k96703
14108g63072m27539j99429J13831J8130J06931J88013J53876K33183l9226l57216
14098i72518j69803j33950J27919P328l336K57122J79707k30639R5376M96991
14088c45803O0215l62183l38026m4066J67945L77222L63700L96663J86843l0735
14078D31775k27119m08213k89282K0021L48703L27425K09572k92891l50329J22255
14068a08083K26515L89777L09038q6425j1139K06050J83758n2955k70816o94924
$$ plain form
14058 90796 -623705 -621703 -59032 536715 963419 950079 963051 1034360 829607 729152 699914
14047 699914 560476 832849 862024 487802 377323 135521 -426969 -518935 -476810 -142040
14037 -142040 481487 774633 587282 80866 -98082 -48469 -114644 -193429 -441649 -643186
14027 -643186 -762952 -1040716 -1209162 -1164149 -927977 -701547 -663029 -653100 -675378 -498851
14017 -498851 -604710 -807099 -697196 -481654 -185941 -316627 -453715 -543030 -606860 -488833
14007 -488833 94208 278606 181806 359345 323530 -124208 -549038 -684647 -822620 -765107
13997 -765107 -513745 -268501 19707 101415 38295 -192943 -121049 158727 520417 541203
13987 541203 -263952 -758704 -383856 267144 525026 265916 235528 140857 17551 -162088
$$ packed form
14058I0796p14501K002N62671N95747M26704j3340J2972P1309k04753j00455k9238
14047F99914j39438K72373K9175l74222j10479k41802n62490r1966M2125L34770
14037a42040O23527K93146j87351n06416j78948M9613o6175p8785k48220k01537
14027f43186j19766k77764j68446M5013K36172K26430L8518R929k2278J76527
14017d98851j05859k02389J09903K15542K95713j30686j37088q9315o3830J18027
14007d88833N83041J84398r6800J77539l5815m47738m24830j35609j37973N7513
13997g65107K51362K45244K88208Q1708o3120k31238P1894K79776L61690K0786
13987E41203q05155m94752L74848O51000K57882k59110l0388r4671j23306j79639
$$ plain form
13977 -162088 -296830 -306389 -322120 -499793 -715845 -1195259 -1464558 -1260779 -964868 -550263
13967 -550263 -393534 -432517 -350418 -646939 -1442401 -2164188 -2225621 -1380528 -619635 -238651
13957 -238651 114903 126784 126092 312422 503517 462858 567831 444589 365965 160651 -293258
13946 -293258 -662164 -580663 -194310 -375545 -761870 -798640 -363364 -73965 21133 -9006
13936 -9006 65890 35956 277748 551363 283193 -340440 -701083 -584096 -111230 186712
13926 186712 221497 286281 388346 587423 829872 1090884 1031186 824870 849525 619328
13916 619328 466158 180761 -221854 -247581 -101386 -65028 -427203 -940290 -1181514 -1385661
13906 -1385661 -1154528 -592580 -96197 259618 284163 111098 -453206 -349752 -61337 115345
$$ packed form
13977a62088j34742r559j5731j77673k16052m79414k69299K03779K95911M14605
13967e50263J56729l8983Q2099k96521p95462p21787o1433Q45093P60893L80984
13957b38651L53554J1881o92J86330J91095m0659J04973j23242p8624k05314m53909
13946b93258l68906Q1501L86353j81235l86325l6770M35276K89399R5098l0139
13936i006P4896k9934K41792K73615k68170o23633l60643J16987M72866K97942
13926A86712L4785O4784J02065J99077K42449K61012n9698k06316K4655k30197
13916F19328j53170k85397m02615k5727J46195L6358l62175n13087k41224k04147
13906a385661K31133N61948M96383L55815K4545j73065n64304J03454K88415J76682
$$ plain form
13896 115345 256805 334196 338371 152933 22087 214741 782955 1211388 1216916 1211705 1288862
13885 1288862 958845 439021 286278 634194 846998 756748 426384 303529 -213247 -433693
13875 -433693 154397 427922 500180 565532 299565 -215897 -344312 68950 516889 849706
13865 849706 646922 120917 -155018 -459050 -1009602 -1342108 -1105165 -915708 -878237 -887433
13855 -887433 -1103884 -1040730 -498544 -11111 281398 337943 347444 47099 -390176 -389187 -161189
13844 -161189 104200 159276 237988 -98023 -298351 -17365 259609 229994 -121761 -438751
13834 -438751 -257235 -209132 -328614 -390100 -402130 -191868 -367568 -343236 -296961 -171197
13824 -171197 -479014 -1074284 -1049950 -562460 -368485 -484559 -487203 -243546 211127 448621
$$ packed form
13896A15345J41460P7391M175j85438j30846J92654N68214M28433N528n211P7157
13885A288862l30017n19824j52743L47916K12804r0250l30364j22855n16776k20446
13875d33693N88090K73525P2258O5352k65967n15462j28415M13262M47939L32817
13865H49706k02784n26005k75935l04032n50552l32506K36943J89457L7471r196
13855h87433k16451O3154N42186M87433K92509N6545R501l00345m37275R89K27998
13844a61189K65389N5076P8712l36011k00328K80986K76974k9615l51755l16990
13834d38751J81516M8103j19482o1486j2030K10262j75700K4332M6275J25764
13824a71197l07817n95270K4334M87490J93975j16074k644K43657M54673K37494
$$ plain form
13814 448621 158255 -148856 -334780 -545048 -789732 -1039149 -928904 -429918 121588 467670
13804 467670 900361 1115302 978758 491840 -211799 -244299 -113625 -221656 -177442 -215417
13794 -215417 -362264 -653270 -561770 -101499 -183838 -662146 -720344 -466680 -446328 -743340
13784 -743340 -982028 -413062 -105345 -141831 -91915 40284 170817 160647 119109 -94361
13774 -94361 -198356 289301 580157 15579 -427034 -635636 -558634 -291261 -455522 -667551
13764 -667551 -740816 -577918 -128644 291120 460491 190220 139289 -118555 -625284 -1050155
13754 -1050155 -1252967 -963046 -687651 -560696 -467828 -578841 -1046762 -972379 -1010975 -970665
13744 -970665 -645422 -749848 -516793 -276349 -462529 -503880 -246366 -6330 -64550 -171344
$$ packed form
13814D48621k90366l07111j85924k10268k44684k49417J10245M98986N51506L46082
13804D67670M32691K14941j36544m86918p03639l2500J30674j08031M4214l7975
13794b15417j46847k91006R1500M60271q2339m78308n8198K53664K0352k97012
13784g43340k38688N68966L07717l6486M9916J32199J30533j0170m1538k13470
13774i4361j03995M87657K90856n64578m42613k08602P7002K67373j64261k12029
13764f67551p3265J62898M49274M19764J69371k70271n0931k57844n06729m24871
13754a050155k02812K89921K75395J26955R2868j11013m67921P4383l8596M0310
13744i70665L25243j04426K33055K40444j86180m1351K57514K40036n8220j06794
$$ plain form
13734 -171344 -324095 -428248 -274708 56101 342447 340804 434700 368752 232753 273624
13724 273624 785227 1006248 554396 -210401 -524627 -40430 543922 425025 -378495 -772597
13714 -772597 -922404 -458935 -21289 -230349 -305882 -195449 -151586 -11116 -113098 -434974
13704 -434974 -754657 -989437 -669926 -362709 -269731 -294948 -664325 -833620 -530581 -393140
13694 -393140 -137707 345805 776877 980890 542907 -263320 -945994 -1264692 -1487979 -1614511
13684 -1614511 -1423940 -1004715 -721868 -795274 -794463 -654826 -525725 -683024 -966015 -756358
13674 -756358 -868919 -1271901 -1145806 -824731 -406842 -149752 -18147 -241429 -354383 -383762
13664 -383762 -45153 298069 449334 229600 -278078 -639818 -826262 -794374 -861459 -1049621
$$ packed form
13734a71344j52751j04153J53540L30809K86346j643R3896o5948j35999M0871
13724B73624N11603K21021m51852p64797l14226M84197N84352j18897q03520l94102
13714g72597j49807M63469M37646k09060p5533J10433M3863J40470j01982l21876
13704d34974l19683k34780L19511L07217R2978k5217l69377j69295L03039J37441
13694c93140K55433M83512M31072K04013m37983q06227o82674l18698k23287j26532
13684a614511J90571M19225K82847p3406Q11J39637J29101j57299k82991K09657
13674g56358j12561m02982J26095L21075M17889K57090J31605k23282j12954k9379
13664c83762L38609L43222J51265k19734n07678l61740j86444L1888o7085j88162
$$ plain form
13654 -1049621 -1400048 -1277489 -611302 -388355 -460687 -526983 -665607 -906150 -1139799 -616444
13644 -616444 -355597 -581845 -684309 -161766 -40308 -246513 -109871 21703 -140497 -41847
13634 -41847 169019 62514 -272382 -577959 -602306 -557266 -713397 -622853 -466954 -539411
13624 -539411 -604200 -643420 -604142 -364969 -125763 -370833 -743903 -783396 -424279 -201035
13614 -201035 -46769 160545 253342 228206 287523 290474 634351 666836 396872 468128 421508
13603 421508 343884 417401 91926 -649038 -806426 -528807 -291538 -185584 -376699 -755513
13593 -755513 -979646 -811035 -253586 229333 -2845 -347157 -458624 -457493 27124 350248
13583 350248 64225 -410967 -361140 -193698 -88109 -161827 -407287 -502905 -527557 -236614
$$ packed form
13654a049621l50427J22559O66187K22947p2332o6296j38624k40543k33649N23355
13644f16444K60847k26248j02464N22543J21458k06205J36642J31574j62200R8650
13634d1847K10866j06505l34896l05577k4347M5040j56131R0544J55899p2457
13624e39411o4789l9220L9278K39173K39206k45070l73070l9493L59117K23244
13614b01035J54266K07314R2797k5136N9317K951L43877L2485k69964P1256m6620
13603D21508p7624P3517l25475p40964j57388K77619K37269J05954j91115l78814
13593g55513k24133J68611N57449M82919k32178l44312j11467J131M84617L23124
13583C50248k86023m75192M9827J67442J05589p3718k45460r5618k4652K90943
$$ plain form
13573 -236614 330 33496 122606 653420 1123287 1186424 818421 145757 -111871 112273
13563 112273 114337 -166973 -308981 -462 224764 267973 201907 98776 172225 89394 212523
13552 212523 175256 17614 -69728 -446982 -961563 -983104 -417980 -2710 257944 505518
13542 505518 574345 612040 74601 -651379 -888033 -853304 -570161 -294522 -255079 -198168
13532 -198168 -114629 -99984 71445 174948 -429411 -954451 -1112056 -1064957 -822947 -601849
13522 -601849 -334248 -167853 -375525 -680721 -743413 -686419 -782449 -923479 -370344 104329
13512 104329 -51825 -310058 -530201 -786219 -910960 -847650 -435681 46705 -161540 -701755
13502 -701755 -513132 -63577 24169 -540396 -813364 -889715 -660366 -704263 -962795 -825396
$$ packed form
13573b36614K36944L3166Q9110N30814M69867O3137l68003o72664k57628K24144
13563A12273K064k81310j42008L08519K25226M3209o6066j03131P3449q2831J23129
13552B12523l7267j57642q7342l77254n14581k1541N65124M15270K60654K47574
13542E05518O8827L7695n37439p25980k36654L4729K83143K75639L9443N6911
13532a98168Q3539J4645J71429J03503o04359n25040j57605M7099K42010K21098
13522f01849K67601J66395k07672l05196o2692N6994r6030j41030N53135M74673
13512A04329j56154k58233k20143k56018j24741O3310M11969M82386k08245n40215
13502g01755J88623M49555Q7746n64565k72968p6351K29349m3897k58532J37399
$$ plain form
13492 -825396 -422816 -352940 -606898 -822578 -727161 -821019 -1106217 -1110477 -912061 -743084
13482 -743084 -369800 29329 -264759 -498049 -372298 -122702 -273376 -782241 -950460 -638241
13472 -638241 -519903 -422139 -296104 -42789 84888 -192934 -271550 -427734 -768712 -1094402
13462 -1094402 -797276 -620709 -910448 -1001963 -627430 -121791 384834 847335 813883 564270
13452 564270 430932 145677 -30001 44910 85383 99793 -59524 46886 216771 111224
13442 111224 -212979 113605 620926 755781 609675 586745 775540 942793 954800 1109134
13432 1109134 910144 369218 -53037 -248718 -81607 423651 516348 534714 633290 464126
13422 464126 136688 44134 240440 336594 499608 441565 9242 -259986 -311740 -326130
$$ packed form
13492h25396M02580O9876k53958k15680R5417r3858k85198m260J98416J68977
13482g43084L73284L99129k94088k33290J25751K49596j50674n08865j68219L12219
13472f38241J18338R7764J26035K53315J27677k77822p8616j56184l40978l25690
13462a094402K97126J76567k89739r1515L74533N05639N06625M62501l3452k49613
13452E64270j33338k85255j75678P4911M0473J4410j59317J06410J69885j05547
13442A11224l24203L26584N07321J34855j46106k2930J88795J67253J2007J54334
13432A109134j98990n40926m22255j95681J67111N05258R2697J8366R8576j69164
13422D64126l27438r2554J96306R6154J63014n8043m32323k69228n1754j4390
$$ plain form
13412 -326130 -341640 -435055 -600152 -366017 -25288 90144 244465 157064 -172202 -229405
13402 -229405 -15772 154690 45799 -39151 262872 455679 260328 -149262 -338161 -553020
13392 -553020 -498092 -553582 -638890 -320188 -105755 -260102 -267602 -17466 415436 841121
13382 841121 942641 752244 531556 343834 304078 692900 782981 468854 196155 91329
13372 91329 14800 55431 -102783 -205856 -7741 258102 176781 93443 428967 366431 -35699
13361 -35699 -170826 -75252 -238570 -45987 683497 1231519 1353889 1057375 635457 333166
13351 333166 113758 350951 1072151 1453033 1130037 584712 379357 468998 692154 619726
13341 619726 122567 -203420 -119090 -431221 -865091 -734636 -663009 -398128 -183789 -236861
$$ packed form
13412c26130j5510r3415j65097K34135L40729J15432J54321q7401l29266n7203
13402b29405K13633J70462j08891q4950L02023J92807j95351m09590j88899k14859
13392e53020N4928n5490q5308L18702K14433j54347p500K50136M32902M25685
13382H41121J01520j90397k20688j87722l9756L88822R0081l14127k72699j04826
13372I1329p6529M0631j58214j03073J98115K65843q1321q3338L35524o2536m02130
13361c5699j35127R5574j63318J92583P29484N48022J22370k96514m21918l02291
13351C33166k19408K37193P21200L80882l22996n45325k05355Q9641K23156p2428
13341F19726m97159l25987Q4330l12131m33870J30455P1627K64881K14339n3072
$$ plain form
13331 -236861 -104494 -2664 -67119 237004 511758 433986 371480 452861 347127 224750
13321 224750 556277 861887 576260 66028 -127884 -226808 -169654 50241 325405 428727
13311 428727 -155112 -642287 -513670 -85558 110439 82421 168124 245399 183930 334881
13301 334881 217986 4904 83589 -72530 -456140 -755207 -1074946 -1267586 -1077518 -623287
13291 -623287 -661358 -684299 -213414 447988 926381 657533 126149 -113454 77148 405154
13281 405154 775525 749013 468919 183328 36944 -20649 -115795 -27736 1408 -10726 163354
13270 163354 674589 1097211 891050 161824 -506829 -751523 -383730 320478 774825 1075149
13260 1075149 1024571 657346 284442 268465 -38369 -243870 8782 376943 721108 709344
$$ packed form
13331b36861J32367J01830o4455L04123K74754p7772o2506Q1381j05734j22377
13321B24750L31527L05610k85627n10232j93912r8924N7154K19895K75164J03322
13311D28727n83839m87175J28617M28112J95997k8018Q5703P7275o1469J50951
13301C34881j16895k13082P8685j56119l83610k99067l19739j92640J90068M54231
13291f23287l8071k2941M70885O61402M78393k68848n31384k39603J90602L28006
13281D05154L70371k6512k80094k85591j46384n7593r5146Q8059K9144j2134J74080
13270A63354N11235M22622k06161p29226o68653k44694L67793P04208M54347L00324
13260A075149n0578l67225l72904j5977l06834k05501K52652L68161L44165j1764
$$ plain form
13250 709344 298872 -142687 44490 566268 716875 620081 363022 -129130 -189242 228646
13240 228646 472698 649279 480144 286995 371558 852621 1198815 1103307 984730 818257
13230 818257 1202294 1489986 1455220 1486975 1781639 1774043 1379976 1248950 1175474 1416825
13220 1416825 1661433 1431602 934227 242256 -173847 95200 277014 436910 333040
13211 333040 177361 153994 480622 562143 267553 -119942 -444373 -102347 418911 811954
13201 811954 1057708 884856 382782 -114980 -39875 574759 1383451 1473402 882641 434806
13191 434806 158499 352265 913926 1156044 940105 946323 1473990 1670283 1324069 825477
13181 825477 309466 -76903 -152469 -68064 246553 789771 1028711 891496 836021 694969
$$ packed form
13250G09344m10472m41559J87177N21778J50607r6794k57059m92152o0112M17888
13240B28646K44052J76581j69135j93149Q4563M81063L46194r5508j18577j66473
13230H18257L84037K87692l4766L1755K94664p596l94067j31026p3476K41351
13220A416825K44608k29831m97375o91971m16103K69047J81814J59896j03870
13211C33040j55679k3367L26628Q1521k94590l87495l24431L42026N21258L93043
13201H11954K45754j72852n02074m97762P5105O14634Q08692Q9951n90761m47835
13191D34806k76307J93766N61661K42118k15939O218N27667J96293l46214m98592
13181H25477n16011l86369p5566Q4405L14617N43218K38940j37215n5475j41052
$$ plain form
13171 694969 507349 171225 138420 299679 203885 225673 268393 308099 303260 355815 577517
13160 577517 1085492 1222622 1255870 1180635 1003595 988718 912001 907970 905774 667342 408079
13149 408079 415722 969999 1500995 1869748 2026452 1807922 1237310 922393 753811 509045
13139 509045 637442 820429 933221 1090293 1148154 858802 673638 657572 582438 719325
13129 719325 1087710 1458978 1571712 1464025 1163388 839403 682822 637373 537007 439579
13119 439579 263355 284175 762238 1212022 1553152 1926277 1933063 1775326 1841394 2035486
13109 2035486 1700369 1327251 1326616 1211669 1098124 1067104 933194 1217587 1463660 933638
13099 933638 344437 1058 -47769 204964 483407 875827 1239906 1335905 1660797 2281911
$$ packed form
13171F94969j87620l36124l2805J61259r5794K1788M2720L9706m839N2555K21702
13160E77517N07975J37130L3248p5235j77040j4877p6717m031k196k38432k59263
13149D08079P643N54277N30996L68753J56704k18530n70612l14917j68582k44766
13139E09045J28397J82987J12792J57072N7861k89352j85164j6066p5134J36887
13129G19325L68385L71268J12734j07687l00637l23985j56581m5449j00366r7428
13119D39579j76224K0820M78063M49784L41130L73125O786j57737O6068J94092
13109B035486l35117l73118o35j14947j13545l1020j33910K84393K46073n30022
13099I33638n89201l43379m8827K52733K78443L92420L64079R5999L24892O21114
$$ plain form
13089 2281911 2562773 2494174 2063790 1582680 1515641 1486478 1810570 1971928 1740414 1159780
13079 1159780 908754 1310501 1448413 1221533 1264460 1833561 2352133 2260705 2156303 2266970
13069 2266970 2405097 2708519 2763358 2326968 2043159 2313277 2671605 2914034 3139568 3048865
13059 3048865 2905619 2653518 2510696 2275003 1942675 2347587 2867174 3163540 3289816
13050 3289816 2847816 2277942 2315065 3399660 4361400 4214718 3842744 3572493 3428172
13041 3428172 3541430 3646965 3369872 3276428 3459391 3879357 3995924 3424316 3194028 3503482
13031 3503482 3982082 4557837 5162161 5625583 5738306 5524885 5164837 5070270 5200695 5687780
13021 5687780 6419374 6987196 7035474 6830765 6781556 6785274 6948583 7330550 7800496 8206795
$$ packed form
13089B281911K80862o8599m30384m81110o7039k9163L24092J61358k31514n80634
13079A159780k51026M01747J37912k26880M2927N69101N18572r1428j04402J10667
13069B266970J38127L03422N4839m36390k83809K70118L58328K42429K25534r0703
13059C048865j43246k52101j42822k35693l32328M04912N19587K96366J26276
13050C289816m42000n69874L7123J084595R61740j46682l71974k70251j44321
13041C428172J13258J05535k77093r3444J82963M19966J16567n71608k30288L09454
13031C503482M78600N75755O04324M63422J12723k13421l60048r4567J30425M87085
13021E687780P31594N67822M8278k04709m9209L718J63309L81967M69946M06299
$$ plain form
13011 8206795 8740481 9434128 10061370 10301583 10678424 11282037 11585592 12117026 12992657
13002 12992657 13589897 13953896 14234443 14998162 16377972 18039386 19977075 21595247 23570670
12993 23570670 26391807 29569808 33562003 38727179 45273053 52543017 61028388 71462714
12985 71462714 84584464 100763788 120942744 147338458 181968870 227375763 286756073
12978 286756073 361530196 442584431 501344894 504239890 450118244 371231292 296493815
12971 296493815 236145189 190315880 155444785 128692047 107981063 91374993 78179168
12964 78179168 67905071 59458317 52559343 46652236 41847530 37673504 34026097 31131054
12956 31131054 28694243 26589356 24528870 22867159 21562731 19840654 17992739 17040667
$$ packed form
13011H206795N33686O93647O27242K40213L76841O03613L03555N31434Q75631
13002A2992657N97240L63999K80547P63719J379810J661414J937689J618172J975423
12993B3570670K821137L178001L992195N165176O545874P269964Q485371J0434326
12985G1462714J3121750J6179324K0178956K6395714L4630412M5406893N9380310
12978B86756073P4774123Q1054235N8760463K894996n4121646p8886952p4737477
12971B96493815o0348626m5829309l4871095k6752738k0710984j6606070j3195825
12964G8179168j0274097q446754o898974n907107m804706m174026l647407k895043
12956C1131054k436811k104887k060486j661711j304428j722077j847915r52072
$$ plain form
12948 17040667 16824967 16311596 15341286 14402506 13624635 13121899 12685046 12620004 12489955
12939 12489955 12016477 11399852 10852228 10619786 10626861 10950768 10946512 10714110 10563379 11072451
12929 11072451 11616346 11812260 11932028 11650674 11548536 12212403 13345488 14600984 15801007
12920 15801007 17180662 18415882 19749883 21403421 22733621 23251000 22642885 22085189
12912 22085189 22069067 22472051 23091912 23986890 25540292 27689560 30407336 33365239 37117358
12903 37117358 41709633 47672332 55192098 64391977 75436957 88852711 105807094 127229885
12895 127229885 154694828 190516669 238522761 302408057 382365575 465874367 518858406
12888 518858406 508078356 442334011 359059917 284510405 226057978 181553699 147900789
$$ packed form
12948A7040667k15700n13371r70310r38780p77871n02736m36853o5042j30049
12939A2489955m73478o16625n47624k32442P075L23907m256k32402j50731N09072
12929A1072451N43895J95914J19768k81354j02138O63867J133085J255496J200023
12920A5801007J379655J235220J334001J653538J330200N17379o08115n57696
12912B2085189j6122M02984O19861Q94978J553402K149268K717776K957903L752119
12903C7117358M592275N962699P519766R199879J1044980J3415754J6954383K1422791
12895A27229885K7464943L5821841M8006092O3885296P9957518Q3508792N2984039
12888E18858406j0780050o5744345q3274094p4549512n8452427m4504279l3652910
$$ plain form
12881 147900789 121972099 101980467 86912124 75559482 65886885 57818532 51052682
12874 51052682 44934377 40155819 36061039 32970994 30111782 27129396 24661538 22584398
12866 22584398 21129747 20336341 19512717 18722371 17887961 16532411 15445063 14925664 14308355
12857 14308355 13452578 12635549 12007895 11697647 11180144 10556432 10164792 10014956 9850616
12848 9850616 9742507 9790108 9910120 10229679 10362355 10402273 10170538 9963292 9862999 9668377
12838 9668377 9579403 9721605 10114738 10488123 11201694 12244535 13468532 13932147 14236721
12829 14236721 14955948 15468640 15850556 16547346 17632655 19270221 20996286 22276021 24238791
12820 24238791 26782057 29811211 33363975 37519113 42397480 48625961 56358160 65456484
$$ packed form
12881A47900789k5928690j9991632j5068343j1352642r672597q068353o765850
12874E1052682o118305m778558m094780l090045k859212k982386k467858k077140
12866B2584398j454651p93406q23624p90346q34410j355550j087348n19399o17309
12857A4308355q55777q17029o27654l10248n17503o23712l91640j49836j64340
12848I850616j08109M7601J20012L19559J32676L9918k31735k07246j00293j94622
12838I668377q8974J42202L93133L73385P13571J042841J223997M63615L04574
12829A4236721P19227N12692L81916O96790J085309J637566J726065J279735J962770
12820B4238791K543266L029154L552764M155138M878367O228481P732199R098324
$$ plain form
12812 65456484 76991505 91546167 109314777 131458714 160485432 199274954 250174863
12805 250174863 315578523 394142702 470152055 509359386 486941163 417966589 337718919
12798 337718919 267945600 213533424 172433128 141172536 116907900 97898412 82942811
12791 82942811 70937702 61236128 53722649 47577076 42224667 37498680 33437865 29796944
12783 29796944 26987397 25266060 23395211 21147867 19178419 17548311 16506004 15647389
12775 15647389 14691056 13485420 12132027 10945325 10251000 10074386 9766100 9084061 8496257
12766 8496257 7922895 7225794 6792534 6026362 5173751 5068691 5666869 5633966 4884263 4253197
12756 4253197 4139818 4199953 4110738 4104915 4021741 3938896 3733500 3573672 3734558 3880320
$$ packed form
12812F5456484J1535021J4554662J7768610K2143937K9026718L8789522N0899909
12805B50174863O5403660P8564179P6009353L9207331k2418223o8974574q0247670
12798C37718919o9773319n4412176m1100296l1260592k4264636j9009488j4955601
12791H2942811j2005109r701574p513479o145573n352409m725987m060815l640921
12783B9796944k809547j721337j870849k247344j969448j630108j042307q58615
12775A5647389r56333j205636j353393j186702o94325j76614l08286o82039n87804
12766H496257n73362o97101m33260p66172q52611j05060N98178l2903p49703o31066
12756D253197j13379O0135q9215n823q3174q2845k05396j59828J60886J45762
$$ plain form
12746 3880320 3652012 3445183 3203405 3002390 3220490 3722622 3970481 3862196 3371020
12737 3371020 2835197 2323484 2169285 2270405 2259503 2348915 2359817 2090971 1711618 1301445
12727 1301445 1397305 1285792 776770 751914 1031507 1182354 1314902 1469140 1274932 1079019
12717 1079019 1318914 1173555 502433 441509 1159324 1605747 1608214 1637733 1725896 1713786
12707 1713786 1569515 1489547 1431307 1147512 961920 725472 845931 1154761 1224413 953473
12697 953473 854634 1023029 1102260 1136701 1401139 1162881 778132 533400 404713 669053
12687 669053 926050 1162157 1434508 1444336 1624474 2032742 1943151 1485470 811138 456694
12677 456694 235708 -218891 -487389 -129887 287426 374494 439919 226318 49196 472270
$$ packed form
12746C880320k28308k06829k41778k01015K18100N02132K47859j08285m91176
12737C371020n35823n11713j54199J01120j0902Q9412J0902k68846l79353m10173
12727A301445R5860j11513n09022k4856K79593J50847J32548J54238j94208j95913
12717A079019K39895j45359o71122o0924P17815M46423K467K9519Q8163j2110
12707A713786j44271p9968n8240k83795j85592k36448J20459L08830O9652k70940
12697I53473r8839J68395P9231L4441K64438k38258l84749k44732j28687K64340
12687F69053K56997K36107K72351R828J80138M08268q9591m57681o74332l54444
12677D56694k20986m54599k68498L57502M17313Q7068O5425k13601j77122M23074
$$ plain form
12667 472270 963532 949981 1128853 1120393 1052882 1502728 2126028 1984593 1463191 849983
12657 849983 344302 529796 753506 709151 724436 630300 710836 913154 808208 959178
12647 959178 973352 829215 536885 681780 1129774 1549172 1241724 1160904 1639186 2234068
12637 2234068 2191640 1403775 973278 1119214 971275 736002 701935 638947 988960 1183425
12627 1183425 970013 558954 319984 222763 -70293 -617941 -1042573 -1266630 -975433 -581397
12617 -581397 -254323 363330 735216 574059 383301 445681 739048 870082 573214 212084
12607 212084 -200240 -106687 -302172 -181412 156343 57274 -183629 -375907 -184771 195434
12597 195434 587656 632341 601670 436322 312733 -36168 -414764 -174703 214828 539815
$$ packed form
12667D72270M91262j3551J78872q460o7511M49846O23300j41435n21402o13208
12657H49983n05681J85494K23710m4355J5285r4136Q0536K02318j04946J50970
12647I59178J4174j44137k92330J44895M47994M19398l07448q0820M78282N94882
12637B234068m2428p87865m30497J45936j47939k35273l4067o2988L50013J94465
12627A183425k13412m11059k38970r7221k93056n47648m24632k24057K91197L94036
12617e81397L27074O17653L71886j61157j90758O2380K93367J31034k96868l61130
12607B12084m12324R3553j95485J20760L37755r9069k40903j92278J91136L80205
12597A95434L92222M4685l0671j65348j23589l48901l78596K40061L89531L24987
$$ plain form
12587 539815 824052 748882 579455 637604 271972 213182 596119 395909 265079 633736
12577 633736 1267245 1666493 1501372 1518189 1730655 1658272 1401366 982169 565809 61625
12567 61625 -179781 -31637 520621 1071985 882987 332329 -296581 -583857 -298447 -69911
12557 -69911 -227207 -605024 -663537 -340654 95556 343054 273483 149267 -147561 -11509
12547 -11509 95354 -174735 -20033 180535 -10159 -183086 -275006 -460562 -943030 -1405937
12537 -1405937 -1442961 -982477 -686360 -169865 130987 142538 328684 412869 583033 522170
12527 522170 704642 1074398 1176589 1040443 765835 548752 178237 -126423 -123776 -334371
12517 -334371 -339115 -212591 -154750 27357 432002 778647 750961 752005 545974 116371 120951
$$ packed form
12587E39815K84237p5170j69427N8149l65632n8790L82937k00210j30830L68657
12577F33736O33509L99248j65121J6817K12466p2383k56906m19197m16360n04184
12567F1625k41406J48144N52258N51364j88998n50658o28910k87276K85410K28536
12557f9911j57296l77817n8513L22883M36210K47498o9571j24216k96828J36052
12547a1509J06863k70089J54702K00568j90694j72927r1920j85556m82468m62907
12537a405937l7024M60484K96117N16495L00852J1551J86146Q4185J70164o0863
12527E22170J82472L69756J02191j36146k74608k17083l70515l04660K647k10595
12517c34371m744J26524N7841J82107M04645L46645k7686J044k06031m29603M580
$$ plain form
12506 120951 204312 379325 745497 786542 741149 813695 549506 191510 100365 24013 106346
12495 106346 143167 107670 31716 -198530 -368997 -173144 -119256 -55359 274651 378258
12485 378258 239772 72237 -45946 -132621 26260 439835 234459 -111231 46125 82107
12475 82107 -188669 -351877 -598175 -566479 -140700 -44996 70588 530868 928629 1068273
12465 1068273 1195684 1170583 1074197 935698 629907 -33563 -537290 -206850 249511 405894
12455 405894 553394 830559 745646 849101 664919 435842 396364 476353 539897 531490 365174
12444 365174 33887 -386621 -457803 -449643 -344958 -488877 -776319 -717159 -460422 -199308
12434 -199308 -168213 -125543 273744 402294 26582 -402459 -1142980 -1764337 -1600068 -1114357
$$ packed form
12506A20951Q3361J75013L66172M1045m5393P2546k64189l57996r1145p6352Q2333
12495A06346L6821l5497p5954k30246j70467J95853N3888O3897L30010J03607
12485C78258j38486j67535j18183q6675J58881M13575k05376l45690J57356L5982
12475H2107k70776j63208k46298L1696M25779R5704J15584M60280L97761J39644
12465A068273J27411k5101r6386j38499l05791o63470n03727L30440M56361J56383
12455D05894J47500K77165q4913J03455j84182k29077l9478P9989O3544q407j66316
12444C65174l31287m20508p1182Q160J04685j43919k87442N9160K56737K61114
12434a99308L1095M2670L99287J28550l75712m29041p40521o21357J64269M85711
$$ plain form
12424 -1114357 -1043516 -904423 -500006 -296723 -449814 -817987 -855173 -411042 -313743 -444480
12414 -444480 -467182 -695674 -1049445 -1277391 -1059537 -810773 -436006 -101786 3164 21679
12404 21679 175538 127782 -192503 -252621 643 153925 33501 -160662 -374776 -604897
12394 -604897 -848794 -1215409 -1577164 -1582131 -1474363 -1300795 -908834 -637145 -464388 -279702
12384 -279702 -192845 588 -159379 -320680 -512297 -662747 -681602 -592147 -582224 -135602
12374 -135602 249269 478389 455423 -113328 -273383 -363384 -378415 -374823 -633223 -469380
12364 -469380 -70964 170839 -56397 -480816 -765519 -678864 -254282 283875 350624 338575
12354 338575 826595 796330 585074 439455 478312 549182 369015 92124 -127522 -262007
$$ packed form
12424a114357P0841J39093M04417K03283j53091l68173l7186M44131R7299j30737
12414d44480k2702k28492l53771k27946K17854K48764L74767L34220J04950J8515
12404B1679J53859m7756l20285o0118K53264J53282j20424j94163k14114k30121
12394f04897k43897l66615l61755m967J07768J73568L91961K71689J72757J84686
12384b79702Q6857J93433j59967j61301j91617j50450j8855Q9455R923M46622
12374a35602L84871K29120k2966n68751j60055r0001j5031L592k58400J63843
12364d69380L98416K41803k27236m24419k84703Q6655M24582N38157O6749j2049
12354C38575M88020l0265k11256j45619L8857P0870j80167k76891k19646j34485
$$ plain form
12344 -262007 -669102 -830666 -705632 -433034 157190 714347 772336 762934 579320 -106639
12334 -106639 -762334 -1060840 -1193041 -1463429 -1400975 -876757 -268303 222670 111955 -229438
12324 -229438 -408837 -441629 -347844 -108835 55615 -19967 -279314 -231697 -24172 174060
12314 174060 269399 40181 3420 264235 508122 593637 896693 1096622 1246208 1126482
12304 1126482 498847 -119245 -305079 -263597 -41272 235691 302595 199156 -153942 -614499
12294 -614499 -848831 -768576 -1087961 -1321102 -1093532 -357764 27563 279364 499383 530759
12284 530759 227664 54295 -141044 -200569 -203873 -317334 -519000 -482442 -167171 184281
12274 184281 244571 350680 542708 563414 318534 -236146 -707582 -1059171 -691388 -164372
$$ packed form
12344b62007m07095j61564J25034K72598N90224N57157N7989r402j83614o85959
12334a06639o55695k98506j32201k70388O2454N24218O08454M90973j10715l41393
12324b29438j79399l2792R3785K39009J64450p5582k59347M7617K07525J98232
12314A74060R5339k29218l6761K60815K43887Q5515L03056J99929J49586j19726
12304A126482o27635o18092j85834M1482K22325K76963O6904j03439l53098m60557
12294f14499k34332Q0255l19385k33141K27570P35768L85327K51801K20019L1376
12284E30759l03095j73369j95339n9525l304j13461k01666L6558L15271L51452
12274A84281O0290J06109J92028K0706k44880n54680m71436l51589L67783N27016
$$ plain form
12264 -164372 -121874 -290048 -316516 -503575 -683969 -744597 -53493 352842 -13433 16904
12254 16904 55759 -27642 108841 402838 123538 -323761 -199577 77199 99099 -117079
12244 -117079 -552052 -559767 -292317 -293907 -374524 -340949 -188997 51566 108226 163417 -142626
12233 -142626 -599889 -881640 -854241 -497891 -318777 50895 273984 -25361 -151580 -275579
12223 -275579 -169780 -50308 -227014 -325513 -166557 -32073 159228 266693 -121121 -785040
12213 -785040 -1015852 -708371 -349230 -357106 -582477 -639815 -533757 -519967 -386722 -502809
12203 -502809 -459766 -337683 -382822 -343357 -415753 -627281 -785531 -513940 -154636 -115649
12193 -115649 -273059 -520882 -550973 -488511 -551287 -664367 -381808 161359 498831 230069
$$ packed form
12264a64372M2498j68174k6468j87059j80394o0628O91104M06335l66275L0337
12254A6904L8855q3401J36483K93997k79300m47299J24184K76776K1900k16178
12244a17079m34973p715K67450j590q0617L3575J51952K40563N6660N5191l06043
12233a42626m57263k81751K7399L56350J79114L69672K23089k99345j26219j23999
12223b75579J05799J19472j76706r8499J58956J34484J91301J07465l87814o63919
12213g85040k30812L07481L59141p876k25371n7338J06058J3790J33245j16087
12203e02809M3043J22083m5139L9465p2396k11528j58250K71591L59304L8987
12193a15649j57410k47823l0091O2462o2776j13080K82559N43167L37472k68762
$$ plain form
12183 230069 158507 261310 112958 -172539 -380780 -492944 -725736 -599630 -302873 -129551
12173 -129551 -352660 -493786 -507521 -548201 -505292 -16636 127525 121939 205443 350201 446637
12162 446637 181703 -70983 -536517 -636053 -643522 -970826 -883017 -872954 -1180498 -845871
12152 -845871 -637537 -710159 -842158 -630531 -139230 -133369 -135582 169634 255333 17754 67225
12141 67225 -109745 -548513 -936530 -560832 115170 315637 65596 -130568 -243274 95604
12131 95604 479695 598641 469907 452784 527008 433943 -32261 -406766 -556838 -438028
12121 -438028 -490748 -581307 -449454 -231725 -651817 -1121077 -1204240 -1083897 -698713 -356795
12111 -356795 -233513 -277872 -225573 -269700 -273322 -13073 45879 -16273 -59383 147766 499190
$$ packed form
12183B30069p1562J02803j48352k85497k08241j12164k32792J26106K96757J73322
12173a29551k23109j41126j3735m0680M2909M88656J44161n586Q3504J44758R6436
12162D46637k64934k52686m65534r9536p469l27304Q7809J0063l07544L34627
12152h45871K08334p2622j31999K11627M91301N861k213L05216Q5699k37579M9471
12141F7225j76970m38768l88017L75698O76002K00467k50041j96164j12706L38878
12131I5604L84091J18946j28734j7123P4224r3065m66204l74505j50072J18810
12121d38028n2720r0559J31853K17729m20092m69260q3163J20343L85184L41918
12111c56795J23282m4359N2299m4127l622K60249N8952o2152m3110K07149L51424
$$ plain form
12100 499190 147088 -636983 -939341 -683910 -500171 -421245 -101872 91884 -61565 -346057
12090 -346057 -383583 -372852 -455731 -437034 -487123 -544664 -292343 244653 637140 654697 539049
12079 539049 559874 518183 152098 -121347 -131266 -128 246104 518117 609412 536424 112546
12068 112546 -307601 -496955 -462982 -398924 -467730 -685522 -860321 -1047817 -1099477 -688114
12058 -688114 -181478 -122494 85421 4494 -504981 -908213 -1163508 -1243833 -1167020 -1117760
12048 -1117760 -1127350 -924727 -717021 -577979 -446380 -17600 364307 430738 438651 635311
12038 635311 637813 546785 404143 355130 508766 750243 576884 416990 281951 231544
12028 231544 720097 1229870 1581908 1694292 1439854 1115239 766965 753432 915576 617724
$$ packed form
12100D99190l52102p84071l02358K55431J83739P8926L19373J93756j53449k84492
12090c46057l7526J0731q2879J8697n0089n7541K52321N36996L92487J7557j15648
12079E39049K0825m1691l66085k73445r919J31138K46232K72013R1295p2988m23878
12068A12546m20147j89354L3973O4058o8806k17792j74799j87496n1660M11363
12058f88114N06636N8984K07915q0927n09475m03232k55295q0325P6813M9260
12048a117760r590K02623K07706J39042J31599M28780L81907O6431P913J96660
12038F35311K502r1028j42642m9013J53636K41477j73359j59894j35039n0407
12028B31544M88553N09773L52038J12384k54438l24615l48274j3533J62144k97852
$$ plain form
12018 617724 458859 594158 228918 -272778 -389458 -285430 -284732 -237702 -233542 -624626 -653376
12007 -653376 -697570 -456836 23451 299293 -8225 -332675 -504910 -1000256 -1437441 -1522084
11997 -1522084 -1120926 -526723 -345203 -584695 -364104 233368 816750 562742 152256
11988 152256 101740 62028 -115579 -276415 -238783 -116296 -250176 -301882 -478241 -972729
11978 -972729 -1240011 -1038093 -785217 -872138 -761492 -410775 -129681 -100973 -327349 -701028
11968 -701028 -728127 -838187 -939240 -969259 -765401 -624014 -973461 -1040887 -1123824 -1337274
11958 -1337274 -1420706 -1670120 -1514381 -1130132 -797625 -676968 -390841 -387834 -680741 -860127
11948 -860127 -979132 -788418 -580137 -299204 -47780 -281537 -369141 -251096 -396900 -341140
$$ packed form
12018F17724j58865J35299l65240n01696j16680J04028O98M7030M160l91084k8750
12007f53376m4194K40734M80287K75842l07518l24450j72235m95346m37185q4643
11997a522084M01158N94203J81520k39492K20591N97472N83382k54008m10486
11988A52256n0516l9712j77607j60836L7632J22487j33880n1706j76359m94488
11978i72729k67282K01918K52876q6921J10646L50717K81094K8708k26376l73679
11968g01028k7099j10060j01053l0019K03858J41387l49447o7426q2937k13450
11958a337274q3432k49414J55739L84249L32507J20657K86127L007k92907j79386
11948h60127j19005J90714K08281K80933K51424k33757q7604J18045j45804N5760
$$ plain form
11938 -341140 -6250 -145681 -217979 -122587 -161646 -317922 -561413 -279041 21825 -271668
11928 -271668 -439355 -411751 -164191 208827 298164 -14580 -542727 -627132 -477972 -162810
11918 -162810 161904 300082 145482 -375737 -575393 -630570 -723240 -670380 -504256 -485665
11908 -485665 -853483 -793727 -223625 -87019 -503849 -450743 -239305 32350 147570 68079
11898 68079 -354833 -777037 -925597 -1254784 -1622023 -1659225 -1412741 -1358269 -1194811 -995004
11888 -995004 -852899 -484291 -270157 -359890 -288277 -232957 -204031 -148117 -66097 42496 -182570
11877 -182570 -83465 209402 283423 199382 192995 219248 97032 -373133 -527628 -409464 -130629
11866 -130629 160167 113079 -152069 -351933 -284266 -632657 -769635 -234234 -258667 -751560
$$ packed form
11938c41140L34890j39431p2298R5392l9059j56276k43491K82372L00866k93493
11928b71668j67687K7604K47560L73018Q9337l12744n28147q4405J49160L15162
11918a62810L24714J38178j54600n21219j99656n5177r2670N2860J66124J8591
11908d85665l67818N9756N70102J36606m16830N3106K11438K71655J15220p9491
11898F8079m22912m22204j48560l29187l67239l7202K46484N4472J63458J99807
11888i95004J42105L68608K14134q9733P1613N5320K8926N5914Q2020J08593k25066
11877a82570R9105K92867P4021q4041o387K6253j22216m70165j54495J18164K78835
11866a30629K90796m7088k65148j99864O7667l48391j36978N35401k4433m92893
$$ plain form
11856 -751560 -1005474 -1282979 -1547854 -1513307 -825827 -175961 -249802 -564227 -644658 -724344
11846 -724344 -910971 -1013581 -914307 -462400 -362471 -282245 -131058 142688 167639 -40253
11836 -40253 -7805 369102 223501 -359478 -832744 -940703 -596097 -128450 5191 165529
11826 165529 639077 870964 542185 173031 -187083 -450276 -114236 82265 222668 691950
11816 691950 878054 1379026 1526900 911712 492532 442798 366535 281516 326799 680129
11806 680129 621083 322792 194144 102571 214874 78942 -47989 16118 208537 300992
11796 300992 -39011 -433023 -530582 -833148 -1100996 -1034850 -694589 -565169 -527699 -269743
11786 -269743 30764 223755 216658 187518 462654 715841 686089 590333 415615 240063
$$ packed form
11856g51560k53914k77505k64875L4547O87480O49866p3841l14425q0431p9686
11846g24344j86627j02610R9274M51907R9929Q0226J51187K73746K4951k07892
11836d0253L2448L76907j45601n82979m73266j07959L44606M67647J33641J60338
11826A65529M73548K31887l28779l69154l60114k63193L36040J96501J40403M69282
11816F91950J86104N00972J47874o15188m19180m9734p6263q5019M5283L53330
11806F80129n9046k98291j28648r1573J12303j35932j26931O4107J92419R2455
11796C00992l40003l94012r7559l02566k67848O6146L40261J29420L7470K57956
11786b69743L00507J92991p097k9140K75136K53187k9752r5756j74718j75552
$$ plain form
11776 240063 -60221 -240714 -97381 -23313 -89813 -127327 -221521 -345766 -87873 434979
11766 434979 815292 848881 513291 62395 -43018 -105051 72416 467617 726615 479944
11756 479944 303263 157694 -130657 -804565 -1427656 -1363650 -1028824 -825991 -976537 -979508
11746 -979508 -357121 203596 322261 204480 -96617 -39672 25968 211132 322397 272660
11736 272660 -103708 -301333 -203202 -88487 28524 205034 355067 254910 255650 284237
11726 284237 300415 92077 -364760 -622028 -610327 -663002 -360288 -136332 -312286 -141443
11716 -141443 203765 -14748 -484497 -1002610 -1857152 -2098043 -1754571 -1802416 -1897813 -1809703
11706 -1809703 -1671511 -1609061 -1576380 -1247143 -942367 -770450 -549159 -291193 -292573 -463124
$$ packed form
11776B40063l00284j80493J43333P4068o6500l7514r4194j24245K57893N22852
11766D34979L80313L3589l35590m50896j05413o2033J77467L95201K58998k46671
11756D79944j76681j45569k88351o73908o23091O4006L34826K02833j50546k971
11746i79508O22387N60717J18665j17781l01097N6945O5640J85164J11265m9737
11736B72660l76368j97625R8131J14715J17011J76510J50033j00157P40K8587
11726B84237J6178k08338m56837k57268J1701n2675L02714K23956j75954J70843
11716a41443L45208k18513m69749n18113q54542k40891L43472m7845r5397Q8110
11706a809703J38192O2450L2681L29237L04776J71917K21291K57966j380j70551
$$ plain form
11696 -463124 -429220 54776 189119 -190243 -153492 26744 68646 -52304 -124515 -27737
11686 -27737 -273384 -753004 -1115284 -881851 -279336 37670 297058 681580 490593 173110
11676 173110 553407 760183 606664 435381 166713 -217997 -402753 -580039 -581282 -81803
11666 -81803 -230047 -661058 -449069 92230 524068 927645 812563 319578 -175220 -253059
11656 -253059 -172109 -238614 -504091 -460793 298275 556389 458014 613054 824036 845028
11646 845028 986625 1069323 1113055 920947 267634 -367008 -832035 -673811 -213901 -54408
11636 -54408 255576 412741 220074 185172 -154706 -715442 -1256575 -1429250 -1161678 -1100573
11626 -1100573 -539585 199695 596978 462788 -115936 -517689 -803535 -980959 -1325467
$$ packed form
11696d63124L3904M83996J34343l79362L6751J80236M1902j20950p2211R6778
11686b7737k45647m79620l62280K33433O02515L17006K59388L84522j90987l17483
11676A73110L80297K06776j53519j71283k68668l84710j84756j77286j243M99479
11666h1803j48244m31011K11989N41299M31838M03577j15082m92985m94798p7839
11656b53059Q0950o6505k65477M3298P59068K58114r8375J55040K10982K0992
11646H45028J41597Q2698M3732j92108o53313o34642m65027J58224M59910J59493
11636e4408L09984J57165j92667l4902l39878n60736n41133j72675K67572O1105
11626a100573N60988P39280L97283j34190n78724m01753k85846j77424l44508
$$ plain form
11617 -1325467 -1655711 -1609540 -1290993 -941173 -470530 -89600 -565305 -1063377 -1401340 -1464310
11607 -1464310 -1387674 -1051578 -551027 -502651 -533818 -400579 -550125 -709175 -558661 -336797
11597 -336797 -388564 -530811 -737152 -854094 -342857 603046 867828 781028 418534 275360
11587 275360 672133 752037 668715 470741 252157 219504 249983 419737 634510 684120
11577 684120 397374 34936 180591 18009 -273417 52724 420237 299241 -30130 179921
11567 179921 653079 1088236 1154466 487272 -83828 -379999 -202562 67513 260158 132759
11557 132759 -259800 -792164 -996697 -520369 18612 423213 599222 221975 -445844 -851689
11547 -851689 -1021724 -1148834 -983312 -58930 751004 333061 -274793 -371949 -188274 4516
$$ packed form
11617a325467l30244M6171L18547L49820M70643L80930m75705m98072l37963o2970
11607a464310P6636L36096N00551M8376l1167J33239j49546j59050J50514K21864
11597c36797n1767j42247k06341j16942N11237R45903K64782q6800l62494j43174
11587B75360L96773P9904q3322j97974k18584l2653L0479J69754K14773M9610
11577F84120k86746l62438J45655j62582k91426L26141L67513j20996l29371K10051
11567A79921M73158M35157O6230o67194n71100k96171J77437K70075J92645j27399
11557A32759l92559n32364k04533M76328N38981M04601J76009l77247o67819m05845
11547h51689j70035j27110J65522R24382Q09934m17943o07854r7156J83675J92790
$$ plain form
11537 4516 -119356 171490 696064 944784 678302 410793 248092 406046 530172 579910
11527 579910 620914 490612 469240 280924 152848 220323 203600 469264 648173 415308
11517 415308 -25271 -239731 84038 178814 -21587 -259212 -213166 160615 374767 207915
11507 207915 64432 150229 -14313 -427963 -247077 166781 108468 -782656 -1027630 -680587
11497 -680587 -640715 -403775 117123 295147 -30663 -30735 -94575 4720 143000 -329323 -1036645
11486 -1036645 -1300301 -1446552 -1385442 -1330620 -1393521 -1146289 -880446 -1047157 -1033849 -819450
11476 -819450 62426 826423 801544 436008 -310350 -1049580 -892603 -833619 -719870 -202967
11466 -202967 168428 100666 107355 277308 403701 244478 98854 167530 116157 104963 281961
$$ packed form
11537D516j23872K90846N24574K48720k66482k67509j62701J57954J24126M9738
11527E79910M1004j30302k1372j88316j28076O7475j6723K65664J78909k32865
11517D15308m40579k14460L23769R4776k00401k37625M6046L73781K14152j66852
11507B07915j43483Q5797j64542m13650J80886M13858n8313q91124k44974L47043
11497f80587L9872K36940N20898J78024l25810p2o3840R9295J38280m72323p07322
11486a036645k63656j46251O1110N4822o2901K47232K65843j66711J3308K14399
11476h19450Q81876P63997k4879l65536p46358p39230J56977N8984J13749N16903
11466b02967L71395o7762O689J69953J26393j59223j45624O8676n1373j1194J76998
$$ plain form
11455 281961 262292 47584 -1895 -371001 -269734 -96787 -413948 -313041 -295414 -502823
11445 -502823 -701765 -844624 -700469 -737430 -605546 -523543 -614055 -613952 -520624 -465619 -625468
11434 -625468 -647325 -544387 -498103 -249028 -91659 -206443 -321434 -340346 -529155 -679624
11424 -679624 -324728 87773 -21838 -353080 -459136 -456619 -130754 429103 286864 344016
11414 344016 783697 649012 386138 396140 679187 646454 360504 156810 9284 147237
11404 147237 93199 -282499 -524535 -590135 -809682 -852004 -349091 22489 91962 103745
11394 103745 286760 701346 683984 224881 31155 -593816 -1565112 -1737430 -1476085 -1120904
11384 -1120904 -718515 -677576 -857728 -1145189 -1134680 -810508 -856239 -871653 -557518 -608187
$$ packed form
11455B81961j9669k14708m9479l69106J01267J72947l17161J00907J7627k07409
11445e02823j98942j42859J44155l6961J31884Q2003r0512J03R3328N5005j59849
11434f25468k1857J02938M6284K49075J57369j14784j14991j8912j88809j50469
11424f79624L54896M12501j09611l31242j06056K517L25865N59857j42239N7152
11414C44016M39681j34685k62874J0002K83047l2733k85950k03694j47526J37953
11404A47237n4038l75698k42036o5600k19547m2322N02913L71580O9473J1783
11394A03745J83015M14586j7362m59103j93726o24971r71296j72318K61345L55181
11384a120904M02389M0939j80152k87461J0509L24172m5731j5414L14135n0669
$$ plain form
11374 -608187 -1144002 -1271504 -1089688 -774703 -739342 -925010 -1047218 -912173 -536304 -208664
11364 -208664 -28054 202379 583926 596745 64134 -187409 -186179 44536 356064 435012
11354 435012 378065 738545 624399 97882 51769 219595 -252022 -453831 -121943 129110
11344 129110 150672 230281 365266 437261 750975 617479 448721 351461 167063 -252607
11334 -252607 -530064 -549618 -675594 -781368 -985814 -1357730 -1404637 -918800 -732377 -764359
11324 -764359 -855068 -1304223 -1611701 -1381728 -900369 -760045 -553479 -468181 -552707 -949467
11314 -949467 -1218906 -1313835 -1286455 -1333095 -1385115 -1010160 -694011 -748543 -1212800 -1355951
11304 -1355951 -1464046 -1302079 -1099672 -903127 -1039667 -1214419 -1419904 -1470158 -1332324 -1173059
$$ packed form
11374f08187n35815j27502J81816L14985L5361j85668j22208J35045L75869L27640
11364b08664J80610K30433L81547J2819n32611k51543J230K30715L11528P8948
11354D35012n6947L60480j14146n26517m6113J67826m71617k01809L31888K51053
11344A29110K1562P9609J34985P1995L13714j33496j68758r7260j84398m19670
11334b52607k77457j9554j25976j05774k04446l71916m6907M85837J86423l1982
11324g64359r0709m49155l07478K29973M81359J40324K06566Q5298q4526l96760
11314i49467k69439r4929K7380m6640n2020L74955L16149n4532m64257j43151
11304a355951j08095J61967K02407J96545j36540j74752k05485n0254J37834J59265
$$ plain form
11294 -1173059 -1163486 -1079815 -880040 -858682 -604529 -213657 11554 -236682 -217886 -34305
11284 -34305 -78975 160643 132633 40466 -37873 136610 173201 -29850 -456167 -916933 -839428
11273 -839428 -633417 -462111 -371870 -639204 -694899 -326163 -200761 49070 621651 661277
11263 661277 348971 147478 11049 -335743 -656323 -793802 -718793 -93473 712392 966861
11253 966861 766572 328452 21246 -95965 -142674 -50347 -99993 -529718 -547149 -259998
11243 -259998 85232 186706 -131865 -588590 -763326 -634800 -427081 -673177 -917167 -1028559
11233 -1028559 -1114011 -847525 -652525 -592341 -664647 -672779 -685173 -631253 -357626 -37751 -82684
11222 -82684 -49653 332782 590567 246018 -259733 -343030 -527982 -1202461 -1732001 -2002991
$$ packed form
11294a173059R573Q3671J99775K1358K54153L90872K25211k48236J8796J83581
11284c4305m4670K39618k8010r2167p8339J74483L6591k03051m26317m60766P7505
11273h39428K06011J71306R0241k67334n5695L68736J25402K49831N72581L9626
11263F61277l12306k01493j36429l46792l20580j37479P5009O25320Q05865K54469
11253I66861k00289m38120l07206j17211m6709R2327m9646m29725j7431K87151
11243b59998L45230J01474l18571m56725j74736J28526K07719k46096k43990j11392
11233a028559q5452K66486J95000O0184p2306q132j2394N3920K73627L19875m4933
11222h2684L3031L82435K57785l44549n05751q3297j84952o74479n29540k70990
$$ plain form
11212 -2002991 -1936737 -1421733 -1053699 -839353 -1032473 -1199217 -592277 -205328 -497157 -675224
11202 -675224 -525370 -279289 62609 176215 331786 69380 -481289 -903788 -896847 -769923
11192 -769923 -738754 -656413 -645463 -632621 -907917 -1061607 -878851 -566370 -189060 -144762
11182 -144762 120460 273254 -80388 -384655 -364139 -643402 -751490 -564646 -466974 -485375
11172 -485375 -466421 -564040 -456791 -267931 -79983 -24018 -446569 -421579 -356066 -880568
11162 -880568 -1157952 -1397834 -919847 -305904 219833 473537 573382 1015008 1636894 1883264
11152 1883264 1565789 1255177 945934 651514 485045 292124 504212 765629 778018 536079
11142 536079 352211 519061 670640 579737 181474 -37154 -404020 -892864 -1023496 -941065
$$ packed form
11212b002991O6254N15004L68034K14346j93120j66744O06940L86949k91829j78067
11202f75224J49854K46081L41898J13606J55571k62406n50669m22499O941J26924
11192g69923L1169Q2341J0950J2842k75296j53690J82756L12481L77310M4298
11182a44762K65222J52794l53642l04267K0516k79263j08088J86844R7672j8401
11172d85375J8954r7619J07249J88860J87948N5965m22551K4990O5513n24502
11162h80568k77384k39882M77987O13943N25737K53704R9845M41626O21886K46370
11152A883264l17475l10612l09243k94420j66469j92921K12088K61417J2389k41939
11142E36079j83868J66850J51579r0903l98263k18628l66866m88844j30632Q2431
$$ plain form
11132 -941065 -1116824 -996439 -595842 -225088 -108567 -124862 -243278 -619199 -654836 -374924
11122 -374924 -442969 -698119 -902367 -913980 -809471 -1012496 -1287572 -1204762 -978337 -960778
11112 -960778 -671204 -495193 -247365 -130079 -574315 -839411 -939841 -1035728 -1099711 -816992
11102 -816992 -601507 -527194 -718788 -1331517 -1610171 -1183012 -689497 -280885 25181 248977
11092 248977 201179 189648 -60522 -220173 113544 6667 -1533 491477 957007 949936 789418
11081 789418 574356 189644 413407 558377 111081 -44424 206419 362155 246443 -174999
11071 -174999 -783558 -771555 -379767 -113381 -9294 -131207 -199599 11195 259336 226475
11061 226475 35807 324160 520901 144894 -181900 -157784 -147137 -179824 -199430 -537229
$$ packed form
11132i41065j75759J20385M00597L70754J16521j6295j18416l75921l5637K79912
11122c74924o8045k55150k04248j1613J04509k03025k75076Q2810K26425J7559
11112i60778K89574J76011K47828J17286m44236k65096j00430r5887o3983K82719
11102h16992K15485P4313j91594o12729k78654M27159M93515M08612L06066K23796
11092B48977m7798j1531k50170j59651L33717j06877q200M93010M65530p071j60518
11081G89418k15062l84712K23763J44970m47296j55505K50843J55736j15712m21442
11071a74999o08559J2003L91788K66386J04087j21913o8392K10794K48141l2861
11061B26475j90668K88353J96741l76007l26794K4116J0647l2687j9606l37799
$$ plain form
11051 -537229 -892279 -929025 -575634 31829 626515 619447 377953 269236 -93713 -492595
11041 -492595 -528573 -335600 -523838 -328354 -6466 -106329 -227771 -278516 -136145 202612
11031 202612 421922 542689 346405 220667 357310 340539 92522 256906 653618 913101
11021 913101 946558 714225 741257 962317 971913 900440 624453 408416 392949 457513 443857
11010 443857 88283 -151710 -25633 528480 938736 1403291 1185467 791149 921538 1041287
11000 1041287 1138379 1319348 1211708 432624 174774 509505 829278 1070376 1136170 822624
10990 822624 854652 1221977 1174826 856853 570059 567325 848315 1000872 1191918 991074
10980 991074 684725 448636 446617 712314 888422 813160 719643 580010 250656 -240585
$$ packed form
11051e37229l55050l6746L53391O07463N94686p068k41494j08717l62949l98882
11041d92595l5978J92973j88238J95484L21888r9863j21442n0745J42371L38757
11031B02612K19310J20767j96284j25738J36643j6771k48017J64384L96712K59483
11021I13101L3457k32333K7032K21060R596p1473k75987k16037j5467O4564j3656
11010D43857l55574k39993J26077N54113M10256M64555k17824l94318J30389J19749
11000A041287R7092J80969j07640p79084k57850L34731L19773K41098O5794l13546
10990H22624L2028L67325m7151l17973k86794k734K80990J52557J91046k00844
10980I91074l06349k36089k019K65697J76108p5262r3517j39633l29354m91241
$$ plain form
10970 -240585 -394192 1192 268022 416466 103391 -220007 -123397 100352 -5914 -604232
10960 -604232 -1029451 -574328 -118407 73884 283197 86641 -193364 -139349 -444831 -720575
10950 -720575 -661705 -411764 266071 924901 1710710 2130955 1885909 1657137 1385129 1458216
10940 1458216 1764259 1396558 1355307 1537661 1185352 994512 879921 505913 671739 1088272
10930 1088272 1380135 1567012 1501381 1356160 978439 677934 872910 1364314 1449888 1379921
10920 1379921 1470225 1521615 1713058 1674396 1334966 1000144 1040048 1081358 1141696 1448769
10910 1448769 1752430 1843495 1989294 2048346 1738131 1582652 1819765 2336598 2179110 2028624
10900 2028624 2038471 2251804 2506869 2782641 3129584 3196769 2971320 2790750 2606300 2183523
$$ packed form
10970b40585j53607L95384K66830J48444l13075l23398R6610K23749j06266n98318
10960f04232m25219M55123M55921J92291K09313j96556k80005N4015l05482k75744
10950g20575N8870K49941O77835O58830P85809M20245k45046k28772k72008P3087
10940A458216L06043l67701m1251J82354l52309j90840j14591l74008J65826M16533
10930A088272K91863J86877o5631j45221l77721l00505J94976M91404Q5574o9967
10920A379921R0304N1390J91443l8662l39430l34822L9904M1310O0338L07073
10910A448769L03661R1065J45799N9052l10215j55479K37113N16833j57488j50486
10900B028624R847K13333K55065K75772L46943O7185k25449j80570j84450m22777
$$ plain form
10890 2183523 1811641 1625927 1679438 1808358 1943850 2237977 2415928 2653011 2606551 2478461
10880 2478461 2589798 2440646 2294242 2775612 3329188 3436004 3570653 3820516 3591084
10871 3591084 3144271 3065599 2961652 2881149 2863242 3060522 3400088 3274223 3028155 2826571
10861 2826571 2831315 2984302 2654508 2035737 2091300 2801318 3335202 3251131 2944976 2557184
10851 2557184 1978840 1956986 2311723 2639740 2764452 2793156 2698670 2682386 2798656 2883767
10841 2883767 2638212 2381274 2562717 2649649 2757705 2448623 2327354 2414514 2484028 2571803
10831 2571803 2482366 2688780 3085381 3325527 3205735 2689917 2492246 2392843 2489724 2678587
10821 2678587 3084879 3202200 3181305 3049315 3038275 3121999 3185489 3767245 4367635 4251846
$$ packed form
10890B183523l71882j85714N3511J28920J35492K94127J77951K37083m6460j28090
10880B478461J11337j49152j46404M81370N53576J06816J34649K49863k29432
10871C591084m46813p8672j03947q0503j7907J97280L39566j25865k46068k01584
10861B826571M744J52987l29794o18771N5563P10018N33884q4071l06155l87792
10851B557184n78344k1854L54737L28017J24712K8704r4486j6284J16270Q5111
10841B883767k45555k56938J81443Q6932J08056l09082j21269Q7160O9514Q7775
10831B571803q9437K06414L96601K40146j19792n15818j97671r9403R6881J88863
10821B678587M06292J17321k0895j31990j1040Q3724O3490N81756O00390j15789
$$ plain form
10811 4251846 3798191 3264608 3151250 3405689 3635400 3558548 3595642 3650763 3742150 3927234
10801 3927234 3868388 3707812 3345170 3390910 3887170 3943733 3523443 3426160 3675547 3768898
10791 3768898 4364191 4980043 5065589 4979889 4694094 4929639 5424207 5401720 5146524 5270557
10781 5270557 5753049 6040390 6174294 6409989 6894538 7486390 7901324 8147199 8252852
10772 8252852 8603467 9232168 9814805 10721101 11546399 11643966 11860686 12338594 12632566 13016616
10762 13016616 13621872 14080486 14186651 14444298 14749229 14943339 15037014 15249884 15485748
10753 15485748 15491877 15484504 15318293 15074859 14381086 13560693 12816160 12592531 12426578 11808632
10743 11808632 11509531 11393532 11234388 10939564 10250595 9643492 9437473 10060390 10654249
$$ packed form
10811D251846m53655n33583j13358K54439K29711p6852L7094N5121R1387J85084
10801C927234n8846j60576l62642M5740M96260N6563m20290r7283K49387R3351
10791C768898N95293O15852Q5546q5700k85795K35545M94568k2487k55196J24033
10781E270557M82492K87341J33904K35695M84549N91852M14934K45875J05653
10772H252852L50615O28701N82637R06296Q25298R7567K16720M77908K93972L84050
10762A3016616O05256M58614J06165K57647L04931J94110R3675K12870K35864
10753A5485748O129p373j66211k43434o93773q20393p44533k23629j65953o17946
10743A1808632k99101j15999j59144k94824o88969o07103k06019O22917N93859
$$ plain form
10734 10654249 10399264 10028549 9993429 9721765 9536703 9308605 9669027 10359996 11095272
10725 11095272 12131071 13253790 14390021 15339490 16524995 18206688 20222285 22255901
10717 22255901 24392643 26864684 29825490 33335305 36870841 39837587 41748843 42288138
10709 42288138 41596835 41251432 41159793 40325249 38896493 37574061 36061393 34416692 32480088
10700 32480088 30317642 28193448 26600979 25248353 24012030 22661459 21375423 20211939
10692 20211939 19129288 18162695 17340837 16819012 16410054 15458267 14392349 13569976 12633053
10683 12633053 11599293 10766029 10432010 10087669 9887172 9965080 10007772 9480174 9380511 9577111
10673 9577111 9539959 9596840 9562080 9695300 9869339 10071806 10420968 10828226 11059900 11678476
$$ packed form
10734A0654249k54985l70715l5120k71664j85062k28098L60422O90969P35276
10725A1095272J035799J122719J136231R49469J185505J681693K015597K033616
10717B2255901K136742K472041K960806L509815L535536K966746J911256N39295
10709D2288138o91303l45403r1639q34544j428756j322432j512668j644701j936604
10700C2480088k162446k124194j592469j352626j236323j350571j286036j163484
10692B0211939j082651r66593q21858n21825m08958r51787j065918q22373r36923
10683A2633053j033760q33264l34019l44341k00497P7908M2692n27598r9663J96600
10673I577111l7152N6881l4760J33220J74039K02467L49162M07258K31674O18576
$$ plain form
10663 11678476 12509090 13761611 15230848 16372795 17318365 18429221 19548477 20253212
10655 20253212 20647142 20593058 20559279 20654277 20788101 20478806 20286615 20539342 21105826 21766173
10645 21766173 22728097 24188195 25513362 26638163 28300858 30544454 33233702 36376188
10637 36376188 40300076 45195179 51021067 57164506 60496987 60400599 58750801 56376166
10629 56376166 53541922 50834337 48543095 46625004 45147599 43932068 42691952 41105945
10621 41105945 39075557 36269792 33273057 30461658 27951366 25405612 22643318 20008506
10613 20008506 17622865 15473939 13135679 10988164 9488056 8404009 7507171 6841176
10605 6841176 6080674 5645899 5319526 4681051 4282005 4006312 3446468 2915496 2946393 3175226
$$ packed form
10663A1678476Q30614J252521J469237J141947R45570J110856J119256P04735
10655B0253212L93930n4084l3779R4998J33824l09295j92191K52727N66484O60347
10645B1766173R61924J460098J325167J124801J662695K243596K689248L142486
10637C6376188L923888M895103N825888O143439L332481r6388j649798k374635
10629E6376166k834244k707585k291242j918091j477405j215531j240116j586007
10621D1105945k030388k805765k996735k811399k510292k545754k762294k634812
10613B0008506k385641k148926k338260k147515j500108j084047q96838o65995
10605F841176p60502m34775l26373o38475l99046k75693n59844n30972L0897K28833
$$ plain form
10595 3175226 3434538 3182494 2704380 2487534 2121742 2092714 2020061 2037449 2243054 2132880
10585 2132880 1759645 1381022 1076032 514011 523589 529057 398280 931351 1623578 1617259
10575 1617259 1288290 1204626 1526375 1745757 1622654 1443331 1134475 586680 489150 387809
10565 387809 271359 161655 -15676 308860 651326 1081241 1449331 1273844 981550 1037415
10555 1037415 1127840 793223 392544 -30994 -164066 25843 297122 465414 572162 49245
10545 49245 -464197 -548957 -562176 -497898 -1008884 -1264303 -896302 -601181 -587649 -325244
10535 -325244 -189755 -406777 -467669 -372770 76639 474914 640985 936947 1212104 745659
10525 745659 305967 604703 617816 516425 263688 -88468 14859 -54188 -641508 -613947
$$ packed form
10595C175226K59312k52044m78114k16846l65792k9028p2653J7388K05605j10174
10585B132880l73235l78623l04990n62021R578N468j30777N33071O92227o319
10575A617259l28969q3664L21749K19382j23103j79323l08856n47795r7530j01341
10565C87809j16450j09704j77331L24536L42466M29915L68090j75487k92294N5865
10555A037415R0425l34617m00679m23538j33072J89909K71279J68292J06748n22917
10545D9245n13442q4760j3219O4278n10986k55419L68001K95121J3532K62405
10535c25244J35489k17022o0892R4899M49409L98275J66071K95962K75157m66445
10525G45659m39692K98736J3113j01391k52737l52156J03327o9047n87320K7561
$$ plain form
10515 -613947 -54245 524689 1170717 1361810 895690 464921 396974 3048 -248942 -28513
10505 -28513 239077 77347 331336 650135 519678 351672 1145 -145117 2385 -227628
10495 -227628 -731423 -631521 -434935 -346408 -282062 -176566 -48914 -196841 -397646 -418616
10485 -418616 -599223 -644505 -632020 -846815 -1189878 -1080885 -596079 -579301 -621502 -680588
10475 -680588 -754776 -905882 -856734 -794345 -1125519 -1136912 -749552 -360324 -298145 -137865
10465 -137865 -94774 -240995 -309818 -503107 -345335 -141507 96646 571976 720425 703098
10455 703098 560531 37318 -169920 -203514 -132500 -233700 -328271 -220256 -359106 -478658
10445 -478658 -548279 -356515 -280344 -557103 -859179 -1087677 -1169128 -943399 -653730 -352581
$$ packed form
10515f13947N59702N78934O46028J91093m66120m30769o7947l93926k51990K20429
10505b8513K67590j61730K53989L18799j30457j68006l50527j46262J47502k30013
10495b27628n03795R9902J96586Q8527O4346J05496J27652j47927k00805k0970
10485d18616j80607m5282J2485k14795l43063J08993M84806J6778m2201n9086
10475f80588p4188j51106M9148O2389l31174j1393L87360L89228O2179J60280
10465a37865M3091j46221o8823j93289J57772K03828K38153M75330J48449j7327
10455G03098j42567n23213k07238l3594P1014j01200r4571J08015j38850j19552
10445d78658o9621J91764P6171k76759l02076k28498q1451K25729K89669L01149
$$ plain form
10435 -352581 -83734 -121858 -219576 -446516 -758392 -913908 -564928 -494786 -761877 -476821
10425 -476821 -226681 -83499 -77188 -235627 -303671 -423219 -443310 -186926 23955 -130889
10415 -130889 -527999 -652224 -741398 -1096531 -1189006 -842742 -838363 -773935 -666298 -766323
10405 -766323 -792212 -700875 19338 453602 225839 280679 286088 -14318 -30591 93868 286402
10394 286402 491807 543671 709140 409795 267872 428843 513789 330414 56491 -113278
10384 -113278 -99332 13174 198803 55572 -233220 -73679 122065 148703 351384 570482
10374 570482 565221 686008 706039 380772 591227 662516 462929 428399 631055 870330
10364 870330 810939 470999 623882 895319 754040 630019 525152 254572 -56256 -323276
$$ packed form
10435c52581K68847l8124r7718k26940l11876j55516L48980P0142k67091K85056
10425d76821K50140J43182O311j58439o8044j19548k0091K56384K10881j54844
10415a30889l97110j24225q9174l55133r2475L46264M379O4428J07637j00025
10405g66323k5889R1337P20213M34264k27763N4840N409l00406j6273J24459J92534
10394B86402K05405N1864J65469k99345j41923J60971Q4946j83375k73923j69769
10384a13278J3946J12506J85629j43231k88792J59541J95744K6638K02681K19098
10374E70482n261J20787K0031l25267K10455P1289j99587l4530K02656K39275
10364H70330n9391l39940J52883K71437j41279j24021j04867k70580l10828k67020
$$ plain form
10354 -323276 -420083 -160535 13837 -85561 -161922 241114 522809 486170 399106 172962
10344 172962 45016 -159784 -497791 -503795 -808905 -942950 -880326 -658059 -496418 -527950
10334 -527950 -499463 -397379 302961 601651 298729 400930 692797 1025399 1563420 1677961
10324 1677961 1199475 731484 553475 705580 626392 172680 -109161 222714 413123 145150
10314 145150 -144345 -179694 146487 791624 1035982 717081 254254 -82864 -303821 -344130
10304 -344130 -351798 -303552 2630 164344 -100019 -225574 -173922 -217546 -331287 -123174
10294 -123174 6515 89331 205042 86259 -361538 -1032446 -1425794 -1049778 -149582 433595
10284 433595 450526 407335 534906 494815 376930 119054 -117699 9497 323403 460484
$$ packed form
10354c23276r6807K59548J74372r9398p6361M03036K81695l6639q7064k26144
10344A72962j27946k04800l38007o004l05110j34045O2624K22267J61641l1532
10334e27950K8487J02084P00340K98690l02922J02201K91867L32602N38021J14541
10324A677961m78486m67991j78009J52105p9188m53712k81841L31875J90409k67973
10314A45150k89495l5349L26181O45137K44358l18901m62827l37118k20957m0309
10304c44130p668M8246L06182J61714k64363j25555N1652m3624j13741K08113
10294a23174J29689Q2816J15711j18783m47797o70908l93348L76016R00196N83177
10284D33595J6931m3191J27571m0091j17885k57876k36753J27196L13906J37081
$$ plain form
10274 460484 435462 420847 410822 263143 317664 248205 -188275 -94750 42846 -60234 -95652
10263 -95652 284002 342657 91398 27649 -60079 -216930 -339821 -411090 -593398 -203438
10253 -203438 126639 235719 566044 707240 538413 194760 -384853 -314959 -114715 -355091
10243 -355091 -516477 -967305 -938447 -345941 -103319 -45988 -27677 -74334 -366456 -521015
10233 -521015 -699397 -532243 -186943 224228 28763 -387188 -429506 -483661 -591055 -446390
10223 -446390 -189215 -84643 -186858 -148761 93819 320473 511659 566151 799298 609064
10213 609064 233842 -107412 -462479 -602810 -37120 361694 277694 162983 95962 144551
10203 144551 -46786 -579856 -1236730 -1347407 -1076504 -906914 -682252 -484052 -607281 -496989
$$ packed form
10274D60484k5022j4615j0025j47679N4521o9459m36480R3525J37596j03080l5418
10263i5652L79654N8655k51259o3749q7728j56851j22891p1269j82308L89960
10253b03438L30077J09080L30325J41196j68827l43653n79613O9894K00244k40376
10243c55091j61386m50828K8858N92506K42622N7331J8311m6657k92122j54559
10233e21015j78382J67154L45300M11171j95465m15951m2318n4155j07394J44665
10223d46390K57175J04572j02215L8097K42580K26654J91186N4492K33147j90234
10213F09064l75222l41254l55067j40331N65690L98814q4000j14711o7021M8589
10203A44551j91337n33070o56874j10677K70903J69590K24662J98200j23229J10292
$$ plain form
10193 -496989 -308664 -472901 -615453 -535711 -317531 -302968 -189909 125945 433962 622449
10183 622449 907423 955249 436279 -21679 51495 192184 45730 -375534 -491608 -13412
10173 -13412 264578 216433 291007 203776 214321 165017 57189 8462 -143781 -375082 -773868
10162 -773868 -888468 -560350 -235221 -89463 -303080 -853206 -1231788 -1073818 -877919 -916887
10152 -916887 -652473 -390385 -522439 -630319 -419434 -543098 -654014 -290127 -181893 -243777
10142 -243777 -581893 -816120 -724404 -933268 -808662 -339665 -226977 -351054 -360533 -353354
10132 -353354 -828675 -1056663 -816417 -314888 -420694 -980831 -932942 -418569 -288961 -577665
10122 -577665 -662189 -637795 -626565 -591660 -329836 89680 360129 133415 -400996 -954401
$$ packed form
10193d96989J88325j64237j42552P9742K18180J4563J13059L15854L08017J88487
10183F22449K84974M7826n18970m57958P3174J40689j46454m21264j16074M78196
10173a3412K77990m8145P4574q7231J0545m9304j07828m8727j52243k31301l98786
10162g73868j14600L28118L25129J45758k13617n50126l78582J57970J95899l8968
10152i16887K64414K62088j32054j07880K10885j23664j10916L63887J08234o1884
10142b43777l38116k34227R1716k08864J24606M68997J12688j24077r479P179
10132c53354m75321k27988K40246N01529j05806n60137M7889N14373J29608k88704
10122e77665q4524K4394J1230L4905K61824M19516K70449k26714n34411n53405
$$ plain form
10112 -954401 -1162838 -1153869 -1036874 -827018 -663977 -375042 90074 234775 -74254 -118153
10102 -118153 334471 470545 62809 -212615 231844 526804 26073 -380790 -300713 -281824
10092 -281824 -441020 -689803 -1054197 -1136219 -649566 -48050 362059 388680 450123 404798
10082 404798 169584 64008 -56018 279548 740017 655728 110726 -257858 -423913 -339639
10072 -339639 -129604 231080 291490 205698 -23135 -225704 -86535 -118123 -160706 -250296
10062 -250296 -453752 -808072 -869833 -904055 -836454 -698686 -508097 -462398 -519431 -751546
10052 -751546 -639565 -183562 -244387 -667327 -1237060 -1317095 -874411 -897771 -1172449 -1213492
10042 -1213492 -1170530 -1083852 -990571 -956092 -666323 3489 296049 224561 -325502 -700096
$$ packed form
10112i54401k08437Q969J16995K09856J63041K88935M65116J44701l09029m3899
10102a18153M52624J36074m07736k75424M44459K94960n00731m06863Q0077J8889
10092b81824j59196k48783l64394q2022M86653O01516M10109K6621O1443m5325
10082D04798k35214j05576j20026L35566M60469q4289n45002l68584j66055Q4274
10072c39639K10035L60684O0410q5792k28833k02569J39169l1588m2583q9590
10062b50296k03456l54320o1761l4222O7601J37768J90589M5699n7033k32115
10052g51546J11981M56003o0825m22940n69733q0035M42684k3360k74678m1043
10042a213492M2962Q6678R3281L4479K89769O69812K92560p1488n50063l74594
$$ plain form
10032 -700096 -673916 -607338 -335452 -90293 -83625 123795 309496 544848 758234 797180
10022 797180 218280 -275857 -407562 -432595 -289642 -265 6559 16046 -102376 -541644
10012 -541644 -871304 -814668 -590567 -205945 168132 147153 -138649 -440161 -300397 -283352
10002 -283352 -595832 -729201 -404500 -574127 -621976 16796 574570 343557 288080 209365
9992 209365 535 -58477 4474 83094 124861 42329 -489603 -824293 -671627 -518993 -778084
9981 -778084 -953068 -653292 -421085 -336341 -23278 163207 8942 -228609 -565983 -921541
9971 -921541 -1123047 -946341 -488213 -294537 -357336 1729 395740 752319 885955 785904
$$ packed form
10032g00096K6180O6578K71886K45159O668K07420J85701K35352K13386L8946
10022G97180n78900m94137j31705k5033J42953K89377O824R487j18422m39268
10012e41644l29660N6636K24101L84622L74077k0979k85802l01512J39764J7045
10002b83352l12480j33369L24701j69627m7849O38772N57774k31013n5477p8715
9992B09365k08830n9012O2951P8620M1767q2532n31932l34690J52666J52634k59091
9981g78084j74984K99776K32207Q4744L13063J86485j54265k37551l37374l55558
9971i21541k01506J76706M58128J93676o2799L59065L94011L56579J33636j00051
$$ [...]
##END NTUPLES=NMR SPECTRUM
##END=
