##TITLE=C13_LR-618-R3-CR18-2
 CDCl3,  19700 sc

 1.7.2021
##JCAMPDX= 6.0         $$ Bruker NMR JCAMP-DX V2.0
##DATA TYPE= NMR SPECTRUM
##DATA CLASS= NTUPLES
##ORIGIN= UXNMR, Bruker Analytische Messtechnik GmbH
##OWNER= root
$$ XWIN-NMR		Version 3.5
$$ Fri Jul  2 08:34:55 2021 Russian Standard Time (UT+4h)  she@DPX200
##.OBSERVE FREQUENCY= 50.327896
##.OBSERVE NUCLEUS= ^13C
##.ACQUISITION MODE= SIMULTANEOUS
##.ACQUISITION SCHEME= undefined
##.AVERAGES= 19700
##.DIGITISER RES= 17
##SPECTROMETER/DATA SYSTEM= spect
##.PULSE SEQUENCE= zgpg30
##.SOLVENT NAME= D2O
##.SHIFT REFERENCE= (INTERNAL, D2O, 0, 222.653)
##AUDIT TRAIL= $$ (NUMBER, WHEN, WHO, WHERE, WHAT)
$$ ##TITLE= Audit trail, XWIN-NMR		Version 3.5
$$ ##JCAMPDX= 5.01
$$ ##ORIGIN= Bruker BioSpin GmbH
$$ ##OWNER= she
$$ F:/spectra/data/she/nmr/c13/1/pdata/1/auditp.txt
$$ ##AUDIT TRAIL=  $$ (NUMBER, WHEN, WHO, WHERE, WHAT)
(   1,<2021-07-02 08:32:45.53 +0400>,<she>,<DPX200>,
      <created by zg, POWCHK disabled, PULCHK disabled
       terminated by command 'halt'
       configuration hash MD5:
       00 E9 B6 7A A2 85 ED C7 34 08 36 98 17 FE 4E 26
       data hash MD5: 32K
       9A 74 A0 B9 D9 48 97 ED 5D 1B 70 F1 D7 D5 F6 2C>)
(   2,<2021-07-02 08:32:56.75 +0400>,<she>,<DPX200>,
      <Start of raw data processing
       efp BC_mod = 2 LB = 1 FT_mod = 6 PKNL = 1 PHC0 = -334.0107 PHC1 = 28.16237 SI = 32K 
       data hash MD5: 32K
       11 FB D9 4D BB F3 F0 DE 0B 92 D2 F6 BE 64 8B 9F>)
(   3,<2021-07-02 08:33:06.06 +0400>,<she>,<DPX200>,
      <abs ABSG = 5 
       data hash MD5: 32K
       26 79 78 18 5A 15 14 4B 39 E5 72 23 13 90 84 DC>)
(   4,<2021-07-02 08:33:32.43 +0400>,<she>,<DPX200>,
      <pk PHC0 = -2.207769 PHC1 = 2.2 
       data hash MD5: 32K
       33 95 56 98 89 D3 B0 ED E8 F7 29 14 5E 53 FD 19>)
(   5,<2021-07-02 08:33:36.39 +0400>,<she>,<DPX200>,
      <abs ABSG = 5 
       data hash MD5: 32K
       AD 60 69 5A DC F4 65 69 B2 A8 87 82 58 45 60 AA>)
(   6,<2021-07-02 08:33:46.81 +0400>,<she>,<DPX200>,
      <abs ABSG = 5 
       data hash MD5: 32K
       7B 53 1A 5B BD DD 1D 67 57 BB D1 6F E2 D3 E0 A5>)
$$ ##END=
$$ 
$$ hash MD5
$$ EF 58 D6 3B 44 22 FE 6B 56 A1 64 97 8C BD EF 53
##$RELAX= 
##$RELAX= 
##$RELAX= 
##$RELAX= 
##$RELAX= 
##$RELAX= 
##$RELAX= 
##$RELAX= 
$$ Bruker specific parameters
$$ --------------------------
##$DU= <F:/spectra>
##$EXPNO= 1
##$NAME= <c13>
##$PROCNO= 1
##$TYPE= <nmr>
##$USER= <she>
##$AMP= (0..31)
100 100 100 100 100 100 100 100 100 100 100 100 100 100 100 100 100 100 
100 100 100 100 100 100 100 100 100 100 100 100 100 100 
##$AQSEQ= 0
##$AQ_mod= 1
##$AUNM= <au_zg>
##$AUTOPOS= <>
##$BF1= 50.322709
##$BF2= 200.13
##$BF3= 50.322709
##$BF4= 500.13
##$BF5= 500.13
##$BF6= 500.13
##$BF7= 500.13
##$BF8= 500.13
##$BYTORDA= 1
##$CFDGTYP= 0
##$CFRGTYP= 5
##$CHEMSTR= <none>
##$CNST= (0..31)
1 1 145 1 1 1 1 1 1 1 1 1 1 1 1 1 1 1 1 1 1 1 1 1 1 1 1 1 1 1 1 1 
##$CPDPRG= <waltz16>
##$CPDPRG1= <>
##$CPDPRG2= <waltz16>
##$CPDPRG3= <>
##$CPDPRG4= <mlev>
$$ [...]
##$SUBNAM4= <"">
##$SUBNAM5= <"">
##$SUBNAM6= <"">
##$SUBNAM7= <"">
##$SUBNAM8= <"">
##$SUBNAM9= <"">
##$SW= 239.972175391363
##$SWIBOX= (0..15)
0 1 3 0 0 0 0 0 0 0 0 0 0 0 0 0 
##$SW_h= 12077.2946859903
##$TD= 32768
##$TD0= 1
##$TE= 0
##$TE2= 300
##$TE3= 300
##$TEG= 300
##$TL= (0..7)
120 120 120 120 120 120 120 120 
##$TP= (0..7)
150 150 150 150 150 150 150 150 
##$TP07= 0
##$TPNAME0= <>
##$TPNAME1= <>
##$TPNAME2= <>
##$TPNAME3= <>
##$TPNAME4= <>
##$TPNAME5= <>
##$TPNAME6= <>
##$TPNAME7= <>
##$TPOAL= (0..7)
0.5 0.5 0.5 0.5 0.5 0.5 0.5 0.5 
##$TPOFFS= (0..7)
0 0 0 0 0 0 0 0 
##$TUNHIN= 0
##$TUNHOUT= 0
##$TUNXOUT= 0
##$USERA1= <user>
##$USERA2= <user>
##$USERA3= <user>
##$USERA4= <user>
##$USERA5= <user>
##$V9= 5
##$VALIST= <valist>
##$VCLIST= <CCCCCCCCCCCCCCC>
##$VD= 0
##$VDLIST= <DDDDDDDDDDDDDDD>
##$VPLIST= <PPPPPPPPPPPPPPP>
##$VTLIST= <TTTTTTTTTTTTTTT>
##$WBST= 1024
##$WBSW= 4
##$XGAIN= (0..3)
0 0 0 0 
##$XL= 0
##$YL= 0
##$YMAX_a= 123010699
##$YMIN_a= -33390658
##$ZGOPTNS= <>
##$ZL1= 120
##$ZL2= 120
##$ZL3= 120
##$ZL4= 120
##$ABSF1= 222.6533
##$ABSF2= -17.34351
##$ABSG= 5
##$ABSL= 3
##$ALPHA= 0
##$AQORDER= 0
##$ASSFAC= 0
##$ASSFACI= 0
##$ASSFACX= 0
##$ASSWID= 0
##$AUNMP= <proc_1d>
##$AZFE= 0.1
##$AZFW= 0.5
##$BCFW= 0
##$BC_mod= 2
##$BYTORDP= 0
##$COROFFS= 0
##$CY= -3
##$DATMOD= 1
##$DC= 0
##$DFILT= <>
##$DTYPP= 0
##$F1P= 0
##$F2P= 0
##$FCOR= 0.5
##$FTSIZE= 32768
##$FT_mod= 6
##$GAMMA= 0
##$GB= 0
##$INTBC= 1
##$INTSCL= 4.134877e-10
##$ISEN= 128
##$LB= 1
##$LEV0= 0
##$LPBIN= 0
##$MAXI= 10000
##$MC2= 0
##$MEAN= 0
##$ME_mod= 0
##$MI= 0.1934396
##$NCOEF= 0
##$NC_proc= 3
##$NLEV= 6
##$NOISF1= 120.0001
##$NOISF2= 80.00006
##$NSP= 0
##$NTH_PI= 0
##$NZP= 0
##$OFFSET= 222.6533
##$PC= 1.4
##$PHC0= -336.2185
##$PHC1= 30.36237
##$PH_mod= 1
##$PKNL= yes
##$PPARMOD= 0
##$PSCAL= 0
##$PSIGN= 0
##$REVERSE= no
##$SF= 50.3227301278049
##$SI= 32768
##$SIGF1= 140
##$SIGF2= 120
##$SINO= 11.81781
##$SIOLD= 32768
##$SREGLST= <13C.CDCl3>
##$SSB= 0
##$STSI= 32768
##$STSR= 0
##$SW_p= 12077.2946859903
##$SYMM= 0
##$S_DEV= 0
##$TDeff= 32768
##$TDoff= 0
##$TI= <>
##$TILT= no
##$TM1= 0
##$TM2= 0
##$TOPLEV= 0
##$USERP1= <user>
##$USERP2= <user>
##$USERP3= <user>
##$USERP4= <user>
##$USERP5= <user>
##$WDW= 1
##$XDIM= 32768
##$YMAX_p= 276028443
##$YMIN_p= -1240602
$$ End of Bruker specific parameters
$$ ---------------------------------
##NTUPLES= NMR SPECTRUM
##VAR_NAME=  FREQUENCY,     SPECTRUM/REAL,   SPECTRUM/IMAG
##SYMBOL=    X,             R,               I
##VAR_TYPE=  INDEPENDENT,   DEPENDENT,       DEPENDENT
##VAR_FORM=  AFFN,          ASDF,            ASDF
##VAR_DIM=   32768,         32768,           32768
##UNITS=     HZ,            ARBITRARY UNITS, ARBITRARY UNITS
##FACTOR=    0.368581032318806, 1,           1
##FIRST=     11204.5221822817, 0,            0
##LAST=      -872.772503708586, 0,           0
##MIN=       -872.772503708586, -1240602,    0
##MAX=       11204.5221822817, 276028443,    0
$$ Real data points
##PAGE= N=1
##DATA TABLE= (X++(R..R)), XYDATA
$$ [...]
$$ plain form
15862 75865 110752 242396 340289 389044 401247 283068 200720 161073 14519 -78568 -216993
15851 -216993 -297293 -293268 -339313 -275874 -217929 -10945 157301 226136 266850 246551 92573
15840 92573 95579 240418 174849 -6064 -34545 -185830 -304049 -242404 -140858 -20753 -100002
15829 -100002 -236678 -312779 -353136 -355590 -279502 -227979 -250918 -226772 11375 74272 -66138
15818 -66138 -185013 -171831 -276250 -368774 -447181 -413422 -367115 -283641 -311958 -470745 -457267
15807 -457267 -212055 146337 237800 211225 288631 293695 201962 151321 299963 452189 450327
15796 450327 418518 523398 607894 512462 317345 279380 154542 -51377 -105760 15311
15786 15311 37147 34365 46073 -109567 8966 212659 180162 45333 -84659 -94570 -45018
$$ packed form
15862G5865L4887J31644R7893M8755J2203j18179q2348l9647j46554r3087j38425
15851b16993q0300M025m6045O3439N7945K06984J68246O8835M0714k0299j53978
15840I2573L006J44839o5569j80913k8481j51285j18219O1645J01546J20105p9249
15829a00002j36676p6101m0357k454P6088N1523k2939K4146K38147O2897j40410
15818f6138j18875J3182j04419r2524p8407L3759M6307Q3474k8317j58787J3478
15807d57267K45212L58392R1463k6575P7406N064r1733n0641J48642J52226j862
15796D50327l1809J04880Q4496r5432j95117l7965j24838k05919n4383J21071
15786A5311K1836k782J1708j55640J18533K03693l2497j34829j29992r911M9552
$$ plain form
15775 -45018 -26286 124030 208895 279867 398596 417624 414653 415276 317592 99732 -220295
15764 -220295 -249399 47650 38245 -135425 -190683 -382908 -422266 -583901 -771846 -689065 -562972
15753 -562972 -492669 -330142 -232210 -201578 -2152 128744 140712 191657 152785 124951 85067
15742 85067 265662 609786 701843 536690 412954 367431 387880 230576 -146479 -391825
15732 -391825 -475917 -383067 -116951 -152495 -253347 -78272 154724 195416 49681 31791
15722 31791 100269 18493 -119820 -63341 -12946 -21660 -16915 -18975 72752 -8273 -184500 -159765
15710 -159765 -57769 -146179 -349612 -448571 -535717 -660384 -770264 -673084 -492277 -373094
15700 -373094 -197263 -136774 -70527 -94766 -143790 -88600 -96100 -301500 -446359 -600781 -692214
$$ packed form
15775d5018J8732J50316Q4865P0972J18729J9028k971O23r7684k17860l20027
15764b20295k9104K97049r405j73670n5258j92225l9358j61635j87945Q2781J26093
15753e62972P0303J62527R7932L0632J99426J30896J1968N0945l8872k7834l9884
15742H5067J80595L44124R2057j65153j23736m5523K0449j57304l77055k45346
15732c91825q4092R2850K66116l5544j00852J75075K32996M0692j45735j7890
15722C1791O8478q1776j38313N6479N0395q714M745k060R1727q1025j76227K4735
15710a59765J01996q8410k03433r8959q7146j24667j09880R7180J80807J19183
15700c73094J75831O0489O6247k4239m9024N5190p500k05400j44859j54422r1433
$$ plain form
15689 -692214 -586285 -487908 -388609 -334841 -267437 -90202 -74526 9927 174127 146462 -60137
15678 -60137 -267417 -181422 -54163 -294085 -451786 -419168 -380308 -124179 250511 356965
15668 356965 260375 116204 -35795 -24344 -159616 -326309 -336954 -301925 -182140 -138187
15658 -138187 -64671 135249 250698 286982 263655 218738 122288 -69082 -87847 -46002 -221073
15647 -221073 -657140 -817950 -663463 -457028 -414857 -300650 -50171 264687 344795 133140
15637 133140 -14578 -174487 -418191 -483552 -300301 -118854 109746 160594 -64248 -227906
15627 -227906 -245315 -110732 12769 128626 151627 52576 -54970 -103746 24029 163077
15617 163077 142993 90965 -16741 -278840 -492059 -539551 -425353 -264948 -331252 -280511
$$ packed form
15689f92214J05929R8377R9299N3768O7404J77235J5676Q4453J64200k7665k06599
15678f0137k07280Q5995J27259k39922j57701L2618L8860K56129L74690J06454
15668C56965r6590j44171j51999J1451j35272j66693j0645L5029J19785M3953
15658a38187P3516J99920J15449L6284k3327m4917r6450j91370j8765M1845j75071
15647b21073m36067j60810J54487K06435M2171J14207K50479L14858Q0108k11655
15637A33140j47718j59909k43704o5361J83251J81447K28600N0848k24842j63658
15627b27906j7409J34583J23501J15857K3001r9051j07546m8776J27775J39048
15617A63077k0084n2028j07706k62099k13219m7492J14198J60405o6304N0741
$$ plain form
15607 -280511 -186538 -295500 -488733 -574647 -473286 -346107 -274778 -234019 -72867 184273
15597 184273 231551 104881 -46025 -84814 46961 65282 -116345 -313039 -471889 -562102
15587 -562102 -489030 -392693 -270911 -307701 -512598 -660677 -526203 -320588 -146436 92680
15577 92680 170780 170165 176885 -54755 -350586 -511201 -547034 -589730 -570210 -435467 -216129
15566 -216129 -134850 -293875 -404322 -395867 -293223 -144815 -194476 -98509 61464 17230 -106411
15555 -106411 -84055 131080 258356 225256 127062 -22600 -94325 -164611 -212922 -169728 -73052
15544 -73052 34490 14725 -915 -12056 -85556 -56779 -58375 -91480 -57476 -44525 -127874 -178527
15532 -178527 -160280 38382 -64587 -243788 -250470 -167977 -50302 16999 -13233 -83746 -47824
$$ packed form
15607b80511R3973j08962j93233q5914J01361J27179P1329M0759J61152K57140
15597A84273M7278j26670j50906l8789J31775J8321j81627j96694j58850r0213
15587e62102P3072R6337J21782l6790k04897j48079J34474K05615J74152K39116
15577I2680P8100o15O720k31640k95831j60615l5833m2696J9520J34743K19338
15566b16129Q1279j59025j10447Q455J02644J48408m9661R5967J59973m4234j23641
15555a06411K2356K15135J27276l3100r8194j49662p1725p0286m8311M3194R6676
15544g3052J07542j9765j5640j1141p3500K8777j596l3105L4004J2951q3349n0653
15532a78527J8247J98662j02969j79201o682Q2493J17675O7301l0232p0513L5922
$$ plain form
15521 -47824 272972 350854 -640 -218010 -184525 -155164 -263960 -441371 -641265 -733780
15511 -733780 -761334 -722143 -590373 -440740 -384052 -403502 -401657 -527891 -541669 -437825 -275412
15500 -275412 740 -163528 -453230 -528572 -422985 -426205 -532779 -456801 -303344 -181456
15490 -181456 11967 235926 506103 511440 320096 222515 188381 227046 148884 129019 219598
15479 219598 185216 117244 98920 93915 -49158 -122912 -66446 60252 151844 215355 364929
15468 364929 269987 -37802 -154041 -105584 12463 234575 305166 163292 112963 105467 39833
15457 39833 -159134 -406225 -469236 -572964 -532845 -153890 115596 258679 127769 77252
15447 77252 145331 -45742 -289018 -486906 -396670 -283303 -154961 111300 97295 -42808
$$ packed form
15521d7824L20796P7882l51494k17370L3485K9361j08796j77411j99894r2515
15511g33780k7554L9191J31770J49633N6688j9450J845j26234j3778J03844J62413
15500b75412K76152j64268k89702p5342J05587l220j06574P5978J53457J21888
15490a81456J93423K23959K70177N337j91344r7581l4134L8665p8162j9865R0579
15479B19598l4382o7972j8324n005j43073p3754N6466J26698R1592O3511J49574
15468C64929r4942l07789j16239M8457J18047K22112P0591j41874n0329p496o5634
15457C9833j98967k47091o3011j03728M0119L78955K69486J43083j30910n0517
15447G7252O8079j91073k43276j97888R0236J13367J28342K66261j4005j40103
$$ plain form
15437 -42808 -107414 -301148 -422817 -594808 -749089 -628558 -302036 -197692 -307682 -292390
15427 -292390 -122503 20510 153522 238673 125642 -26212 22971 224098 302884 173464
15417 173464 5898 -171000 -187963 65029 358865 382075 167147 -118622 -218655 -152547
15407 -152547 -15879 21026 -68839 -46518 -38840 -36771 -71224 -85253 -140020 -159417 -46871
15396 -46871 29780 203625 343909 333711 284166 360910 387493 402559 461382 431387 378590
15385 378590 393884 325886 395434 368914 58303 46533 280161 258173 122483 97475 55730
15374 55730 -136055 -278792 -428277 -572324 -630709 -627748 -555208 -497527 -456265 -510993 -643859
15363 -643859 -533519 -150862 11470 97998 52446 -94756 51833 318578 574989 553401
$$ packed form
15437d2808o4606j93734j21669j71991j54281J20531L26522J04344j09990J5292
15427b92390J69887J43013J33012Q5151j13031j51854M9183K01127P8786j29420
15417A73464j67566j76898j6963K52992K93836K3210k14928k85769j00033O6108
15407a52547J36668L6905q9865K2321P678K069l4453j4029n4767j9397J12546
15396d6871P6651J73845J40284j0198m9545P6744K6583J5066N8823k9995n2797
15385C78590J5294o7998O9548k6520l10611j1770K33628k1988j35690k5008m1745
15374E5730j91785j42737j49485j44047n8385K961P2540N7681M1262n4728j32866
15363f43859J10340L82657J62332Q6528m5552j47202J46589K66745K56411k1588
$$ plain form
15353 553401 322430 199351 148502 227641 296095 242547 215030 228936 310906 178925 -32950
15342 -32950 49594 100864 29470 34652 8655 -163680 -257482 -418654 -505382 -332190 -82683
15331 -82683 14509 -8045 73475 126139 25350 -167362 -191005 41232 258217 248443 111486
15320 111486 -57503 -50660 35917 96200 42420 -73273 -60131 -189995 -430525 -470671 -267911
15309 -267911 -84268 -22729 -11418 -32331 12099 156883 161091 140801 94233 37131 109993
15298 109993 213292 163458 -121755 -293513 -259671 -274774 -506809 -646110 -541255 -419562
15288 -419562 -370114 -317727 -203458 12914 160841 168710 196276 146722 154931 85740 -127771
15277 -127771 -405429 -415880 -389265 -427049 -432740 -341748 -230313 -377400 -596095 -531733 -422571
$$ packed form
15353E53401k30971j23079n0849P9139O8454n3548k7517J3906Q1970j31981k11875
15342c2950Q2544N1270p1394N182k5997j72335r3802j61172q6728J73192K49507
15331h2683R7192k2554Q1520N2664j00789j92712k3643K32237K16985r774j36957
15320A11486j68989O843Q6577O0283n3780j15693J3142j29864k40530m0146K02760
15309b67911J83643O1539J1311k0913M4430J44784M208k0290m6568n7102P2862
15298A09993J03299m9834k85213j71758L3842j5103k32035j39301J04855J21693
15288d19562M9448N2387J14269K16372J47927P869K7566m9554Q209o9191k13511
15277a27771k77658j0451K6615l7784n691R0992J11435j47087k18695O4362J09162
$$ plain form
15266 -422571 -308209 -219196 -289972 -338563 -310586 -438055 -489052 -339286 -184556 -211451 -191975
15255 -191975 -294104 -617137 -775809 -621799 -426615 -402301 -561200 -774035 -869377 -777462
15245 -777462 -478889 -225542 -334518 -537217 -530645 -563052 -532534 -427013 -178176 33324
15235 33324 16441 -278563 -480108 -468430 -200259 179749 261691 202433 175737 157829 -92887
15224 -92887 -74753 65967 35403 -19896 35527 116550 97370 41480 -128637 -272044 -170866
15213 -170866 -23213 76113 -71587 -236900 -315967 -285657 -176372 -123236 -75528 -154519 -264455
15202 -264455 -248606 -167405 -100195 17329 190117 134713 -89199 -94520 54739 163293 287711
15191 287711 367697 236593 182489 207046 214809 311911 241944 -86902 -420328 -498284 -360043
$$ packed form
15266d22571J14362Q9013p0776m8591K7977j27469n0997J49766J54730k6895J9476
15255a91975j02129l23033j58672J54010J95184K4314j58899k12835r5342R1915
15245g77462K98573K53347j08976k02699O572l2407L0518J05521K48837K11500
15235C3324j6883k95004k01545J1678K68171L80008Q1942n9258k6696j7908k50716
15224i2887J8134J40720l0564n5299N5423Q1023j9180n5890j70117j43407J01178
15213a70866J47653R9326j47700j65313p9067L0310J09285N3136M7708p8991j09936
15202b64455J5849Q1201O7210J17524J72788n5404k23912n321J49259J08554J24418
15191B87711P9986j31104n4104K4557P763R7102o9967l28846l33426p7956J38241
$$ plain form
15180 -360043 -205230 51504 218884 333006 405244 430596 102612 -274317 -259882 -285195
15170 -285195 -348112 -467347 -655756 -800126 -780379 -599113 -425749 -357404 -304480 -272325
15160 -272325 -272017 -189120 -195660 -180647 -59597 48059 160192 232178 291984 182327 -6949
15149 -6949 -34447 -1343 7672 -135480 -65146 -23891 -142888 -378502 -562959 -354576 -107879
15138 -107879 -265011 -486369 -463649 -366520 -201519 -186319 -289367 -195638 141492 323284
15128 323284 129740 -103336 -238983 -267526 -455059 -595821 -415334 -184140 45076 81736
15118 81736 83765 13719 -200140 -348030 -399364 -267128 5274 119161 15396 -398236
15108 -398236 -605847 -658436 -575079 -443553 -258446 -52260 -142138 -305768 -305658 -92429 148641
$$ packed form
15180c60043J54813K56734J67380J14122P2238K5352l27984l76929J4435k5313
15170b85195o2917j19235j88409j44370J9747J81266J73364O8345N2924L2155
15160b72325L08Q2897o540J5013J21050J07656J12133P1986N9806j09657j89276
15149f949k7498L3104R015j43152P0334M1255j18997k35614j84457K08383K46697
15138a07879j57132k21358K2720R7129J65001J5200j03048R3729L37130J81792
15128C23284j93544k33076j35647k8543j87533j40762J80487K31194K29216L6660
15118H1736K029p0046k13859j47890n1334J32236K72402J13887j03765m13632
15108c98236k07611n2589Q3357J31526J85107K06186q9878j63630J10K13229K41070
$$ plain form
15097 148641 161114 15318 73609 215583 79214 82868 395225 588331 481366 457686
15087 457686 461981 449518 530737 438458 335320 254736 141055 168650 244460 229380 22149
15076 22149 -32852 170250 252020 332428 419016 633451 810386 779533 554516 347315 114620
15065 114620 -58421 -10298 76929 10123 129453 191074 153056 5448 49957 34319 -225582
15054 -225582 -384249 -222442 37487 4145 -216496 -247675 -235254 -264716 -250907 -68118
15044 -68118 -115190 -292648 -185305 -176664 -333168 -347983 -265136 -81906 -87685 -208308 -254679
15033 -254679 -178299 -182877 -423705 -493780 -423546 -307533 -296190 -392995 -451913 -534575 -409552
15022 -409552 -273453 -175742 -41717 129972 42586 -168473 -318634 -495456 -430555 -189156
$$ packed form
15097A48641J2473j45796N8291J41974j36369L654L12357J93106j06965k3680
15087D57686M295j2463Q1219r2279j03138q0584j13681K7595P5810j5080k07231
15076B2149n5001K03102Q1770Q0408Q6588K14435J76935l0853k25017k07201k32695
15065A14620j73041M8123Q7227o6806J19330O1621l8018j47608M4509j5638k59901
15054b25582j58667J61807K59929l3342k20641l1179J2421k9462J3809J82789
15044f8118m7072j77458J07343Q641j56504j4815Q2847J83230n779j20623m6371
15033b54679P6380m578k40828p0075P0234J16013J1343r6805n8918q2662J25023
15022d09552J36099R7711J34025J71689q7386k11059j50161j76822O4901K41399
$$ plain form
15012 -189156 61750 108855 61772 124387 160937 11444 -5654 55974 56584 113373 -80891
15001 -80891 -264328 -288395 -316889 -372352 -448618 -480485 -408517 -152498 -64662 -67632 -14057
14990 -14057 124287 231437 196333 157584 -102442 -404193 -470015 -630062 -628380 -471961 -485388
14979 -485388 -575655 -496691 -348704 -240264 -368244 -563528 -630663 -582909 -630254 -620739 -626340
14968 -626340 -668371 -765160 -754413 -562863 -389466 -245928 -152662 -1283 79879 64462 -88638
14957 -88638 -174966 -185027 -209984 -284927 -373898 -366508 -412071 -438923 -227537 -57787 -146766
14946 -146766 -227177 -334234 -362170 -347636 -234250 -256453 -376865 -381060 -338978 -425517 -557376
14935 -557376 -589072 -426734 -252928 -329038 -547264 -612946 -527749 -535759 -630542 -546871 -450614
$$ packed form
15012a89156K50906M7105m7083O2615L6550j49493j7098O1628O10N6789j94264
15001h0891j83437k4067k8494n5463p6266l1867P1968K56019Q7836k970N3575
14990a4057J38344J07150l5104l8749k60026l01751o5822j60047J682J56419j3427
14979d85388r0267P8964J47987J08440j27980j95284o7135M7754m7345R515n601
14968f26340m2031r6789J0747J91550J73397J43538R3266J51379Q1162j5417j53100
14957h8638q6328j0061k4957p4943q8971P390m5563k6852K11386J69750q8979
14946a46766q0411j07057k7936J4534J13386k2203j20412m195M2082q6539j31859
14935e57376l1696J62338J73806p6110k18226o5682Q5197q010r4783Q3671R6257
$$ plain form
14924 -450614 -382574 -350483 -349474 -177221 64609 96688 77905 -2641 -41305 -21158 -56371
14913 -56371 -190639 -421686 -423369 -321382 -229386 -76069 12655 -188501 -379653 -553365
14903 -553365 -675384 -554307 -417680 -323740 -162012 -309723 -492238 -402698 -356420 -314423
14893 -314423 -143817 -50937 -37820 46908 40117 38965 119879 66877 7879 -60564 -30115 -147435
14881 -147435 -221434 -66578 25499 2674 -75617 -163428 -169866 -126961 -225718 -219111 -230025 -107914
14869 -107914 -89198 -275253 -428668 -318153 -325538 -422533 -347165 -309267 -314487 -272719 -52950
14858 -52950 53871 113744 188649 132970 -88136 -314123 -470036 -373838 -335615 -441800 -369619
14847 -369619 -180605 -88970 -56823 -96691 -21821 178426 179016 82523 -110821 -169122 -250714
$$ packed form
14924d50614O8040L2091J009J72253K41830L2079j8783q0546l8664K0147l5213
14913e6371j34268k31047j683J01987R1996J53317Q8724k01156j91152j73712
14903e53365j22019J21077J36627R3940J61728j47711j82515Q9540M6278M1997
14893c14423J70606R2880J3117Q4728o791j152Q0914n3002n8998o8443L0449j17320
14881a47435p3999J54856R2077k2825p8291q7811o438M2905r8757O607j0914J22111
14869a07914J8716j86055j53415J10515p385r6995P5368L7898n220M1768K19769
14858e2950J06821N9873P4905n5679k21106k25987j55913R6198L8223j06185P2181
14847c69619J89014R1635L2147l9868P4870K00247N90r6493j93344n8301q1592
$$ plain form
14836 -250714 -363655 -327251 -436668 -608507 -550483 -148576 66349 -30240 83735 395172
14826 395172 458993 416583 411705 180094 -167649 -349124 -319355 -285111 -76852 212188 163702
14815 163702 -26334 -124305 -182569 -131302 -86048 -197848 -289371 -177190 -99800 -30127 -28836
14804 -28836 -186907 -346231 -448713 -407598 -274019 -258628 -209172 -81769 -33223 89939
14794 89939 175748 213712 242334 195127 176530 330349 427842 369761 217690 149416 -135286
14783 -135286 -521450 -658855 -560760 -312370 -215765 -117537 -44454 -89458 -57638 76126 164295
14772 164295 -9267 -259801 -433734 -307771 -195946 -321958 -492610 -650828 -582905 -373037
14762 -373037 -298712 -339197 -328161 -215443 -122002 -235031 -305162 -344843 -398636 -360252 -312785
$$ packed form
14836b50714j12941L6404j09417j71839N8024M01907K14925r6589J13975L11437
14826C95172O3821m2410m878k31611l47743j81475K9769L4244K08259K89040m8486
14815A63702j90036r7971n8264N1267M5254j11800r1523J12181P7390O9673J291
14804b8836j58071j59324j02482M1115J33579J5391M9456J27403M8546J23162
14794H9939Q5809L7964K8622m7207j8597J53819R7493n8081j52071o8274k84702
14783a35286l86164j37405R8095K48390R6605R8228P3083m5004L1820J33764Q8169
14772A64295j73562k50534j73933J25963J11825j26012j70652j58218O7923K09868
14762c73037P4325m0485J1036J12718R3441j13029p0131l9681n3793L8384M7467
$$ plain form
14751 -312785 -209748 32308 54038 -89441 -273963 -506647 -817793 -907714 -639084 -390448
14741 -390448 -123534 144987 326282 252438 118617 62753 34074 -127399 -253022 -246686
14731 -246686 -235687 -402220 -632626 -659852 -550578 -387966 -56627 133378 39647 28837
14721 28837 64894 217273 419354 420247 255735 82905 -221618 -264103 -201786 -335765 -337727
14710 -337727 -465111 -597087 -397197 -221205 -136339 -265201 -415176 -532983 -551014 -423237
14700 -423237 -293280 -16324 553 103431 149468 -118094 -313511 -298982 -178399 -79168
14690 -79168 -237748 -452690 -514064 -567956 -502582 -399721 -292384 -306176 -341091 -240247 -2061
14679 -2061 102514 -213294 -385546 -205874 27200 83215 36368 47902 179331 256624 274596
$$ packed form
14751c12785J03037K42056K1730j43479j84522k32684l11146q9921K68630K48636
14741c90448K66914K68521J81295p3844j33821n5864k8679j61473j25623O336
14731b46686J0999j66533k30406k7226J09274J62612L31339J90005r3731j0810
14721B8837L6057J52379K02081Q93j64512j72830l04523m2485O2317j33979j962
14710c37727j27384j31976J99890J75992Q4866j28862j49975j17807j8031J27777
14700d23237J29957K76956J6877J02878M6037k67562j95417J4529J20583R9231
14690g9168j58580k14942o1374n3892O5374J02861J07337j3792l4915J00844K38186
14679b061J04575l15808j72252J79672K33074N6015m6847J1534J31429P7293J7972
$$ plain form
14668 274596 473363 580000 500763 404331 305590 102443 14834 156427 328160 321621 189327
14657 189327 -79369 -400345 -480955 -210399 -15296 70903 128461 70955 -53779 -218075
14647 -218075 -299737 -245229 -175424 -119754 -221883 -431348 -562888 -545446 -399707 -340631 -260079
14636 -260079 -219664 -172279 52342 1333 -262526 -336601 -177932 -131848 -184012 59813 153319
14625 153319 4471 -248214 -410680 -202230 -39242 7585 -97085 -234026 -299252 -337427
14615 -337427 -391088 -359941 -96660 2349 -211094 -443359 -411838 -183749 52442 315159
14605 315159 313861 332302 621126 792771 854761 650467 387905 180507 114298 215817
14595 215817 101135 2826 96913 120971 -76359 -94468 -134549 -395377 -509353 -401221
$$ packed form
14668B74596J98767J06637p9237r6432r8741k03147q7609J41593J71733o539j32294
14657A89327k68696l20976q0610K70556J95103Q6199N7558n7506j24734j64296
14647b18075q1662N4508O9805N5670j02129k09465j31540J7442J45739N9076Q0552
14636b60079M0415M7385K24621n1009k63859p4075J58669M6084n2164K43825R3506
14625A53319j48848k52685j62466K08450J62988M6827j04670j36941o5226l8175
14615c37427n3661L1147K63281R9009k13443k32265L1521K28089K36191K62717
14605C15159j298J8441K88824J71645O1990k04294k62562k07398o6209J01519
14595B15817j14682r8309R4087K4058j97330j8109m0081k60828j13976J08132
$$ plain form
14585 -401221 -244690 -22316 155334 107704 -114219 -186682 33507 194727 -48323 -362739
14575 -362739 -359926 -120056 135875 241580 168718 -30121 -161320 -219332 -41460 127696
14565 127696 173145 212248 169887 60385 108191 152401 90850 -14608 -96174 -46460 22487
14554 22487 57807 9367 -131448 -228564 -259699 -351862 -386016 -497555 -647259 -777799 -860592
14543 -860592 -894491 -661027 -414408 -423825 -567073 -622193 -552128 -393837 -297569 -258708 -183819
14532 -183819 -198681 -45963 -56117 -128080 -78260 -92726 -208870 -508077 -550890 -286066 104678
14521 104678 266403 207642 15975 -188151 -38241 133383 268351 268953 77804 -105161
14511 -105161 13006 182127 141365 -67352 -216310 -348283 -368793 -350675 -296618 -291052 -243371
$$ packed form
14585d01221J56531K22374J77650m7630k21923p2463K20189J61220k43050l14416
14575c62739K813K39870K55931J05705p2862j98839j31199n8012J77872J69156
14565A27696M5449L9103m2361j09502M7806M4210o1551j05458q1566M9714O8947
14554B2487L5320m8440j40815r7116l1135r2163l4154j11539j49704j30540q2793
14543h60592l3899K33464K46619r417j43248n5120P0065J58291R6268L8861P4889
14532a83819j4862J52718j0154p1963M9820j4466j16144k99207m2813K64824L90744
14521A04678J61725n8761j91667k04126J49910J71624J34968O02j91149j82965
14511a05161J18167J69121m0762k08717j48958j31973k0510J8118N4057N566M7681
$$ plain form
14500 -243371 -199655 -125134 -145431 -217448 -77899 -40352 25692 162639 28673 -122478 -292100
14489 -292100 -498422 -521520 -542033 -660625 -566714 -153277 123466 185015 141511 57845 22928
14478 22928 -74740 -244591 -455938 -566728 -461216 -270248 -50124 133482 235118 194917
14468 194917 38678 -313204 -613915 -691624 -658476 -530461 -459209 -377040 -290606 28978
14458 28978 296156 333567 210700 87217 160627 232349 199466 85946 -168491 -385914
14448 -385914 -455554 -399773 -404967 -499150 -522437 -490393 -489164 -296710 -238619 -282414 -193419 -324352
14436 -324352 -578531 -560490 -387870 -288824 -181034 -205421 -142266 -82048 13266 154729 214022
14425 214022 118808 -93665 -128060 -110429 -235809 -126612 -26359 72531 -69976 -493424
$$ packed form
14500b43371M3716P4521k0297p2017J39549L7547O6044J36947j33966j51151j69622
14489b92100k06322k3098k0513j18592R3911M13437K76743O1549m3504q3666l4917
14478B2928r7668j69851k11347j10790J05512J90968K20124J83606J01636m0201
14468A94917j56239l51882l00711p7709L3148J28015P1252Q2169Q6434L19584
14458B8978K67178L7411j22867j23483P3410P1722l2883j13520k54437k17423
14448c85914o9640N5781n194r4183k3287L2044J229J92454N8091m3795Q8995j30933
14436c24352k54179J8041J72620R9046J07790k4387O3155O0218R5314J41463N9293
14425B14022r5214k12473l4395J7631j25380J09197J00253R8890j42507m23448
$$ plain form
14415 -493424 -627219 -453260 -238439 -146037 -258637 -577984 -710360 -634073 -487838 -246903
14405 -246903 -142257 -268989 -296873 -345655 -440782 -268237 -25731 86144 -9441 -225641
14395 -225641 -339854 -226271 25650 157199 237563 244528 108336 -120337 -291101 -340506
14385 -340506 -345521 -300480 -167054 -92168 71108 343067 235466 -89459 -339731 -517261
14375 -517261 -432549 -195483 -325561 -498093 -592280 -627743 -472106 -226760 -24124 90562
14365 90562 204269 195002 -4910 -166164 -150234 -256270 -350595 -352158 -493717 -477006 -399383
14354 -399383 -324478 -205120 -37885 -150495 -412045 -556996 -593793 -601953 -681854 -604929 -425269
14343 -425269 -229613 -269604 -396215 -285925 -121426 -102940 -51524 32369 -91682 -428317
$$ packed form
14415d93424j33795J73959K14821R2402j12600l19347j32376P6287J46235K40935
14405b46903J04646j26732k7884m8782r5127J72545K42506J11875r5585k16200
14395b25641j14213J13583K51921J31549Q0364O965j36192k28673j70764m9405
14385c40506n015M5041J33426P4886J63276K71959j07601l24925k50272j77530
14375e17261Q4712K37066j30078j72532r4187l5463J55637K45346K02636J14686
14365I0562J13707r267j99912j61254J5930j06036r4325j563j41559J6711P7623
14354c99383P4905J19358J67235j12610k61550j44951l6797q160p9901P6925J79660
14343d25269J95656l9991j26611J10290J64499J8486N1416Q3893j24051l36635
$$ plain form
14333 -428317 -593247 -440495 -318052 -356855 -376541 -326089 -221862 -223764 -439773 -555404
14323 -555404 -531232 -558414 -657940 -673518 -563194 -353935 -431754 -480425 -388094 -169250 -121853
14312 -121853 -197536 -338447 -501760 -550518 -617373 -640414 -598169 -540565 -547613 -548519 -428335
14301 -428335 -326694 -253481 -43929 -93189 -414861 -649674 -834947 -969685 -927530 -906545
14291 -906545 -667169 -248284 -20641 78344 28561 137371 331433 277943 129450 -70298
14281 -70298 -162159 -193272 -142775 -99656 10903 75986 103077 305546 428959 206682 -30658
14270 -30658 -133407 -161077 -229021 -263110 -187401 505 267984 335994 171724 109139 143010
14259 143010 152046 -129536 -437808 -428180 -310571 -208209 -184722 -414004 -572721 -402015
$$ packed form
14333d28317j64930J52752J22443l8803j9686N0452J04227j902k16009j15631
14323e55404K4172k7182r9526j5578J10324K09259p7819m8671R2331K18844M7397
14312a21853p5683j40911j63313m8758o6855k3041M2245N7604p048r06J20184
14301d28335J01641P3213K09552m9260l21672k34813j85273j34738M2155K0985
14291i06545K39376M18885K27643R8985m9783J08810J94062n3490j48493j99748
14281g0298r1861l1113N0497M3119J10559O5083K7091K02469J23413k22277k37340
14270c0658j02749k7670o7944l4089P5709J87906K67479O8010j64270o2585L3871
14259A43010R036k81582l08272R628J17609J02362K3487k29282j58717J70706
$$ plain form
14249 -402015 -345516 -355929 -425082 -452117 -360368 -288050 -328741 -527297 -631994 -583123 -501141
14238 -501141 -274433 -14892 89048 34180 36983 158292 276707 30832 -176401 -160904
14228 -160904 -247710 -330767 -165132 39944 44019 144137 99543 2549 -178302 -455691 -626061
14217 -626061 -545506 -432038 -412465 -318627 -85459 -99442 -468880 -778466 -802478 -628928
14207 -628928 -535902 -571895 -766013 -957964 -845524 -568230 -328948 -358406 -520643 -376465
14197 -376465 -221363 -181536 -343580 -421717 -393629 -372815 -306182 -237280 -135771 -49832 -72543
14186 -72543 -246993 -358740 -454954 -439997 -322439 -186254 80311 285770 250788 158721
14176 158721 161389 113028 -126563 -434651 -451708 -259407 -215584 -284332 -218461 -67092 49284
$$ packed form
14249d02015N6499j0413o9153k7035R1749P2318m0691j98556j04697M8871Q1982
14238e01141K26708K59541J03940n4868K803J21309J18415k45875k07233J5497
14228a60904q6806q3057J65635K05076M075J00118m4594r6994j80851k77389j70370
14217f26061Q0555J13468J9573R3838K33168j3983l69438l09586k4012J73550
14207f28928R3026l5993j94118j91951J12440K77294K39282k9458j62237J44178
14197c76465J55102L9827j62044p8137K8088K0814O6633O8902J01509Q5939k2711
14186g2543j74450j11747r6214J4957J17558J36185K66565K05459l4982r2067
14176A58721K668m8361k39591l08088j7057J92301M3823o8748O5871J51369J16376
$$ plain form
14165 49284 146278 186613 155326 44423 -85565 -24899 230134 395042 312643 80703 -173435
14154 -173435 -416401 -424030 -155881 77836 270265 473381 485029 420124 426697 385705 251486
14143 251486 71486 -207978 -386871 -462591 -456821 -240257 -111731 -175913 -218741 -291797 -295787
14132 -295787 -237074 -291101 -491544 -650410 -554440 -519165 -582429 -595022 -701497 -720463 -563715
14121 -563715 -529002 -574228 -474394 -445317 -420662 -167018 -76187 -105529 -237715 -299432 -256104
14110 -256104 -118978 15433 108546 62473 13012 34166 39164 61752 48749 3876 78975
14099 78975 101552 -43729 -244690 -297419 -201517 -117183 -174213 -261993 -164865 -85790 43804
14088 43804 243805 191267 20208 -58024 -214377 -388305 -483289 -549399 -458659 -411058 -435982
$$ packed form
14165D9284R6994M0335l1287j10903j29988O0666K55033J64908q2399k31940k54138
14154a73435k42966p629K68149K33717J92429K03116J1648o4905O573m0992j34219
14143B51486j80000k79464j78893p5720N770K16564J28526o4182m2828p3056l990
14132b95787N8713n4027k00443j58866R5970L5275o3264j2593j06475j8966J56748
14121e63715L4713m5226R9834K9077K4655K53644R0831k9342j32186o1717M3328
14110b56104J37126J34411R3113m6073m9461K1154M998K2588j3003m4873P5099
14099G8975K2577j45281k00961n2729R5902Q4334n7030q7780R7128P9075J29594
14088D3804K00001n2538j71059p8232j56353j73928r4984o6110R0740M7601k4924
$$ plain form
14077 -435982 -241198 -256663 -395121 -439737 -489901 -524517 -592987 -576094 -307277 -183256 -278306
14066 -278306 -369038 -315904 -63147 288038 134652 -174070 -212328 -219990 -182657 -237676 -308324
14055 -308324 -236186 -216434 -177245 -150902 -166965 -189642 -222184 -164358 -70388 14233 12789 -234437
14043 -234437 -392761 -370152 -137047 -10346 10210 195905 385403 299579 80577 179783
14033 179783 348759 227500 -14645 -93801 -293012 -337714 -212251 -102991 21977 159790
14023 159790 226929 146472 -99010 -214860 -174149 -261829 -391271 -461938 -362163 -152280 -103888
14012 -103888 -248631 -244718 83889 287810 438768 671081 656518 493626 225325 46224
14002 46224 -31283 -86260 -279047 -324677 -146546 -31352 47540 -55265 -348898 -655651
$$ packed form
14077d35982J94784j5465j38458m4616n0164l4616o8470J6893K68817J24021r5050
14066b78306r0732N3134K52757L51185j53386l08722l8258p662L7333n5019p0648
14055c08324P2138J9752L9189K6343j6063k2677l2542N7826R3970Q4621j444k47226
14043b34437j58324K2609K33105J26701K0556J85695J89498q5824k19002R9206
14033A79783J68976j21259k42145p9156j99211m4702J25463J09260J24968J37813
14023A59790O7139q0457k45482j15850M0711q7680j29442p0667R9775K09883M8392
14012a03888j44743L913L28607K03921J50958K32313j4563j62892k68301j79101
14002D6224p7507n4977j92787m5630J78131J15194P8892j02805k93633l06753
$$ plain form
13992 -655651 -690165 -637659 -686646 -671779 -531634 -292887 -352237 -469774 -405249 -243851 -271610
13981 -271610 -481149 -636320 -703433 -563052 -452370 -319087 -178626 -146167 -252905 -319742
13971 -319742 -297433 -96282 236949 332766 314591 192781 -22471 -112152 -170384 -210087 -284439
13960 -284439 -369057 -387349 -203704 -89703 -144927 -175606 -375126 -403095 -344108 -202146 -60941
13949 -60941 -134854 -326276 -456006 -575647 -684928 -705339 -561993 -472514 -408492 -474633 -469912
13938 -469912 -431516 -446675 -419164 -440472 -655442 -891881 -822025 -638027 -532951 -596050 -425272
13927 -425272 -199136 -183762 -387226 -354327 -234988 -399396 -544289 -483174 -351113 -365870
13917 -365870 -408742 -367480 -222272 -246610 -358690 -411949 -471472 -268105 -190526 -273929 -256673
$$ packed form
13992f55651l4514N2506m8987J4867J40145K38747n9350j17537O4525J61398k7759
13981b71610k09539j55171o7113J40381J10682J33283J40461L2459j06738o6837
13971c19742K2309K01151L33231R5817j8175j21810k15252q9681n8232l9703p4352
13960b84439q4618j8292J83645J14001n5224l0679j99520k7969N8987J41962J41205
13949f0941p3913j91422j29730j19641j09281k0411J43346Q9479O4022o6141M721
13938d69912L8396j5159K7511k1308k14970k36439O9856J83998J05076o3099J70778
13927d25272K26136J5374k03464L2899J19339j64408j44893O1115J32061j4757
13917c65870m2872M1262J45208k4338j12080n3259n9523K03367P7579q3403J7256
$$ plain form
13906 -256673 -40181 163963 151906 135889 80471 -219815 -496120 -597872 -408852 -305135
13896 -305135 -344626 -329941 -270404 -258804 -270164 -358969 -368868 -359488 -267744 -189662 -165451 -116966
13884 -116966 -138029 -129942 -174463 -244086 -182544 -87526 -152099 -218845 -312972 -411974 -373181 -304841
13872 -304841 -275651 -220988 -396527 -549993 -538074 -593824 -511061 -398174 -272815 -121094
13862 -121094 -89254 -152822 -223815 -337287 -617334 -811717 -775189 -610172 -446979 -242446
13852 -242446 -66263 -29482 -44814 -111303 -138146 -314728 -506264 -420704 -327365 -406360 -458986
13841 -458986 -504818 -455491 -267916 -225634 -479311 -729198 -733852 -630735 -463987 -466433 -438811
13830 -438811 -469490 -591829 -468684 -160206 -16729 94309 86280 147996 231643 434287
$$ packed form
13906b56673K16492K04144j2057j6017n5418l00286k76305j01752J89020J03717
13896c05135l9491J4685N9537J1600j1360q8805r899R380R1744P8082K4211M8485
13884a16966k1063Q087m4521o9623O1542R5018o4573o6746r4127r9002L8793O8340
13872c04841K9190N4663j75539j53466J1919n5750Q2763J12887J25359J51721
13862a21094L1840o3568p0993j13472k80047j94383L6528J65017J63193K04533
13852b42446J76183L6781j5332o6489k6843j76582j91536Q5560R3339p8995n2626
13841d58986m5832M9327J87575M2282k53677k49887m654J03117J66748k446K7622
13830d38811l0679j22339J23145L08478J43477J11038q029O1716Q3647K02644
$$ plain form
13820 434287 478109 523827 533242 417210 90673 -153480 -198893 -176895 1833 -18869 -29291
13809 -29291 -153030 -226941 -95521 46625 121609 144185 93016 -103211 -400599 -495092 -597411
13798 -597411 -707043 -773483 -705461 -664462 -593732 -343985 -156723 -78913 -117251 -124551 -176575
13787 -176575 -204817 -212667 -255367 -193908 -195569 -395135 -393354 -89316 -85163 -273297 -424549
13776 -424549 -402930 -372374 -295329 -315077 -311623 -16327 325621 322921 136010 -119798 -291967
13765 -291967 -253937 -94530 -93943 -20005 168147 329700 447388 325108 146774 51004 118982
13754 118982 261515 132928 -236221 -402346 -591128 -684570 -390073 -199192 -216400 -22408
13744 -22408 48389 -144016 -360111 -550940 -661544 -577477 -473130 -234415 -49912 -246462
$$ packed form
13820D34287M3822M5718R415j16032l26537k44153m5413K1998J78728k0702j0422
13809b9291j23739p3911J31420J42146P4984K2576n1169j96227k97388r4493j02319
13798e97411j09632o6440O8022M0999P0730K49747J87262P7810l8338p300n2024
13787a76575k8242p850m2700O1459j661j99566J781L04038M153j88134j51252
13776d24549K1619L0556P7045j9748L454K95296L41948k700j86911k55808j72169
13765b91967L8030J59407N87P3938J88152J61553J17688j22280j78334r5770O7978
13754A18982J42533j28587l69149j66125j88782r3442K94497J90881j7208J93992
13744b2408P0797j92405k16095j90829j10604Q4067J04347K38715J84503j96550
$$ plain form
13734 -246462 -487913 -606366 -551513 -452496 -396946 -277591 -240003 -297793 -363312 -428888 -501410
13723 -501410 -520816 -518614 -466043 -261120 -259679 -328252 -342160 -285844 -186941 -207175 -119863 154038
13711 154038 209558 116451 24687 4861 -85537 -137882 -3027 123587 72916 -15536 47034
13700 47034 71433 -76764 -139076 -129764 -41737 -3189 13612 118933 31345 -114640 -217168
13689 -217168 -211325 -112816 -25991 27069 -67115 -233956 -309157 -445455 -415208 -347024 -290475
13678 -290475 -154446 27846 115993 -7906 -49304 -27704 79515 293200 170931 -144811
13668 -144811 -266096 -312704 -467524 -499313 -288262 -97389 -160035 -358621 -259106 -6761
13658 -6761 1726 -10339 2802 -131282 -176819 -193801 -304355 -342393 -179624 -159106 -235506
$$ packed form
13734b46462k41451j18453N4853R9017N5550J19355L7588n7790o5519o5576p2522
13723e01410j9406K202N2571K04923J441o8573j3908N6316R8903k0234Q7312K73901
13711A54038N5520r3107r1764j9826r0398n2345J34855J26614n0671q8452O2570
13700D7034K4399j48197o2312R312Q8027L8548J6801J05321q7588j45985j02528
13689b17168N843R8509Q6825N3060r4184j66841p5201j36298L0247O8184N6549
13678b90475J36029J82292Q8147j23899m1398K1600J07219K13685j22269l15742
13668a44811j21285m6608j54820l1789K11051J90873o2646j98586R9515K52345
13658f761Q487j2065J3141j34084m5537j6982j10554l8038J62769K0518p6400
$$ plain form
13647 -235506 -182927 -34938 200530 255725 219884 111992 173676 299959 354003 238684
13637 238684 110117 -244384 -650803 -992963 -946628 -616755 -577511 -638666 -583699 -471340
13627 -471340 -354941 -171589 -163196 -266417 -233567 -312252 -483537 -460214 -358083 -280201 -127720
13616 -127720 -58384 -130304 -281730 -476297 -729746 -701720 -410964 -110083 -53055 -83478
13606 -83478 -336523 -659667 -467440 -244166 -246126 -291699 -413121 -512151 -532081 -616201 -712505
13595 -712505 -553278 -238150 -54169 -90974 -234334 -276413 -465318 -559896 -510237 -529654
13585 -529654 -457203 -302933 -189217 2689 163036 59815 -182721 -349498 -451921 -488504
13575 -488504 -379930 -88134 177439 418657 428430 292363 307516 335731 98904 -291112
$$ packed form
13647b35506N2579J47989K35468N5195l5841j07892O1684J26283N4044j15319
13637B38684j28567l54501m06419l42160M6335L29873L9244o1155N4967J12359
13627d71340J16399J83352Q393j03221L2850p8685j71285K3323J02131P7882J52481
13616a27720O9336p1920j51426j94567k53449K8026K90756L00881N7028l0423
13606h3478k53045l23144J92227K23274j960m5573j21422r9030j9930q4120r6304
13595g12505J59227L15128J83981l6805j43360m2079j88905r4578M9659j9417
13585e29654P2451J54270J13716J91906J60347j03221k42536j66777j02423l6583
13575d88504J08574K91796K65573K41218R773j36067J5153K8215k36827l90016
$$ plain form
13565 -291112 -453578 -469299 -389522 -257199 -111974 102563 187568 75126 48253 320919
13555 320919 398307 161926 -105438 -246923 -36226 -16596 -351083 -441045 -363182 -215786
13545 -215786 -173711 -360521 -458050 -361262 -45727 62287 -113994 -263564 -302472 -297445 -185893
13534 -185893 -18714 95333 160233 154762 249581 414798 265774 -58765 -265266 -255739 -156957
13523 -156957 -207283 -240013 -426126 -774575 -866168 -729363 -783931 -959051 -897612 -515196
13513 -515196 -196352 -134840 -23901 95353 38727 20204 113121 169621 123676 109121 269109
13502 269109 201276 -88132 -185344 9089 -22008 -90173 -147092 -187840 -56386 -70911 -168271
13491 -168271 -295156 -325069 -293528 -188374 43584 128542 12806 -52976 -93534 -197383
$$ packed form
13565b91112j62466j5721P9777J32323J45225K14537Q5005j12442k6873K72666
13555C20919P7388k36381k67364j41485K10697J9630l34487q9962P7863J47396
13545b15786M2075j86810r7529R6788L15535J08014j76281j49570l8908N027J11552
13534a85893J67179J14047O4900n471R4819J65217j49024l24539k06501R527R8782
13523a56957n0326l2730j86113l48449r1593J36805n4568j75120O1439L82416
13513e15196L18844O1512J10939J19254n6626j8523R2917N6500m5945j4555J59988
13502B69109o7833k89408r7212J94433l1097o8165n6919m0748J31454j4525r7360
13491a68271j26885k9913L1541J05154K31958Q4958j15736o5782m0558j03849
$$ plain form
13481 -197383 -329530 -344148 -80915 245851 268118 255620 157785 -83774 -262571 -436986
13471 -436986 -435321 -377148 -310344 -43678 63952 -56919 -194189 -128536 -40894 -120331 -126130
13460 -126130 59057 122260 267564 120976 -19645 -49590 -192054 -231876 -26042 223501
13450 223501 76954 -160303 -79126 -84105 -174473 -151132 -93822 -34830 -166763 -366949 -404903
13439 -404903 -219929 -57496 -63605 -198783 -271404 -117286 4028 -26082 -102053 59196
13429 59196 254983 184088 104974 225578 274506 297415 245681 -11446 -123286 -177232 -212622
13418 -212622 -144552 -91730 -126734 -202340 -92802 93104 186446 230531 231849 170343 41758
13407 41758 -48301 -84373 34313 12269 -116542 -112199 -200104 -436017 -668574 -666509 -458930
$$ packed form
13481a97383j32147j4618K63233L26766K2267j2498r7835k41559j78797j74415
13471d36986J665N8173O6804K66666J07630j20871j37270O5653Q7642p9437n799
13460a26130J85187O3203J45304j46588j40621k9945j42464l9822K05834K49543
13450B23501j46547k37257Q1177m979r0368K3341N7310N8992j31933k00186l7954
13439d04903J84974J62433o109j35178p2621J54118J21314l0110p5971J61249
13429E9196J95787p0895p9114J20604M8928K2909n1734k57127j11840n3946l5390
13418b12622O8070N2822l5004p5606J09538J85906R3342M4085J318o1506j28585
13407D1758r0059l6072J18686k2044j28811M343q7905k35913k32557K065K07579
$$ plain form
13396 -458930 -197340 -142311 -331847 -389219 -271144 -56490 126199 252927 143322 -102405
13386 -102405 -161397 -201307 -423275 -449709 -316782 -260421 -78484 -2480 74647 -6495 -240033
13375 -240033 -352045 -356335 -225038 -239414 -405165 -733373 -781617 -575123 -354990 -219298
13365 -219298 -277624 -458295 -543164 -514259 -514836 -462642 -114936 58478 16540 -64992 -123167
13354 -123167 -36919 57125 -82996 -240111 -231636 -98789 -111328 -228426 -473665 -819896
13344 -819896 -977257 -959260 -910397 -778091 -579919 -472793 -290537 -113044 -182612 -275650
13334 -275650 -268565 -418266 -530591 -637657 -629043 -278266 -59833 -91659 -30082 184770 245080
13323 245080 119283 43763 72243 116743 -296 -68067 -70922 69867 212053 36379 -64118
$$ packed form
13396d58930K61590N5029j89536n7372J18075K14654J82689J26728j09605k45727
13386a02405n8992l9910k21968k6434J32927N6361J81937P6004P7127q1142k33538
13375b40033j12012m290J31297j4376j65751l28208m8244K06494K20133J35692
13365b19298n8326j80671q4869K8905n77N2194L47706J73414m1938q1532n8175
13354a23167Q6248R4044j40121j57115Q475J32847j2539j17098k45239l46231
13344h19896j57361J7997M8863J32306J98172J07126J82256J77493o9568r3038
13334b75650P085j49701j12325j07066Q614L50777K18433l1826O1577K14852O0310
13323B45080j25797p5520K8480M4500j17039o7771k855J40789J42186j75674j00497
$$ plain form
13312 -64118 -70607 -104077 -183003 -99518 48988 160083 300271 266669 44602 -174261 -215137
13301 -215137 -165587 -243416 -226797 -197902 -136673 53173 -116067 -319605 -335693 -262113 -155784
13290 -155784 -230781 -167327 -55910 69750 89023 -173894 -412334 -441629 -338623 -365534
13280 -365534 -615429 -799356 -658734 -301569 15038 112082 88225 44065 -17166 101882
13270 101882 263669 335348 519912 695784 779500 549682 382282 413304 342291 145239
13260 145239 175744 342697 423810 173726 -160458 -342469 -346162 -279575 -336693 -305072 -140162
13249 -140162 144278 318137 175572 51691 188079 478513 523705 354956 141053 189002
13239 189002 372692 437717 399368 229790 9593 -128065 -232952 -286083 -241884 -86722
$$ packed form
13312f4118o489l3470p8926Q3485J48506J11095J40188l3602k22067k18863m0876
13301b15137M9550p7829J6619K8895O1229J89846j69240k03538j6088P3580J06329
13290a55784p4997O3454J11417J25660J9273k62917k38440k9295J03006k6911
13280c65534k49895j83927J40622L57165L16607R7044k3857m4160o1231J19048
13270A01882J61787P1679J84564J75872Q3716k29818j67400L1022p1013j97052
13260A45239L0505J66953Q1113k50084l34184j82011l693O6587n7118L1621J64910
13249a40162K84440J73859j42565j23881J36388K90434M5192j68749k13903M7949
13239A89002J83690O5025l8349j69578k20197j37658j04887n3131M4199J55162
$$ plain form
13229 -86722 39737 -67044 -237815 -330687 -309511 -416843 -406356 -386898 -386914 -327643 -244512
13218 -244512 -195192 -84396 -9812 37304 52295 -40397 -306602 -422706 -279849 -81194
13208 -81194 144432 259059 191129 65172 44994 7682 35880 -19881 54784 75883 73607
13197 73607 95222 -82627 -321848 -330666 -115070 -17626 91421 205533 230355 229251 83977
13186 83977 -4297 236638 290756 208093 390489 465249 351026 170055 92087 164302 250703
13175 250703 337772 287065 107820 181404 487017 647071 640667 524832 443918 480019 372840
13164 372840 267739 294643 103477 -194495 -279313 -269263 -343994 -386226 -289940 -258413 -254558
13153 -254558 -187793 83033 346610 297267 281891 255024 103316 264433 351261 452229
$$ packed form
13229h6722J26459j06781j70771r2872K1176j07332J0487J9458j6N9271Q3131
13218b44512M9320J10796P4584M7116J4991r2692k66205j16104J42857J98655
13208h1194K25626J14627o7930j25957k0178l7312K8198n5761P4665K1099k276
13197G3607K1615j77849k39221q818K15596R7444J09047J14112K4822j104j45274
13186H3977q8274K40935N4118q2663J82396P4760j14223j80971p7968P2215Q6401
13175B50703Q7069n0707j79245P3584L05613J60054o404j15835q0914L6101j07179
13164C72840j05101K6904j91166k97972q4818J0050p4731m2232R6286L1527L855
13153b54558O6765K70826K63577m9343j5376k6867j51708J61117Q6828J00968
$$ plain form
13143 452229 494127 405424 439942 284047 70866 115042 144171 166987 252213 401870 455867
13132 455867 494165 462871 216677 229103 340139 269184 382647 308127 98186 -151337
13122 -151337 -353846 -262033 134438 400460 515909 634238 507896 408244 258506 131474
13112 131474 44304 -46112 -134678 -79587 141263 228530 290688 358426 354630 466461 590431
13101 590431 479312 516575 639283 727202 717970 506632 404739 324012 252698 116155 176104
13090 176104 239794 212221 365371 675044 916469 1084022 1046223 778941 565907 463134
13080 463134 401850 470985 394743 416648 585171 665972 541479 413791 460542 456996 248790
13069 248790 78856 128627 573918 956443 999603 873709 758044 656640 585691 565779
$$ packed form
13143D52229M1898q8703L4518j55895k13181M4176K9129K2816Q5226J49657N3997
13132D55867L8298l1294k46194J2426J11036p0955J13463p4520k09941k49523
13122a51337k02509R1813L96471K66022J15449J18329j26342r9652j49738j27032
13112A31474q7170r0416q8566N5091K20850Q7267O2158O7738l796J11831J23970
13101E90431j11119L7263J22708Q7919r232k11338j01893q0727p1314j36543N9949
13090A76104O3690k7573J53150L09673K41425J67553l7799k67282k13034j02773
13080D63134o1284O9135p6242K1905J68523Q0801j24493j27688M6751l546k08206
13069B48790j69934M9771M45291L82525M3160j25894j15665j01404p0949j9912
$$ plain form
13059 565779 565472 608386 675177 637087 674039 727006 769088 873602 931670 895879 988122 1075898
13047 1075898 1266304 1424784 1304803 1110489 1095183 1099971 978694 935188 979364 1043357
13037 1043357 1202733 1415040 1533834 1550312 1467529 1472384 1650281 1813609 1844632 2069784
13027 2069784 2288267 2340240 2480963 2862405 3126776 3100009 2918578 2894889 2956453 3089887
13017 3089887 3343774 3622058 3754835 3960845 4282295 4772704 5223743 5442011 5651964
13008 5651964 5816562 6158284 6717181 7467676 8195137 9089861 10145959 11352724 12620080
12999 12620080 13891832 15568014 17997125 21304950 25211798 29740337 35532423 43220197
12991 43220197 53325946 66316599 83570976 107273668 139393329 180171806 223786102
$$ packed form
13059E65779l07M2914O6791l8090L6952N2967M2082J04514N8068l5791R2243Q7776
13047A075898J90406J58480j19981j94314j5306M788j21277m3506M4176O3993
13037A043357J59376K12307J18794J6478q2783M855J77897J63328L1023K25152
13027B069784K18483N1973J40723L81442K64371k6767j81431k3689O1564J33434
13017C089887K53887K78284J32777K06010L21450M90409M51039K18268K09953
13008E651964J64598L41722N58897P50495P27461Q94724J056098J206765J267356
12999A2620080J271752J676182K429111L307825L906848M528539N792086P687774
12991D3220197J0105749J2990653J7254377K3702692L2119661M0778477M3614296
$$ plain form
12984 223786102 257224767 267815586 253219366 222620131 187582185 155543102 129224898
12977 129224898 108423015 92206498 79193675 68681531 60158971 53018784 46847194
12970 46847194 41482890 36819995 32840740 29523128 26566339 24048655 22042513 20210724
12962 20210724 18440861 17021700 15764449 14626312 13743938 12961378 12189248 11180776
12954 11180776 10483994 10061965 9403251 8657701 7956288 7485828 7355306 7177874 6989655
12945 6989655 6909649 6940139 6850424 6543786 6193995 5919488 5719963 5665710 5626935 5575439
12935 5575439 5663650 6025959 6425379 6732549 6956604 7116851 7527660 8264976 9284801
12926 9284801 10565943 12055907 13137491 13505698 13173866 12362438 11614880 11179678 11161000
$$ packed form
12984B23786102L3438665J0590819j4596220l0599235l5037946l2039083k6318204
12977A29224898k0801883j6216517j3012823j0512144q522560p140187o171590
12970D6847194n364304m662895l979255l317612k956789k517684k006142j831789
12962B0210724j769863j419161j257251j138137q82374p82560p72130j008472
12954A1180776o96782m22029o58714p45550p01413m70460j30522j77432j88219
12945F989655q0006L0490q9715l06638l49791k74507j99525n4253l8775n1496
12935E575439Q8211L62309L99420L07170K24055J60247M10809P37316J019825
12926I284801J281142J489964J081584L68207l31832q11428p47558m35202j8678
$$ plain form
12917 11161000 11384971 11704597 12277380 13267455 14519272 16125877 18007448 20308248 23181183
12908 23181183 26776450 31179242 36838931 44375473 54403884 67764550 85722172 110368702
12900 110368702 143978283 186891030 233056322 267468187 276028443 257847864 223661822
12893 223661822 186497478 153829547 127380730 106662740 90643443 77903164 67713695
12886 67713695 59642959 52941219 46964077 41611033 37124246 33235319 29723922 26745376
12878 26745376 24287704 22090637 20300183 18745706 17258165 15823341 14508134 13416201
12870 13416201 12554386 11849338 10997946 10226318 9541376 8784407 8167345 7752308 7460979
12861 7460979 7255149 7128795 6946463 6863952 6737284 6451749 6066092 5803613 5639121 5528996
$$ packed form
12917A1161000K23971L19626N72783R90075J251817J606605J881571K300800K872935
12908B3181183L595267M402792N659689P536542J0028411J3360666J7957622K4646530
12900A10368702L3609581M2912747M6165292L4411865Q560256j8180579l4186042
12893B23661822l7164344l2667931k6448817k0717990j6019297j2740279j0189469
12886F7713695q070736o701740n977142n353044m486787l888927l511397k978546
12878B6745376k457672k197067j790454j554477j487541j434824j315207j091933
12870A3416201q61815p05048q51392p71628o84942p56969o17062m15037k91329
12861G460979k05830j26354j82332q2511j26668k85535l85657k62479j64492j10125
$$ plain form
12851 5528996 5566936 5683761 5980033 6169889 6183551 6114655 6090093 6040102 5792693 5725211
12841 5725211 5873969 6074058 6538249 7049442 7399174 7452274 7518381 7646007 8068784 8621223
12831 8621223 9031231 9719848 10507076 11480041 12608183 13972624 15761294 17851219 20431843
12822 20431843 23480156 27111465 31710419 37921305 45951628 56235999 69677403 88060376
12814 88060376 113141911 146565841 187840072 230622788 261112386 267327104 249032337
12807 249032337 216361315 181135499 149902242 124471329 104339906 88477468 76011316
12800 76011316 66005978 57928954 51211927 45405232 40073482 35318834 31439480 28270788
12792 28270788 25642094 23364689 21168164 19193627 17616658 15939784 14332457 13075560
$$ packed form
12851E528996L7940J16825K96272J89856J3662o8896k4562m9991k47409o7482
12841E725211J48758K00089M64191N11193L49732N3100O6107J27626M22777N52439
12831H621223M10008O88617P87228R72965J128142J364441J788670K089925K580624
12822B0431843L048313L631309M598954O210886Q030323J0284371J3441404J8382973
12814H8060376K5081535L3423930M1274231M2782716L0489598O214718j8294767
12807B49032337l2671022l5225816l1233257k5430913k0131423j5862438j2466152
12800G6011316j0005338q077024o717027n806695n331750m754648l879354l168692
12792B8270788k628694k277405k196525j974537j576969j676874j607327j256897
$$ plain form
12784 13075560 12093770 11336135 10682151 9801802 8881779 8310987 7709646 7005875 6427614
12775 6427614 5915479 5374771 5191747 5122728 4995454 4944298 4694534 4277916 3810741 3647208
12765 3647208 3626759 3430185 3123383 2760167 2484894 2526468 2727006 2877994 2848988 2592504
12755 2592504 2349142 2297523 2197958 2029661 1947615 1831481 1666343 1438381 1361375 1582944
12745 1582944 1902390 2310741 2410028 2215351 1818372 1367882 1153950 853025 664677 718105
12735 718105 786008 1031351 1135744 974273 1089692 1129798 1047559 1039936 804552 553538
12725 553538 546906 551710 555942 658021 670068 641559 666345 851209 769854 675484 751500 837976
12713 837976 994919 1022991 787305 694384 604288 557194 549582 390378 294330 453786 624183
$$ packed form
12784A3075560r81790p57635o53984q80349r20023n70792o01341p03771n78261
12775F427614n12135n40708j83024o9019j27274n1156k49764m16618m67175j63533
12765C647208k0449j96574l06802l63216k75273M1574K00538J50988k9006k56484
12755B592504k43362n1619r9565j68297q2046j16134j65138k27962p7006K21569
12745A582944L19446M08351R9287j94677l96979m50490k13932l00925j88348N3428
12735G18105O7903K45343J04393j61471J15419M0106q2239p623k35384k51014
12725E53538o632M804M232J02079J2047k8509K4786J84864q1355r4370P6016Q6476
12713H37976J56943K8072k35686r2921r0096m7094p612j59204r6048J59456J70397
$$ plain form
12702 624183 662622 691057 742140 766336 857928 883405 790172 657915 594725 578894 493320
12691 493320 688522 857478 976569 978457 798336 495747 530448 750185 832376 860086
12681 860086 800814 434783 201294 255536 318154 398657 454578 718051 833050 762986 456621
12670 456621 319668 464962 522846 551869 567767 607665 636865 552107 523682 614771 636755
12659 636755 476592 490416 544957 569190 608279 619656 631488 725753 606504 431075 341456
12648 341456 315871 416503 557742 585725 610513 539717 518627 596048 409078 107745 -483
12637 -483 -5683 -129934 -188776 -149501 -123720 29010 230995 306579 424402 504043 502835 668156
12625 668156 784840 727685 546870 498464 569949 481734 340128 382162 457530 406736 371491
$$ packed form
12702F24183L8439K8435N1083K4196R1592K5477r3233j32257o3190j5831q5574
12691D93320J95202J68956J19091J888j80121l02589L4701K19737Q2191K7710
12681H60086n9272l66031k33489N4242O2618Q0503N5921K63473J14999p0064l06365
12670D56621j36953J45294N7884K9023J5898L9898K9200q4758k8425R1089K1984
12659F36755j60163J3824N4541K4233L9089J1377J1832R4265j19249j75429q9619
12648C41456k5585J00632J41239K7983K4788p0796k1090P7421j86970l01333j08228
12637d83n200j24251n8842L9275K5781J52730K01985P5584J17823P9641j208J65321
12625F68156J16684n7155j80815m8406P1485q8215j41606M2034P5368n0794l5245
$$ plain form
12614 371491 431644 362726 139958 -56548 -202356 -224650 -226994 -73565 82929 203898
12604 203898 256369 221246 374607 652369 890611 1059549 1127239 1061084 847144 535527
12594 535527 362940 276300 217966 127521 149646 364842 542634 508913 212330 -167482
12584 -167482 -398463 -248135 84984 230129 61793 -258262 -411446 -223058 50415 306004
12574 306004 446113 529047 475022 156650 -118287 -65509 188077 371752 457027 271842
12564 271842 58278 -82730 -95475 52199 335235 459171 415378 540965 591568 527109
12554 527109 313591 110424 65283 135146 147718 148269 188535 271017 368859 391024 219747
12543 219747 -35125 -6324 142209 293357 422586 439734 532543 537107 558302 464054 155255
$$ packed form
12614C71491O0153o8918k22768j96506j45808k2294k344J53429J56494J20969
12604B03898N2471l5123J53361K77762K38242J68938O7690o6155k13940l11617
12594E35527j72587q6640n8334r0445K2125K15196J77792l3721k96583l79812
12584a67482k30981J50328L33119J45145j68336l20055j53184J88388K73473K55589
12574C06004J40109Q2934n4025l18372k74937N2778K53586J83675Q5275j85185
12564B71842k13564j41008j2745J47674K83036J23936m3793J25587N0603o4459
12554E27109k13518k03167m5141O9863J2572N51M0266Q2482R7842K2165j71277
12543B19747k54872K8801J48533J51148J29229J7148R2809M564K1195r4248l08799
$$ plain form
12532 155255 -30091 -137761 -71615 218265 248862 127453 90155 169566 137188 89214 -18022
12521 -18022 -142602 -41584 21942 -125620 -228031 -253819 -56668 391307 457006 482895
12511 482895 596717 477547 294292 238727 117639 47713 182100 254642 320267 170182
12501 170182 -47731 -25281 141919 346402 572164 620582 517031 563721 689678 641839
12491 641839 371592 197091 89260 100940 32775 -60596 17528 -28306 -103990 -144885 -7833
12480 -7833 140242 212531 212076 312669 280395 187135 47670 -247904 -497598 -526257 -525151
12469 -525151 -388848 -50851 196556 84685 -962 -88474 -236371 -296809 -279223 -256369
12459 -256369 -119076 174660 136778 -65327 -315566 -508850 -476250 -194067 -101037 -107436
$$ packed form
12532A55255j85346j07670O6146K89880L0597j21409l7298P9411l2378m7974j07236
12521a8022j24580J01018O3526j47562j02411k5788J97151M47975O5699K5889
12511D82895J13822j19170j83255n5565j21088o9926J34387P2542O5625j50085
12501A70182k17913K2450J67200K04483K25762M8418j03551M6690J25957m7839
12491F41839k70247j74501j07831J1680o8165r3371P8124m5834p5684m0895J37052
12480g833J48075P2289m55J00593l2274r3260j39465k95574k49694k8659J106
12469e25151J36303L37997K47407j11871q5647q7512j47897o0438J7586K2854
12459b56369J37293K93736l7882k02105k50239j93284L2600K82183R3030o399
$$ plain form
12449 -107436 -7335 -88993 -222500 -79483 -7542 -179378 -215902 -186475 -102864 19055
12439 19055 329521 473693 318149 242047 332552 383230 208508 -9056 -127865 -310782
12429 -310782 -474004 -453546 -125920 192788 307654 325158 327756 432557 417315 -19339
12419 -19339 -347929 -328668 -337692 -413392 -516551 -340425 -216994 -337461 -504451 -502209 -320546
12408 -320546 -100761 -17329 -37082 36211 -33857 -6135 82398 18791 177628 284723 149485
12397 149485 13540 -57622 75999 248702 291191 314872 413373 392678 363981 281661 239407
12386 239407 149480 -46926 -16794 108744 282804 359328 245921 113357 130107 169033
12376 169033 61501 69249 -91685 -268813 -171842 85990 546800 707322 618110 496133
$$ packed form
12449a07436J00101q1658j33507J43017P1941j71836l6524K9427Q3611J21919
12439A9055L10466J44172j55544p6102R0505N0678j74722k17564j18809j82917
12429c10782j63222K0458L27626L18708J14866J7504K598J04801j5242m36654
12419a9339l28590J9261r024p5700j03159J76126J23431j20467j66990K242J81663
12408c20546K19785Q3432j9753P3293p0068K7722Q8533o3607J58837J07095j35238
12397A49485j35945p1162J33621J72703M2489K3681R8501k0695k8697q2320m2254
12386B39407q9927j96406L0132J25538J74060P6524j13407j32564J6750L8926
12376A69033j07532P748j60934j77128R6971K57832M60810J60522q9212j21977
$$ plain form
12366 496133 628716 704549 605971 440668 378487 481974 630022 677128 640331 548647 481593
12355 481593 366780 191937 47826 -67116 -216595 -337385 -163281 104730 320516 398873
12345 398873 506040 575268 466955 439107 485542 505635 285979 -86924 -151574 98557
12335 98557 127649 15042 -44612 -92004 -198540 -469641 -550466 -473598 -325904 -100060 -110116
12324 -110116 -141771 75192 320431 428112 528617 415091 375874 504556 747972 896071
12314 896071 703971 374318 245566 84479 -146165 7157 290692 349540 274243 308058
12304 308058 435464 493463 388340 278863 91100 12853 -28673 -72920 -121411 73420
12294 73420 285795 238888 249175 268997 197418 -95275 -128827 32791 127783 182769 205879
$$ packed form
12366D96133J32583P5833r8578j65303o2181J03487J48048M7106l6797r1684o7054
12355D81593j14813j74843j44111j14942j49479j20790J74104K68011K15786P8357
12345C98873J07167O9228j08313k7848M6435K0093k19656l72903o4650K50131
12335I8557K9092j12607n9654m7392j06536k71101q0825P6868J47694K25844j0056
12324a10116l1655K16963K45239J07681J00505j13526l9217J28682K43416J48099
12314H96071j92100l29653j28752j61087k30644J53322K83535N8848p5297L3815
12304C08058J27406N7999j05123j09477j87763p8247m1526m4247m8491J94831
12294G3420K12375m6907J0287J9822p1579k92693l3552J61618R4992N4986K3110
$$ plain form
12283 205879 174930 -4530 -176690 -61464 162966 388121 609942 458965 236455 51275
12273 51275 173544 353897 378797 404135 446915 560299 387854 -28105 -297386 -203189
12263 -203189 57497 180772 133606 337249 362442 175497 -44399 -62088 -7076 42726
12253 42726 72723 78142 102316 113034 136404 189480 195400 278246 232296 -67413 -316587 -342062
12241 -342062 -162272 2771 274137 254664 181252 114178 51722 175365 228504 164857 116869
12230 116869 79479 -28210 -234325 -162289 149852 189499 -36026 -52134 144950 188618
12220 188618 -70022 -212243 -25943 170129 92516 86625 159148 86678 -26334 -206617
12210 -206617 -329238 -325006 -292376 -395818 -338691 -194246 -208910 -126381 48045 147629 75919
$$ packed form
12283B05879l0949j79460j72160J15226K24430K25155K21821j50977k22510j85180
12273E1275J22269J80353K4900K5338M2780J13384j72445m15959k69281R4197
12263b03189K60686J23275m7166K03643K5193j86945k19896j7689N5012M9802
12253D2726K9997N419K4174J0718K3370N3076N920Q2846m5950k99709k49174k5475
12241c42062J79790J65043K71366j9473p3412o7074o2456J23643N3139o3647m7988
12230A16869l7390j07689k06115P2036L12141L9647k25525j6108J97084M3668
12220A88618k58640j42221J86300J96072p7613n891P2523p2470j13012j80283
12210b06617j22621M232L2630j03442N7127J44445j4664Q2529J74426R9584p1710
$$ plain form
12199 75919 14613 30829 -153186 -268359 -245716 -107013 -101154 -133858 -101585 168771 403255
12188 403255 501125 440441 218290 15672 -107248 -189856 -125961 -80757 -53855 -71142 89365
12177 89365 161261 98494 51842 85668 223835 57654 45673 331983 617933 544599 355265
12166 355265 268823 6956 -251482 -231769 -143198 -148614 -151615 -122476 -115519 -113190 -109319 95657
12154 95657 307697 287257 167208 54829 5602 41632 262968 472959 446159 307506
12144 307506 211860 166474 322338 455307 119788 -335977 -438844 -310670 -97364 -116047
12134 -116047 -415394 -579674 -564474 -450236 -330312 -218532 85222 99214 -162789 -233240
12124 -233240 -234706 -338427 -495776 -533055 -438050 -290414 -272582 -81196 136202 107727 234933
$$ packed form
12199G5919o1306J6216j84015j15173K2643J38703N859l2704L2273K70356K34484
12188D03255R7870o0684k22151k02618j22920q2608O3895M5204K6902j7287J60507
12177H9365P1896o2767m6652L3826J38167j66181j1981K86310K85950p3334j89334
12166C55265q6442k61867k58438J9713Q8571n416l001K9139O957K329L871K04976
12154I5657K12040k0440j20049j12379m9227L6030K21336K09991k6800j38653
12144C07506r5646m5386J55864J32969l35519m55765j02867J28174K13306j8683
12134a16047k99347j64280J5200J14238J19924J11780L03754J3992k62003p0451
12124b33240j466j03721j57349l7279R5005J47636J7832J91386K17398k8475J27206
$$ plain form
12113 234933 280976 205243 148052 96201 112499 31179 -68277 -44282 53176 142092 245494
12102 245494 129113 -114410 -284060 -115833 204308 280511 274928 243561 184331 151819 40236
12091 40236 178568 347255 452586 427103 154071 -33734 -61525 -94649 -117054 -276426
12081 -276426 -593988 -697933 -502940 -313492 34116 345743 399126 118339 -81705 30838
12071 30838 221819 156382 51955 22480 -4510 5288 -52841 -95777 -69063 38910 178148
12060 178148 104216 58402 219080 266360 211350 31724 -314383 -395404 -316654 -217269 -69962
12049 -69962 168233 256069 231220 91415 -244223 -446952 -414987 -492438 -509028 -437101 -358001
12038 -358001 -297565 -333114 -267087 -71550 112114 358981 518708 255486 123260 151509
$$ packed form
12113B34933M6043p5733n7191n1851J6298q1320r9456K3995R7458Q8916J03402
12102B45494j16381k43523j69650J68227L20141P6203n583l1367n9230l2512j11583
12091D0236J38332J68687J05331k5483k73032j87805k7791l3124k2405j59372
12081b76426l17562j03945J94993J89448L47608L11627N3383k80787k00044J12543
12071C0838J90981o5437j04427k9475k6990R798n8129m2936K6714J07973J39238
12060A78148p3932m5814J60678M7280n5010j79626l46107q1021P8750R9385J47307
12049f9962K38195Q7836k4849j39805l35638k02729L1965p7451j6590P1927P9100
12038c58001O0436l5549O6027J95537J83664K46867J59727k63222j32226K8249
$$ plain form
12028 151509 132939 -69026 -262474 -439399 -558389 -479280 -283097 -328718 -389946 -210310
12018 -210310 78767 236686 165413 59393 31844 27792 -145315 -389890 -350901 -155883
12008 -155883 -21093 126104 168150 284140 495882 478027 306836 44792 -131115 -155287
11998 -155287 -113851 9286 36227 -140545 -264443 -285445 -288680 -231331 18528 391205 345316
11987 345316 85145 -54755 -220247 -405719 -514984 -610500 -670182 -521354 -82888 248924
11977 248924 367364 168386 -180278 -265088 -192188 -72663 116986 251593 348320 442495
11967 442495 647264 697238 525632 437885 491487 471888 365443 369253 266249 47107 -106479
11956 -106479 -207222 -147551 -145714 -43154 97705 91150 182815 168329 -7970 -171529 -105923
$$ packed form
12028A51509j8570k01965j93448j76925j18990P9109J96183m5621o1228J79636
12018b10310K89077J57919p1273j06020k7549m052j73107k44575L8989J95018
12008a55883J34790J47197M2046J15990K11742j7855j71191k62044j75907k4172
11998a55287M1436J23137K6941j76772j23898k1002l235N7349K49859L72677m5889
11987C45316k60171j39900j65492j85472j09265r5516n9682J48828M38466L31812
11977B48924J18440j98978l48664q4810P2900J19525J89649J34607R6727R4175
11967D42495K04769M9974j71606q7747N3602j9599j06445L810j03004k19142j53586
11956a06479j00743N9671J837J02560J40859o555R1665j4486j76299j63559O5606
$$ plain form
11945 -105923 93286 179507 203282 455992 640138 417007 76618 -360801 -686672 -612322
11935 -612322 -513599 -334442 -158975 -34488 32896 137247 263377 176700 121861 47586
11925 47586 21233 438 -73030 -106998 -183107 -225246 -219301 -110763 -106145 -179947 -214772 -152386
11913 -152386 -49132 13596 208260 533746 493393 326184 231512 154088 69364 -141806
11903 -141806 -314660 -402058 -396254 -397435 -238155 -42600 -106555 -165397 -137604 -75607 -43236
11892 -43236 -75888 -106245 -432684 -715631 -837840 -921403 -828212 -562990 -254276 -113540
11882 -113540 32847 100439 156411 57669 -132168 -194869 -72288 56711 -37605 -32280 41604
11871 41604 58192 258884 499640 596344 466719 276930 469565 655575 595782 307334
$$ packed form
11945a05923J99209Q6221K3775K52710J84146k23131l40389m37419l25871P4350
11935f12322R8723J79157J75467J24487O7384J04351J26130q6677n4839p4275
11925D7586k6353k0795p3468l3968p6109m2139N945J08538M618p3802l4825O2386
11913a52386J03254O2728J94664L25486m0353j67209r4672p7424q4724k11170
11903a41806j72854q7398N804j181J59280J95555o3955n8842K7793O1997L2371
11892d3236l2652l0357l26439k82947j22209q3563R3191K65222L08714J40736
11882a13540J46387O7592N5972r8742j89837o2701J22581J28999r4316N325P3884
11871D1604J6588K00692K40756R6704j29625j89789J92635J86010n9793k88448
$$ plain form
11861 307334 -21471 -269976 -313638 -247355 -47483 -24521 -213214 -265483 -214495 -36686
11851 -36686 58398 15310 -2854 195559 291939 90603 -167494 -371356 -497140 -416156 -240769
11840 -240769 -65556 31746 9313 -188465 -161943 98041 247574 391669 372373 348254
11830 348254 446328 561846 394402 222552 117536 -50233 -215689 -494396 -499240 -262959
11820 -262959 -28963 181570 312666 229844 -5527 -204472 -381238 -302798 -337495 -479241
11810 -479241 -586504 -466729 -185624 -198264 -270544 -89271 172484 181865 -43152 -329822
11800 -329822 -324799 -113963 119748 67689 -215129 -577546 -792689 -741218 -616973 -550943
11790 -550943 -422771 -229090 -98521 -110936 -54574 -69945 -142098 -211453 -265799 -320216 -349575
$$ packed form
11861C07334l28805k48505m3662O6283J99872K2962j88693n2269N0988J77809
11851c6686R5084m3088j8164J98413R6380k01336k58097k03862j25784Q0984J75387
11840b40769J75213R7302k2433j97778K6522K59984J49533J44095j9296k4119
11830C48254R8074J15518j67444j71850j05016j67769j65456k78707m844K36281
11820b62959K33996K10533J31096q2822k35371j98945j76766P8440l4697j41746
11810d79241j07263J19775K81105j2640p2280J81273K61755R381k25017k86670
11800c29822N023K10836K33711n2059k82818l62417k15143N1471J24245O6030
11790e50943J28172J93681J30569j2415N6362j5371p2153o9355n4346n4417k9359
$$ plain form
11779 -349575 -240626 -195 -232620 -513053 -560435 -528652 -465409 -315282 -8901 -31260
11769 -31260 -388452 -587871 -525112 -497068 -538377 -397287 -115107 40325 57364 68615 77490
11758 77490 130224 237090 432377 442092 346610 330269 230494 89650 -18315 127626 236231
11747 236231 259361 227127 -23953 -341956 -561549 -457299 -309749 -276565 -139765 7894
11737 7894 150221 77136 -88877 -102809 -91175 180006 399409 332880 242389 171499 -47962
11726 -47962 -318769 -632683 -770723 -589088 -340124 -140220 -13097 -26314 -1581 134754
11716 134754 182752 123743 -172563 -402098 -260990 -159524 -124756 -67962 -90361 -183051 -417810
11705 -417810 -602987 -538285 -492797 -470522 -251521 -123210 -83179 -10501 129884 266068
$$ packed form
11779c49575J08949K40431k32425k80433m7382L1783O3243J50127L06381k2359
11769c1260l57192j99419O2759K8044m1309J41090K82180J55432J7039J1251Q875
11758G7490N2734J06866J95287R715r5482j6341r9775j40844j07965J45941J08605
11747B36231K3130l2234k51080l18003k19593J04250J47550L3184J36800J47659
11737G894J42327p3085j66013j3932J1634K71181K19403o6529r0491p0890k19461
11726d7962k70807l13914j38040J81635K48964J99904J27123j3217K4733J36335
11716A34754M7998n9009k96306k29535J41108J01466L4768N6794k2399r2690k34759
11705d17810j85177O4702M5488K2275K19001J28311M0031P2678J40385J36184
$$ plain form
11695 266068 115891 -40317 -264767 -477057 -269352 -31822 162780 185093 -35969 -135136
11685 -135136 -191894 -296108 -329167 -346371 -205791 -100976 -71426 -92996 257 -42460 -13634
11674 -13634 237362 301198 134389 -96455 -123332 -8625 -121187 -241564 -208889 -84792
11664 -84792 134445 254183 313758 210112 47850 -35561 22191 79121 85387 197537 296528
11653 296528 202420 107546 -59384 -125385 -53961 -60571 -119851 -237465 -269379 -100458 98096
11642 98096 -23752 -291773 -335988 -248199 -209106 -208242 -246972 -271922 -258863 -78046 55808
11631 55808 153063 360499 378558 294843 143390 -81390 -165108 -43763 96108 10847 -24028
11620 -24028 -145789 -321697 -389465 -311451 -42248 80133 6148 -97575 -292104 -346368
$$ packed form
11695B66068j50177j56208k24450k12290K07705K37530J94602K2313k21062r9167
11685a35136n6758j04214l3059j7204J40580J04815K9550k1570R3253m2717K8826
11674a3634K50996O3836j66809k30844k6877J14707j12562j20377L2675J24097
11664h4792K19237J19738N9575j03646j62262q3411N7752N6930O266J12150R8991
11653B96528r4108r4874j66930o6001P1424o610n9280j17614l1914J68921J98554
11642I8096j21848k68021m4215Q7789L9093Q64l8730k4950J3059J80817J33854
11631E5808R7255K07436J8059q3715j51453k24780q3718J21345J39871q5261l4875
11620b4028j21761j75908o7768P8014K69203J22381p3985j03723j94529n4264
$$ plain form
11610 -346368 -137657 -33720 -259883 -462109 -424407 -349605 -472419 -466770 -300482 -173902
11600 -173902 -78742 -142323 -168142 -191942 -49816 96775 32497 -1727 62555 193458 36617
11589 36617 -187818 -246170 -332385 -543972 -542001 -371355 -94200 60627 -20264 -241320 -416106
11578 -416106 -457996 -373460 -189365 -89670 53847 36264 -75336 -180370 -150178 -116866 -318326
11567 -318326 -407414 -245072 -53051 56615 153078 -674 -230966 -306830 -199169 -1547
11557 -1547 178927 510125 691331 495835 338390 104998 40385 90806 30209 69561 266033
11546 266033 357069 250129 182779 153005 157463 115209 189722 258921 183672 58013 -6440
11535 -6440 -59362 -237796 -345475 -179397 18926 69465 91234 187810 174202 -118311 -292057
$$ packed form
11610c46368K08711J03937k26163k02226L7702P4802j22814N649J66288J26580
11600a73902R5160o3581k5819k3800J42126J46591o4278l4224O4282J30903j56841
11589C6617k24435n8352q6215k11587J971J70646K77155J54827q0891k21056j74786
11578d16106m1890Q4536J84095R9695J43517j7583j11600j05034L0192L3312k01460
11567c18326q9088J62342J92021J09666R6463j53752k30292p5864J07661J97622
11557a547J80474L31198J81206j95496j57445k33392o4613N0421o0597L9352J96472
11546B66033R1036j06940o7350k9774M458m2254P4513O9199p5249j25659o4453
11535f440n2922j78434j07679J66078J98323N0539K1769R6576j3608k92513j73746
$$ plain form
11524 -292057 -184322 35258 169364 185111 142330 261093 520808 587311 455055 257956
11514 257956 134741 35779 -5868 21680 -32470 -94379 -407618 -477450 -327835 -62145 59233
11503 59233 39841 37215 -101945 -113513 -170781 -301722 -437350 -516705 -257334 58876 263079
11492 263079 228677 199645 338957 438103 201363 -47991 -127287 -388115 -607889 -666403
11482 -666403 -628440 -464219 -254352 -309035 -338556 -322795 -102745 -2223 -111843 -209689
11472 -209689 -147169 -25316 27219 198513 315174 273170 312191 363666 298961 175297 193407
11461 193407 209416 139807 -22536 -92677 -100791 -38113 22811 -108265 -129933 -30328 28062
11450 28062 212215 360945 467733 426485 356747 259317 125314 139558 57841 -61696 -147260
$$ packed form
11524b92057J07735K19580J34106J5747m2781J18763K59715O6503j32256j97099
11514B57956j23215r8962m1647K7548n4150o1909l13239o9832J49615K65690J21378
11503E9233j9392k626j39160j1568n7268j30941j35628p9355K59371L16210K04203
11492B63079l4402k9032J39312R9146k36740k49354p9296k60828k19774n8514
11482f66403L7963J64221K09867n4683k9521J5761K20050J00522j09620r7846
11472b09689O2520J21853N2535J71294J16661m2004L9021N1475o4705j23664J8110
11461A93407J6009o9609j62343p0141q114O2678O0924j31076k1668R9605N8390
11450B8062J84153J48730J06788m1248o9738r7430j34003J4244q1717j19537q5564
$$ plain form
11439 -147260 -209598 -199565 -199804 -316862 -501351 -591833 -423493 -285262 -172427 -210805 -343304
11428 -343304 -498380 -612012 -546338 -454624 -428713 -312547 -26408 80556 90136 135334 9909
11417 9909 -290888 -411799 -408628 -412604 -346346 -149163 93348 186242 27092 -234053 -353056
11406 -353056 -177152 -22825 -180347 -245502 -116761 12068 35555 7754 93063 51412
11396 51412 -72736 -208851 -96200 103531 -24514 -305771 -363416 -185834 -84748 -178350
11386 -178350 -331187 -315107 42590 292612 202594 56533 -62550 -169816 -291988 -407104
11376 -407104 -349343 -98853 17397 249911 314335 287350 361006 358492 277552 317938 597161
11365 597161 550328 306643 83427 54948 114740 9578 -110901 -16096 74830 -8828 -16944
$$ packed form
11439a47260o2338J0033k39j17058j84489r0482J68340J38231J12835l8378j32499
11428c43304j55076j13632O5674R1714K5911J16166K86139J06964R580M5198j25425
11417I909l00797j20911L171l976O6258J97183K42511R2894j59150k61145j19003
11406c53056J75904J54327j57522o5155J28741J28829K3487k7801Q5309m1651
11396E1412j24148j36115J12651J99731j28045k81257n7645J77582J01086r3602
11386a78350j52837J6080L57697K50022r0018j46061j19083j07266j22172j15116
11376d07104N7761K50490J16250K32514O4424k6985P3656k514q0940M0386K79223
11365E97161m6833k43685k23216k8479N9792j05162j20479R4805R0926q3658q116
$$ plain form
11354 -16944 -76844 -370482 -702552 -758071 -654743 -466782 -271512 -86784 26439 28104
11344 28104 -38042 76074 120461 8054 -159375 -121277 6753 99564 115198 90307 106663
11333 106663 160269 -32790 -375854 -488004 -394780 -182543 -212084 -190341 -126240 -235083
11323 -235083 -505165 -652332 -555618 -316126 -166752 -228221 -287021 -224965 -252527 -267276 -267390
11312 -267390 -295281 -359118 -274361 -234911 -290504 -357838 -356852 -283283 -165326 -89941 160129
11301 160129 259111 234889 225716 137859 26306 -28624 -104653 -266234 -395863 -475851 -486170
11290 -486170 -581937 -513369 -398001 -251874 -204552 -418853 -473588 -446810 -445379 -539565 -493858
11279 -493858 -254017 112395 236991 -85513 -334951 -354936 -222708 -193359 -422908 -584251
$$ packed form
11354a6944n9900k93638l32070n5519J03328J87961J95270J84728J13223J665
11344B8104o6146J14116M4387j12407j67429L8098J28030R2811J5634k4891J6356
11333A06663N3606j93059l43064j12150R3224K12237k9541K1743O4101j08843
11323b35083k70082j47167R6714K39492J49374o1469n8800O2056k7562j4749j14
11312b67390k7891o3837Q4757L9450n5593o7334R86P3569J17957P5385K50070
11301A60129R8982k4222r173q7857j11553n4930p6029j61581j29629p9988j0319
11290d86170r5767O8568J15368J46127M7322k14301n4735K6778J431r4186M5707
11279d93858K39841L66412J24596l22504k49438j9985J32228K9349k29549j61343
$$ plain form
11269 -584251 -585468 -531812 -426000 -177540 54177 121705 152041 165091 200020 135841 64852
11258 64852 192153 241453 65726 166666 271572 35670 -243670 -426930 -510994 -529302
11248 -529302 -486246 -369623 -332226 -218375 -172707 -331342 -509632 -638132 -721360 -625596
11238 -625596 -462136 -329922 -329721 -397772 -316396 -441262 -584991 -568050 -420890 -291894 -360033
11227 -360033 -504492 -678457 -587983 -298075 -167765 19383 138553 -83920 -291314 -300168
11217 -300168 -172540 -114883 -123504 -87192 -111746 -277235 -395921 -344871 -221921 -130307 77686
11206 77686 268450 125039 -30554 -259022 -315629 -122112 -199186 -346045 -264464 -118984
11196 -118984 -170154 -161081 -63334 728 44983 49151 112357 147301 94652 -63951 -243673
$$ packed form
11269e84251j217N3656J05812K48460K31717O7528L0336J3050L4929o4179p0989
11258F4852J27301M9300j75727J00940J04906k35902k79340j83260q4064j8308
11248e29302M3056J16623L7397J13851M5668j58635j78290j28500q3228R5764
11238f25596J63460J32214K01o8051Q1376j24866j43729J6941J47160J28996o8139
11227c60033j44459j73965R0474K89908J30310J87148J19170k22473k07394q854
11217c00168J27628N7657q621L6312k4554j65489j18686N1050J22950R1614K07993
11206G7686J90764j43411j55593k28468n6607J93517p7074j46859Q1581J45480
11196a18984n1170R073R7747O4062M4255M168O3206L4944n2649j58603j79722
$$ plain form
11185 -243673 -247681 -154287 -172428 -116436 -12797 -7488 13760 154876 152488 209575 90618
11174 90618 -185827 -215830 -290679 -446688 -721938 -861261 -616139 -331309 -497183 -690715
11164 -690715 -636292 -385819 -310592 -371793 -584764 -596948 -330067 -176666 -120133 -80197 131547
11153 131547 202133 122475 99238 142400 175653 27095 -298115 -529502 -324876 -148507
11143 -148507 -242508 -315942 -269393 -315886 -580443 -631236 -382555 -229890 -146298 -144606 -263029
11132 -263029 -101971 250903 476000 436683 201758 71925 18139 -187940 -299830 -239854
11122 -239854 -174763 -215814 -303887 -281328 -91774 26973 20114 138766 324944 229169 248102
11111 248102 392697 295508 46385 -54376 140487 370457 318187 284435 413876 521378
$$ packed form
11185b43673m008R3394j8141N5992J03639N309K1248J41116k388N7087j18957
11174I0618k76445l0003p4849j56009k75250j39323K45122K84830j65874j93532
11164f90715N4423K50473P5227o1201k12971j2184K66881J53401N6533L9936K11744
11153A31547P0586p9658k3237M3162L3253j48558l25210k31387K04626J76369
11143a48507r4001p3434M6549m6493k64557n0793K48681J52665Q3592J692j18423
11132b63029J61058L52874K25097l9317k34925j29833n3786k06079j11890N9976
11122b39854O5091m1051q8073K2559J89554J18747o859J18652J86178r5775J8933
11111B48102J44595r7189k49123j00761J94863K29970n2270l3752J29441J07502
$$ plain form
11101 521378 415893 79341 -90063 -66461 170449 112690 77167 113667 108983 49113 191528
11090 191528 198849 66954 121268 267927 324550 326604 263773 101772 26500 112658 324790
11079 324790 366512 311932 459793 410874 281790 428561 488972 183947 -64213 -90943
11069 -90943 -9640 -14604 57188 51285 22949 17516 -51422 -90771 18024 105821 100048 19464
11057 19464 -80487 89662 138254 216431 358057 408033 369141 184263 -114577 -180224 -10899
11046 -10899 35264 -5414 -55821 -126476 -232447 -307107 -457394 -499764 -312277 -88470 -172480
11035 -172480 -301418 -168173 30709 137764 224410 312167 438879 497047 568262 525248
11025 525248 233743 100936 93081 101902 -49153 -64884 -85580 -129640 -60002 -50200 -123076
$$ packed form
11101E21378j05485l36552j69404K3602K36910n7759l5523L6500m684n9870J42415
11090A91528P321j31895N4314J46659N6623K054o2831j62001p5272Q6158K12132
11079C24790M1722n4580J47861m8919j29084J46771O0411l05025k48160k6730
11069i0943Q1303m964P1792n903k8336n433o8938l9349J08795Q7797n773q0584
11057A9464r9951J70149M8592P8177J41626M9976l8892j84878k98840o5647J69325
11046a0899M6163m0678n0407p0655j05971p4660j50287m2370J87487K23807q4010
11035a72480j28938J33245J98882J07055Q6646Q7757J26712N8168P1215m3014
11025E25248k91505j32807p855Q821j51055j5731k0696m4060O9638R802p2876
$$ plain form
11014 -123076 -138556 473 155295 220051 241454 252203 217270 248173 475349 637501 794586
11003 794586 751940 711221 621818 474217 540749 747121 783266 655639 764610 810193 628241
10992 628241 486513 424832 235886 194572 359695 497628 579164 695739 790949 636388
10982 636388 502900 406621 528513 650236 539342 451508 379634 197496 276684 529121
10972 529121 728019 735788 705468 709287 638679 572487 288045 188670 329078 624053 995681
10961 995681 1033118 1124262 1121572 955335 801306 721729 808483 863961 871963 985843 1091555
10950 1091555 1047129 935940 842086 828914 865136 841131 801296 580164 420788 503434 602818
10939 602818 761525 1034317 1201516 1267730 1395780 1508118 1223646 944907 952211 954143
$$ packed form
11014a23076j5480J39029J54822O4756K1403J0749l4933L0903K27176J62152J57085
11003G94586m2646m0719q9403j47601O6532K06372L6145j27627J08971M5583j81952
10992F28241j41728o1681j88946m1314J65123J37933Q1536J16575R5210j54561
10982F36388j33488r6279J21892J21723j10894q7834p1874j82138P9188K52437
10972E29121J98898P769l0320L819p0608o6192k84442r9375J40408K94975L71628
10961I95681L7437R1144k690j66237j54029p9577Q6754N5478Q002J13880J05712
10950A091555m4426j11189r3854j3172L6222k4005l9835k21132j59376Q2646R9384
10939F02818J58707K72792J67199O6214J28050J12338k84472k78739P304J932
$$ plain form
10929 954143 929306 1164388 1453628 1510918 1428064 1226963 1263630 1336657 1330038 1385030 1300815
10918 1300815 1212745 1397848 1462095 1362393 1258438 1077377 1120193 1371235 1553341 1435822
10908 1435822 1481874 1596458 1592317 1517172 1462819 1523647 1664992 1585540 1383118 1248043 1364676
10897 1364676 1465798 1326937 1175979 1221571 1476605 1868076 2233993 2395391 2482664 2583197
10887 2583197 2573136 2460673 2304059 2097856 2013327 2015856 2116841 2202260 2322681 2367409
10877 2367409 2317822 2270761 2372511 2620366 2744790 2694577 2748426 2874279 2883053 2979183 3186322
10866 3186322 3304610 3358411 3219034 2996743 2947491 2832476 2619143 2493068 2435137 2450348
10856 2450348 2473498 2343749 2274352 2412663 2544682 2639870 2579949 2343031 1961401 1766624
$$ packed form
10929I54143k4837K35082K89240N7290q2854k01101L6667P3027o619N4992q4215
10918A300815q8070J85103O4247r9702j03955j81061M2816K51042J82106j17519
10908A435822M6052J14584m141p5145n4353O0828J41345p9452k02422j35075J16633
10897A364676J01122j38861j50958M5592K55034L91471L65917J61398Q7273J00533
10887B583197j0061j12463j56614k06203q4529K529J00985Q5419J20421M4728
10877B367409m9587m7061J01750K47855J24424n0213N3849J25853Q774R6130K07139
10866C186322J18288N3801j39377k22291m9252j15015k13333j26075n7931J5211
10856B450348K3150j29749o9397J38311J32019R5188n9921k36918l81630j94777
$$ plain form
10846 1766624 1639723 1579373 1623567 1832483 1821927 1677644 1750716 2007543 2247818 2419432
10836 2419432 2429612 2091629 1760860 1636813 1678024 1785940 1798258 1807298 1754473 1625860
10826 1625860 1620523 1713532 1827290 1846084 1887266 1877996 2001081 2270986 2478345 2501148 2488966
10815 2488966 2588321 2649462 2703999 2774888 2708386 2664747 2879667 3208424 3397292 3350869 3403571
10804 3403571 3611744 3546840 3342354 3258736 3196707 3213827 3127860 3170675 3292706 3369688 3247494
10793 3247494 2977551 2865778 2854256 2894072 2934418 3016349 3104781 3368940 3587946 3654447
10783 3654447 3883250 4353078 4721821 4793673 4691960 4566330 4504104 4345086 4381321 4766149
10773 4766149 5137789 5288866 5435044 5717956 5958983 6187921 6564993 6992920 7312324
$$ packed form
10846A766624j26901o0350M4194K08916j0556j44283P3072K56827K40275J71614
10836B419432J0180l37983l30769j24047M1211J07916J2318R040n2825j28613
10826A625860n337R3009J13758J8794M1182r270J23085K69905K07359K2803j2182
10815B488966R9355O1141N4537P0889o6502m3639K14920L28757J88868m6423N2702
10804C403571K08173o4904k04486q3618o2029J7120q5967M2815J22031P6982j22194
10793C247494k69943j11773j1522L9816M0346Q1931Q8432K64159K19006O6501
10783C654447K28803M69828L68743P1852j01713j25630o2226j59018L6235L84828
10773D766149L71640J51077J46178K82912K41027K28938L77072M27927L19404
$$ plain form
10764 7312324 7610906 7955304 8348102 8740106 9060403 9347805 9816883 10320235 10645342
10755 10645342 11097847 11524643 11867564 12129130 12476460 12977978 13297643 13399584 13582346
10746 13582346 13753276 13769964 13697790 13457644 13017853 12506214 12264797 11984232 11525508 11163078
10736 11163078 10619075 10147477 9816379 9536408 9358182 9307075 9133181 8899127 8898705 8894083
10726 8894083 8695063 8648133 8797057 9044600 9374524 9704360 10071838 10626265 11054477 11447543
10716 11447543 11972198 12542827 13393353 14606207 15972358 17469436 19024339 20769899
10708 20769899 22811219 25251209 27624924 29794737 31914399 33786005 34977942 35525088
10700 35525088 35635168 35399885 34677116 33428529 32139231 30898381 29619308 28439691
$$ packed form
10764G312324K98582L44398L92798L92004L20297K87402M69078N03352L25107
10755A0645342M52505M26796L42921K61566L47330N01518L19665J01941J82762
10746A3582346J70930J6688p2174k40146m39791n11639k41417k80565m58724l62430
10736A1163078n44003m71598l31098k79971j78226n1107j73894k34054m22m622
10726H894083j99020m6930J48924K47543L29924L29836L67478N54427M28212L93066
10716A1447543N24655N70629Q50526J212854J366151J497078J554903J745560
10708B0769899K041320K439990K373715K169813K119662J871606J191937N47146
10700C5525088J10080k35283p22769j248587j289298j240850j279073j179617
$$ plain form
10692 28439691 27204084 25884925 24654155 23521960 22422398 21172420 19919301 18792888
10684 18792888 17747881 16778319 16059272 15502304 14884214 14079406 13310263 12610501 12061511
10675 12061511 11601101 11129192 10617105 10135032 9824788 9676163 9549362 9546213 9477769 9251680
10665 9251680 9235494 9270327 9348042 9466363 9666441 10159078 10484847 10777877 11193291 11738624
10655 11738624 12457749 13385061 14457824 15622909 16643082 17296456 17798348 18340185 18566276
10646 18566276 18532956 18419663 18281203 18314135 18341125 18468894 18931057 19498677 20130847 20686406
10636 20686406 21493422 22675389 23947998 25644940 27796599 30440111 33688031 37525618
10628 37525618 42042534 47013676 51095255 53255811 53618749 52651783 51225922 49793998
$$ packed form
10692B8439691j235607j319159j230770j132195j099562j249978j253119j126413
10684A8792888j045007r69562p19047n56968o18090q04808p69143o99762n48990
10675A2061511m60410m71909n12087m82073l10244j48625j26801l149o8444k26089
10665I251680j6186L4833P7715J18321K00078M92637L25769K93030M15414N45333
10655A1738624P19125R27312J072763J165085J020173O53374N01892N41837K26091
10646A8566276l3320j13293j38460L2932K6990J27769M62163N67620O32170N55559
10636B0686406Q07016J181967J272609J696942K151659K643512L247920L837587
10628C7525618M516916M971142M081579K160556L62938r66966j425861j431924
$$ plain form
10620 49793998 48550350 47290130 46127325 44864937 43150003 40850254 38263576 35920160
10612 35920160 33448245 30575589 27568905 24499406 21663338 19271867 17221101 15375338
10604 15375338 13903686 12496604 11161057 10364645 9542047 8754406 8006296 7333151 6707478
10595 6707478 6154511 5724843 5372042 5049596 4552270 4319888 4140743 3754887 3426478
10586 3426478 3103160 2873814 2595175 2426641 2316842 2172873 2079615 1760129 1663902 1787153
10576 1787153 1900445 2094239 2332226 2467436 2330766 2010268 1930442 1858713 1816992 1818919
10566 1818919 1726036 1425629 1320601 1515226 1539074 1438515 1354227 1138603 937353 862322
10556 862322 673978 815197 951023 782089 624159 540569 728196 831042 778570 520064
$$ packed form
10620D9793998j243648j260220j162805j262388j714934k299749k586678k343416
10612C5920160k471915k872656l006684l069499k836068k391471k050766j845763
10604A5375338j471652j407082j335547p96412q22598p87641p48110o73145o25673
10595F707478n52967m29668l52801l22446m97326k32382j79145l85856l28409
10586C426478l23318k29346k78639j68534j09799j43969r3258l19486r6227J23251
10576A787153J13292J93794K37987J35210j36670l20498p9826p1729m1721J927
10566A818919r2883l00407j05028J94625K3848j00559q4288k15624k01250p5031
10556H62322j88344J41219J35826j68934j57930q3590J87627J02846n2472k58506
$$ plain form
10546 520064 255426 136274 229910 389870 410364 276046 224097 301428 455059 488310
10536 488310 398490 357197 328025 202545 -38900 -23389 191021 502849 689534 491232
10526 491232 269541 166796 287681 295334 52311 100434 295220 314310 130998 -147393
10516 -147393 -208581 -88155 72568 251280 290425 340255 343343 223314 131761 -44302 -192908
10505 -192908 -215832 -145072 157353 353742 343917 178657 178504 197792 220403 298445 256390
10494 256390 160312 32444 -40855 17398 68631 -44169 -226982 -258980 -74588 153697
10484 153697 412683 461140 427111 482966 557572 415160 173356 -24751 80441 284170
10474 284170 414535 580669 502012 255190 291042 381429 374214 429944 412408 522841 444915
$$ packed form
10546E20064k64638j19152R3636J59960K0494j34318n1949P7331J53631L3251
10536D88310q9820m1293k9172j25480k41445J5511K14410L11828J86685j98302
10526D91232k21691j02745J20885P653k43023M8123J94786J9090j83312k78391
10516a47393o1188J20426J60723J78712L9145M9830L088j20029r1553j76063j48606
10505a92908k2924P0760L02425J96389r825j65260j53J9288K2611P8042m2055
10494B56390r6078j27868p3299N8253N1233j12800j82813l1998J84392K28285
10484A53697K58986M8457l4029N5855P4606j42412k41804j98107J05192K03729
10474B84170J30365J66134p8657k46822L5852R0387p215N5730j7536J10433p7926
$$ plain form
10463 444915 266410 135778 -3136 -31838 57434 79128 40986 -10502 -48318 6667 8944
10452 8944 -168202 -423314 -471939 -351692 -100735 194719 162932 103731 239396 411470
10442 411470 297373 106691 170240 269527 367088 592317 550481 284394 124364 137775
10432 137775 292318 326730 165345 7455 -18682 -38739 -57484 -77624 -239636 -259984 -70101
10421 -70101 -43020 2563 97042 85399 12524 -96061 -169696 -33581 52715 -107641 -144442
10410 -144442 -123917 -60302 -191018 -140255 -14022 -44142 -104401 -56377 86260 248470 151391
10399 151391 -156687 -275840 -133568 -126067 -200599 -54648 -101594 -212416 -212960 -317388 -356419
10388 -356419 -373146 -246741 -187315 -105215 -24264 85269 -14126 -244532 -243534 -38884 91603
$$ packed form
10463D44915j78505j30632j38914k8702Q9272K1694l8142n1488l7816N4985K277
10452H944j77146k55112m8625J20247K50957K95454l1787n9201J35665J72074
10442D11470j14097j90682O3549R9287R7561K25229m1836k66087j60030J3411
10432A37775J54543L4412j61385j57890k6137k0057j8745k0140j62012k0348J89883
10421g0101K7081M5583R4479j1643p2875j08585p3635J36115Q6296j60356l6801
10410a44442K0525O3615j30716N0763J26233l0120o0259M8024J42637J62210r7079
10399A51391l08078j19153J42272P501p4532J45951m6946j10822n44j04428l9031
10388c56419j6727J26405N9426Q2100Q0951J09533r9395k30406R98K04650J30487
$$ plain form
10377 91603 89965 189292 423433 418262 264814 19117 -281703 -255716 -16696 175526 274196
10366 274196 357061 416943 576538 747792 678004 432832 271755 299019 489906 337712
10356 337712 177322 209906 219635 281246 243643 319826 348627 312239 201652 121084 151935
10345 151935 222069 164957 27267 9704 101238 30540 -124580 -104975 -158333 -239643 -175572
10334 -175572 -46101 222104 397153 207964 45690 35965 30570 -16974 -93780 -153258 -243093
10323 -243093 -264420 -244784 -262105 -190802 -73119 -38337 125049 429144 547131 391801
10313 391801 219955 175217 165673 -32641 -176584 -71627 196273 378726 279846 111433
10303 111433 -43660 -131009 -25273 -65434 -136337 11886 -11127 -214615 -395746 -466289
$$ packed form
10377I1603j638R9327K34141n171j53448k45697l00820K5987K39020J92222R8670
10366B74196Q2865N9882J59595J71254o9788k45172j61077K7264J90887j52194
10356C37712j60390L2584R729O1611l7603P6183K8801l6388j10587q0568L0851
10345A51935P0134n7112j37690j7563R1534p0698j55120J9605n3358q1310O4071
10334a75572J29471K68205J75049j89189j62274r725n395m7544p6806n9478q9835
10323b43093k1327J9636j7321P1303J17683L4782J63386L04095J17987j55330
10313C91801j71846m4738r544j98314j43943J04957K67900J82453r8880j68413
10303A11433j55093q7349J05736m0161p0903J48223k3013k03488j81131p0543
$$ plain form
10293 -466289 -289026 -173444 -223548 -356345 -366366 -151092 27221 159588 162317 115060
10283 115060 -84970 -95807 -97475 834 89102 93653 91309 48309 78388 51076 -254038 -369928
10271 -369928 -263816 -115872 41395 -899 -284609 -494985 -593943 -648784 -628889 -557156
10261 -557156 -302705 -73842 -107218 73851 379780 407179 216458 31805 -319656 -611065
10251 -611065 -536015 -484160 -548795 -549713 -474060 -295120 45770 151056 99024 71448 152371
10240 152371 251385 177805 -2346 -119976 -71220 -122894 -138998 -114946 60510 446682 567694
10229 567694 430386 254824 69660 -99080 -94771 119031 271651 122039 -150484 -146772
10219 -146772 -85405 71350 110026 28687 -120231 -131864 -10584 131956 123080 127377 134783
$$ packed form
10293d66289J77263J15582n0104j32797j0021K15274J78313J32367K729m7257
10283A15060k00030j0837j668R8309Q8268M551k344m3000L0079k7312l05114j15890
10271c69928J06112J47944J57267m2294k83710k10376r8958n4841J9895P1733
10261e57156K54451K28863l3376J81069L05929K7399j90721j84653l51461k91409
10251f11065P5050N1855o4635r18P5653J78940L40890J05286n2032k7576Q0923
10240A52371R9014p3580j80151j17630M8756n1674j6104K4052J75456L86172J21012
10229E67694j37308j75562j85164j68740M309K13802J52620j49612k72523L712
10219a46772O1367J56755L8676q1339j48918j1633J21280J42540q876M297P406
$$ plain form
10208 134783 66070 -4231 25406 712 -116360 -111817 -61698 -148699 -53618 175021 182124
10197 182124 198828 293989 272279 222538 159412 248892 179000 47833 75453 211503 164227
10186 164227 12789 138046 22175 -123000 -7821 108583 36521 -24212 -7863 117996
10176 117996 120137 -32385 -73615 -67361 -162245 -175431 -276678 -281435 -117466 72424 346844
10165 346844 356789 220610 208928 269260 264808 234982 150401 99621 -18932 -151943 -118951
10154 -118951 20542 -126322 -295729 -347909 -342516 -163481 63835 -118377 -235119 -283439
10144 -283439 -426166 -278520 -299338 -460788 -489908 -574186 -662647 -543904 -262925 -122988
10134 -122988 -91928 17904 33260 -30747 -92830 -50555 -169668 -320900 -187606 -192933 -134879
$$ packed form
10208A34783o8713p0301K9637k4694j17072M543N0119q7001R5081K28639P103
10197A82124J6704R5161k1710m9741o3126Q9480o9892j31167K7620J36050m7276
10186A64227j51438J25257j15871j45175J15179J16404p2062o0733J6349J25859
10176A17996K141j52522m1230O254r4884j3186j01247m757J63969J89890K74420
10165C46844R945j36179j1682O0332m452k9826q4581n0780j18553j33011L2992
10154a18951J39493j46864j69407n2180N393J79035K27316j82212j16742m8320
10144b83439j42727J47646k0818j61450k9120q4278q8461J18743K80979J39937
10134a22988L1060J09832J5356o4007o2083M2275j19113j51232J33294n327N8054
$$ plain form
10123 -134879 -30550 -55793 -86118 -168975 -125359 -10889 -55681 -213167 -242691 -288711 -171545
10112 -171545 -61650 -154988 -427931 -705060 -572577 -294204 -370129 -513699 -524413 -332206
10102 -332206 -184917 -159323 -100607 93967 277905 273324 243863 397019 570609 575613 337937
10091 337937 -33764 -257696 -204696 -153872 -90230 156606 373648 298522 213395 188509 194685
10080 194685 238509 125031 -11226 -43618 40130 215195 138999 -231129 -368215 -287488
10070 -287488 -245400 -238513 -333915 -399552 -340282 -224473 -112294 -44053 -72759 -183406 -80783
10059 -80783 34085 -171820 -305202 -247401 -111355 -107580 -231485 -260341 -272923 -258778 -48939
10048 -48939 -18200 -130624 -92825 150620 186487 56977 -25515 -93179 -197946 -71640 36428
$$ packed form
10123a34879J04329k5243l0325q2857M3616J14470m4792j57486k9524m6020J17166
10112a71545J09895r3338k72943k77129J32483K78373p5925j43570j0714J92207
10102c32206J47289K5594N8716J94574J83938m581k9461J53156J73590N004k37676
10091C37937l71701k23932N3000N0824O3642K46836K17042p5126q5127k4886O176
10080A94685M3824j13478j36257l2392Q3748J75065p6196l70128j37086Q0727
10070b87488M2088O887r5402o5637N9270J15809J12179O8241k8706j10647J02623
10059h0783J14868k05905j33382N7801J36046L775j23905k8856j2582J4145K09839
10048d8939L0739j12424L7799K43445L5867j29510q2492o7664j04767J26306J08068
$$ plain form
10037 36428 46831 -49920 22538 86419 32708 35722 254567 478567 449941 247924 -57443
10026 -57443 -242156 -362636 -493258 -539523 -429038 -134240 66300 66813 95448 -35202 -176317
10015 -176317 -303471 -371619 -268263 -240906 -275052 -369423 -267386 -130774 -62010 -129440 -253927
10004 -253927 -337152 -628361 -707797 -445446 -163654 -180356 -390352 -504269 -657452 -544998
9994 -544998 -247382 -103781 -27629 -30636 120839 309518 308397 389578 380834 227927 277906
9983 277906 380001 421734 331488 169262 224853 344828 4785 -458046 -516517 -457669 -412697
9972 -412697 -345117 -247098 49162 28096 -71445 -142864 -382801 -429535 -355710 -289283 -230882
9961 -230882 -134220 -48072 19423 25655 102364 150492 121602 189298 243419 217161 29034 -180244
$$ packed form
10037C6428J0403r6751P2458O3881n3711L014K18845K24000k8626k02017l05367
10026e7443j84713j20480j30622m6265J10485K94798K00540N13K8635j30650j41115
10015a76317j27154o8148J03356K7357l4146r4371J02037J36612O8764o7430j24487
10004b53927q3225k91209p9436K62351K81792j6702k09996j13917j53183J12454
9994e44998K97616J43601P6152l007J51475J88679j121Q1181q744j52907M9979
9983B77906J02095M1733r0246j62226N5591J19975l40043m62831n8471N8848M4972
9972d12697O7580R8019K96260k1066r9541p1419k39937m6734P3825O6427N8401
9961b30882R6662Q6148O7495O232P6709M8128k8890O7696N4121k6258j88127k09278
$$ plain form
9949 -180244 -401228 -543122 -585219 -666465 -629653 -639855 -607501 -440430 -539160 -514064 -232343
9938 -232343 -37023 106621 110307 -29589 -276658 -131898 245135 339609 193140 22685
9928 22685 67196 -116240 -302413 -332236 -317484 -427901 -425496 -367271 -391979 -275142 -334591
9917 -334591 -365511 -367861 -525213 -666123 -599063 -319171 -198259 -122209 -240380 -482821 -556171
9906 -556171 -338877 -106300 -5633 -26969 -28765 28968 225551 288960 205588 134134 -97908
9895 -97908 -387202 -275884 -118069 -221361 -238949 -86394 53931 212171 149657 45617
9885 45617 -31015 -141474 -7022 44867 88197 227710 196214 71817 -74415 -238673 -209083
9874 -209083 -91956 -48223 -108770 -179876 -127259 150773 273363 502372 667949 605441 432209
$$ packed form
9949a80244k20984j41894m2097q1246L6812j0202L2354J67071r8730K5096K81721
9938b32343J95320J43644L686j39896k47069J44760L77033R4474j46469j70455
9928B2685M4511j83436j86173k9823J4752j10417K405N8225k4708J16837n9449
9917c34591l0920k350j57352j40910O7060K79892J20912P6050j18171k42441p3350
9906e56171K17294K32577J00667k1336j796N7733J96583O3409q3372p1454k32042
9895i7908k89294J11318J57815j03292j7588J52555J40325J58240o2514j04040
9885D5617p6632j10459J34452N1889M3330J39513l1496j24397j46232j64258K9590
9874b09083J17127M3733o0547p1106N2617K78032J22590K29009J65577o2508j73232
$$ plain form
9863 432209 147965 55228 8680 -20425 30522 125523 88163 -132601 -363122 -178804 30682
9852 30682 -6170 185212 564416 801997 777751 557486 396274 266949 305507 312469 281471
9841 281471 312879 380477 389261 318781 395988 448887 393934 373381 572150 581931 366831 206654
9829 206654 231802 385616 577562 470887 218398 13879 -152752 -284650 -197920 -26688
9819 -26688 6980 -3358 246294 518687 587816 762309 900093 721601 372536 344992 388590
9808 388590 219533 -30871 -145774 -296412 -326990 -274434 -189652 -142749 3372 252189
9798 252189 267251 262741 311123 280584 211056 196221 292437 418370 520700 429373 179046
9787 179046 136079 243016 289077 219140 103156 -45037 -77822 -25534 29186 -37501 -134511
$$ packed form
9863D32209k84244r2737m6548k9105N0947R5001l7360k20764k30521J84318K09486
9852C0682l6852J91382L79204K37581k4246k20265j61212j29325L8558O962l0998
9841B81471L1408O7598Q784p0480P7207N2899n4953k0553J98769R781k15100j60177
9829B06654K5148J53814J91946j06675k52489k04519j66631j31898Q6730J71232
9819b6688L3668j0338K49652K72393O9129J74493J37784j78492l49065k7544M3598
9808C88590j69057k50404j14903j50638l0578N2556Q4782M6903J46121K48817
9798B52189J5062m510M8382l0539o9528j4835R6216J25933J02330r1327k50327
9787A79046m2967J06937M6061o9937j15984j48193l2785N2288N4720o6687r7010
$$ plain form
9776 -134511 -78324 120110 -21602 -149952 99910 506229 719643 750032 603670 409187
9766 409187 311954 248755 205538 257463 341559 271665 320154 415082 225007 203295 434007
9755 434007 459457 262336 213083 189475 -20067 28824 166193 -43066 -363571 -281783 -111796
$$ packed form
9776a34511N6187J98434j41712j28350K49862M06319K13414L0389j46362j94483
9766D09187r7233o3199m3217N1925Q4096o9894M8489R4928j90075k1712K30712
9755D34007K5450j97121m9253k3608k09542M8891J37369k09259l20505Q1788J69987
$$ [...]
##END NTUPLES=NMR SPECTRUM
##END=
