##TITLE=C13_LR-580-R2H2_CR2
 D2O, 24150 sc

 9.1.2020
##JCAMPDX= 6.0         $$ Bruker NMR JCAMP-DX V2.0
##DATA TYPE= NMR SPECTRUM
##DATA CLASS= NTUPLES
##ORIGIN= UXNMR, Bruker Analytische Messtechnik GmbH
##OWNER= root
$$ XWIN-NMR		Version 3.5
$$ Fri Jan 10 14:07:20 2020 Russian Standard Time (UT+4h)  she@DPX200
##.OBSERVE FREQUENCY= 50.327896
##.OBSERVE NUCLEUS= ^13C
##.ACQUISITION MODE= SIMULTANEOUS
##.ACQUISITION SCHEME= undefined
##.AVERAGES= 21160
##.DIGITISER RES= 17
##SPECTROMETER/DATA SYSTEM= spect
##.PULSE SEQUENCE= zgpg30
##.SOLVENT NAME= D2O
##.SHIFT REFERENCE= (INTERNAL, D2O, 0, 222.624)
##AUDIT TRAIL= $$ (NUMBER, WHEN, WHO, WHERE, WHAT)
$$ ##TITLE= Audit trail, XWIN-NMR		Version 3.5
$$ ##JCAMPDX= 5.01
$$ ##ORIGIN= Bruker BioSpin GmbH
$$ ##OWNER= she
$$ F:/spectra/data/she/nmr/c13/1/pdata/1/auditp.txt
$$ ##AUDIT TRAIL=  $$ (NUMBER, WHEN, WHO, WHERE, WHAT)
(   1,<2020-01-10 10:27:40.95 +0400>,<she>,<DPX200>,
      <created by zg, POWCHK disabled, PULCHK disabled
       terminated by command 'halt'
       configuration hash MD5:
       00 E9 B6 7A A2 85 ED C7 34 08 36 98 17 FE 4E 26
       data hash MD5: 32K
       02 05 7C 2A 64 44 E3 7B B4 53 55 18 7F 13 36 00>)
(   2,<2020-01-10 14:05:46.76 +0400>,<she>,<DPX200>,
      <Start of raw data processing
       efp BC_mod = 2 LB = 1 FT_mod = 6 PKNL = 1 PHC0 = -256.149 PHC1 = 58.80638 SI = 32K 
       data hash MD5: 32K
       86 E9 C5 8D C1 4D 8C 9C F9 66 A0 B4 2A 6D 24 23>)
(   3,<2020-01-10 14:05:49.35 +0400>,<she>,<DPX200>,
      <abs ABSG = 5 
       data hash MD5: 32K
       17 E2 C6 0C C1 D9 F5 41 85 81 93 9B 3C BF 9A EE>)
(   4,<2020-01-10 14:06:23.15 +0400>,<she>,<DPX200>,
      <pk PHC0 = -1.179292 PHC1 = -1.999998 
       data hash MD5: 32K
       87 74 5E AD 25 99 E7 6D A6 25 54 8B B3 6D 87 0C>)
(   5,<2020-01-10 14:06:26.51 +0400>,<she>,<DPX200>,
      <abs ABSG = 5 
       data hash MD5: 32K
       2B A8 A9 F9 70 DF 1E 03 8E 83 7C A0 1A 1C 62 1F>)
$$ ##END=
$$ 
$$ hash MD5
$$ B8 11 31 3F 7A 57 B6 71 CF 48 A6 4D F8 09 8D AD
##$RELAX= 
##$RELAX= 
##$RELAX= 
##$RELAX= 
##$RELAX= 
##$RELAX= 
##$RELAX= 
##$RELAX= 
$$ Bruker specific parameters
$$ --------------------------
##$DU= <F:/spectra>
##$EXPNO= 1
##$NAME= <c13>
##$PROCNO= 1
##$TYPE= <nmr>
##$USER= <she>
##$AMP= (0..31)
100 100 100 100 100 100 100 100 100 100 100 100 100 100 100 100 100 100 
100 100 100 100 100 100 100 100 100 100 100 100 100 100 
##$AQSEQ= 0
##$AQ_mod= 1
##$AUNM= <au_zg>
##$AUTOPOS= <>
##$BF1= 50.322709
##$BF2= 200.13
##$BF3= 50.322709
##$BF4= 500.13
##$BF5= 500.13
##$BF6= 500.13
##$BF7= 500.13
##$BF8= 500.13
##$BYTORDA= 1
##$CFDGTYP= 0
##$CFRGTYP= 5
##$CHEMSTR= <none>
##$CNST= (0..31)
1 1 145 1 1 1 1 1 1 1 1 1 1 1 1 1 1 1 1 1 1 1 1 1 1 1 1 1 1 1 1 1 
##$CPDPRG= <waltz16>
##$CPDPRG1= <>
##$CPDPRG2= <waltz16>
##$CPDPRG3= <>
##$CPDPRG4= <mlev>
##$CPDPRG5= <mlev>
##$CPDPRG6= <mlev>
##$CPDPRG7= <mlev>
##$CPDPRG8= <mlev>
##$CPDPRGB= <>
##$CPDPRGT= <>
##$D= (0..31)
$$ [...]
##$SUBNAM4= <"">
##$SUBNAM5= <"">
##$SUBNAM6= <"">
##$SUBNAM7= <"">
##$SUBNAM8= <"">
##$SUBNAM9= <"">
##$SW= 239.972175391363
##$SWIBOX= (0..15)
0 1 3 0 0 0 0 0 0 0 0 0 0 0 0 0 
##$SW_h= 12077.2946859903
##$TD= 32768
##$TD0= 1
##$TE= 0
##$TE2= 300
##$TE3= 300
##$TEG= 300
##$TL= (0..7)
120 120 120 120 120 120 120 120 
##$TP= (0..7)
150 150 150 150 150 150 150 150 
##$TP07= 0
##$TPNAME0= <>
##$TPNAME1= <>
##$TPNAME2= <>
##$TPNAME3= <>
##$TPNAME4= <>
##$TPNAME5= <>
##$TPNAME6= <>
##$TPNAME7= <>
##$TPOAL= (0..7)
0.5 0.5 0.5 0.5 0.5 0.5 0.5 0.5 
##$TPOFFS= (0..7)
0 0 0 0 0 0 0 0 
##$TUNHIN= 0
##$TUNHOUT= 0
##$TUNXOUT= 0
##$USERA1= <user>
##$USERA2= <user>
##$USERA3= <user>
##$USERA4= <user>
##$USERA5= <user>
##$V9= 5
##$VALIST= <valist>
##$VCLIST= <CCCCCCCCCCCCCCC>
##$VD= 0
##$VDLIST= <DDDDDDDDDDDDDDD>
##$VPLIST= <PPPPPPPPPPPPPPP>
##$VTLIST= <TTTTTTTTTTTTTTT>
##$WBST= 1024
##$WBSW= 4
##$XGAIN= (0..3)
0 0 0 0 
##$XL= 0
##$YL= 0
##$YMAX_a= 134724429
##$YMIN_a= -37133129
##$ZGOPTNS= <>
##$ZL1= 120
##$ZL2= 120
##$ZL3= 120
##$ZL4= 120
##$ABSF1= 222.624
##$ABSF2= -17.3728
##$ABSG= 5
##$ABSL= 3
##$ALPHA= 0
##$AQORDER= 0
##$ASSFAC= 0
##$ASSFACI= 0
##$ASSFACX= 0
##$ASSWID= 0
##$AUNMP= <proc_1d>
##$AZFE= 0.1
##$AZFW= 0.5
##$BCFW= 0
##$BC_mod= 2
##$BYTORDP= 0
##$COROFFS= 0
##$CY= -3
##$DATMOD= 1
##$DC= 0
##$DFILT= <>
##$DTYPP= 0
##$F1P= 0
##$F2P= 0
##$FCOR= 0.5
##$FTSIZE= 32768
##$FT_mod= 6
##$GAMMA= 0
##$GB= 0
##$INTBC= 1
##$INTSCL= 4.134877e-10
##$ISEN= 128
##$LB= 1
##$LEV0= 0
##$LPBIN= 0
##$MAXI= 10000
##$MC2= 0
##$MEAN= 0
##$ME_mod= 0
##$MI= 0.1934396
##$NCOEF= 0
##$NC_proc= 1
##$NLEV= 6
##$NOISF1= 120.0001
##$NOISF2= 80.00006
##$NSP= 0
##$NTH_PI= 0
##$NZP= 0
##$OFFSET= 222.624
##$PC= 1.4
##$PHC0= -257.3283
##$PHC1= 56.80639
##$PH_mod= 1
##$PKNL= yes
##$PPARMOD= 0
##$PSCAL= 0
##$PSIGN= 0
##$REVERSE= no
##$SF= 50.3227315989248
##$SI= 32768
##$SIGF1= 140
##$SIGF2= 120
##$SINO= 11.81781
##$SIOLD= 32768
##$SREGLST= <13C.CDCl3>
##$SSB= 0
##$STSI= 32768
##$STSR= 0
##$SW_p= 12077.2946859903
##$SYMM= 0
##$S_DEV= 0
##$TDeff= 32768
##$TDoff= 0
##$TI= <>
##$TILT= no
##$TM1= 0
##$TM2= 0
##$TOPLEV= 0
##$USERP1= <user>
##$USERP2= <user>
##$USERP3= <user>
##$USERP4= <user>
##$USERP5= <user>
##$WDW= 1
##$XDIM= 32768
##$YMAX_p= 377765308
##$YMIN_p= -4529990
$$ End of Bruker specific parameters
$$ ---------------------------------
##NTUPLES= NMR SPECTRUM
##VAR_NAME=  FREQUENCY,     SPECTRUM/REAL,   SPECTRUM/IMAG
##SYMBOL=    X,             R,               I
##VAR_TYPE=  INDEPENDENT,   DEPENDENT,       DEPENDENT
##VAR_FORM=  AFFN,          ASDF,            ASDF
##VAR_DIM=   32768,         32768,           32768
##UNITS=     HZ,            ARBITRARY UNITS, ARBITRARY UNITS
##FACTOR=    0.368581032318806, 1,           1
##FIRST=     11203.0474431902, 0,            0
##LAST=      -874.247242800138, 0,           0
##MIN=       -874.247242800138, -4529990,    0
##MAX=       11203.0474431902, 377765308,    0
$$ Real data points
##PAGE= N=1
##DATA TABLE= (X++(R..R)), XYDATA
$$ [...]
10892 -2180603 -2141544 -1466501 -710533 -964193 -1688364 -1982512 -1598637 -1448058 -815330 620850
10882 620850 1790018 1588399 229215 -372189 -935989 -1095845 -499927 -104680 -465055
10873 -465055 -844947 -429553 770280 862125 -527214 -2135642 -2506932 -1724450 -637814
10864 -637814 653828 846691 280224 -88975 -369187 -627970 -1113075 -1189520 -51863
10855 -51863 937531 852550 550660 986493 1014605 1231395 1532878 1654820 1632023 1158096
10845 1158096 85308 -358169 -381868 -1312078 -1339152 -871856 -464694 -402509 39964 493448
10835 493448 476118 82819 -197187 -56507 -486880 -829515 -531561 -526876 -756567 -778506
10825 -778506 -936903 -1088185 -852559 -151085 755640 964370 994997 927615 703777 779929
10815 779929 883540 339073 -69832 -110336 57176 310030 -36533 -831812 -1646606 -1839619
10805 -1839619 -2250088 -2453791 -2281109 -1207265 88165 -589979 -1349151 -1313454 -483944
10796 -483944 -18019 33936 -159362 -484692 -683786 -965054 -1321393 -1464755 -1655677 -1870779
10786 -1870779 -1528988 -491349 454233 728733 1072016 693404 273271 184316 -57127
10777 -57127 -481673 -736190 -1005698 -881016 -268815 -508537 -1517386 -1820732 -1785430 -1997495
10767 -1997495 -1147804 -277045 428937 1574883 2432042 2911826 3006334 3270702 2965035
10758 2965035 1699680 453630 303738 619098 463450 354276 806099 660885 488719
10749 488719 135738 115513 864780 1224175 1597242 1654567 2122986 2355092 1506819 1148887
10739 1148887 905766 608206 736759 691546 633866 763152 1260323 1205012 406571 458132
10729 458132 426565 78472 -233362 27522 725086 1384539 1846816 1085137 104836 -433507
10719 -433507 -412413 -13843 471973 885606 824935 733012 737616 907649 704406 -25878
10709 -25878 -1031430 -1073936 -1114233 -1272301 -526836 361339 861165 485776 408050 787679
10699 787679 1576256 1631559 437850 -293241 -150453 -471986 -514325 -10698 431810 -116261
10689 -116261 -528320 -296507 440720 635825 310937 396519 722926 1154666 1495386 1446907
10679 1446907 1438456 1992412 2074656 1027949 -221891 -614377 -30986 511117 -542814
10670 -542814 -1044183 -137089 369825 421135 174678 1182454 1867574 988068 -181589
10661 -181589 -1176675 -2033145 -1575222 -305828 530833 1013934 1016836 979614 425782 297145
10651 297145 913695 1042941 1051269 528945 394119 842759 1547293 2172651 1964451 952284
10641 952284 -85322 -633816 -1522599 -1983376 -1606059 -1425522 -1028422 75975 1098343
10632 1098343 1239661 285367 -354812 -268787 69854 -61751 -283731 -436075 -722236 -732967
10622 -732967 -712203 -1251833 -1177078 -219287 818138 1227076 1402607 518604 -360032 128354
10612 128354 719990 848340 866729 463884 -427405 -748651 -382699 -155571 438466 1251145
10602 1251145 2019265 1912090 1637040 1249757 490723 324735 232168 -214132 -231716 402502
10592 402502 169567 -743412 -901471 -1019108 -1494936 -1712918 -1472266 -1398095 -1760334 -948767
10582 -948767 -648840 -1694360 -2756682 -2960812 -2035470 -949452 -482126 -381351 156839
10573 156839 679339 312376 -33282 335919 206351 -239173 -525566 299835 613665 113155
10563 113155 -441993 -517576 -467074 -504617 -158594 597709 602258 461443 468463 457828 944465
10552 944465 1674540 2013391 1690369 1518336 1553346 398437 -775424 -729787 -347036 -198287
10542 -198287 -421120 -281381 124430 482287 571683 664494 867669 1306768 1659043 1177227
10532 1177227 20736 -343248 109559 583939 456490 -269826 -864721 -1248980 -883221
10523 -883221 -832815 -524073 -415302 -533618 -1115509 -1632447 -1136985 -253178 538014 1233737
10513 1233737 1122539 411010 39390 18809 -458102 -448188 433143 1189797 1267321 880728
10503 880728 826253 1786024 2693980 2371252 1812091 1234780 858457 1117795 848285 513451
10493 513451 977679 724194 590448 282052 140990 846291 1641831 1688446 1635297 1921214
10483 1921214 1212954 516567 537476 379798 -391489 -1070421 -1031229 -644641 21151 189811
10473 189811 594737 1398491 1409759 1178011 1208925 1499608 1559987 596008 197290 647968
10463 647968 1015370 909674 762619 423982 25849 356672 1058533 1407936 2087354 2845897
10453 2845897 3532055 3699097 3097623 2285141 1228817 668737 1131990 1643537 1103248
10444 1103248 -754462 -1116172 -676648 -558079 -769084 -288440 750036 1066307 196824
10435 196824 -918477 -1104219 -453184 262199 767605 1298836 2254074 2931074 2455606
10426 2455606 1736165 1758559 2219794 2512063 1950214 1093551 1507286 2218568 2246984 1583609
10416 1583609 1200814 1142248 1640302 1826363 1265415 1325250 1405015 1083447 170106 -338856
10406 -338856 -1283799 -1411211 -514859 -195862 693092 1334198 1661737 1817803 1905013 2124589
10396 2124589 2199684 2414529 2083668 1424351 1585425 2415006 2195155 467856 -1656614
10387 -1656614 -2788088 -2257814 -1151064 -328097 -364702 87806 696364 372913 -241259
10378 -241259 -181747 664643 1577136 2569721 3642866 3901128 3601191 3166828 2886817 3099992
10368 3099992 3296053 3005945 2104475 1270714 1051096 485979 222862 289475 908954 1394440
10358 1394440 1698529 2121299 2436187 2345291 2031202 1880405 1835498 2457305 2462650 1495778
10348 1495778 973613 610425 694872 963028 1041835 965314 669866 548872 1350070 2049081
10338 2049081 2479453 2911389 3050042 3346641 3669182 3628332 3593560 3678485 3886045 4403587
10328 4403587 4364489 4108613 4175135 4016466 3584225 3439474 3396637 2930786 2202968 1612193
10318 1612193 1731858 2301545 2532761 2716308 2446303 3242341 4057122 4415028 4439134 4834061
10308 4834061 5052126 5212052 6016577 6286036 6302798 6747810 7782024 9055610 9878454
10299 9878454 10221994 11040719 12202406 13068792 13691779 13904984 14276271 15241583 15777958
10290 15777958 16709527 18185909 19996691 21812575 23346769 24915816 26743975 29235874
10282 29235874 31588346 34933649 39070453 42165840 44298760 46262880 47368267 48256024
10274 48256024 49478303 49913105 48662871 45752796 42826040 40087540 36883721 34069439
10266 34069439 32141854 30150466 28356833 26065736 23352514 21055025 18969703 17077012
10258 17077012 15931801 15032738 13755573 12222855 11485955 10869259 10401890 9523327 8195095
10249 8195095 7560797 7078530 6351679 5683259 5708990 6070584 5726401 5300423 4915288 4235754
10239 4235754 2690903 1440854 1078906 1673563 2985528 3524310 3638228 3533204 2957604
10230 2957604 2882972 3442182 2792699 2571589 2924378 3200370 3144747 3226407 3157295 2728310
10220 2728310 2782814 3941208 4400121 4078568 3102284 2793462 2957581 2306313 1703224
10211 1703224 1364691 830037 723317 1093539 1327986 1800690 2120115 1819539 1427982
10202 1427982 1449870 1859265 2057216 2208876 1970686 1217425 902792 514831 1183615 1706376
10192 1706376 1579867 1735039 1436833 821646 866000 902583 896474 819730 1040538 1362807
10182 1362807 1013008 1158990 1170366 849421 601315 39578 -380157 -85745 205834 110850
10172 110850 248770 659727 943289 571091 367973 324760 -179455 -176341 545975 1204924
10162 1204924 1659226 1470961 1590295 1469378 975324 236415 543626 183807 -745044
10153 -745044 -812542 -775262 -317394 188647 873984 904639 297466 -1084915 -1471526 -734123
10143 -734123 -341616 -470561 -464601 -230030 357674 501212 608785 538788 -105063 -60333
10133 -60333 806336 857478 1247469 1865569 1965973 1748149 1736198 1813843 1147006 1285766
10123 1285766 2573678 2681604 1934650 1602190 1362973 1246831 2112526 2047302 1497862
10114 1497862 978564 280556 11543 751595 1051200 763762 39216 -409006 236795
10105 236795 818619 1291613 1386599 762619 372168 730787 884362 1095642 1755612 3329527
10095 3329527 4693089 5183845 4932403 4166733 3246061 2929369 3712353 4859995 4664929
10086 4664929 4633645 4215987 2712775 1289550 957013 556385 292991 261764 529021
10077 529021 616145 1190756 1724884 1744617 1259302 778654 1479706 2438763 3250393 4342182
10067 4342182 4780292 4481370 4070878 3683917 3054325 2760618 2900437 3007464 2417423
10058 2417423 1952325 2734967 2938746 3449677 3743904 3221002 3068879 3570182 4204515
10049 4204515 5505929 6725486 7148074 6595423 5795732 5609576 5870742 6256678 6445421
10040 6445421 6772134 6586483 6373404 6880185 7609711 8930284 9987738 10328096 11076877
10031 11076877 13226665 15238552 16116747 16487990 17226260 18854284 21435440 24300435
10023 24300435 25930457 27577137 30091816 33243790 36016368 38640592 41083777 42922095
10015 42922095 44613774 46242248 46768234 46665291 46344888 46038389 45159169 42823285 39531682
10006 39531682 36864431 33450735 29778639 26833214 24717328 23209153 21345474 20161540
9998 20161540 19313414 18224736 16850904 15520014 14210930 12430214 10867673 8900526
9990 8900526 6792714 5356507 4797845 5248174 5520734 5209634 4938541 4660948 4462449
9981 4462449 4202590 3589766 3004666 3221022 4012941 3769917 3344752 4217336 5485228
9972 5485228 5660979 5091863 4706016 4135540 3065965 2939534 2450359 925774 265921
9963 265921 137055 598771 1529769 2153725 1784405 1732624 1937477 1619131 2183964 3158164
9953 3158164 3400898 3328311 3229318 3503770 3322758 2315861 1455513 1338181 1106396 604364
9943 604364 10426 -67022 103769 399370 736743 950802 1131225 1798470 2712142 2831289
9933 2831289 2144148 1434638 1290119 1085712 218238 -767946 -1777004 -1836933 -1154946 -1171464
9923 -1171464 -1621100 -1004845 210151 1049502 1020194 423640 -92430 -212263 -255205 -258968
9913 -258968 -254044 -236865 -288083 -1162188 -2000361 -2210784 -1800486 -1422956 -753903 -395026
9903 -395026 419229 1566010 1729361 1313157 1437504 1743546 1488686 1110618 1631263 1443585
9893 1443585 339957 -858840 -1152930 -690486 393011 1364800 1241229 906041 104709
9884 104709 -533371 31448 424576 237131 323325 473071 86956 52721 272317 35303
9874 35303 385558 -211398 -1100677 -567940 -34720 -403492 -854786 -399738 293932 644438
9864 644438 1045571 271799 -312164 632192 975992 -11578 -893244 -1189506 -1058162 -679156
9854 -679156 -184913 505956 820770 987890 1358451 1150175 794995 555044 479426 610130
9844 610130 536915 289242 -12829 -328168 -475257 -304448 -322186 -88918 -52583 -54677 -1007936
9833 -1007936 -1765140 -2151515 -2006806 -1539482 -927162 -504507 -874883 -1232529 -808477 216964
9823 216964 236550 -862081 -816695 -418998 -921605 -1202572 -723980 -224547 225609 76656
9813 76656 -725824 -1183596 -1396833 -998503 -49065 1124007 1437726 823417 170270 59435
9803 59435 -452781 -758705 -271333 -164855 207690 422408 574867 957259 1235816 1261196
9793 1261196 806975 134495 -65635 225988 297952 -172411 -646839 -1059204 -584101 335029
9783 335029 833076 1796536 2053465 1454487 1155082 483770 -33251 -500550 -767690 -1235178
9773 -1235178 -862520 364100 431381 -199026 -102355 -397030 -138606 498870 213966 -69387
9763 -69387 -445414 -810812 -947513 -892773 -1109206 -1409026 -2180239 -2156257 -785378 -192037
9753 -192037 -295626 -241476 -3751 530104 889781 696280 -250315 -955522 -740778 -862655
9743 -862655 -690704 104593 824254 1129798 1244188 1264730 842446 644433 -7148 145581
9733 145581 777898 -181406 -1273621 -979612 -676982 -721639 -1346783 -2142769 -2459790 -2457750
9723 -2457750 -2192648 -2155031 -1377643 -586004 205109 838663 364226 -521492 -1128752 -2130363
9713 -2130363 -2177287 -1313599 -794038 -303537 255190 843534 1529764 1338111 1296550 1064859
9703 1064859 47208 -1510431 -1716827 -1097677 -452822 307491 45735 -694450 -1189291
9694 -1189291 -1166787 -1000182 -205990 154364 -168033 -574727 -1322783 -1974874 -1656660 -1610759
9684 -1610759 -2041164 -1761693 -1403020 -1647060 -1581344 -1733720 -2450182 -2439821 -1744960 -1780529
9674 -1780529 -2019616 -1767074 -1562400 -838895 -75471 791225 1438152 540557 -552983
9665 -552983 -781974 -328350 62278 -98188 -663890 -523447 -289534 -202569 -273881 -103641
9655 -103641 384848 1367421 1986673 921518 40443 289391 429968 317188 445320 611182
9645 611182 736099 414656 -533199 -597235 -322411 321010 1016046 941225 120024 -837194
9635 -837194 -222334 991815 1438458 1583507 1722103 1083641 -162929 -666607 -618698 -250934
9625 -250934 -405310 -884015 -631936 -291577 -638870 -522976 576708 1549220 2170782 1890594
9615 1890594 1353802 -107368 -763643 -776706 -402739 -415379 -912577 -459695 -74361 -284871
9605 -284871 -1608662 -2032914 -1512444 -1115052 -798348 -490553 -322661 554217 1239045 2063483
9595 2063483 2342866 2590058 2126916 1371324 1724289 1506999 815400 170421 86845 381501
9585 381501 234395 929741 1652721 1696071 1571830 862740 277784 369172 -149014 -987805
9575 -987805 -1350422 -1186995 -1294222 -962346 -373968 427831 932600 -621083 -1496381 -748937
9565 -748937 137782 145359 -919614 -1221927 -922128 -7193 824240 1549139 2356669 2998767
9555 2998767 2945311 2705336 2676642 2537773 1640235 -103873 -1250947 -1200375 -995184 -888888
9545 -888888 -527691 146442 332894 68661 -300518 -900053 -1064535 -225405 298451 -698281
9535 -698281 -2036562 -3248061 -3251099 -2669351 -2555357 -2199571 -1838087 -1490557 -1035547 -717765
9525 -717765 -1033546 -1574770 -1976141 -1583954 -384857 443336 200650 -487032 -674923 -948636
9515 -948636 -1211820 -1644708 -1820272 -1453400 -730248 167254 623725 943933 353493 -235943
9505 -235943 -938942 -1066705 -692879 -873522 -1526926 -1686562 -1127582 -631671 30690 564068
9495 564068 604430 678843 569042 99519 181914 228137 411019 508984 1028841 1591874 1262006
9484 1262006 5498 -782197 -1108540 -832356 -332390 -112893 -95022 -311386 -348235 -320996
9474 -320996 -737239 -235295 743552 1257386 1632345 1589486 675437 -461205 -1189235 -1183048
9464 -1183048 -983511 -1143735 -1204398 -1454944 -2107347 -2086507 -1312107 -538398 -126047 -59530
9454 -59530 46363 5170 -289434 -550495 -907295 -1273873 -509384 1151045 833782 -92240
9444 -92240 -997329 -879944 -658477 -1393118 -2328134 -2428146 -2112363 -2277968 -1943104 -1449219
9434 -1449219 -1850813 -2207620 -1730301 -922873 994 584375 248520 -128351 -87881 344853
9424 344853 -250986 -996489 -987698 -331811 247492 299815 -43052 218250 718108 99854
9414 99854 -931082 -1850792 -1763656 -1391228 -1176132 -1379714 -1444193 -1171461 -14712 717621
9404 717621 609830 668535 692497 519755 725554 138591 -412486 -188674 615336 1644330
9394 1644330 2304900 2343267 1503879 696979 76518 -638648 -312323 806566 1219522 1195620
9384 1195620 1089567 1089899 822554 519191 254669 373261 986044 1579963 1325847 792179
9374 792179 920395 1108354 377233 -513143 -1293755 -1299583 -628220 -548869 -853977 -941959
9364 -941959 -813943 -519236 361492 696508 -102722 -836397 -1089471 -772695 -316671 -450475
9354 -450475 12431 591618 726785 717803 423085 327167 371557 881798 1470151 1530610 1176153
9343 1176153 1178804 1119805 1131586 727059 251870 512320 100207 -222327 -540116 -719341
9333 -719341 -1486350 -1831557 -1748876 -1012837 815480 1761796 1922541 1755459 1441965 1432718
9323 1432718 1602461 1215114 509018 41922 -90818 1046639 1813176 267210 -1398233
9314 -1398233 -1613644 -1244035 -179512 380584 -149453 -427494 -107183 -12598 -557107 -948652
9304 -948652 -881363 -341444 178087 573833 738276 380587 216147 636184 679171 399260
9294 399260 1125452 1486391 860243 902121 695030 16131 -343293 -127079 135032 109712
9284 109712 -65777 -386267 -1429365 -1416746 -492251 -297049 -481879 -603105 -664774 -37303
9274 -37303 586637 269723 556278 1246787 1485544 1977168 3053190 3373393 3019300 1864553
9264 1864553 912910 247251 217929 212670 211661 761151 888901 384175 83844 293080
9254 293080 223312 -72337 -377231 -779961 -259611 183110 -355369 -1181289 -947274 -493158
9244 -493158 -990142 -1530714 -1699949 -1023091 -881039 -754258 -349293 -269098 -172771 -306621
9234 -306621 85725 257940 -254280 -897837 -400379 668269 1522544 1711498 778617 59620
9224 59620 -541913 -1110792 -894969 -705675 -1151151 -1056717 -657003 -588040 -798177 -956105
9214 -956105 -591536 -259889 -506263 -486232 -1099350 -1952641 -2083637 -1227168 -904831 -980966
9204 -980966 -533840 -52224 -313512 -662440 123788 906737 1190739 898064 494383 -278619
9194 -278619 -334807 411286 31331 -603750 -536164 -153295 -743191 -1577290 -1999025 -2398063
9184 -2398063 -2764128 -2868711 -1978163 -411033 -14063 -445606 -678222 -1254714 -1402219
9175 -1402219 -799467 -1447086 -1493752 -609544 -218971 337927 86463 -882034 -1121516 -1251169
9165 -1251169 -1073657 -810808 -1431914 -1253411 -105174 310775 -506779 -1139932 -1660079
9156 -1660079 -2294346 -2389680 -1928172 -1420335 -209775 576189 366825 369361 218639 693269
9146 693269 1253887 1116744 1272185 1295083 870553 989004 1643432 2314545 2742009 1848804
9136 1848804 267929 -877020 -1362407 -1703027 -1767731 -1877494 -2362603 -1680299 -324804
9127 -324804 246792 327662 836346 1178910 857931 856360 670471 -172625 -900469 -1246225
9117 -1246225 -162241 -26973 -782759 -1376116 -1722165 -1584413 -1509628 -1022958 -245954 106231
9107 106231 -517685 -769381 -363993 366486 840865 1394966 1390412 1203546 896435 -449171
9097 -449171 -1049533 -376040 152874 -87364 -160912 448618 852930 508075 -131863 -373276
9087 -373276 -474222 57288 641149 740426 451931 327110 128368 233876 705196 -204345
9077 -204345 -925589 -787909 -142027 -111208 -1350524 -2343687 -2479007 -2186744 -941536 14795
9067 14795 401313 1012051 1313136 241422 -596273 -542947 -834759 -1325617 -1460849 -1104327
9057 -1104327 -909979 -895710 -960103 -187144 593809 227578 -283767 -535255 -480136 -278462
9047 -278462 -141746 47704 238554 -125464 -362950 -195210 45212 312372 415956 907638
9037 907638 1208151 1793912 2301015 2202956 1183778 211796 -184603 -475429 -925700 -41198
9027 -41198 1240213 1748896 2280677 2339608 2518137 2305843 1162187 1081525 1104611 200557
9017 200557 -361270 -465228 -453140 -1232330 -2392389 -2669563 -1823327 -1427063 -1170029 -47905
9007 -47905 1119731 1410254 1921987 2065479 1331846 674924 -78634 -479128 128038 997689
8997 997689 1133476 360392 -390571 -95445 279338 -235679 -549204 -12109 228090 531630
8987 531630 290212 411535 1041568 1413792 1263626 1042668 732861 835593 261109 -525493
8977 -525493 -456087 405841 845936 675757 638387 297120 575542 1108758 1861101 2831599
8967 2831599 3079401 1977148 763085 549421 620030 685537 1005169 1598113 2352685 2189138
8957 2189138 779780 -355473 -99763 680875 824735 612243 302071 -225888 -713025
8948 -713025 -1076996 -818627 -29159 170319 -232350 -137174 472899 1224026 972442 37404
8938 37404 794118 1590607 1133456 1078219 1125587 1514770 1477354 871265 -183434 -98056
8928 -98056 284011 270117 250181 -43125 -169769 142915 681226 240168 -244764 -109899
8918 -109899 652509 1066517 1131155 1278333 642723 -517852 -1185465 -756887 -80840 1047942
8908 1047942 1333662 1010142 1065249 1068571 1365575 1688274 1255519 449428 -60308 -150371
8898 -150371 217970 874208 1286513 441121 -266948 -103482 111456 621526 1091892 1052018
8888 1052018 1196053 2278652 1861968 586123 697377 1066821 532809 508204 568340 918323
8878 918323 1145072 1289188 1213585 496348 793120 1547019 1932421 1517788 890782 1054641
8868 1054641 1765432 1852404 2926748 3889455 4461592 3879033 3419616 3526744 4059390 4269826
8858 4269826 4053067 4496949 4874618 5788416 6548270 5571969 4980876 4864322 4995293 5050561
8848 5050561 5427831 5184873 5016501 5292368 5912851 7053794 7974051 8558039 9866603
8839 9866603 10411711 10481332 11979292 14182982 16313415 18061650 20525444 23792217 28835175
8830 28835175 34422658 41542137 51505893 64721534 82400647 106729752 137523107 165027291
8822 165027291 175171759 163885205 141223791 118868666 102012999 91576594 86509079
8815 86509079 86505640 90620259 99216332 113828219 133795070 157017592 174647611 173409300
8807 173409300 151917743 122199572 96067469 74801262 57896443 45508776 36510213
8800 36510213 29807899 24490303 21014193 17917637 14685971 12154901 10471063 9863832
8792 9863832 9364645 8901798 8437374 7542518 5990948 4913621 4905410 4074636 3658772 3827713
8782 3827713 3543973 3275524 2970104 2522495 2180072 2028098 1900721 1439155 983673 179603
8772 179603 -340533 129014 1291429 2253585 2857385 2783617 2252876 1708295 1623110 2319070
8762 2319070 2471354 2281416 938954 231271 396874 884508 1352907 1286449 641572 -568
8752 -568 -648711 -601797 -450819 -637105 -673415 -1250586 -1215698 -632261 -870345 -390133 953666
8741 953666 744378 -744330 -863790 -7046 904705 1299039 858908 778939 544971 226844
8731 226844 196003 -271691 456139 1248625 1089007 1198387 2158933 2333293 1578500 624984
8721 624984 -75339 178798 875556 598332 -60881 -602024 -425185 -84672 49629 -78980
8711 -78980 -330396 -826703 -578859 79330 54349 -592946 -1022041 -472464 541719 709160
8701 709160 229659 -37007 -485200 -1040996 -639761 -296619 -1271692 -1851096 -1469304 -561680
8691 -561680 366278 577491 829138 41067 -1232563 -1394370 -605523 62190 27534 -350884
8681 -350884 -819712 -602427 -805689 -1026171 -1225000 -1106102 -860880 -816327 -780574 -666279
8671 -666279 -1250985 -1432922 -1033626 -1403719 -1021346 -381869 -497466 -917136 -924581 -207811
8661 -207811 416506 47180 -226197 120725 212936 136920 -222726 -62505 409065 463036
8651 463036 330918 447041 99876 -1010217 -1463466 -1051722 -245906 -170100 -896995 -701939
8641 -701939 -886078 -976521 -687853 -1000667 -1410503 -1124866 -322570 -409584 -189058 241263
8631 241263 -184243 -633766 -975258 -1602124 -1693152 -1213295 -1521668 -2381839 -2044472 -722045
8621 -722045 -83179 6714 -172426 -768171 -1629701 -2371113 -2364899 -1223611 -771804 -1551560
8611 -1551560 -2642645 -3079471 -2675733 -1001968 226355 -27402 -1016958 -817822 -97297
8602 -97297 -127621 -651828 -767081 -387686 -26357 464258 524126 315279 351904 -178184
8592 -178184 -1062081 -963973 -1094384 -1222293 -747895 -433360 155353 1561088 2326623 1982389
8582 1982389 1615733 813904 -183114 -1082062 -999437 -1056404 -1081909 -1181722 -777394 -62058
8572 -62058 607853 729452 1035078 1557406 2004068 2209856 1425731 1607175 2450769 2443633
8562 2443633 2376370 3007525 3293231 2210524 769152 19226 -169107 563566 1468236
8553 1468236 1666725 1162240 211562 -701132 -381725 499754 666410 202026 -159961 258607
8543 258607 668049 423587 263290 -88896 217558 994741 1407220 2035575 1554656 975035
8533 975035 812656 433111 27653 -537255 -1101387 -1152547 -1770385 -1490134 -604270 -182593
8523 -182593 -282795 -365578 -871125 -1476826 -806702 32557 1140897 1508310 1129187 980222
8513 980222 1710591 2543953 3001338 3012446 2515997 1662046 528602 -288754 -492973 -302003
8503 -302003 -35402 -147268 -340339 -1221858 -1973594 -1517765 -838974 -569857 -192488 -491849
8493 -491849 -870399 -1036128 -1700243 -2150739 -1627309 -956499 -649997 -230612 38120 -49556
8483 -49556 -10600 -277091 -1317215 -2204518 -1753680 -1018004 -1790429 -2198090 -1929636 -1110345
8473 -1110345 -20046 236955 -143870 -323324 -334149 -621272 -832628 -602672 -289983 -422558
8463 -422558 -538414 -356800 -452338 -900310 -1063859 -1047886 -1087968 -973460 -508091 -75963
8453 -75963 -191458 -226441 -79430 81266 323318 -690444 -1459244 -2131366 -1983547 -1735482
8443 -1735482 -1850923 -1587260 -1777298 -2025412 -2792577 -3185454 -2857484 -2059762 -801667
8434 -801667 156979 1015944 1980131 1719090 934012 611204 624778 95868 64096 388522
8424 388522 -637523 -2026078 -1904866 -1019635 -672112 -702340 -396015 -114330 -529347 -621161
8414 -621161 109017 175049 230565 572608 1215713 1381921 1174708 739700 537461 182479
8404 182479 53861 94268 -601874 -1761857 -2125295 -1343671 -870399 -332948 350593 624233
8394 624233 193418 204135 -138245 169895 1193088 1525317 816732 302649 308267 240680
8384 240680 -486954 -762115 -517197 -1181 256626 -436604 -827366 -1490181 -2091379 -1766525
8374 -1766525 -1140040 -183319 155088 329481 88141 -319842 100766 314927 481467 145635
8364 145635 -335337 450255 1587697 1736500 894610 -218279 -527091 -337137 -728301
8355 -728301 -1027878 -768270 -235000 983146 1649845 1336142 793714 -374503 -97172
8346 -97172 621820 240144 -154543 -490703 -484650 133096 -322957 -1307554 -1870552 -1884893
8336 -1884893 -682911 -38256 78332 737144 1245963 1520930 1804575 1091209 615900
8327 615900 493058 -14293 -78183 185706 650710 1097711 1490938 928888 -260080 -405172
8317 -405172 161383 523376 671378 1397577 1856382 1538123 1572606 991298 548742 33579
8307 33579 -892807 -1712717 -1793666 -1327559 -1165179 -497562 -833499 -987881 232164 1369265
8297 1369265 1484146 1417919 1504785 457200 -448432 -771927 -1276612 -1507459 -1504452 -1869777
8287 -1869777 -1306243 -605849 -918714 -653495 51868 474256 135649 -647305 -1182971 -1409127
8277 -1409127 -1121932 -481096 -434814 -441332 -169330 -507935 -832272 -671588 -590687 -843241
8267 -843241 -1619485 -2742603 -2606783 -1564941 -820305 -628291 -867893 -1741718 -2403394
8258 -2403394 -2622583 -2052296 -447640 1140776 1726563 2000925 1839598 762780 -115357
8249 -115357 -1237562 -1943165 -1296316 -434280 412618 1049304 736842 274197 -959414
8240 -959414 -1951452 -1861403 -1695920 -2286558 -2947723 -2350198 -1215199 -493975 -447376 -1025487
8230 -1025487 -873566 -484054 -464547 -73395 -475862 -788853 -392740 196098 -16848 -497902
8220 -497902 -751029 -607159 -937568 -964443 -810467 -1037137 -832631 -1269010 -2502618 -3044300
8210 -3044300 -2060025 -761024 -447893 -547118 -227178 212161 581886 1638067 2442734
8201 2442734 2502216 2872254 2421498 1946344 1841709 1123815 376574 262237 982233 1019169
8191 1019169 467917 -169910 -647465 -1165460 -786434 463982 1612998 2927303 3458090
8182 3458090 3244358 3060903 2716860 1920012 304265 -1025658 -684479 610869 1775543
8173 1775543 2170026 2253761 1529969 72834 -710241 -516346 -925086 -762591 -799444 -340766
8163 -340766 538511 578146 725856 744343 279055 468840 1261475 990434 781157 541390
8153 541390 -417511 -854332 -794531 -1150224 -1195447 -1538454 -1622869 -831807 -270477 -513009
8143 -513009 -1007357 -233222 1366419 1930903 1311787 823297 633166 282166 -253229 -69737
8133 -69737 596635 804175 984681 1731586 1953999 1569442 1036482 1042223 775614 344211
8123 344211 -75800 -464809 -1126546 -1829725 -1509909 -1387215 -1272068 -997079 -389046 694500
8113 694500 1345911 1423916 1686926 1525585 698339 -51109 -1124963 -1946364 -1381155 -269336
8103 -269336 501441 738405 296359 -321068 -601168 641600 2012648 1260009 -373235
8094 -373235 -515758 -201919 533743 1529660 1768562 1927186 1873605 1524124 1120920 112815
8084 112815 -613164 -582394 -776736 -731099 -208736 169042 -221221 -739356 36024 916081
8074 916081 959051 324691 -931093 -1955411 -2160850 -1635485 -1179385 -1563310 -1305597 -724587
8064 -724587 -398291 117763 -73300 -838305 -633018 -296049 -530207 -1791638 -2450903 -2620566
8054 -2620566 -2512330 -1724371 -1236597 -678935 -622190 -561409 -90246 4454 -279083 302448
8044 302448 584806 1109218 1241539 1698049 2202049 2190371 2061070 1109663 -146323 -1027345
8034 -1027345 -1137865 -792963 552483 917588 43453 244453 955560 556030 69377
8025 69377 534535 505514 379379 966136 975040 413861 219176 820800 1560732 1751064
8015 1751064 1187609 477909 473831 821104 1228723 1092046 578204 237162 266239 262153
8005 262153 29850 363770 694221 453935 723706 932586 687445 505795 -178324 -442164
7995 -442164 236563 690524 220289 -476569 -938191 -1512907 -1745380 -2059497 -1910029 -1534793
7985 -1534793 -1388519 -318944 743112 1376161 1105557 280447 -647170 -1170162 -1302200
7976 -1302200 -838616 -44392 431008 231858 455233 595093 623254 534457 -172602 -443853
7966 -443853 -217245 -216247 -221190 -32479 -227887 -106372 -45218 -54741 -731164 -1512060 -1502862
7955 -1502862 -644232 438188 854680 813317 326669 -1108930 -2049558 -1176597 -224900
7946 -224900 -100028 -582722 -699284 -46103 483223 792198 654683 703779 573572 -243186
7936 -243186 -1183752 -1310316 -1131793 -553997 -124800 132603 -228254 -449953 -281642 -879564
7926 -879564 -1076696 -1171633 -886992 -189040 548826 1292718 1318111 1257977 1144081 376772
7916 376772 -228999 -115911 44972 -1033319 -2094830 -2294361 -1688715 -1713833 -1625924 -1039329
7906 -1039329 1646 505676 118888 -625025 -715089 -9307 132010 209832 -81055 -752781
7896 -752781 -755075 396478 855226 1341692 2201262 2173696 955510 253232 23677 -428778
7886 -428778 -138474 627325 900792 371019 -466280 -473565 -633013 -868936 -330924 120864
7876 120864 -351189 -1132566 -1273232 -934983 -543443 -288933 -268198 -32132 -78174 -581112
7866 -581112 -1257653 -1237645 -492108 -271701 -1152095 -1582184 -1525389 -1509223 -1726726 -1870044
7856 -1870044 -1675747 -1710885 -2274557 -2027778 -1704226 -1115661 -502317 -781581 -539019 -687036
7846 -687036 -876758 -1278630 -1551552 -1864667 -2456579 -2870213 -2995008 -2603458 -1748120 -1346933
7836 -1346933 -1505953 -1709500 -1335497 -160818 628809 1225841 1335480 1559841 1702554
7827 1702554 803618 326075 326654 56776 329572 625021 1054891 1564475 1638113 1327455
7817 1327455 213380 -620190 -1047672 -1623234 -2229500 -2714185 -3192932 -3004539 -1815943
7808 -1815943 -1211419 -669780 -60607 -918 -211579 -983073 -1480006 -1872688 -2052538 -1430666
7798 -1430666 -332394 299846 -64809 -664946 -569833 -153309 -322449 -409816 -102882 134547
7788 134547 37995 454099 979019 259800 -934125 -1906575 -2107105 -2100865 -2060994 -1881236
7778 -1881236 -1179026 -8627 1470555 2333792 2380758 2596288 2708521 2351462 1576806
7769 1576806 343751 8665 -19762 -913921 -1582973 -1250344 -506498 391127 1581248
7760 1581248 2726785 2850700 1378185 611533 684897 261777 -263983 -658092 -588074 -638937
7750 -638937 -1259072 -1360938 -1047182 -553232 -483464 -598114 411172 1021372 910618 708662
7740 708662 1012257 1491753 1239877 951069 1148490 1331761 1232751 1084869 407267 -225811
7730 -225811 -610306 -733809 -934014 -1517180 -1453169 -769599 -42514 -166491 -752627 -1278864
7720 -1278864 -1609569 -1148173 -367943 414052 79683 -467022 -706712 -876211 72701 1189447
7710 1189447 1823952 1788879 1117986 470488 -5427 -701690 -1553291 -2124704 -1536687 -488365
7700 -488365 -442251 -791402 -1053100 -231494 311448 -1409263 -3307066 -3335453 -2544962 -2230403
7690 -2230403 -899355 569633 259019 -868797 -2019052 -1794416 -1098226 -1104211 -1489250
7681 -1489250 -1576441 -986698 -58453 574327 1207818 1970456 2010146 734360 -326991 -1257442
7671 -1257442 -1482772 -983756 -820531 -830646 -1020452 -579870 228230 710226 624014 210928
7661 210928 480956 1265239 1516245 1430307 1185695 1613649 2141065 2288512 2151522 2232365
7651 2232365 2819063 2740276 2414051 2647852 2556248 2085156 974662 226536 694470 754130
7641 754130 491330 -74699 -627541 -587315 -484925 -320103 34158 1099907 1164128 657629
7631 657629 798147 1080232 662423 26168 86555 212720 638902 1096154 1188940 637118
7621 637118 73249 -640051 -929306 -916611 -710119 -747867 -1242802 -1308537 -1363062 -1735367
7611 -1735367 -1555015 -203301 578920 932619 1418588 1307158 987675 779533 946642
7602 946642 716177 127554 -407663 -1724917 -2736444 -2590866 -2250012 -1729706 -1202644
7593 -1202644 -1347059 -1032195 -625955 -382381 -357843 -859966 -1621048 -1882368 -1715282 -723070
7583 -723070 -35077 43145 840463 1217868 378985 -157768 -424284 -424116 -20454 -715756
7573 -715756 -1611057 -1396322 -719383 -1134375 -1521068 -1231863 -1796376 -3008729 -3050119 -1804480
7563 -1804480 -592384 443636 753438 758932 786522 1355898 1585058 1536917 2198537 1857725
7553 1857725 835901 306423 431990 745742 1522169 2764210 3316440 3229836 2758337
7544 2758337 1381296 364184 -78984 -401307 -186225 -261556 127410 1387602 1357064
7535 1357064 771746 460853 256142 311672 287424 25890 -69547 27126 -666271 -1540529
7525 -1540529 -1213565 -18688 694755 548704 759322 568051 980107 1799876 1796625 1877644
7515 1877644 1202161 396194 230477 224131 363934 432462 -55319 -312086 364072 809658
7505 809658 837756 384800 -180085 -607390 -1037353 -1165212 -1228787 -1493830 -1630859 -1199822
7495 -1199822 -907067 -474198 26739 875851 1342759 153149 -655473 -543633 -788905
7486 -788905 -1041567 -1100144 -614781 -698778 -1319775 -2230640 -2406642 -1685618 -874499 -346913
7476 -346913 434361 901651 1021103 1310536 1205776 745063 913839 859754 773998 784156
7466 784156 493924 732494 994340 463726 356395 353385 -25730 -380798 515323 1249355
7456 1249355 1250583 1069055 865649 1613180 1649649 1270756 391690 -1312231 -2420355 -2491290
7446 -2491290 -2666075 -3048766 -2965314 -2126764 -675271 673783 1080306 986177 585374 218481
7436 218481 36415 -436584 -1191633 -2001198 -1774611 -1033514 -660911 -325136 -385949 -838657
7426 -838657 -1287832 -1026008 -896167 -1210491 -1534419 -1514520 -1425452 -1587714 -1681735 -1093003
7416 -1093003 -587470 -722668 -606692 522451 753240 19538 -558372 -1277405 -1746310
7407 -1746310 -1708408 -794884 297622 739089 679797 219886 -573583 -1184803 -513505 565917
7397 565917 689047 1143216 1775011 1093116 -388737 -1487478 -2254095 -2723391 -2528140
7388 -2528140 -2318977 -2147013 -1817685 -1481216 -639480 1009999 1621277 1287298 1387641
7379 1387641 869283 300877 606983 1333304 1542037 1375063 1278629 847810 629774 737628
7369 737628 1199053 816995 73102 -369112 -1382304 -1965475 -1775485 -1427076 -855449 -1142088
7359 -1142088 -1359089 -806378 -497210 -701512 -677787 -943297 -1734151 -1775274 -923323 -1152832
7349 -1152832 -1236266 -66468 1562948 2656140 2306941 1623592 580404 -489682 -106303
7340 -106303 1088151 1700742 2183679 2006414 1345563 793159 480786 217475 203089 172946
7330 172946 364110 1486739 2254865 2411124 2897811 2787653 1905070 799616 665728
7321 665728 1096419 841020 350482 532670 264725 -302043 -876950 -1468299 -1015422 -497734
7311 -497734 -21793 714242 1117571 742800 -81248 -9598 1077256 1950195 1986970 1746368
7301 1746368 1069142 3465 -488807 -65307 605125 499766 88294 659919 1323323
7292 1323323 986223 43454 -568187 -315408 -14779 -544946 -584329 -83099 -542689 -1787337
7282 -1787337 -1502036 -361836 -720828 -1440639 -1305933 -556141 207716 1362432 2021298
7273 2021298 1355702 322689 316409 637372 -161130 -1574369 -1509710 -727693 -508448 -724972
7263 -724972 -704751 -958540 -752368 -388603 -449336 -655122 -680019 -163045 254704 126757
7253 126757 -580503 -1196322 -1287248 -899995 -876712 -1145827 -1309575 -912906 -518398 -80442
7243 -80442 359780 821197 710368 207324 348809 636649 762180 140065 -928819 -967850
7233 -967850 -787871 -1011160 -68446 1030821 1329554 388079 -631920 -873202 -1274350
7224 -1274350 -1059098 -44544 391579 318233 165030 -230966 -443039 -239786 145875 1108720
7214 1108720 870774 -328463 -248556 -184598 -274787 -572395 -727757 -596228 -720954 -862487
7204 -862487 44958 377318 -39238 -483583 -386045 30952 -427819 45325 -115478 -676924
7194 -676924 -967358 -1293824 -1755758 -1809336 -1611709 -1031175 -473117 -44594 326398 51370
7184 51370 -660989 -1418540 -1911252 -1832082 -1070556 -133146 -674276 -1067497 -340109 585627
7174 585627 758475 288477 -442937 -586334 431275 1140893 1063910 864586 597033 -141686
7164 -141686 132231 1113421 1959477 2592740 2652993 2108253 1515080 1448055 1690520 1954322
7154 1954322 1795742 1178348 975804 878723 339828 104037 553099 955192 1173505 1106504
7144 1106504 1462643 1030855 39539 -42732 -541760 -595656 343874 191938 -492 -287692
7134 -287692 -1128016 -1137284 -131406 769444 1031072 1464648 1053776 -116997 -819684 -460438
7124 -460438 127907 174891 -408271 -918005 -430671 -116968 324701 807277 638923 74137
7114 74137 -509225 -528274 -1330316 -1931442 -1142076 -619495 -8762 714962 1310319 834469
7104 834469 279154 -271201 -266001 603128 305843 221043 -208574 -1256792 -892802 -318993
7094 -318993 -920095 -979571 -728304 -1212815 -1833013 -1027642 53959 211605 44272 201889
7084 201889 816916 1130614 897962 700157 1027062 1463074 964831 -641786 -1617000 -1032192
7074 -1032192 -95330 46008 -231348 -313048 -26659 -390967 -252785 -626908 -885512 -121241
7064 -121241 1036191 1645517 562439 -478966 -1024906 -1891340 -2361677 -2455065 -2353748
7055 -2353748 -1800004 -242438 246583 123277 363341 627963 692202 40617 -1067963
7046 -1067963 -1818777 -1579172 -1109798 -877630 -144954 1288500 1380011 551339 -186981 -884466
7036 -884466 -108025 153212 953196 1234874 849925 391976 -60395 -530560 -899324 -950921
7026 -950921 -677068 -733022 -2024000 -3260378 -3190238 -2021364 -985853 -1144448 -1246888
7017 -1246888 -1314984 -1810937 -1293427 -601227 -638729 -437525 130290 883089 1360148 1086817
7007 1086817 237486 -165817 146995 24754 -973909 -1308264 -1114311 -1676031 -1949416 -1460923
6997 -1460923 -658497 -31844 725752 976396 1044267 -420366 -1427847 -1034711 -890494
6988 -890494 -629809 -678822 -1432374 -751090 -82942 -73706 -187454 -274864 -280282 -398919 -303781
6977 -303781 -347553 -590760 -228313 933990 1015243 -428417 -1929100 -2777347 -2572568 -1759830
6967 -1759830 -830804 -39429 418873 279265 773068 1943144 1639747 617999 -192234
6958 -192234 -477741 -1112249 -1085389 -456417 -975879 -948214 -476403 -40545 569334 602947
6948 602947 327716 428564 530361 745701 456748 -32246 -859817 -2013056 -2820863 -2210203
6938 -2210203 -976644 26871 1075613 984427 191840 -76083 33237 542451 737234
6929 737234 614384 353617 12962 69944 -235046 -329007 185298 1108951 1700154 1556517
6919 1556517 1250428 1914432 3332463 3461866 1965603 1018504 977204 608489 -186119
6910 -186119 -614758 -594343 175620 1024060 825671 137975 185990 622989 496293 319438
6900 319438 180284 324641 172026 -219134 -446090 -886560 -1669832 -1627775 -1333444 -1727128
6890 -1727128 -1803252 -897630 -160095 239086 901965 1017831 1262612 2075453 2069586 1844287
6880 1844287 1628616 652826 -45030 229705 -17729 -444269 -117089 48828 -803104 -1011465
6870 -1011465 -286025 533545 1852926 2808248 2731088 1740354 782766 220139 -929705
6861 -929705 -1284296 -415452 290694 510442 52875 -663320 -990398 -221000 377674 474351
6851 474351 126835 -296844 -29555 320016 147728 -530682 -737407 -900410 -715528 -86896
6841 -86896 -182324 -206366 -226485 21187 79346 116085 533932 833011 1088762 1897243 2537680
6830 2537680 2071776 857299 -869176 -1970071 -2418340 -2557482 -1967285 -960479 -131785
6821 -131785 93550 20742 -379051 -628026 -754524 -541805 449191 857238 612687 97038
6811 97038 -147372 98644 1066377 2061576 2534632 2125961 1567271 848108 855759 1210985
6801 1210985 635923 -202961 -435752 -334771 -898700 -1670995 -1963433 -2166613 -2216085 -1727540
6791 -1727540 -1274124 -1818912 -2595703 -2375277 -1625917 -975544 -372274 115958 467116 434184
6781 434184 1161526 1510080 1043943 1173771 1094743 304351 -264336 200195 701657 790692
6771 790692 776129 223910 -266718 -700878 -918746 -1089466 -746094 -1089690 -1852456 -1613959
6761 -1613959 -972452 -462807 -1055477 -1669894 -1692262 -1891823 -2000500 -300194 1722311
6752 1722311 2180488 2175714 1958392 622872 499067 1236716 1051003 907905 915428 960287
6742 960287 1214281 425646 -203668 -725788 -2020794 -1800622 -1044223 -1540193 -1716951 -955267
6732 -955267 -729946 -762515 -816932 -1442862 -1679799 -1011045 -524105 -479672 -142387 488803
6722 488803 957709 1311737 1229576 832618 758020 810755 1721600 2217312 1790421 1701239
6712 1701239 916335 6231 367411 278518 -175368 -209640 -493598 -336595 853621 1285319
6702 1285319 708250 -364859 -565745 -194009 191358 212988 570208 1572632 882548
6693 882548 -273193 -826497 70863 1290810 1007259 -215041 -1206345 -721798 161301
6684 161301 590121 841198 522080 -3006 -127000 175338 -374253 -973412 -347755 191541
6674 191541 -72880 -518303 -995308 -804762 242084 1243349 1057693 126001 -851535
6665 -851535 -1687512 -2065892 -1876779 -1429032 -1227510 -1330394 -909562 -465585 36214 683460
6655 683460 590071 -235167 -1324801 -1423147 -1572031 -1672332 -1954747 -1774835 -873352 -157116
6645 -157116 -263431 -330169 314730 1047683 1258046 1657203 2060863 1693406 302432 -618206
6635 -618206 344925 1089482 1142247 1169934 1009080 1330673 1806307 1735263 1344058 567411
6625 567411 -93128 -1049197 -1707362 -1707928 -2043231 -1783630 -959905 518145 1628908 1466455
6615 1466455 913708 250618 -1034888 -960335 279306 1603125 2206702 1404507 461006
6606 461006 236532 616054 1251470 994010 789490 754975 456888 494068 311746 122182
6596 122182 262404 366119 756789 1824644 2217992 911681 -115269 23285 237061
6587 237061 153487 -315699 -492297 -730022 -1226030 -731114 415826 850004 960280 1482843
6577 1482843 1796410 1531775 269500 -1015516 -1756543 -1832958 -903585 356765 1226539
6568 1226539 644491 -579034 -704783 144199 712256 433753 -229820 -266987 305787 1588172
6558 1588172 1791530 613523 -1007929 -1567756 -878739 -622097 -874985 -485202 -247841
6549 -247841 -565273 -891595 -1437105 -1676443 -1130821 -1280434 -1965512 -2042611 -2193236 -2305695
6539 -2305695 -1609590 -977894 -249433 807614 2105042 3525873 3752113 3103468 2344018
6530 2344018 709470 -593414 -435946 -78581 -316744 -1242783 -1990371 -1490755 -1097723
6521 -1097723 -1120821 -1223842 -1279494 -1327601 -1739355 -2374313 -2246434 -1216747 -203617 503656
6511 503656 523500 -371673 -1183731 -1697019 -2147345 -1725164 -1063061 -1048655 -1213472 -1623418
6501 -1623418 -1908085 -1803270 -1673538 -1453309 -1338265 -1413375 -927202 289867 1432354
6492 1432354 1625555 948010 -199568 -553238 -240486 -54522 -288656 -215067 954226
6483 954226 1404193 990185 863059 1245484 1914497 2073738 1366443 1258885 1507008 1341117
6473 1341117 396606 -553751 -167779 937733 1433275 1407204 1670158 1555679 676009 6727
6463 6727 -33763 955747 1230494 1081457 450596 468390 740589 176278 -635519 -1404652
6453 -1404652 -2132955 -2383104 -2432263 -2518894 -1666244 -225470 1073485 1463100 1190882 1133159
6443 1133159 560379 -380238 -730478 -856228 -1261537 -1276181 -1693140 -2170276 -2568429 -2059775
6433 -2059775 -1177890 -833850 -88848 49168 -44761 -180565 11661 633911 1104366 1064445
6423 1064445 1341424 929116 249949 278870 1456918 2230210 1773504 466111 -663248
6414 -663248 -1622925 -1348735 -895554 -699100 -1487510 -2274292 -1998400 -2401736 -3088642 -2900272
6404 -2900272 -1950654 -219094 607727 325015 -342048 -882869 -1053479 -1278340 -1066913
6395 -1066913 -1016283 -790854 53884 1266446 1352822 825650 1012109 1040168 1077408 1269530
6385 1269530 876107 210749 -1693383 -2771129 -2657824 -2155381 -1083945 -578919 -1428883
6376 -1428883 -2200412 -2440249 -1493618 -470259 180370 449211 542556 -78845 -1458623
6367 -1458623 -2218649 -2065865 -1420087 -999984 -556092 -633874 -396100 299930 571933 73103
6357 73103 -184247 -278075 233648 588587 407731 574039 1016565 1121517 1194031 1162825
6347 1162825 814481 641815 1470339 1610346 1897919 2590563 2203858 2190373 2921087 3296754
6337 3296754 2940002 2633841 2613431 2391513 2147091 1935918 1828693 1678154 1003867 -135729
6327 -135729 -1153065 -869635 -457687 -824812 -750137 174994 -77057 -881438 -1200674 -907818
6317 -907818 -672772 -605594 -960344 -643625 563071 1744068 2630155 3009907 3186694 2900638
6307 2900638 1931482 392217 -150734 -17069 187959 361590 189701 -57023 -558659
6298 -558659 -871938 -747240 492106 1615746 1217145 1247135 1511085 936059 394257 -425293
6288 -425293 -1008977 -1280712 -1821528 -960066 418620 647736 501357 609418 545759 652456
6278 652456 440566 112853 -90874 615452 1437777 1211167 897258 848848 953025 1024198
6268 1024198 936194 440450 -291921 -867562 -1039045 -192482 839325 1698232 1956426 1789359
6258 1789359 938779 -206973 -725692 -1149186 -925748 -409409 -847784 -1740176 -1399751
6249 -1399751 -1027959 -1901873 -2704234 -3162084 -3249287 -1701631 107306 821205 459325
6240 459325 -77449 -221470 268316 832975 840427 1048556 193828 -221875 -67935 -799939
6230 -799939 -1236945 -654761 -35893 -19535 -183528 -24055 -83662 -739948 -992757 -834153
6220 -834153 -970116 -1416532 -1358482 -1178734 -1413736 -1242055 -324464 863512 1435499 1131164
6210 1131164 479687 -296689 -737857 -1261552 -721053 -274408 502856 1054739 593367 86497
6200 86497 6317 -90353 -1142856 -2034027 -1187396 330576 911067 1138095 669247 -72599
6190 -72599 -1103607 -1429011 -957275 -554586 -518061 -236110 237481 337138 862169 774643
6180 774643 117281 -9499 -595187 -541798 550920 1194801 650061 418585 -121288 -536115
6170 -536115 3550 -4185 588506 1560162 2139156 2225304 1763720 1097265 1104154 512688 448589
6159 448589 421052 -312595 -782649 -1236705 -1053052 -771452 -1484303 -1861967 -1432668 -1031446
6149 -1031446 -818233 -536552 325056 863060 1151166 1181818 702664 753713 1425308 1473523
6139 1473523 751504 816634 623407 433160 1540108 3156353 3498238 3457886 3546110 2337755
6129 2337755 899333 385762 -19531 -29159 356034 84363 -95653 -195596 -814479 -1005217
6119 -1005217 -268591 163147 794699 954599 -22053 -864280 -1280728 -1166918 -1238981 -1278048
6109 -1278048 -844754 -355784 -168513 -391339 -858007 -619406 356177 412638 590408 1113883
6099 1113883 1009394 769729 379219 436189 688570 815519 989887 809897 63216 22694
6089 22694 -86065 -395504 -476435 -367680 548670 1358799 1373089 765262 -382858 -1435213
6079 -1435213 -2046628 -1908228 -2070112 -2384479 -2175060 -1876624 -1377246 -340124 536786
6070 536786 778689 249518 -380548 -544124 118777 136641 -226858 -127662 -176836 -497762
6060 -497762 -630509 -395408 -297315 784114 1677770 2275938 1294071 -70613 37691 675021
6050 675021 973716 1581014 1689989 690798 -434210 -1157860 -1489455 -1632324 -1859197 -1789210
6040 -1789210 -2111655 -2213265 -2071346 -1790782 -1156131 -892814 -268563 -58038 228074 238652
6030 238652 514532 935125 853063 945609 653030 -196751 -804268 -875910 -370631 -438288
6020 -438288 -399843 -18356 223360 239000 -121264 170178 -7018 -721466 -1637642 -1776624
6010 -1776624 -1615702 -1071817 -1035485 -1621131 -1094105 386155 704478 133542 -470313 -415322
6000 -415322 -807171 -1054533 -312709 38398 -53935 -544825 -871610 -816833 -896873 -602857
5990 -602857 -103048 -276709 -895579 -1462576 -1755303 -830964 692433 1803547 2339189
5981 2339189 1627532 1304805 1350922 470413 -1025869 -1959589 -2357191 -2192927 -1160078
5972 -1160078 488365 1182764 1056499 945016 206860 -325747 -131316 184619 332444
5963 332444 165206 -286160 -742536 -750314 -189521 615176 1074472 1323756 868930 234726
5953 234726 590733 1002309 826685 -236810 -416001 -18702 -128994 -315527 70008 599453
5943 599453 972955 1728164 1978926 1628112 1699656 1591403 1288789 883936 331572 1020078
5933 1020078 2426487 2878939 2639133 1974618 1406921 1061965 914158 401614 -241986
5924 -241986 -116165 570667 819873 284016 -562525 -380832 660548 1454000 1781353 2373356
5914 2373356 2856120 2159045 802609 -441983 -541355 -112891 -258305 25840 441501
5905 441501 655966 854080 374228 182463 -130710 -204116 -635740 -1202433 -1096013 -1028870
5895 -1028870 -1156527 -619733 90030 1683781 2537526 1948228 1527412 1378621 1525443
5886 1525443 1395573 1106413 140120 -653156 -691480 -68681 -271395 -1194596 -867974 -21460
5876 -21460 -371395 -848721 -381898 1101189 1920593 1453422 -87255 -730870 452242
5867 452242 1334078 1757211 1902031 1397534 936423 1270960 2278343 3660662 3924400
5858 3924400 3217091 2994458 3268020 3248492 3613349 4446846 5487383 5535247 5749688 6512930
5848 6512930 5949617 4615829 3771035 4270249 4922286 5263172 4996709 4794448 4728485 3993776
5838 3993776 3355433 3728978 4963971 4945060 5351147 6480097 6593852 6396475 6862217
5829 6862217 7927945 9507963 10489047 11187565 11626982 12488441 14038967 16564302 19170622
5820 19170622 22119197 26558814 32615081 40737463 52296699 68172116 90380785 122027945
5812 122027945 167674094 232777344 313838949 377765308 376046095 314219181 239364715
5805 239364715 178077297 133567326 102313723 80512865 64963699 54802805 46708157
5798 46708157 39274995 33614685 28585856 24296321 20517583 17893697 16856319 16074802
5790 16074802 14774786 13185815 11458906 9572606 8007654 7424722 7194082 6270685 5502878
5781 5502878 4796150 3653175 3098054 4250716 5496457 6255327 6298380 5357815 3689346
5772 3689346 3031048 3448705 3517576 2900249 1933938 1313960 1898939 2902423 3003278 3739485
5762 3739485 4248784 3503154 1882080 754561 704352 1737526 1860624 1578395 1550726
5753 1550726 1834412 1802065 1700802 2475394 2621102 2623578 3531906 3089847 1635971 1115085
5743 1115085 1462412 1877996 1318404 1231430 1403496 1012125 1038180 1510069 2456646 3479590
5733 3479590 3885509 3396038 2993618 2504418 1725999 1447607 821335 -13031 -185946 429850
5723 429850 327433 -309546 -537566 -145467 -54237 -436025 -1127445 -1299238 -877059 -454071
5713 -454071 -572975 -688902 -209447 -591951 -633970 -25462 808556 1104054 358935 408705
5703 408705 1444303 1282611 193005 -693103 -1084835 -1554784 -1919923 -1442447 -669930
5694 -669930 -142460 49596 723522 1743216 1912317 2004136 2260945 2381476 2108588 1236516
5684 1236516 1043630 1088135 351161 -838460 -1323514 -517541 265706 316940 92467 130761
5674 130761 303157 -16504 649585 2229107 2342137 1848991 1620322 1552786 2270013 3406740
5664 3406740 3912213 3456703 3450109 3992947 4377024 3992779 3344021 3204771 3740917 4311282
5654 4311282 4956770 5288544 5723850 5978689 4970163 4061700 4085002 5092520 5641299
5645 5641299 5701608 6274423 7890007 9464774 10440959 11186278 12888153 15074596 17340941
5636 17340941 19994982 24006854 29432883 38050096 51162074 67662112 88925427 118381057
5628 118381057 153002266 178585556 177872850 153204599 122330433 96777558 78342231
5621 78342231 65469760 56236660 49405168 45228342 43890722 44191551 45577440 48849736
5613 48849736 54387859 62619647 74699336 91605224 115932415 147262017 174816828
5606 174816828 180437759 158682348 125448516 95880083 74115738 57672822 45785200
5599 45785200 37051158 30510029 25941210 22867374 20673757 18164467 15171435 12023321
5591 12023321 9744390 9423617 10270409 10382517 9703021 9232067 7682883 6053223 5116388
5582 5116388 4781623 5044626 5328092 5115094 4639220 4748349 4994329 4139960 3205415 3317185
5572 3317185 3190385 2581096 2904359 3304208 3733297 4124822 3382243 2597398 2066753 1538258
5562 1538258 768850 742600 1276632 2056992 2569913 2574889 2267591 1686098 1697188 1718712
5552 1718712 2123970 2952872 3478565 3021945 1898680 1015223 696554 1204102 2089248
5543 2089248 2186236 1056746 626322 910354 779103 -72262 -252552 498132 523930 470447
5533 470447 600826 531103 -32174 1602 625000 745137 1115224 655915 20046 -1001738
5523 -1001738 -1726158 -1152617 -380043 112611 -158515 -249626 40541 392814 358891 -34985
5513 -34985 -276180 -577168 -1745456 -2064492 -1743178 -1488013 -1143040 -1316346 -2040744 -2300225
5503 -2300225 -1978588 -873936 275788 466805 706372 1158917 1467325 1435102 1405275 1459356
5493 1459356 1877803 1997776 1366626 716583 403436 -412116 -984684 -441345 443517 964750
5483 964750 769144 314209 441325 1486781 2261336 1660399 473712 39326 -408213
5474 -408213 -1000433 -1152857 -871435 -480179 -443412 -114010 343598 295167 -232185 -291605
5464 -291605 -774732 -1201030 -601650 -203051 -562629 -1375718 -1736733 -1539545 -778680 -242560
5454 -242560 242707 977976 1647122 1663007 1676257 916232 -636591 -1088581 -245521 754286
5444 754286 718740 716591 836204 199139 -283097 199945 416378 -154593 -687844 -1007754
5434 -1007754 -1094301 -325180 -252401 -824245 -304537 420424 874030 1488634 1736079 1272998
5424 1272998 647642 274037 535206 1413676 2343582 2655982 2031736 1306319 1172889 960396
5414 960396 571819 100951 -302325 -458018 303396 900820 923342 1377204 2122037 2590184
5404 2590184 2424780 1546094 40942 -1077881 -731539 -523151 45010 987637 967820
5395 967820 261861 10334 823379 1033407 711996 165325 26790 518836 730732 -41986
5385 -41986 -463100 -31763 642679 439643 -211633 132281 530746 1302084 2105142 3280994
5375 3280994 3467854 1847220 592029 49525 -71177 -6304 -17640 -302490 -789292 -600859
5365 -600859 623067 2538486 3027259 3379061 4050431 3757301 2558826 1284163 -242441
5356 -242441 -894368 -560740 -229084 702312 1061216 607894 785496 1045870 1230578 1296570
5346 1296570 1716307 2547900 2906119 2641335 2011668 1850919 2405739 3310867 3560377 2805351
5336 2805351 1887726 1408078 795760 554646 335016 820283 1106852 1851090 2112904 1201633
5326 1201633 752492 1349334 1581242 1227102 738182 746095 667596 618293 3513 -1148315
5316 -1148315 -1298333 -1637472 -1770284 -1507520 -1431565 -496805 86969 -584923 -1288251 -889925
5306 -889925 -1043 940964 1844804 1655829 911586 -41662 -715672 -29801 756463 -207948
5296 -207948 -1075838 -831490 -356802 -286418 -239234 -509917 -1670543 -1855800 -713577 -332175
5286 -332175 32170 705162 928211 110502 -1603680 -2091851 -1570138 -633789 -171871 -216461
5276 -216461 -179841 890987 1975987 1757183 1304185 1851893 1754347 864529 718469 638300
5266 638300 -184262 -1191912 -1971672 -1936579 -1274024 -574884 -291247 -558400 -657835 -734369
5256 -734369 -912138 -1367851 -1610370 -1086017 -572259 210032 975988 1309770 1515061 1486552
5246 1486552 1903312 1637393 427828 -111145 -1182362 -1922211 -1855545 -1337707 -1318723 -954113
5236 -954113 -931848 -1465481 -1832918 -1749202 -1503447 -1307074 -1192346 -880256 204907 -220063
5226 -220063 -1593646 -1468852 -1093383 -751785 -156554 -176644 -606404 -1105937 -991833 -481445
5216 -481445 -551181 -428974 338356 596730 574054 -120949 -864064 -857900 -432290 -346147 -237866
5205 -237866 640532 2008002 2737842 2744519 2482616 2380105 2148484 1671430 1553951 524466
5195 524466 -1074407 -1703282 -2055378 -1201678 -242587 -387808 -597003 117691 413827 1026368
5185 1026368 1392598 1155623 403514 -189331 553144 914168 294675 -268313 -567599 -236140
5175 -236140 -760780 -1539701 -946096 -521732 -652528 -1001987 57879 1304274 995936
5166 995936 683491 364660 293065 68179 398009 1209416 1776255 1824041 1381313 905655
5156 905655 96606 51873 611369 595391 283586 452233 385245 -203349 -949852 -1510615
5146 -1510615 -1463444 -1112075 -816840 -51204 1237742 1880256 1424835 222655 -571405
5137 -571405 -299037 913902 1451273 981911 209492 303869 423291 504414 620715 583891
5127 583891 305111 -662271 -1629072 -1804046 -1421163 -1433581 -1964855 -2373810 -2169540 -2217608
5117 -2217608 -1385853 -429929 -145011 -570939 -457660 238935 -523382 -1074180 -1239585 -2008364
5107 -2008364 -2399110 -2397103 -2662157 -3238750 -3388066 -3245258 -3093029 -2845329 -1793334 -288910
5097 -288910 115398 450734 909340 1008372 561757 641 122598 360113 390974 90660
5087 90660 109905 256204 468824 496226 -799927 -1347791 -1094740 -758684 -1049441 -798300
5077 -798300 124909 500527 677311 11611 -1440924 -2049415 -1589152 -1016230 47089
5068 47089 593256 843672 596942 -593096 -1625654 -2467560 -2865631 -3054965 -3100634 -2301003
5058 -2301003 -1015230 301922 1015747 314779 -968590 -1461387 -995487 -249945 -161910
5049 -161910 -481477 -1221048 -1520306 -1251733 -202776 1103289 791528 -600124 -1234289
5040 -1234289 -684525 -48900 -85624 -696070 -506680 389235 -625911 -1846880 -1858218 -1454942
5030 -1454942 -285928 95836 -529880 -1362498 -1509424 -697849 329867 309972 -792255
5021 -792255 -1456926 -1738207 -2114852 -1610114 -1256239 -671009 764630 1659138 1404378 314280
5011 314280 -591563 -1240551 -1645612 -1874806 -1847768 -1718257 -1382032 -1761203 -2483792 -3126287
5001 -3126287 -2498159 -1683017 -533902 -145250 -725719 -937249 -593698 569147 430405
4992 430405 110925 19930 -593517 -802210 -867557 -806869 -350648 -369866 -1064338 -1906350
4982 -1906350 -2195122 -2619418 -2289462 -1130487 -465690 160486 929697 1738972 1260603
4973 1260603 1090923 1681559 1773513 1872759 1346138 536712 285528 326295 739130 1208878
4963 1208878 1438408 1390337 1064341 1110096 617941 -829034 -978122 -774228 -692893 -484124
4953 -484124 -214286 209905 457111 253142 -15859 506412 247126 -331063 253549 560349
4943 560349 1083020 2109539 2201693 2115029 2023222 1577982 1235323 981047 226926 -248149
4933 -248149 246739 589356 1540997 1841025 1321076 1232900 306446 -236623 146347 940886
4923 940886 1003631 428025 -256829 -851330 -507031 275071 726352 746741 498137 202348
4913 202348 417768 822109 1179899 1180827 1363836 1687575 1081494 635654 215034 -332889
4903 -332889 159447 845595 799398 597704 -196586 -197068 332801 1142353 874429 96531
4893 96531 469966 874104 169979 28784 667909 1532280 1690620 1274057 1139281 1284753
4883 1284753 1534639 2109825 1899461 511574 -637558 -1754143 -2266440 -1696570 -465185
4874 -465185 643130 1448032 1930554 2371983 2630475 2784706 2939719 2774003 2747621 2693503
4864 2693503 2436274 1604359 1277842 1242183 38784 -1062616 -796507 300998 631822
4855 631822 45211 -6648 205443 -339820 -1656588 -2499417 -2339141 -1837082 -1047750 -32005
4845 -32005 621491 303014 170928 850574 559409 -1292673 -1911982 -1352775 108615 353816
4835 353816 -315463 -848901 -1084011 -914800 -362820 402490 361459 63317 519233 1195867
4825 1195867 1175830 266089 -841320 -1655606 -2103477 -2235582 -1274434 -272677 -490195
4816 -490195 -1524234 -1892042 -1757779 -2132529 -2519341 -2803049 -2336802 -515358 933225
4807 933225 1005918 998380 1625630 1463970 804997 777458 669320 -154493 -930649 -388367
4797 -388367 348631 23582 -306741 434962 1782367 2073216 1690695 911913 -153773
4788 -153773 -600747 -836724 -787985 -343028 -458783 -1310133 -1422442 -1318831 -2269029 -2846848
4778 -2846848 -3084694 -2726817 -1828702 -1798116 -1877958 -1460800 -748538 204246 1258152 921513
4768 921513 -434653 -722498 -302444 -309525 -519593 -712290 -236123 -347700 -507693 -371090
4758 -371090 -330713 -256292 288415 683475 497765 422414 -241588 -1028787 -1681840 -2427926
4748 -2427926 -2021593 -1287000 -1610564 -1014783 -968847 -787753 305748 942965 118678 -413401
4738 -413401 596892 958564 1413090 1855968 1462219 969061 807420 686680 19513 -462696
4728 -462696 -1532027 -2575494 -2401620 -1060200 224102 755863 698151 469312 184338
4719 184338 608303 1409410 983575 405737 193020 564305 1258879 1122489 638016 628846
4709 628846 686735 179266 -266593 -293215 -136216 587293 1315128 1237840 1319306 1484969
4699 1484969 1181507 369296 -766539 -1018809 -391969 413263 577256 1004915 1351107
4690 1351107 1240094 1538046 1972885 1441759 1075603 365118 -405404 -67907 596074 937720
4680 937720 1340627 1105723 1404408 2140087 1956960 1115234 378452 -343107 -339962 -344081
4670 -344081 -206630 459437 414993 -220885 -507371 -1135069 -1244408 -1135954 -280949 1062757
4660 1062757 1547760 972496 380565 398355 300027 476970 726935 487655 730112 1482355
4650 1482355 2196295 2049644 2657768 3121992 1738748 251210 -442722 -500484 -604242
4641 -604242 -1186603 -1735989 -1486808 -1510617 -1262770 -646450 72784 28067 239951 301179
4631 301179 -47200 -296639 -759364 -621708 27799 204827 24235 2378 963217 1994289
4621 1994289 1808716 1359207 1223136 127666 -620397 -665508 -431449 -667702 -908667 -620030
4611 -620030 503848 1591835 1456416 1332245 1385399 747680 -148320 -1122836 -1886497 -1461638
4601 -1461638 -1054039 -1150244 -1102785 -813068 120609 1415579 1954994 1545488 1406891 1894913
4591 1894913 1873769 935478 -457677 -1275089 -569936 1000465 2350546 2554915 1546110
4582 1546110 613434 -349527 -624571 -451736 374141 1229711 1444371 1164761 1229877 1359780
4572 1359780 1624991 1627383 1122990 817037 1801397 2034762 1550934 1060571 39841 -988673
4562 -988673 -845438 -35179 135340 606272 1494574 2033200 1650360 2080962 3227608 2624535
4552 2624535 978968 711223 530900 482935 1074751 1685322 1686836 1086876 478650 116011
4542 116011 -155918 -304215 -222418 -548268 -1208114 -1601646 -1071361 -505867 -719213 -673414
4532 -673414 -369590 -255456 -255383 -11919 384654 1329089 1279451 457622 -87891 -179854 376436
4521 376436 62326 -466900 53369 638277 943412 1707073 2156848 2986641 3208618 2126815
4511 2126815 1473283 1832079 2242134 2152758 1648801 978343 579020 381539 888787 1609966
4501 1609966 2315306 2652129 1835753 673130 208032 226826 607029 669976 368352 591714
4491 591714 1674988 2737862 2662600 1955710 1021873 157658 -212883 -545431 -576702 -395284
4481 -395284 -125685 463177 757782 672722 428144 375208 655902 555342 586816 105055
4471 105055 -142661 503444 1296672 1976223 2542094 2768192 2224132 953506 385242 430394
4461 430394 -253979 -965923 -544309 -359941 -495570 118041 782716 867708 290386 244424
4451 244424 593521 207254 374098 751955 987866 374427 -232661 133712 878476 978731
4441 978731 1005734 1540978 1065627 -218514 -687843 -446600 -3089 506682 979253 1409674
4431 1409674 2279114 2959087 2637257 2565744 2601165 1953187 1763513 1829255 1080135 497304
4421 497304 1047369 1602715 2383257 2662176 2358895 1959961 1765937 1783711 1656767 1901211
4411 1901211 1388952 972139 1250874 1540532 2006744 2161180 1841630 1650985 1289639 1498977
4401 1498977 1726398 1067787 165475 -129373 521968 1546123 2996572 4530391 5115199
4392 5115199 4302035 2871242 2592876 2287739 2328196 2838448 3194606 4042332 5094629
4383 5094629 6029620 6158858 5476255 5509068 6261572 6622742 7544305 8834230 9642904 9798479
4373 9798479 10658423 11893802 13034571 14813819 16809752 19993549 24151899 28966472
4365 28966472 34946134 42058402 50071633 59589121 69708821 78430130 84010588 85159897
4357 85159897 82238772 75330156 65953004 56218582 47773789 40509629 34420291 29149585
4349 29149585 25691909 23354905 20448830 17667968 15800447 14346132 12678913 11664618
4341 11664618 10881960 10279497 10415894 10301028 9234677 8039608 6550111 5273655 4382465
4332 4382465 5033405 5443042 4287721 3268551 3009567 3144455 3645192 4272108 4378935
4323 4378935 3601353 2523775 1892719 1528230 956008 499390 907229 1024945 1468331
4314 1468331 2612028 3224548 2980501 2625780 1722354 1163684 1551384 1347618 444088
4305 444088 -267845 138806 1631198 2773077 2727263 2000973 1713403 2625463 3088847 2912541
4295 2912541 3098200 2879486 2072987 952987 287729 1198810 1694115 1391261 1112286
4286 1112286 420601 316277 608098 220728 52111 298331 58021 612339 1940723
4277 1940723 2276592 2763566 3115075 2766352 2511323 2621670 2437809 2437431 2893563 2359181
4267 2359181 1117788 767476 758702 519640 629672 128740 11956 82842 70404 139057
4257 139057 -178698 -233215 318431 1488648 1596799 1410409 1140502 318524 -419002 -226600
4247 -226600 21548 -617046 -1419835 -1884772 -1303157 -195690 47169 -13347 -366417 -250473
4237 -250473 236395 662624 544074 320966 740156 1077823 602825 190885 98809 376463
4227 376463 669785 783701 240815 -327747 -127425 301160 819001 914170 370692 120399
4217 120399 -353861 -315 1439635 2030468 2646389 2895418 2528312 1861153 693216
4208 693216 -841521 -1467446 -1231073 -1532339 -1468333 -1200800 -1120875 -491787 204894 495801
4198 495801 829242 1127525 997867 672131 584023 336101 527929 647460 424577 640860
4188 640860 572519 867418 829039 70647 70730 997076 1586722 1310323 900267 467736 -470167
4177 -470167 -492321 -349758 -25479 285105 211652 357995 670327 546209 569080 851010
4167 851010 1199763 1832544 1552827 1497539 2533051 2952413 3363628 3913390 2797682 1438169
4157 1438169 1391238 1352267 1193970 1657793 1877401 1793272 2321564 2982397 3012742 3053191
4147 3053191 3268083 3681601 4257718 4422231 3610409 2811699 2807309 3668790 4104416 2868459
4137 2868459 1939569 2509773 3255933 3503322 3733088 3721655 3360771 3110424 4211099 5019988
4127 5019988 4949976 4960245 5095424 4660207 4650411 5245079 5481734 6139384 6326744 6209484
4117 6209484 6341439 7088468 7330727 8283696 9930933 11449153 14047804 16827873 19110256
4108 19110256 21757623 25543031 30054036 35707241 42643288 50989205 60142708 69360468
4100 69360468 78590347 85308716 86606905 82683309 74223647 63955833 54387714 46627217
4092 46627217 40619085 35206616 30696360 26969013 23538821 19944911 17036303 15340155
4084 15340155 14244663 13864377 12599738 11455438 11168697 10709748 10780048 10303613 9305732
4075 9305732 9201809 8513848 7357500 5628011 5320511 4998151 4118234 4172992 4702493
4066 4702493 4676025 4082262 4097958 4333036 3555853 2936983 3188334 2884435 2082194 2091743
4056 2091743 2828089 3404074 3304046 3007057 3069801 3012915 3267404 3525493 3395219 2557787
4046 2557787 1262939 1491410 2705060 3633748 3914402 4235199 4378285 3490778 3083656
4037 3083656 3658190 3925513 3303029 2148375 1191308 887913 1553693 1443319 630362
4028 630362 378502 615868 1557619 1907395 1796098 2200512 2132937 1855306 1765313 2109311
4018 2109311 2054267 1411244 1561275 1366842 1559750 1535642 1211634 567203 278709 302768
4008 302768 184944 141656 444577 1583353 1678019 1518031 1808739 1689071 1840490 1558054
3998 1558054 1667303 2001130 1682291 1433274 1157894 854423 910065 479771 -209151 -812010
3988 -812010 -1442234 -1874609 -1098512 -286527 -240923 -495974 -94915 -9616 -62363 -420922
3978 -420922 -523841 -806757 -680164 -121494 205470 641180 354778 -100395 170893 1219574
3968 1219574 1887369 1582037 1211565 454454 405082 322443 -516994 -967554 -695238 -72693
3958 -72693 682716 818501 918358 1825961 1143307 -132427 -970491 -1934545 -2168998 -1708104
3948 -1708104 -1536932 -1282157 -686976 -355009 -258629 -440909 -1534011 -2348374 -1723490 -1213414
3938 -1213414 -516900 70522 299727 341516 493206 614585 132481 -312001 -339216 -234246
3928 -234246 -326020 -597536 -618396 118192 98374 -812987 -1286472 -702828 -453854 -768280
3918 -768280 -1272043 -1571102 -1251498 -780529 -627729 -94626 260201 152618 -150717 -17882
3908 -17882 102814 63227 -75661 947201 1843583 1448566 332994 -442748 -1045467 -887921
3898 -887921 -15185 827585 1059055 1161222 975382 287229 466313 1014063 1896236 3180730
3888 3180730 3146779 1617737 313265 535767 931848 1002588 1002800 1140259 943545 120343
3878 120343 -193465 -334799 -542499 -139666 509156 -51539 -614023 -403872 -531278 -302629
3868 -302629 792047 775829 -47094 -664067 -896922 -506594 317472 273235 22183 265578
3858 265578 320726 618365 1045050 433335 -377049 -137719 235548 869025 1257785 1424941
3848 1424941 2001230 2412920 2316104 2237265 2310285 1624744 852343 668494 807203 402902
3838 402902 92566 490660 533635 365154 159090 201794 101390 473177 1735072 1976624
3828 1976624 881393 457484 237349 169209 1023738 1070175 19980 -608496 -617737 -755498
3818 -755498 -494641 298668 1026770 1289749 1423655 1264958 373243 -438971 -826947 -624824
3808 -624824 157150 406472 -405577 -1313084 -1805372 -2292175 -2205747 -1695981 -394324 839726
3798 839726 1297690 1224576 455563 481606 1520530 1904980 1845226 1531805 1584238 2180365
3788 2180365 2552219 2526325 2669151 3217765 3303020 3015621 2068482 1235111 744612 493683
3778 493683 580228 547859 784750 421755 510695 1228575 1384261 1084151 891860 872975
3768 872975 139384 -251441 270304 334478 220827 -417542 -1294721 -1763166 -2051538 -1030485
3758 -1030485 329231 1409089 1678255 1162920 -97971 -1353086 -1603997 -860922 -582116
3749 -582116 -1439414 -1459489 -1051746 -476770 -843394 -1364871 -799200 -106396 -248859 418000
3739 418000 891939 973978 1236487 873268 -527565 -1588331 -1828239 -1984913 -1394413 -967403
3729 -967403 -1250268 -1881345 -1839609 -1455857 -1091152 -403977 409394 831000 591494 64686
3719 64686 -349875 -453286 -1004547 -1698357 -1567246 -1416087 -1185044 -900379 -540444 28316
3709 28316 -346876 -1675794 -2494831 -2478039 -2339792 -2012920 -1273483 -741457 -685182 -699587
3699 -699587 -530949 -1022508 -1151410 -1186369 -2120452 -2592887 -2456315 -1992945 -909701 643728
3689 643728 1007228 685302 388804 219163 1315307 1358071 446036 22759 -582733 -1337523
3679 -1337523 -1326844 -1386214 -1931980 -1686242 -1008502 -529711 -417045 -15119 672559 753705
3669 753705 549666 81978 -366554 -159780 -113029 -115285 376916 215998 405295 1237277
3659 1237277 1963502 2497064 2457388 2163376 1830216 1164634 -187626 -770459 -528718 64707
3649 64707 356262 69754 402833 908750 865003 445285 -324132 -431195 150956 -125906
3639 -125906 -739127 75193 637005 438424 349338 119964 -376781 -738592 -640237 -675649
3629 -675649 -828913 -1230686 -1323725 -1507582 -1966122 -2502675 -2387126 -1930252 -2021875 -2007144
3619 -2007144 -2563972 -2504992 -1943377 -1199131 -1039856 -1359749 -1978818 -3001524 -3452953 -3277053
3609 -3277053 -2981822 -2871441 -2132815 -1188068 -267791 -81352 -394093 -1011213 -1430671 -1540100
3599 -1540100 -1174547 -416846 -168729 -292425 68044 930234 1710610 1443902 1186687 1496886
3589 1496886 1566900 1703344 1657523 1505078 1031317 1040537 1444232 1505039 1056337 246625
3579 246625 -715845 -867709 -429598 -393490 -222131 -461849 -237497 -251511 -486329 430412
3569 430412 1133879 554214 -265930 -224475 161316 589370 618429 679297 918185 682772
3559 682772 623774 438208 165119 -187241 -273914 -775499 -1589570 -1755507 -1551944 -1366017
3549 -1366017 -1951248 -2456252 -2113978 -1821242 -2150431 -2052860 -1824933 -1660561 -1578944 -1295893
3539 -1295893 -1214521 -1174330 -1590927 -1907670 -1467455 -575962 358785 990564 1290127 1316597
3529 1316597 1021959 575211 435098 172075 56016 -302799 -606509 -1095126 -1391149 -1390108
3519 -1390108 -758177 -224180 522975 1302162 840372 -47253 -725033 -625564 250361 817774
3509 817774 557317 289381 719873 981960 969492 413737 573461 1160652 1763845 2328191
3499 2328191 2039714 920029 125369 -604059 -966848 -460273 783611 1523910 1444516
3490 1444516 528682 -284029 -263358 283541 -141608 -1119948 -1645028 -1719401 -1149871 -1060734
3480 -1060734 -951876 -29606 373128 -810195 -1977075 -2361853 -2503724 -2720321 -2376461
3471 -2376461 -1618122 -450607 -269704 -53242 955098 1098221 804361 1388800 2059754
3462 2059754 2465101 2910618 3419701 3175923 2469309 1868757 1000662 549206 1244362 1814193
3452 1814193 1521022 1443706 1221974 -183264 -1449181 -1149970 196080 715884 521005
3443 521005 302066 257262 -186439 -1366730 -2005740 -2046198 -1129852 129625 763389 605158
3433 605158 215229 -47804 -196272 -411164 -793659 -789879 -487017 -535249 -532487 -672743 -964254
3422 -964254 -376701 361131 823029 398807 -559232 -1397410 -1686078 -1135043 -735190 -994794
3412 -994794 -1224680 -1055668 -360246 -224421 -1046406 -1714137 -1577778 -1911393 -1969580 -1913672
3402 -1913672 -2221099 -2405396 -2481523 -3043126 -2936726 -2533669 -2570986 -2781139 -2632185 -2074488
3392 -2074488 -1062473 -618321 -562183 97913 486448 -132423 -454305 -66596 580535 1021131
3382 1021131 489584 98026 -550489 -691389 -322387 -387519 -440122 -1297875 193523 1724767
3372 1724767 2188786 1825986 532973 -52414 -501242 -728283 -424934 -134557 -583928
3363 -583928 -458726 132586 587629 62372 -949262 -1286871 -1122694 -635335 -732540 -859241
3353 -859241 -717765 -876343 -305549 -164874 -257572 -389429 -236904 400526 1686506 2047575
3343 2047575 1596455 1288755 1134710 832030 1090791 1009500 -106183 -1129557 -1428430
3334 -1428430 -1738342 -1476884 -1058835 -723269 -714164 -1457180 -863756 -516629 -953242 -876523
3324 -876523 -303162 73938 341475 596867 1029974 1905185 1838725 1029502 329368 483458
3314 483458 584316 1377171 1744552 1376759 918977 791098 562005 349874 525056 538438
3304 538438 178879 -285498 345567 1726160 1883598 1029786 -81582 -129762 749771 1179905
3294 1179905 716083 -267610 -93910 -210775 -1033132 -1407263 -1315679 -1599612 -2338638 -2820365
3284 -2820365 -2642618 -2017228 -1477634 -1503963 -1715171 -1164653 -701247 -589123 132780 990331
3274 990331 989437 934245 1389575 1077304 210107 -156802 -911642 -1280060 -1286815 -507642 158969
3263 158969 -201505 -872671 -855160 -1024134 -1769438 -2183889 -2859176 -3544968 -3668804 -3015683
3253 -3015683 -2486596 -2552303 -2784502 -1971168 -682527 -275871 -22044 243069 -128589 98580
3243 98580 118589 -352710 -536586 -1004228 -1509193 -1092430 76062 126608 -676435 -781273
3233 -781273 -496883 -720143 -1230319 -1080068 -731674 -731371 -1172554 -1244569 -1295804 -1540527 -1496374
3222 -1496374 -1621289 -1899624 -1952285 -1722167 -587962 1268525 2377809 2545250 1971268
3213 1971268 1354024 1213453 1156516 723607 -451445 -392406 317355 -47640 -330079 -366129
3203 -366129 -263128 37430 413846 847334 1013209 831139 -82049 -1276821 -1876191 -1384716
3193 -1384716 -718423 -61710 105669 -184657 -28215 -367867 -1260725 -2123842 -2318169 -1293622
3183 -1293622 184019 1049166 968484 616364 141769 19003 502969 970465 1146663 1081117
3173 1081117 517846 -702536 -1928226 -1741253 -798003 -360568 -441470 -807726 -768322 -751937
3163 -751937 -680668 -338517 -27353 -598782 -1910737 -1743976 -514450 -239496 28658 551819
3153 551819 45874 -337585 -456441 36448 500234 268260 -172489 -234324 -37447 89066
3143 89066 -390190 -1116270 -1373885 -1575607 -2204508 -3101818 -3342578 -2460682 -1151100 -587410
3133 -587410 -1012505 -1416694 -438715 416236 3030 -1355094 -2704199 -3025256 -2761422
3124 -2761422 -2556803 -3035286 -3375614 -2861646 -2305537 -2017954 -1557434 -1317582 -576680 -99051
3114 -99051 306790 568480 434386 -117241 -209935 -775867 -1412160 -1688668 -1839758 -1348448
3104 -1348448 -1158078 -763836 -271140 -17299 -64918 -718578 -1634587 -1472491 -624385 58111
3094 58111 770257 718544 -2007 -626705 -413217 -587016 -420324 18989 -334330 -455345
3084 -455345 -675963 -564782 -111097 -107115 -832066 -1165241 -395781 62978 638947 1264917
3074 1264917 736535 -40661 175714 675321 -362500 -1596066 -1827484 -1876247 -1146955
3065 -1146955 -62653 691512 981538 1469622 2390494 2637377 1554973 189807 -490499
3056 -490499 -866249 -899550 -489385 74691 25303 -206610 -813914 -1829713 -1792979 -695901
3046 -695901 -36483 -6285 -916535 -2156035 -1883261 -1245713 -1603920 -2146133 -2950699 -2467090
3036 -2467090 -2261588 -2383987 -2062251 -1821741 -1796704 -1348850 -335519 183037 -79803 -694079
3026 -694079 -1268227 -912029 -388331 -4711 582817 1111447 1265604 2023890 2010684 1315457
3016 1315457 1284811 1204593 293724 -164809 -102044 -185282 -197136 154919 314445 346587 -165906
3005 -165906 -1287587 -1496895 -699261 -448804 -749025 -462670 -624387 -686054 -942926 -1691205
2995 -1691205 -2324623 -2814224 -2795458 -1969947 -1257777 -249161 231283 -1269991 -1688449
2986 -1688449 -1814041 -2300139 -1399982 -9369 811251 1284263 1175576 621195 593135 1069899
2976 1069899 892983 1388339 1952763 1142449 508143 165842 491374 1103510 1504621 1332088
2966 1332088 1566395 1598012 143940 -705973 -159535 -140918 -924547 -1434053 -1314079 -709985
2956 -709985 -437085 -194960 1007098 2355784 3267669 3296780 3079422 2776501 2317260 1368419
2946 1368419 796592 457891 -593822 -1350225 -2320097 -3022722 -2977406 -2294784 -1205353
2937 -1205353 -338742 418186 1334776 1423225 910388 551494 612931 805906 676995 978257
2927 978257 520430 -943618 -2126298 -2352329 -1793603 -1670835 -1530671 -645699 -163504
2918 -163504 -1299006 -2713505 -3126135 -2528892 -1684570 -938104 353959 690704 382913
2909 382913 523657 344622 -2916 -460767 -478857 304690 841162 511529 -26125 -879278
2899 -879278 -1772549 -2217483 -1524725 -795594 -994539 -1963328 -2904267 -3813992 -3602141 -2461162
2889 -2461162 -980636 -46401 420932 1337531 1762966 2028131 1217183 -67958 -132584
2880 -132584 -406838 -1227729 -776854 416370 680238 -18712 -957190 -1199137 -559334 319478
2870 319478 1801975 2967811 3763418 3416362 1944187 1402639 1641375 1340643 954605
2861 954605 560684 531334 655602 738177 451535 500464 566934 -332189 -912812 -1181137
2851 -1181137 -1089881 -716399 -251739 -138542 -427364 -764204 -734389 573002 1498105 1393860
2841 1393860 849378 639271 776388 1406790 1797312 1565733 809470 133078 -212632 -580880
2831 -580880 214223 1530975 1996415 1349800 1188082 1499275 1434061 829439 -57122 68359
2821 68359 187293 757932 987352 748317 1118254 1457248 1852488 2063318 1568815 649139
2811 649139 -370652 -729051 -262800 -511104 -1054281 -1366300 -1897524 -2153872 -1922060 -1573008
2801 -1573008 -1588555 -1670886 -1646930 -1723821 -2014765 -1813044 -1005140 -88252 422393 -48095
2791 -48095 -153065 -112381 57743 108935 528972 808346 623201 1011372 1266588 392726
2781 392726 -107474 -718845 -1426939 -561873 769070 744104 40402 -155640 219802 654808
2771 654808 345658 40658 183733 145840 -53699 -371732 -907059 -1302325 -1583869 -1152263
2761 -1152263 -1089914 -455425 317083 1047678 1545580 1904432 2038154 1475902 921798 504895
2751 504895 101253 -193690 -469874 -461310 -766956 -789086 -517328 -201269 -173173 163185
2741 163185 1188937 1043780 130231 -923832 -1284489 -839102 -1559423 -2619803 -2553302
2732 -2553302 -2057960 -1627861 -1372073 -1476503 -1388588 -928799 -10487 1096452 1322993 1307046
2722 1307046 1699307 2077765 2011331 2118487 2184007 1629189 481359 55505 287141 370813
2712 370813 381475 341671 -876288 -1412360 -1189846 -652952 -534703 -543525 432675 1032722
2702 1032722 1153151 947269 718787 344871 -81608 -892335 -737762 48561 407203 117563
2692 117563 -352631 -338872 350587 278833 -105517 112139 667638 1421974 1463224 548950
2682 548950 -416754 -1006875 -179387 889639 970506 848224 365705 -660453 -930518 -300086
2672 -300086 -312407 -1090842 -1030449 -1053370 -1421398 -1062473 -1446405 -1890282 -1777049 -1325904
2662 -1325904 -795165 -195241 -56306 289656 875153 424065 -867516 -1773012 -1387658
2653 -1387658 -676939 -1003055 -1620784 -2171654 -2517038 -1836632 -1357261 -1903131 -1871590 -1244516
2643 -1244516 -1289741 -1516172 -2062782 -2624829 -2697859 -2303775 -1933857 -1947574 -1856716 -1389019
2633 -1389019 -1370910 -1929811 -2208407 -2162471 -2091435 -1232304 -648464 -644676 -1295576 -2263663
2623 -2263663 -2519361 -1930704 -1295621 -1429205 -1007252 -119894 -45895 -38477 279333 268864
2613 268864 -378485 -1139860 -422786 161721 243457 202376 418443 122364 -520105 -893692
2603 -893692 -594536 -506135 -373813 50378 7512 4075 25794 -281917 -466413 -547007 -1837655
2592 -1837655 -2719089 -3079054 -3167918 -2591283 -2094581 -1942549 -2265960 -1876275 -938839 -1271572
2582 -1271572 -1908180 -962871 -26165 311053 209312 197726 95815 90656 774412 1359768
2572 1359768 1020051 185016 -259691 -278755 -767439 -1216197 -708274 -131027 -167786 -591972
2562 -591972 -1335034 -1895972 -1193944 68477 842255 1178260 650714 312114 602961 1185448
2552 1185448 1985652 2648502 2521190 1964157 1938093 1570951 623900 -711250 -2214194
2543 -2214194 -2463446 -2376970 -2571306 -2631324 -2030051 -653599 253952 207036 -522810 -1278987
2533 -1278987 -1595025 -1120541 -267693 585572 1184575 1655058 1700827 1102996 369630 211412
2523 211412 97588 198981 -154845 -801707 -945953 -608511 181980 1670420 2252471 1208435
2513 1208435 962662 1220080 1168435 1280370 1136771 623067 901859 1749186 1701181 495977
2503 495977 -820403 -1603522 -1757898 -1565147 -975180 -823777 -480479 -884792 -600739 -181634
2493 -181634 -665208 -1211434 -1318239 -1110889 -1022274 -1258944 -1952262 -2471072 -2492535 -1641363
2483 -1641363 -190447 548751 498357 123905 -547162 -603496 -817993 -312577 -98838 -828420
2473 -828420 -823560 -506749 -113948 709077 1647046 1745874 811466 32894 130823 603103
2463 603103 824705 320150 -238691 -1098150 -1297023 -608468 26329 624513 1245312 1474787
2453 1474787 1465613 1500242 1554626 761200 1013935 2196821 2356081 2206536 1621501 1520828
2443 1520828 1374094 926841 710424 863542 799764 648019 216959 -665714 -349621 -163692
2433 -163692 -750931 -779417 -338788 73917 467379 950736 1207717 1212976 1735959 2248395
2423 2248395 2087320 1950493 1969603 1700304 1761188 1499127 20227 -623084 -154617 138431
2413 138431 -231385 -331966 42022 772681 1843335 2423367 1927984 1046817 680589 909641
2403 909641 1354110 1665501 832663 127533 279684 729900 1300502 1611383 229539 -998667
2393 -998667 -670901 -28722 -412635 -1323692 -1418348 -1469542 -2206112 -1978840 -1060096 -400802
2383 -400802 -152584 -585268 -753022 -1189147 -993458 -561000 -1160586 -1392449 -613100 104746
2373 104746 566132 649961 122742 -167678 970812 2414267 1779225 531605 -451062
2364 -451062 -510396 -429095 -305774 -414820 -533336 206159 1316260 1942574 1770681 954411
2354 954411 816647 734020 808342 976362 994249 1151571 1110894 842990 696810 366797
2344 366797 -173694 -123375 242708 169533 -427561 -867848 -395121 -85937 -496254 -829448
2334 -829448 -708250 -1258379 -1879305 -919205 -216442 -1435910 -1942717 -1635356 -2094531 -2214467
2324 -2214467 -1565060 -874508 -331745 -456263 -1353435 -2307191 -2260107 -1227294 -258523 177361
2314 177361 -67718 199064 558567 1148297 1809377 2221775 2965224 3303605 2983265 2185348
2304 2185348 1451523 1220726 1119904 944097 299536 -253325 -915002 -1144651 -69533
2295 -69533 838584 297935 -417728 -759224 -750944 -398408 293583 711257 1014188 606936
2285 606936 794375 1058568 1834193 2433835 2381336 2536702 2783525 2422779 822693 -301769
2275 -301769 -482987 -455091 -603173 -918544 -462758 72767 -700174 -1114556 -892891 -174420
2265 -174420 -55677 -619840 -693436 -532613 -778494 -1127036 -1031710 -618790 -418466 -262974
2255 -262974 -366648 -480843 -468137 -990030 -1955931 -1855845 -903577 -310999 -57417 6333
2245 6333 466101 813206 778601 357832 650335 1449041 1075340 875821 1417686 2050942
2235 2050942 1518944 529967 639888 377736 -781931 -1801628 -2312726 -2194640 -1681702
2226 -1681702 -1415154 -1349556 -1449042 -785346 -451264 -338688 -660106 -617246 -753817 -920395
2216 -920395 -781704 -794297 -895315 -439832 -492866 303446 1227237 911910 571254 371033
2206 371033 731817 1490172 1375079 742116 286850 -576370 -280556 749847 1517989 1452027
2196 1452027 1067787 685568 -77968 -558273 -259824 659085 801525 447177 604936 1268949
2186 1268949 1086453 84675 266238 1191711 1996415 1628173 1220474 985940 83354
2177 83354 -110021 557833 898252 938704 968479 1450598 1030403 -233659 -1057827 -1018638
2167 -1018638 -222861 954881 1247109 1441271 1478856 1822007 1936435 2029178 1799622 1228410
2157 1228410 804758 1208979 2270596 2940028 1840100 557884 -22987 -1014929 -2048885
2148 -2048885 -2028080 -1708734 -1272127 -1429889 -2265931 -2202356 -1722049 -1193613 -374149 -88797
2138 -88797 -239757 477601 1255065 1208087 992692 596623 -26369 351066 1292791 758821
2128 758821 -245559 -1036827 -1244222 -407035 575358 1025668 944173 1024077 141561 -865966
2118 -865966 -1505420 -1357931 -707737 -218722 -1235614 -2420474 -2302614 -1787458 -1775177 -2289168
2108 -2289168 -2206109 -1902294 -1180851 -684559 -1153352 -1582365 -1025593 -790667 -1215183 -1085207
2098 -1085207 -429760 -31335 153771 505433 984965 1427878 1811179 1839618 1662458 1717850
2088 1717850 1370359 948456 715808 490359 287128 854003 1549190 1355902 954014 1209243
2078 1209243 851233 1322293 2471467 2801651 2200574 1769321 1303058 879052 593059
2069 593059 60755 -679246 -555076 -10234 586213 1176157 1654159 816570 -157450 -35081
2059 -35081 621424 1005363 1040929 412659 -637725 -1205292 -1507234 -1896980 -2182658 -1121584
2049 -1121584 168570 -125467 -882018 -1623287 -2354140 -2104138 -998688 -722623 -938468
2040 -938468 -671652 -389060 -744126 -1571379 -1276595 -846790 -1009418 -1082681 -779509 -520293
2030 -520293 -96274 306231 -68812 -621072 -905307 -1467179 -2147679 -2162982 -2057072 -1925588
2020 -1925588 -864892 -345549 -836805 -756224 81386 763476 1251510 1680886 1512130 1417743
2010 1417743 1278725 375494 -300715 -813734 -1481601 -975074 -201107 382395 -59698 -1316658
2000 -1316658 -1787093 -1294160 -971608 -1153844 -1608951 -1620832 -675860 749610 1372799 1418211
1990 1418211 1481816 1480304 1109511 -146500 -523451 647420 1487071 671906 -419669 -945479
1980 -945479 -1922417 -2808279 -2939133 -2456900 -1258942 -424602 -341634 -655284 -923645 -1404927
1970 -1404927 -1164141 5022 1216985 1284811 172124 92781 818090 900191 1053640 2247842
1960 2247842 2851925 2527658 2248381 1675738 586597 -73662 -187355 -289994 -103473
1951 -103473 -104083 -881854 -1149658 -564255 -354464 122676 961476 1052418 747330 571751
1941 571751 1293299 1798197 1745256 1977506 1428543 988694 1256111 876309 -805080 -1435003
1931 -1435003 -200526 20556 -775122 -471406 26553 387607 -196114 -1334747 -1204514
1922 -1204514 -374759 263381 667128 580179 319514 591667 988997 658597 91159 -271908
1912 -271908 -716280 -442426 703218 1254361 2039115 2503984 2395117 1896437 655431
1903 655431 -839377 -1661759 -1408527 -1017801 -1020993 -372434 476364 717828 614789 599463
1893 599463 546268 350828 274136 720207 1144074 1271385 617536 209420 8129 399700
1883 399700 933329 1381841 1397559 863648 590819 -27962 -1097179 -946355 -699502 -780719
1873 -780719 -1194472 -1551761 -1251526 -1090733 -1385230 -1558342 -1147730 -197212 -424767 -844042
1863 -844042 -217525 330989 1303500 1481707 873459 506589 225005 -4106 -239078 -282570
1853 -282570 399288 638417 -97197 -72059 -63435 -538510 -349009 -712669 -1703398 -2246822
1843 -2246822 -2011245 -1515977 -1660872 -1760586 -1442027 -407497 -268563 -746217 -783960 -810886
1833 -810886 -1058198 -963136 25020 948062 1542714 970300 -141603 -845456 -1323905 -1566497
1823 -1566497 -1527973 -1147966 -489305 -6214 496609 347983 -164304 -331706 -508309 -1083239
1813 -1083239 -1345668 -1589823 -1787836 -1431160 -1348573 -1430238 -1259210 -687336 -589620 -1498233
1803 -1498233 -1801470 -935701 -360982 -238857 -465980 -802538 -735880 -1096371 -1839791 -2097086
1793 -2097086 -1239721 -749748 -1098143 -1603062 -1854376 -1912442 -1975325 -2276850 -1738135 -573394
1783 -573394 107832 866558 1979232 1675035 762063 190652 -332377 -438311 -544379 -317450
1773 -317450 -633441 -838915 -957567 -776734 75731 628074 403313 431635 844426 1046453
1763 1046453 1064795 1006907 1100059 594702 238550 -516173 -947996 -950744 -1000952 -1018392 -756348
1752 -756348 -502559 -656209 -1459304 -2148694 -1657854 -1178736 -836352 -429561 -499062 -256668
1742 -256668 543262 609484 730745 1417125 1314126 943682 766649 457064 -313304 -20083
1732 -20083 692393 362754 -126840 88165 724148 858588 605870 294896 110746 364562
1722 364562 302210 -169896 132736 253768 -317998 -900310 -489379 438631 275228 295998
1712 295998 679833 851191 437113 147547 -204710 -705428 -1342301 -2014051 -1625376 -411890
1702 -411890 1056507 1889036 1550074 1478444 1843235 1291066 283459 1004912 1823224 1917494
1692 1917494 1376977 980360 455848 -615641 -1012935 217637 1814657 2401253 1963523
1683 1963523 1649070 1866929 1725912 1528090 1191540 551105 -2456 -695274 -1433063 -1221952
1673 -1221952 -194407 21907 -369800 -560426 -806111 -1256658 -977281 -381106 -799859
1664 -799859 -1719417 -1882542 -1002372 -739836 -1184174 -1186506 -1530970 -1805173 -1036633 -835489
1654 -835489 -862898 -121531 1289082 2664720 2379961 786292 -427928 -810214 -140635
1645 -140635 103711 477460 458707 238570 321902 367723 388364 33117 73254 343775 442738
1634 442738 -47026 -1640668 -2354356 -1580559 -622998 49674 245347 338360 338201 -53591
1624 -53591 -197292 -57105 713502 918988 778411 612173 750248 1117537 1343231 1539273
1614 1539273 938787 -251480 -1394645 -2189752 -2022473 -419066 373778 -241602 -944063
1605 -944063 -877817 -255527 406498 830274 344120 212102 9230 -569225 -981191 -902204
1595 -902204 -1164700 -825157 -129488 759867 1900550 2153532 1832332 1918700 1154106 105607
1585 105607 -10349 -244878 -191848 -135605 -649664 -1207519 -805015 -313484 -476699 -324827
1575 -324827 -391986 -440556 518091 854036 -179270 -952228 -951227 -807004 -540495 161943
1565 161943 1456327 2846834 3072881 2674009 2066110 1955628 2042344 1748483 1728710 1678054
1555 1678054 1808560 1794185 1094768 -5388 -513693 -919188 -1489597 -1415412 -756940 -77160
1545 -77160 612417 498982 162387 -618862 -784584 -316874 -284826 432369 980801 1264891
1535 1264891 1739545 2216095 1478973 740344 879450 950441 585901 -236780 -771410 -444328
1525 -444328 584946 1056268 1000660 -54710 -1130307 -1202541 -826252 -1743750 -2212212 -1399083
1515 -1399083 -581244 -1053126 -1957910 -1446580 -79710 997980 1534022 1602342 1198002
1506 1198002 984771 1265509 1631931 1883377 1793442 1408980 731033 65874 -327377 -727243
1496 -727243 -828794 -443706 -48173 114101 477856 888339 1046641 1068669 1006899 1162762
1486 1162762 764253 1047183 1071422 468037 294764 97401 130351 493497 611306 1032858
1476 1032858 1697417 653484 -1146155 -1699342 -1559077 -1033094 -394373 -739955 -1726347
1467 -1726347 -1990919 -663687 332407 694280 1684438 2792577 2512921 2367825 2587712
1458 2587712 2354275 1901275 2339027 2543872 1662175 1092089 738024 118326 -446716 -243463
1448 -243463 -123806 -744107 -806345 -399821 -393032 -31039 360281 912535 1659674 1396851
1438 1396851 226486 -100134 318148 618561 571998 672872 703552 334112 -144372 -279845
1428 -279845 135902 371488 645705 973433 1402884 816304 496506 945026 668088 -641179
1418 -641179 -879049 -270142 59221 27849 496747 1211249 1436391 1085033 274072 -885626
1408 -885626 -1295790 -1263245 -1098055 -534521 -21750 886720 1485364 965705 -253117 -665156
1398 -665156 -820718 -1259482 -1009850 -131771 -422608 -600796 -714221 -929626 -482581 -214201
1388 -214201 -231440 246312 610353 1054334 1255266 1149506 529181 323371 701278 1058264
1378 1058264 812315 531112 528695 304576 27328 -454331 424113 2051167 3278872 3013686
1368 3013686 963665 -590984 -162395 693388 1718381 2393115 1004022 -301512 -1290364
1359 -1290364 -1693274 -652715 -523330 -931626 -385186 143885 -327226 -728274 -875512
1350 -875512 -689003 -776131 -568276 -150483 22503 -327635 -588162 -423181 90702 496768
1340 496768 1340390 1560726 1304001 1286389 1085030 25126 -836282 -722810 -293413 -271258
1330 -271258 609388 911664 437762 -41167 -311311 529134 1320269 2063677 1916097 431238
1320 431238 -535682 159085 334066 -397216 -1133101 -1461905 -1431898 -754471 -698989 -1746166
1310 -1746166 -1951475 -2093212 -2316268 -2789904 -2723437 -1701626 -493631 253431 -274146
1301 -274146 -618422 -349318 92844 -315465 -920292 -283671 735441 615530 35160 -82373
1291 -82373 133276 833807 1327836 744058 650729 963723 1037021 731737 463779 462941 167607
1280 167607 313953 385577 -573781 -205051 679905 646388 915893 1539922 1257751 364003
1270 364003 -565542 -1538360 -1452247 -713973 -837066 -1272865 -876567 -893437 -1136734 -1116993
1260 -1116993 -292943 399888 -143192 -522987 -578755 -485380 -400201 -482659 -348536 -251776
1250 -251776 -161473 -249782 -939385 -833978 -485143 -100310 219634 725190 1184332 796961
1240 796961 -391152 -717326 -653232 -688793 -937431 -666701 80162 667523 411294 -367882
1230 -367882 -985697 -1631192 -1678073 -800141 -65389 -391301 -1734834 -2198101 -1031247 -144314
1220 -144314 -225112 -919867 -1518671 -1718652 -1358922 -518311 202338 172438 -254136 -353085
1210 -353085 80614 597015 1016397 1052809 518557 328130 490553 739106 554224 -347579
1200 -347579 -979900 -1595643 -2298261 -2333057 -1504269 -779548 -427542 648586 1699363 1509125
1190 1509125 607027 127802 300005 1028511 1025721 296543 20832 -50848 -74544 103805
1180 103805 377184 -281783 -1032150 -907761 -953409 -1158250 -1874729 -2123993 -1874686 -1898654
1170 -1898654 -1776032 -1649545 -1322448 -634190 501810 334892 -754833 -1060386 -1403396
1161 -1403396 -1824573 -2654379 -3124318 -2082510 -685496 608822 1399635 862823 687212
1152 687212 787003 -52733 -692256 -533662 -55681 150221 702067 1374439 1547175 1613977
1142 1613977 1764892 1711782 1094209 353765 -176020 -607374 -1171880 -1135232 -671170 170283
1132 170283 619271 -107187 -1043851 -586853 310040 837748 2313981 3058644 3001045 2950515
1122 2950515 1904166 962868 527851 383662 799584 276832 605857 1951989 2599379
1113 2599379 1899836 1490824 1294744 399985 328025 720641 1163682 1344534 1475447 1735886
1103 1735886 1259409 710035 708043 858951 1141167 1251311 1605155 1810911 477093 -465973
1093 -465973 -972179 -762740 -821234 -1173641 -1204520 -990069 -1769134 -1838440 -675639 -53258
1083 -53258 424983 585077 821017 1113610 812400 178579 -337546 -1198467 -1929439 -1819298
1073 -1819298 -1439549 -1282194 -544300 486546 1635029 2331752 1801458 987984 105016
1064 105016 -941064 -1710755 -1822390 -1759928 -1710779 -1431938 -500992 769508 1028142 1227960
1054 1227960 1658397 936356 549508 502286 638398 703230 729438 986043 1260547 286471
1044 286471 -569570 -1327966 -1174177 -14476 399533 1039740 548663 -520005 -586681 -604038
1034 -604038 -1115632 -1599185 -852011 -16850 454936 1033892 770421 327439 84470 -705205
1024 -705205 -1312414 -1021178 -821877 -444083 -506077 -1234130 -551580 99507 35683 65130
1014 65130 672304 1183361 -95647 -1232896 -1340928 -583786 798243 1340335 538715
1005 538715 -71259 -91160 960564 1830232 1525118 606447 -114540 233004 1348288 1905317
995 1905317 1777263 1227834 1764640 1892689 1115348 106613 -354048 -560243 -20923 736905
985 736905 1445176 1705601 1622199 1145010 836502 375882 380496 917383 -106467 -744957
975 -744957 -1003670 -1424658 -1206576 -312574 115203 -164540 -232216 67823 327886 -47699
965 -47699 -63329 28353 206875 420375 220788 222365 677278 625073 465392 302769 -472196
954 -472196 -907189 -1216676 -1658698 -2184274 -2389281 -1487760 -108485 610361 908922 1083869
944 1083869 1080280 1428385 1711724 1209877 663917 -282214 32035 1650544 1981057 1425746
934 1425746 1579065 1785552 1929306 1393131 538566 522718 792666 323773 -315356 -490595
924 -490595 -751329 -231171 312510 1026627 1393348 823361 834596 801517 141902 405785
914 405785 1142610 1402086 974996 148160 120857 311098 569210 1372913 1976982 1631036
904 1631036 1392825 1793431 2125825 2344548 1884682 744157 -508422 -531073 102535 -22562
894 -22562 240238 428028 6563 -1103377 -1490170 -1329703 -940399 -302242 319510 551375
884 551375 539704 879067 856732 485464 453968 1354155 1474989 1227485 1557638 1925041
874 1925041 1665914 1010375 -240046 -1592227 -1381826 -493157 658360 1225676 677078
865 677078 11833 -698646 -1139895 -1021977 -443509 401044 470151 7644 -61754 -146259
855 -146259 -529952 -1092056 -199015 605135 603987 790146 1413970 1705211 1209987 1451908
845 1451908 1635246 1572755 1122973 69000 -879758 -820302 -279480 238763 -386200 -1316243
835 -1316243 -2088183 -2345805 -2063907 -1101878 -464382 -435786 106512 613339 566877 386014
825 386014 43855 -61140 36623 242114 727094 387735 220247 -200527 -791985 -845384
815 -845384 -1127079 -373668 898982 1505441 1582605 1297798 1216860 1225250 965784 1235855
805 1235855 1681573 1228242 388192 -355353 -378822 -423896 -805538 -1002966 -912675 -917783 -599052
794 -599052 -262112 -793185 -538896 -100403 -360919 -147501 511142 1495377 2234796 2124223
784 2124223 1378296 426751 210192 1329914 1906522 1414833 981085 99974 -633227 -1280270
774 -1280270 -1686704 -1892471 -1344274 -547811 290732 1279690 2141438 2621876 2716064 2406168
764 2406168 1758843 1649136 1020764 -86227 -106651 -243395 -635883 -399923 -32853 -563005
754 -563005 -971026 -712950 -71050 182248 193743 -112356 -947573 -1176779 -870385 -294720
744 -294720 -572279 -1269126 -925302 -419593 -315092 -842139 -2035597 -2595682 -3099034 -2834753
734 -2834753 -1607680 -639528 -503262 -448920 -525188 -376118 -914507 -1048314 -902435 -1047148
724 -1047148 -1019276 -712497 -30240 106014 78612 29110 -145100 -37425 493637 918246
714 918246 1011869 958292 544747 47009 -4049 1030266 2192555 2886238 2263525 806341
704 806341 -394102 -1797331 -1897666 -456354 311393 413964 469788 791576 916540 194886
694 194886 -712505 -1293349 -1611239 -1636655 -1423225 -1395731 -1153702 -928843 -878518 -920346 -420100
683 -420100 233813 724695 561386 -122955 -48613 303284 334310 -63564 -106496 372857
673 372857 447023 913782 2020560 2990698 2738775 1855020 188190 -1452383 -537541 365662
$$ [...]
##END NTUPLES=NMR SPECTRUM
##END=
