##TITLE=C13_LR-0155-CBZ-C2-Et2O
 DMSO-d6, 22100 sc

 12.4.2023
##JCAMPDX= 6.0         $$ Bruker NMR JCAMP-DX V2.0
##DATA TYPE= NMR SPECTRUM
##DATA CLASS= NTUPLES
##ORIGIN= UXNMR, Bruker Analytische Messtechnik GmbH
##OWNER= root
$$ XWIN-NMR		Version 3.5
$$ Thu Apr 13 13:36:03 2023 Russian Standard Time (UT+4h)  she@DPX200
##.OBSERVE FREQUENCY= 50.327896
##.OBSERVE NUCLEUS= ^13C
##.ACQUISITION MODE= SIMULTANEOUS
##.ACQUISITION SCHEME= undefined
##.AVERAGES= 18275
##.DIGITISER RES= 17
##SPECTROMETER/DATA SYSTEM= spect
##.PULSE SEQUENCE= zgpg30
##.SOLVENT NAME= CDCl3
##.SHIFT REFERENCE= (INTERNAL, CDCl3, 0, 222.624)
##AUDIT TRAIL= $$ (NUMBER, WHEN, WHO, WHERE, WHAT)
$$ ##TITLE= Audit trail, XWIN-NMR		Version 3.5
$$ ##JCAMPDX= 5.01
$$ ##ORIGIN= Bruker BioSpin GmbH
$$ ##OWNER= she
$$ F:/spectra/data/she/nmr/c13/1/pdata/1/auditp.txt
$$ ##AUDIT TRAIL=  $$ (NUMBER, WHEN, WHO, WHERE, WHAT)
(   1,<2023-04-13 10:05:41.68 +0400>,<she>,<DPX200>,
      <created by zg, POWCHK disabled, PULCHK disabled
       terminated by command 'halt'
       configuration hash MD5:
       00 E9 B6 7A A2 85 ED C7 34 08 36 98 17 FE 4E 26
       data hash MD5: 32K
       19 E2 FE AF 9E 99 2A 6A 85 54 E2 1F A7 68 28 8F>)
(   2,<2023-04-13 13:34:28.95 +0400>,<she>,<DPX200>,
      <Start of raw data processing
       efp BC_mod = 2 LB = 2 FT_mod = 6 PKNL = 1 PHC0 = -295.9884 PHC1 = 18.28503 SI = 32K 
       data hash MD5: 32K
       1E E1 8A 33 8A 09 B4 5D CF 80 86 B8 D8 3D B9 B7>)
(   3,<2023-04-13 13:34:31.75 +0400>,<she>,<DPX200>,
      <abs ABSG = 5 
       data hash MD5: 32K
       01 5F 59 C7 34 28 5F 40 78 7B 60 C2 56 72 4B 97>)
(   4,<2023-04-13 13:34:46.50 +0400>,<she>,<DPX200>,
      <pk PHC0 = -4.371932 PHC1 = 7.2 
       data hash MD5: 32K
       B4 18 A0 48 CA 49 0E E7 EC 83 AA 4F 95 3F FE 60>)
(   5,<2023-04-13 13:34:49.57 +0400>,<she>,<DPX200>,
      <abs ABSG = 5 
       data hash MD5: 32K
       A6 65 28 7A CB 52 E7 9F A7 7B 3E F7 9B C2 DB EF>)
$$ ##END=
$$ 
$$ hash MD5
$$ 46 E5 45 2F 02 66 D2 F5 AA F0 88 6A 94 A1 69 EA
##$RELAX= 
##$RELAX= 
##$RELAX= 
##$RELAX= 
##$RELAX= 
##$RELAX= 
##$RELAX= 
##$RELAX= 
$$ Bruker specific parameters
$$ --------------------------
##$DU= <F:/spectra>
##$EXPNO= 1
##$NAME= <c13>
##$PROCNO= 1
##$TYPE= <nmr>
##$USER= <she>
##$AMP= (0..31)
100 100 100 100 100 100 100 100 100 100 100 100 100 100 100 100 100 100 
100 100 100 100 100 100 100 100 100 100 100 100 100 100 
##$AQSEQ= 0
##$AQ_mod= 1
##$AUNM= <au_zg>
##$AUTOPOS= <>
##$BF1= 50.322709
##$BF2= 200.13
##$BF3= 50.322709
##$BF4= 500.13
##$BF5= 500.13
##$BF6= 500.13
##$BF7= 500.13
##$BF8= 500.13
##$BYTORDA= 1
##$CFDGTYP= 0
##$CFRGTYP= 5
##$CHEMSTR= <none>
##$CNST= (0..31)
1 1 145 1 1 1 1 1 1 1 1 1 1 1 1 1 1 1 1 1 1 1 1 1 1 1 1 1 1 1 1 1 
##$CPDPRG= <waltz16>
##$CPDPRG1= <>
##$CPDPRG2= <waltz16>
##$CPDPRG3= <>
##$CPDPRG4= <mlev>
##$CPDPRG5= <mlev>
##$CPDPRG6= <mlev>
##$CPDPRG7= <mlev>
##$CPDPRG8= <mlev>
##$CPDPRGB= <>
##$CPDPRGT= <>
##$D= (0..31)
$$ [...]
##$SUBNAM4= <"">
##$SUBNAM5= <"">
##$SUBNAM6= <"">
##$SUBNAM7= <"">
##$SUBNAM8= <"">
##$SUBNAM9= <"">
##$SW= 239.972175391363
##$SWIBOX= (0..15)
0 1 3 0 0 0 0 0 0 0 0 0 0 0 0 0 
##$SW_h= 12077.2946859903
##$TD= 32768
##$TD0= 1
##$TE= 0
##$TE2= 300
##$TE3= 300
##$TEG= 300
##$TL= (0..7)
120 120 120 120 120 120 120 120 
##$TP= (0..7)
150 150 150 150 150 150 150 150 
##$TP07= 0
##$TPNAME0= <>
##$TPNAME1= <>
##$TPNAME2= <>
##$TPNAME3= <>
##$TPNAME4= <>
##$TPNAME5= <>
##$TPNAME6= <>
##$TPNAME7= <>
##$TPOAL= (0..7)
0.5 0.5 0.5 0.5 0.5 0.5 0.5 0.5 
##$TPOFFS= (0..7)
0 0 0 0 0 0 0 0 
##$TUNHIN= 0
##$TUNHOUT= 0
##$TUNXOUT= 0
##$USERA1= <user>
##$USERA2= <user>
##$USERA3= <user>
##$USERA4= <user>
##$USERA5= <user>
##$V9= 5
##$VALIST= <valist>
##$VCLIST= <CCCCCCCCCCCCCCC>
##$VD= 0
##$VDLIST= <DDDDDDDDDDDDDDD>
##$VPLIST= <PPPPPPPPPPPPPPP>
##$VTLIST= <TTTTTTTTTTTTTTT>
##$WBST= 1024
##$WBSW= 4
##$XGAIN= (0..3)
0 0 0 0 
##$XL= 0
##$YL= 0
##$YMAX_a= 90643323
##$YMIN_a= -41729562
##$ZGOPTNS= <>
##$ZL1= 120
##$ZL2= 120
##$ZL3= 120
##$ZL4= 120
##$ABSF1= 222.624
##$ABSF2= -17.3728
##$ABSG= 5
##$ABSL= 3
##$ALPHA= 0
##$AQORDER= 0
##$ASSFAC= 0
##$ASSFACI= 0
##$ASSFACX= 0
##$ASSWID= 0
##$AUNMP= <proc_1d>
##$AZFE= 0.1
##$AZFW= 0.5
##$BCFW= 0
##$BC_mod= 2
##$BYTORDP= 0
##$COROFFS= 0
##$CY= -3
##$DATMOD= 1
##$DC= 0
##$DFILT= <>
##$DTYPP= 0
##$F1P= 0
##$F2P= 0
##$FCOR= 0.5
##$FTSIZE= 32768
##$FT_mod= 6
##$GAMMA= 0
##$GB= 0
##$INTBC= 1
##$INTSCL= 4.134877e-10
##$ISEN= 128
##$LB= 2
##$LEV0= 0
##$LPBIN= 0
##$MAXI= 10000
##$MC2= 0
##$MEAN= 0
##$ME_mod= 0
##$MI= 0.1934396
##$NCOEF= 0
##$NC_proc= 3
##$NLEV= 6
##$NOISF1= 120.0001
##$NOISF2= 80.00006
##$NSP= 0
##$NTH_PI= 0
##$NZP= 0
##$OFFSET= 222.624
##$PC= 1.4
##$PHC0= -300.3603
##$PHC1= 25.48503
##$PH_mod= 1
##$PKNL= yes
##$PPARMOD= 0
##$PSCAL= 0
##$PSIGN= 0
##$REVERSE= no
##$SF= 50.3227315983092
##$SI= 32768
##$SIGF1= 140
##$SIGF2= 120
##$SINO= 11.81781
##$SIOLD= 32768
##$SREGLST= <13C.CDCl3>
##$SSB= 0
##$STSI= 32768
##$STSR= 0
##$SW_p= 12077.2946859903
##$SYMM= 0
##$S_DEV= 0
##$TDeff= 32768
##$TDoff= 0
##$TI= <>
##$TILT= no
##$TM1= 0
##$TM2= 0
##$TOPLEV= 0
##$USERP1= <user>
##$USERP2= <user>
##$USERP3= <user>
##$USERP4= <user>
##$USERP5= <user>
##$WDW= 1
##$XDIM= 32768
##$YMAX_p= 399347418
##$YMIN_p= -781760
$$ End of Bruker specific parameters
$$ ---------------------------------
##NTUPLES= NMR SPECTRUM
##VAR_NAME=  FREQUENCY,     SPECTRUM/REAL,   SPECTRUM/IMAG
##SYMBOL=    X,             R,               I
##VAR_TYPE=  INDEPENDENT,   DEPENDENT,       DEPENDENT
##VAR_FORM=  AFFN,          ASDF,            ASDF
##VAR_DIM=   32768,         32768,           32768
##UNITS=     HZ,            ARBITRARY UNITS, ARBITRARY UNITS
##FACTOR=    0.368581032318806, 1,           1
##FIRST=     11203.0474430531, 0,            0
##LAST=      -874.247242937185, 0,           0
##MIN=       -874.247242937185, -781760,     0
##MAX=       11203.0474430531, 399347418,    0
$$ Real data points
##PAGE= N=1
##DATA TABLE= (X++(R..R)), XYDATA
$$ [...]
10984D16842j0023J791J7475J9859k981m1634o3393o5556p9120r9067j03056p9120
10972h7983m1215j6014K253J0821K4782O5917R6939P1022K0552k2959n1735n8705
10960A3675o1106p3817o0193L800N1805M0438M229k9526l0798J021L7539O1856
10948d1077N0481J2650j0708j1434p840j2923k9775m2529m0582k5185n345P05
10936a63562j6999l9967l5949L030O0681J04394J11615P3944N884l7199k6873
10925C8999l2678o2845n3240k6860p301K8579O5881P4610M1793k7934q1625p5299
10913a17920l7352l790J3971L848j4173j4075K185Q631K6453N5758N3581j0607
10901c3490j04991j58204j23797l8924J2390J7685K5726O2831Q2877Q2613Q0409
$$ plain form
10984 416842 406819 408610 426085 445944 442963 401329 337936 272380 193260 94193 -8863 -87983
10972 -87983 -129198 -145212 -142959 -132138 -107356 -41439 55500 126522 147074 124115 72380 13675
10960 13675 -47431 -121248 -181441 -177641 -125836 -85398 -81169 -110695 -141493 -140472 -102933 -41077
10948 -41077 9404 22054 11346 -88 -7928 -20851 -50626 -93155 -133737 -158922 -164267 -163562
10936 -163562 -180561 -220528 -256477 -253447 -192766 -88372 23243 97187 103071 65872 38999
10925 38999 6321 -56524 -109764 -136624 -143925 -115346 -49465 25145 66938 39004 -42621 -117920
10913 -117920 -155272 -159062 -145091 -141243 -155416 -169491 -167306 -158675 -132222 -76464 -22883 -33490
10901 -33490 -138481 -296685 -420482 -459406 -447016 -429331 -403605 -340774 -257897 -175284 -94875
10890i4875O8620O0120N7101N2086L0362j3149k7433O668L6750J0342n3329o9185
10878F4078l1847p411q964k0584m5544r0211r8891m0231J1894O261k3737n020
10866b90207P1957J22180J08000O3854K0014K605j3809o3614r7157n2501M1468
10855h7210R5650P0776K3219J7093J4759k4693o2354n5579r729J9301j406k7107
10843b7280k9916m2444o8068p6982o9075p3567q1366p7695m7304K5638R1045J12173
10831c64841J09736J14822J06184O5550K1254k9914o7259o5072m8130m4480m7119
10820b49269l3847j4998N303K9765L8027K6524K0484K2771L0719N1594M0524j0644
10808d3047m2180m2564j1931K9889K7626k359j8859k6825k6668j1598O504J5498
$$ plain form
10890 -94875 -26255 33865 90966 143052 173414 160265 132832 139500 176250 186592 133263 64078
10878 64078 32231 24820 15856 -4728 -50272 -140483 -239374 -279605 -267711 -261450 -285187 -290207
10866 -290207 -218250 -96070 11930 75784 95798 98403 84594 20980 -76177 -128678 -87210
10855 -87210 8440 79216 102435 119528 134287 109594 47240 -8339 -18068 1233 -173 -27280
10843 -27280 -57196 -99640 -167708 -244690 -313765 -387332 -468698 -546393 -593697 -568059 -477014 -364841
10831 -364841 -255105 -140283 -34099 31451 52705 22791 -44468 -109540 -157670 -202150 -249269
10820 -249269 -283116 -298114 -292811 -263046 -225019 -198495 -178011 -155240 -124521 -72927 -32403 -43047
10808 -43047 -85227 -127791 -139722 -109833 -82207 -84566 -103425 -130250 -156918 -168516 -162012 -146514
10796a46514J2815J1206J5869O688j3644k4353n0029q4774o7463j8958J0703M6596
10784c01858Q4342O2107j223k7167r500K2246N0532N8751L7462n966l0495n670
10772f6439K5740L3506K3773N624p086q806Q444L4123K1919k8875n5914m1280
10760e5271o399J1059m005L090L1521N2435N2199M6531M9279L3581k6816r3922
10748I3282j24812j13537p2560j448L5112r247n3740l8623l402K021J835Q921
10736b76198M454j4264k7357j0291M0594R2331J05896P5271K1412j1557k4507
10725b4216l0957q603L3543L7443k8245r5492r5839n6215j2781L1373N8921N8896
10713a32172M8264M4035K9230k422r848j640j7511n4408q3600q0194k6275M6365
$$ plain form
10796 -146514 -133699 -122493 -106624 -99936 -113580 -137933 -187962 -272736 -340199 -359157 -348454 -301858
10784 -301858 -217516 -155409 -156632 -183799 -193299 -171053 -120521 -61770 -24308 -30274 -60769 -66439
10772 -66439 -40699 -7193 16580 22204 15118 6312 14756 48879 70798 41923 -13991 -55271
10760 -55271 -61670 -50611 -54616 -51526 -20005 32430 84629 131160 180439 214020 187204 93282
10748 93282 -31530 -145067 -217627 -219075 -183963 -193210 -246950 -285573 -288975 -286954 -285119 -276198
10736 -276198 -271744 -286008 -313365 -323656 -283062 -190731 -84835 -9564 11848 291 -24216
10725 -24216 -55173 -63776 -30233 7210 -21035 -116527 -212366 -268581 -281362 -249989 -191068 -132172
10713 -132172 -83908 -39873 -10643 -13065 -22913 -24553 -42064 -96472 -180072 -260266 -286541 -240176
10701b40176P5296O5125N3118L9152O485j2319J7428P2987J03339P1620K896m1174
10689B13777l0777O24J0977j2343o3080j15015j27700p4880N701O6595Q1477P5373
10677C0729Q5324Q5524N6325J4087k3376k7179n165K0416M1955M2280J0673j1253
10665C20340k4693o3756j09473j32251j17441q5318l8669J4997K7440O048l926
10654b06702J5433M5747M4651J624m6553p3439p1926l7799R578N0776O8276N2433
10642a47901J9025q333l4048n6387n2369k7678J5620P2387R9321N7583j5860n3836
10630a32476n2810m2320k5834n945J6665M1581O5465P6205O6606L4790k0493o0308
10618c8874o6739n0203p922K6733K0454j0368m1935o0543n0363k2123K5561N7611
$$ plain form
10701 -240176 -164880 -99755 -46637 -7485 -1000 -13319 4109 77096 180435 252055 254951 213777
10689 213777 183000 183624 194601 182258 119178 4163 -123537 -198417 -192716 -126121 -44644 30729
10677 30729 116053 201577 257902 271989 248613 221434 216269 236685 278640 320920 331593 320340
10665 320340 295647 231891 122418 -9833 -127274 -212592 -251261 -236264 -208824 -202776 -206702
10654 -206702 -191269 -145522 -100871 -99247 -145800 -219239 -291165 -328964 -319386 -268610 -200334 -147901
10642 -147901 -128876 -137209 -171257 -227644 -280013 -307691 -292071 -219684 -120363 -62780 -78640 -132476
10630 -132476 -185286 -227606 -253440 -259385 -242720 -201139 -135674 -59469 7137 41927 21434 -38874
10618 -38874 -105613 -155816 -163738 -137005 -116551 -126919 -168854 -229397 -279760 -301883 -276322 -218711
10606b18711N0169K1354Q622K2731J2040l0491j7188O2629J14462J01057N4128
10595A80802J2513R50J1808L2773N6560O2574N3664M1234K1513m021m2087q0791
10583C47492j13693j25450r3164m4819j9868l3821n8277n2404m3073n8382o9733
10572c65192l2103M7985J05584J06683P3258L2768j3742k6355K7001Q1871O3735
10561A01493j0758n5695l9199j5614m2169p8887o8380k7696N163J8456M860j6988
10549b25414k3238k0660j2338M997M3285Q7896J09603J06874Q8725O0439M0239
10538B60408M6826M9998L1631K5222L9584K7127k4451o7682p8690n2315k4368
10527B33290j8052j2627j7116k8924j9440m365L345J0468Q912M101n580m3393
$$ plain form
10606 -218711 -168542 -147188 -138566 -115835 -103795 -134286 -151474 -88845 25617 126674 180802
10595 180802 193315 194265 206073 238846 295406 357980 411644 452878 474391 470370 428283 347492
10583 347492 233799 108349 15185 -29634 -49502 -83323 -141600 -194004 -237077 -295459 -365192
10572 -365192 -397295 -349310 -243726 -137043 -63785 -31017 -44759 -71114 -44113 37758 101493
10561 101493 90735 35040 -4159 -19773 -61942 -140829 -209209 -236905 -231742 -213286 -208426 -225414
10549 -225414 -248652 -269312 -281650 -276653 -233368 -145472 -35869 71005 159730 220169 260408
10538 260408 307234 357232 388863 414085 453669 480796 456345 388663 309973 257658 233290
10527 233290 215238 202611 185495 156571 137131 132766 136111 146579 155491 159592 154012 110619
10515A10619p9473o8911k4956J678j781j8098j4590j2300k5323l2304k9739j8252
10503b13430R412M3578M7579K6131J5381K4626L0963K4878J1852j4810n5415p9263
10491a28518n8148j1337L8448Q9456J21320J08078N5745L841k0321m5129q7876
10480F5559j17832j07018p8699n2061l1233k0079j1061l341j6158k2862m690J8801
10468c80674L5302K2966p093j5605p280J1591M1091O4857O5157N2023L7335K0774
10456e9556K601r926k2319l8988l4833r693J1785J4745Q058j800j4093l8028o4836
10443b56883q6124q4099m3096K4182R7025J45139J55248J27269O7786K5806J7289
10432A89542J7181J755k4208k6743q424r371n0330j03374j16397p6309k0436L3283
$$ plain form
10515 110619 31146 -37765 -62721 -61043 -62824 -80922 -95512 -107812 -133135 -165439 -195178 -213430
10503 -213430 -204018 -160440 -112861 -86730 -71349 -46723 -15760 9118 20970 6160 -49255 -128518
10491 -128518 -186666 -198003 -159555 -70099 51221 159299 215044 218885 198564 153435 65559
10480 65559 -52273 -159291 -237990 -290051 -321284 -341363 -352424 -355765 -371923 -394785 -399475 -380674
10468 -380674 -345372 -322406 -329499 -345104 -352384 -340793 -299702 -234845 -169688 -117665 -80330 -59556
10456 -59556 -56955 -66881 -89200 -128188 -163021 -172714 -160929 -146184 -138126 -139926 -154019 -192047 -256883
10443 -256883 -343007 -427106 -470202 -446020 -348995 -203856 -48608 78661 146447 172253 189542
10432 189542 206723 208478 184270 157527 149103 139732 89402 -13972 -130369 -206678 -227114 -193831
10420a93831P3360O9913K8535l1801q7757r8896o8554k8302l322m880j6324j1665
10408c73524K2769O1931Q0008P7807P2649O2925K7576j7605l5565l9125m9425
10397a09579n0275m4458l5356l1069l4532k3002Q13K4402M0194L6826K4853L1211
10385a69972N4406O1930M9619K3004j7195m0282l5259j3954k444r730j9836m0661
10373a60374n6951m2510j5553o220j5643k1851k1671l2122k9797l099N040Q390
10361c92361L5814N8950M7412J9478r877k9354j8965J554j359k5893l6381j5685
10349c66667K3814M4378M3895M9536O7897Q9399J01542J01409Q3282L1877l5933
10338B34429p4606o2982k7194R752J7189R256M706j9313n5714p3989q2166q7829
$$ plain form
10420 -193831 -120471 -50558 -22023 -53824 -141581 -240477 -309031 -337333 -340655 -345535 -361859 -373524
10408 -373524 -350755 -288824 -208816 -131009 -58360 4565 32141 14536 -21029 -60154 -109579
10397 -109579 -159854 -204312 -239668 -270737 -305269 -328271 -327458 -303056 -262862 -226036 -201183 -169972
10385 -169972 -115566 -53636 -4017 18987 1792 -38490 -73749 -87703 -90147 -99877 -119713 -160374
10373 -160374 -217325 -259835 -275388 -281608 -297251 -319102 -340773 -372895 -402692 -405791 -400751 -392361
10361 -392361 -356547 -297597 -250185 -230707 -240584 -269938 -288903 -287349 -288708 -314601 -350982 -366667
10349 -366667 -342853 -298475 -254580 -205044 -137147 -47748 53794 155203 238485 270362 234429
10338 234429 159823 96841 69647 79399 96588 105844 110550 91237 35523 -38466 -120632 -208461
10326b08461p1061m4094k6283j9300j3486L64J9291L8949M4212L3588L5170K5805
10314a85306l423j0061J7022M5631M5839K9613L3866M8828L2909j9711o9586p7791
10302a12170l3060L1725Q2282J06559J02102O8729L0719J5147L8262M4414J5674
10291C90383j906j3781l5631n2934m7900m9640m4369m962L1497L9564P405n3444
10279A64282q1518n5094j6562Q781K5739L8187M3014K3535j1678m5368n1892j7243
10267B4183L2473N5653M4569L5789N7314P9320O6490L2399o034m2976p2492p7216
10255B29472m4052o330O775P776J9468L6407K0852l0286q2172j02815r4419p0449
10243a09773l5596R145O7868J24919J71170J67780R8376J6649l5289n0363m8051
$$ plain form
10326 -208461 -279522 -323616 -349899 -369199 -382685 -382321 -363030 -324081 -279869 -246281 -211111 -185306
10314 -185306 -188729 -198790 -181768 -136137 -90298 -60685 -26819 22009 54918 35207 -34379 -112170
10302 -112170 -145230 -113505 -31223 75336 177438 246167 276886 292033 330295 374709 390383
10291 390383 388477 374696 339065 286131 238231 188591 144222 139260 170757 210321 217726 164282
10279 164282 82764 27670 11108 19889 45628 83815 126829 150364 138686 93318 41426 24183
10267 24183 56656 112309 156878 192667 249981 329301 395791 428190 422156 379180 306688 229472
10255 229472 185420 179090 185865 193641 213109 249516 270368 240082 157910 55095 -39324 -109773
10243 -109773 -145369 -136224 -68356 56563 227733 395513 493889 510538 475249 424886 376835
10232C76835n6663p5257r9965j21126j27233j11300q7355o2490j5496L9862Q3762
10221b56426J05324J03304R4403O4516M879o8323j09937q8673m3729j4240q737
10210b17639k0355j067N8173Q7130M6130j3644o0175q3128m6252L1887P0886N6532
10198i1522O0205J02157J22703R8337N1621j8881o8846m9955j2794J0429J4797
10187B18251K532j2151l5898o0825n6844k0896L78J262r42j9257m1156l7647k7883
10174i1076l7363o3415p9925o2852k6939J91J2239J7745R858j4138j6819J9764
10162c32730O0757O0007N2447N9878M6865Q674k3842k8349j8282j5312j4769K007
10150a42649K8979L6791J1140j2623j7086k5738p998M6631P4511M6552j7950p4556
$$ plain form
10232 376835 320172 244915 144950 23824 -103409 -214709 -302064 -364554 -380050 -340188 -256426
10221 -256426 -151102 -47798 46605 111121 116000 47677 -62260 -150933 -194662 -208902 -217639
10210 -217639 -237994 -239061 -180888 -93758 -47628 -61272 -121447 -204575 -250827 -218940 -148054 -91522
10198 -91522 -31317 70840 193543 291880 343501 324620 255774 205819 193025 203454 218251
10187 218251 220783 208632 172734 111909 55065 34169 34547 35809 34867 15610 -25546 -63193 -91076
10174 -91076 -128439 -191854 -271779 -334631 -361570 -361379 -349140 -331395 -321537 -335675 -352494 -332730
10162 -332730 -271973 -211966 -159519 -99641 -52776 -44102 -67944 -96293 -114575 -129887 -144656 -142649
10150 -142649 -113670 -76879 -65739 -78362 -95448 -121186 -129184 -82553 -8042 38510 20560 -53996
10138e3996p1822k719P6190Q7943K5496m1529o7248m7811p506J5318L1276L6596
10126a9812K6079J6603J9777L1422L0820J1505m629r746L039J3972k2668p3039
10114B3323o6628l9955l9648l4053k352J8640K8545M5163O4122Q8693R3982O0093
10102B39925J5656k1361o4207r2831q5777o8337m3050m083L0015O1566P9764Q0575
10090A27855O6345K8298k9947p3748p1271k8486K1160N6105P4584O0490J6984
10079B48369l0135n7477n4330l1056j0058j6229m5831q3141j16949j19984q4263
10068d01084k8603P778N972j657K0221N5119O5687M9015L1829M0575P9034J02504
10056B6390R1284N4749j153m8081n2826j1411K8377L5954J8505j6991o1746r5521
$$ plain form
10138 -53996 -125818 -128537 -52347 35596 61092 19563 -47685 -95496 -103002 -87684 -56408 -19812
10126 -19812 6267 22870 42647 74069 104889 116394 111765 102019 105058 119030 96362 23323
10114 23323 -43305 -83260 -122908 -156961 -159313 -140673 -112128 -66965 -2843 85850 179832 239925
10102 239925 255581 234220 170013 77182 -8595 -76932 -119982 -124065 -94050 -32484 47280 127855
10090 127855 194200 222498 192551 118803 47532 19046 40206 96311 170895 231385 248369
10079 248369 218234 160757 106427 75371 65313 49084 3253 -79888 -196837 -316821 -401084
10068 -401084 -429687 -421909 -415937 -417594 -397373 -342254 -276567 -227552 -195723 -155148 -76114 26390
10056 26390 117674 172423 171270 123189 70363 58952 87329 123283 141788 124797 63051 -32470
10044c2470r2805n9217j7009Q093K877j6016m3437n8834m3245m881L1062N2701
10032b73181N9650O5780O4219L4815M637j6114l4736k1431J7488K8389k7183j08729
10020b06396j09968l3864K3523M7942P6647R7298Q6639O1745J4050o1078j09583
10009a13045r1488n2511m9940n4290j7215K5978K4260O741j984J80J58k5969l5637
9996c84762j549L9775O0446N7595M6729L3813J6317R229P728k381q108j396P362
9983a19202J965o031N373J7068J3967J5011J8684L5015N9555M4600q239m6138
9971C1628n7580o0612m9030l4857n0857r0850r4208n3791j7718J0422O1945J20296
9959b85212J39663J19395P7016J7205m3515j05200j43431j18088n4022n722J4117
$$ plain form
10044 -32470 -125275 -184492 -201501 -193408 -190531 -206547 -249984 -308818 -352063 -356944 -325882 -273181
10032 -273181 -213531 -147751 -83532 -48717 -44080 -60194 -94930 -116361 -98873 -70484 -97667 -206396
10020 -206396 -316364 -350228 -326705 -278763 -202116 -104818 -18179 43566 57616 -3462 -113045
10009 -113045 -204533 -257044 -306984 -361274 -378489 -352511 -328251 -321510 -323494 -323314 -323156 -349125 -384762
9996 -384762 -386311 -346536 -286090 -228495 -181766 -147953 -131636 -122407 -114679 -117060 -125168 -126564 -119202
9983 -119202 -117237 -123268 -117895 -100827 -86860 -71849 -53165 -18150 41405 86005 77766 31628
9971 31628 -25952 -86564 -135594 -170451 -221308 -312158 -406366 -460157 -477875 -467453 -405508 -285212
9959 -285212 -145549 -26154 50862 68067 24552 -80648 -224079 -342167 -396189 -401911 -387794
9948c87794L2180M3894J4269l2403m4802j1729N1280J02537R9775O4653K3789
9937d4351k188j639m739k8445o3726r9168r5519m5778O757L6997L8870J8013J217
9924b83699N22j8939m3975m7519l9892j5046K8431O9097P5985N1931L2049L1076
9912a59979K6793L4368N6669L7756r201m0487m1414k2733j6724j4148J1338M3054
9900i4708M3711K7327K0476P95l1218m1033l1875k3011r136J6345M4820M1632
9888c5875L414l2040n9099o9587n8995m4175k4992P163K5358L1479L6709K7111
9876a93529K6951L6113L6024L0952J7763L839L951L158j364R040K0032P696k825
9863b199K4039N2755M8048M0822K8606J445k2770l5202m3252o1634p1192o8907
$$ plain form
9948 -387794 -355614 -311720 -297451 -329854 -374656 -386385 -335105 -232568 -132793 -68140 -44351
9937 -44351 -46539 -48178 -52917 -81362 -145088 -244256 -339775 -385553 -378796 -341799 -302929 -284916 -283699
9924 -283699 -283177 -302116 -346091 -393610 -433502 -448548 -420117 -351020 -275035 -223104 -191055 -159979
9912 -159979 -133186 -98818 -42149 -4393 -13594 -54081 -95495 -118228 -134952 -149100 -137762 -94708
9900 -94708 -50997 -23670 -3194 -2399 -33617 -74650 -106525 -129536 -138672 -122327 -77507 -35875
9888 -35875 -32461 -64501 -123600 -193187 -252182 -296357 -321349 -314186 -288828 -257349 -220640 -193529
9876 -193529 -166578 -130465 -94441 -63489 -45726 -41887 -37936 -34778 -36142 -27102 -7070 626 -2199
9863 -2199 21840 74595 122643 163465 192071 193516 170746 135544 92292 30658 -40534 -109441
9851a09441m2748K9052Q6421Q2653L5121j572j1382j3159k4658l6902j0804L4408
9839A6989M4124K7625K1221L286m8156r7957r3451l9961L994L2930M5437K9603
9827e4316J1359N74k1465n8923q8641p9169k2948K7040K6740N697J8650M3194
9815a92208K5279l0194o4900m0292R074N0762Q0223R4809Q6560N4524O112m9594
9803C0155r6956r2053k9646J7230K2465L2250O4947Q5045P5070M4612l64l1370
9791A21385m4279p0531j07726j12979p0354L833O7908Q9653O6650L1374R666q489
9779b3889k4119k0140O05M108M863K6680L9580L2660J7631Q741J12l1365o9756
9766c4289q8437q1611n6956j3291P299R337K4059M4860P5479J04235J02271O8323
$$ plain form
9851 -109441 -152189 -123137 -36716 45937 81058 79486 68104 54945 30287 -6615 -17419 16989
9839 16989 61113 88738 109959 113245 65089 -32868 -126319 -166280 -162286 -129356 -83919 -54316
9827 -54316 -42957 -42383 -63848 -122771 -211412 -290581 -313529 -286489 -259749 -254052 -235402 -192208
9815 -192208 -166929 -197123 -262023 -302315 -293241 -242479 -162256 -67447 19113 73637 79749 30155
9803 30155 -66801 -158854 -188500 -171270 -148805 -116555 -51608 33437 108507 153119 152755 121385
9791 121385 77106 6575 -101151 -214130 -284484 -280651 -212743 -123090 -56440 -25066 -15400 -23889
9779 -23889 -48008 -68148 -67543 -63435 -58572 -31892 7688 40348 57979 66720 66832 35467 -34289
9766 -34289 -122726 -204337 -261293 -274584 -267285 -257948 -233889 -189029 -113550 -9315 92956 161279
9754A61279J4319l8399o5966n5021j9765J1870K8156N1863P4889N3369P640k1869
9742B02365k2886k4640k4575j0425P389j5353p6060r0652n2895j9379k0539k8811
9730a76461j1729j602r631k5501l9675l6168j9597J162N313M572L4210P7596R1613
9717a05898P3027N3390L4744J0430j6065m0145m1638l3079j7850L929j855k2442
9705a03452m5572n7831l4051j8417m3262o4587n2346j8803K0977N4694O8571N4879
9693b39200L6222N5806R2833Q0611M1601J1247j7684l3627l4574r119L0459M0533
9681E5108J1228k2147k7033j7130k6018l3745j4982J2532K0299J436j8798k7613
9669h6863p742K4630L3129J9031P321P156R837k096l3248n2082l3855p530o8L555
$$ plain form
9754 161279 175598 137199 71233 16212 -3553 8317 36473 88336 163225 216594 224234 202365
9742 202365 179479 154839 130264 119839 127228 111875 35815 -54837 -107732 -127111 -147650 -176461
9730 -176461 -188190 -189792 -199423 -224924 -264599 -300767 -320364 -319202 -313889 -309317 -275107 -197511 -105898
9717 -105898 -32871 20519 55263 65693 49628 9483 -32155 -65234 -83084 -79155 -81010 -103452
9705 -103452 -149024 -206855 -240906 -259323 -302585 -367172 -419518 -438321 -417344 -362650 -294079 -239200
9693 -239200 -202978 -147172 -54339 26272 67873 79120 61436 27809 -6765 -15884 14575 55108
9681 55108 66336 44189 17156 26 -25992 -59737 -74719 -62187 -41888 -40452 -59250 -86863
9669 -86863 -94605 -69975 -36846 -17815 -10494 -3338 6499 4403 -28845 -80927 -114782 -122312 -122380 -118825
9655a18825Q003P640R740J2817J9136J6333L78j3771l3442o5900p8676p7750o7319
9642c81636l2451J0792M7521M1592K2887L3250L4467K1270K1596L6781M9096L4202
9630f0633R155p164j4859j9316k8584m2470m8009m0838l5749l7782l9040l4709
9618c99998m5575o1665n0412l578N4351Q1185O6332M0804O1684J07101R7623L6779
9606a5369j6427l6326l8991m2949o2671r2735r5198n9952j4441J3880J6277J6790
9594d28112K5840L0377L4613N3329Q4223J08031R0166L8430L209m094J549q777
9582B8784l9823n4800m0160j2403O380J2211P617J7048M8520O9094O0143K2479
9570A25090j7766k9186k5690l4929m3565l3130O526L7704M1037J8015l1203o9932
$$ plain form
9655 -118825 -110822 -103182 -93442 -80625 -61489 -45156 -44778 -58549 -91991 -157891 -236567 -314317 -381636
9642 -381636 -414087 -403295 -355774 -314182 -291295 -258045 -223578 -202308 -180712 -143931 -94835 -60633
9630 -60633 -51478 -58642 -73501 -92817 -121401 -163871 -211880 -252718 -288467 -326249 -365289 -399998
9618 -399998 -445573 -507238 -557650 -561228 -506877 -425692 -359360 -318556 -256872 -149771 -52148 -15369
9606 -15369 -31796 -68122 -107113 -150062 -212733 -305468 -400666 -460618 -475059 -461179 -444902 -428112
9594 -428112 -402272 -371895 -337282 -283953 -199730 -91699 -1533 36897 40106 36012 37561 28784
9582 28784 -11039 -65839 -105999 -118402 -112022 -99811 -92194 -75146 -26626 42468 102611 125090
9570 125090 107324 78138 52448 17519 -26046 -59176 -52650 -14946 26091 44106 12903 -57029
9558e7029p0040k2559L9223N7829O0968P1852N7475K815m5795m4275k3165J1318
9546C8617L0349j5213o2185n2811j1232K0682L2086L6885L2835J5914j1310l1837
9534B2780k9918k9208k7376p875K0835M6868N7578M5575K1285j901j3322n957
9522I9364l77j9601l2945j8728j8725m0107n1024n3853m5857j5695L6874R3769
9510f6905R2171L1501j5759l0244l4920j7795K3754N8190N5283J5923m3946p1722
9498d469k5535N5911P5983K3667k0409j7267p559J991L0074M9930N3705N3404
9486B69426M6904L9568L2585p107p2345j14583j27883j10935o4277m7046p3452
9475b29145q4085m4270J3882O2585Q7977M7012l0134m5984M801M8296M6731Q184
$$ plain form
9558 -57029 -127069 -149628 -110405 -52576 8392 80244 137719 140534 94739 50464 27299 38617
9546 38617 68966 53753 -8432 -61243 -72475 -51793 -19707 17178 50013 65927 54617 22780
9534 22780 -7138 -36346 -63722 -71597 -50762 -3894 53684 99259 120544 118643 105321 99364
9522 99364 98987 79386 46441 27713 8988 -31119 -82143 -135996 -181853 -197548 -160674 -66905
9510 -66905 25266 56767 41008 10764 -24156 -41951 -18197 39993 95276 111199 67253 -4469
9498 -4469 -30004 25907 101890 125557 105148 87881 80322 82313 112387 162317 216022 269426
9486 269426 316330 355898 388483 381376 309031 194448 66565 -44370 -108647 -155693 -229145
9475 -229145 -313230 -357500 -343618 -281033 -193056 -146044 -176178 -222162 -217361 -169065 -122334 -114150
9463a14150m4702n9826l8854l1999k9306j7517Q41j251k4715j8529p02j2275l8895
9450d31880k9604m19J0564J3682J6791J5522R741K2401N5077O2132K8056p437
9438b35374k3465k5144m868K6137L0838K1115J4046Q673K304j8271m2676m1391
9426b88076j2403K4063O1672P5293N6802L6905K7917K5052K613m0609o1400n4205
9414a46376n0355m9907j6592M0336O3467M0587J3976J6950M5429Q5760J07144
9403A50419Q2540L2004l6096j03119j22563r4059n3089j5960K7722M8657M3187
9392d0357L5250M3970O9245N4998j0908o5415p5147o8547m5332k2057k1164q861
9380a54325K0021K8473J0589j7145l3686k4447j204K7147N7174N0030P733k3381
$$ plain form
9463 -114150 -158852 -218678 -257532 -289531 -318837 -336354 -335513 -336764 -361479 -380008 -380710 -392985 -431880
9450 -431880 -461484 -461903 -451339 -437657 -420866 -405344 -395603 -373202 -318125 -255993 -227937 -235374
9438 -235374 -258839 -283983 -288851 -262714 -231876 -210761 -196715 -188042 -185738 -204009 -246685 -288076
9426 -288076 -300479 -276416 -214744 -139451 -82649 -45744 -17827 7225 9838 -30771 -92171 -146376
9414 -146376 -196731 -246638 -263230 -222894 -159427 -118840 -104864 -87914 -42485 43275 150419
9403 150419 232959 264963 228867 125748 3185 -90874 -143963 -159923 -132201 -83544 -40357
9392 -40357 -5107 38863 108108 163106 152198 86783 11636 -56911 -102243 -124300 -145464 -154325
9380 -154325 -134304 -105831 -95242 -112387 -146073 -170520 -171724 -144577 -87403 -37373 -29640 -53021
9368e3021k7591j8516r020o885l0826o5218p9096p5448o6764k7281L6028O9624
9356c54014N2024J9702J3376J8791J3887O309J9073L5331K2716J7552N2685O2105
9344b0463J0150l0512j7004K8684M7207M997n5387p2701m0365N521M0685K6102
9332g3086l1331n3329l3293r146O157lj1298r630J3621M5177M3149Q813j3130
9319a17329j6196m0508o1914m1398q276J9420L6903K4768M540p95J297J3748J3949
9306a71791j4543n5575r6083j07247o3664Q517M5442K8572k1394o9669q7278n8462
9294f63175p418J0646k0091n8052m3670J5629O0971N3706K3112J1624K8157P4468
9282e14093J16190J14381R0030O8138K6559k2716l6799k3226j5742k6416m6463
$$ plain form
9368 -53021 -80612 -99128 -108148 -115033 -145859 -211077 -290173 -365621 -432385 -459666 -423638 -354014
9356 -354014 -301990 -282288 -268912 -250121 -236234 -229925 -210852 -175521 -152805 -135253 -82568 -20463
9344 -20463 -10313 -40825 -57829 -29145 18062 23059 -32328 -105029 -145394 -139873 -99188 -73086
9332 -73086 -104417 -157746 -191039 -200185 -194028 -194031 -205329 -214959 -201338 -156161 -113012 -104199 -117329
9319 -117329 -133525 -174033 -235947 -277345 -285621 -266201 -229298 -204530 -199990 -200785 -199488 -185740 -171791
9306 -171791 -186334 -241909 -337992 -445239 -508903 -500386 -454944 -426372 -447766 -517435 -604713 -663175
9294 -663175 -670593 -659947 -680038 -738090 -781760 -766131 -705160 -651454 -628342 -616718 -588561 -514093
9282 -514093 -397903 -283522 -193492 -125354 -98795 -121511 -158310 -181536 -197278 -223694 -270157
9271b70157o6342n5567k2084Q30J0734Q843j98j4168j6234o96n453j8510j2040
9258d61042M628J8357M5862Q4935J08368R2185L6221j4982k9792o871M0001P0287
9246a1843N6000J0316m8192p6192p1075o3489n4345k6653K3001N1253L4011j2549
9234a89757m3265k1492K2899K4122k1767m3631k4919J4996O3203R1547P0378K8721
9222b8965M940j5467l1042k2101o177L879M403O650K4352K8869k499p0684j41031
9209b44873j28222m8652J4189K6171m44j3208l36J2974K9555O2501O5312K1233
9197b03800l1168m6229j6076L7083Q7953R7153P5672L7500r918m1474m6208m0486
9185i9998l8090l4262j2230K7359M7589J8550k3979l7769l9704l9051k9490k4411
$$ plain form
9271 -270157 -336499 -392066 -414150 -413320 -402586 -393743 -393941 -408109 -424343 -425039 -430492 -449002 -461042
9258 -461042 -456414 -438057 -392195 -307260 -198892 -106707 -70486 -85468 -115260 -122131 -82130 -11843
9246 -11843 44157 54473 6281 -69911 -140986 -204475 -258820 -285473 -262472 -211219 -177208 -189757
9234 -189757 -233022 -254514 -231615 -207493 -229260 -272891 -297810 -282814 -219611 -128064 -57686 -28965
9222 -28965 -24025 -39492 -70534 -92635 -98812 -94933 -90530 -83880 -59528 -30659 -33158 -103842 -244873
9209 -244873 -373095 -421747 -407558 -381387 -381831 -395039 -395375 -382401 -352846 -290345 -225033 -203800
9197 -203800 -234968 -281197 -297273 -260190 -172237 -75084 588 38088 28170 -13304 -59512 -99998
9185 -99998 -138088 -172350 -184580 -157221 -109632 -91082 -115061 -152830 -192534 -231585 -261075 -285486
9173b85486j8592o960K192J7169L9617N7348N8938M4268J8580q213k3160l3859
9161a38158k6258j5086k0703j5919J5711N7863P0670M1758m987j4607j151j1402
9149f2269k0760n262J0252K336j7910j2725J8755L9734K5829j9382n5551m7880
9137a44833J0087N7834N5751K4430k4330p9710r9311q4248o0175l8271j7991K3187
9125c77580O4597P5548N4890M7983O0035M6724J4855J0765K1590J6070J1163L2996
9113G9636O7822R4669Q1435M716q4891j36172j21435n4943l486R877J9273L2914
9101a0585L6986J3244m7006q6245p2479j8614M4474P3488N4247n49m3434n8977
9089a15450n9161m1234k3563j7254o001K2857M4508O3987P2815L4382k2029p0435
$$ plain form
9173 -285486 -304078 -311038 -308846 -291677 -252060 -194712 -135774 -91506 -72926 -81139 -104299 -138158
9161 -138158 -164416 -179502 -200205 -216124 -200413 -142550 -71880 -30122 -35109 -49716 -50867 -62269
9149 -62269 -83029 -88291 -78039 -75703 -93613 -106338 -87583 -47849 -22020 -41402 -96953 -144833
9137 -144833 -134746 -76912 -21161 3269 -21061 -100771 -200082 -284330 -344505 -382776 -400767 -377580
9125 -377580 -312983 -237435 -182545 -134562 -74527 -27803 -12948 -2183 19407 35477 46640 79636
9113 79636 147458 242127 323562 328278 243387 107215 -14220 -69163 -72649 -62772 -43499 -10585
9101 -10585 26401 39645 -7361 -93606 -166085 -184699 -140225 -66737 -12490 -13039 -56473 -115450
9089 -115450 -174611 -215845 -239408 -256662 -262663 -239806 -195298 -131311 -58496 -24114 -46143 -116578
9077a16578j16565j38176j30724j19541r9517m3430K1670N7133O9961O2020L5879
9066e17868L783k9872j9794L3542J00992J62732J55566Q8508K3768j9924n2261
9055g0828o6791l5679K9710P6471Q3871O1910K0077l1669o9704p0363n1480m7431
9043a71906l2715J3083M9926M6021J7007n018p779J5052M6284P0954P6640L9408
9031A56957j0673k8269k4734j2611K6165O6524P9025O8559K4066k9650n9597o6039
9019A89723n4124m2582n2471o0331m4503k4644p988J572J3316K9676L4431R526
9007h399k4442m5320n8213o8245n5612k1056K2524N3608N3882N4766N6319K8901
8995a1287k2763n0415l8966j4537j756J795J3640K4183M9104Q3811R3589J08687
$$ plain form
9077 -116578 -233143 -371319 -502043 -621584 -721101 -764531 -742861 -685728 -615767 -553747 -517868
9066 -517868 -514085 -543957 -563751 -530209 -429217 -266485 -110919 -22411 1357 -18567 -70828
9055 -70828 -137619 -173298 -143588 -67117 16754 78664 98741 67072 -2632 -72995 -124475 -171906
9043 -171906 -204621 -191538 -141612 -95591 -78584 -83602 -91381 -76329 -30045 40909 117549 156957
9031 156957 146284 118015 93281 80670 106835 173359 252384 320943 345009 315359 255762 189723
9019 189723 135599 93017 40546 -19785 -64288 -88932 -96920 -95348 -82032 -52356 -17925 -8399
9007 -8399 -32841 -78161 -136374 -204619 -260231 -281287 -258763 -205155 -151273 -96507 -40188 -11287
8995 -11287 -34050 -84465 -123431 -137968 -139724 -137929 -124289 -100106 -51002 32809 126398 235085
8983B35085J16372P5766K0524N947J4701O198j7139l0905l9434n4388n4233l4045
8971B44449k0061k1227k3639m1059o2929m9717r14L5928L2632R631j6812k9331
8959E6951j7224P150J7519K245q734o777l183k8547n0903k9005J5528K8804k653
8946a8829k3900j7530j653L391j1490l8139n3712m7743m742N5930R5943R4537
8934C2063N6069l36l6627j2367K3476J5559j8379m4991m9136k0067M1473R1288
8922G8025J00435O8951J8011l0728m8308k5390J1936M0344K3703k8544n2626l5232
8910A20577j1049J2130M4838N8173N5800N6722N4896M7300L8796M6469N5675M5337
8898F25664K1344J574n490j2888m8506p3474n0331l4656m5889m0287q841K7034
$$ plain form
8983 235085 351457 427223 447747 453694 468395 474593 457454 426549 387115 332727 278494 244449
8971 244449 224388 203161 179522 138463 75534 25817 24903 60831 93463 103094 86282 56951
8959 56951 39727 46877 64396 66641 57907 51130 47947 19400 -31503 -60508 -44980 -16176 -18829
8946 -18829 -42729 -60259 -61912 -58521 -70011 -108150 -161862 -209605 -214347 -158417 -62474 32063
8934 32063 88132 87796 51169 38802 62278 77837 59458 14467 -34669 -54736 -13263 78025
8922 78025 178460 247411 265422 234694 186386 160996 172932 213276 236979 208435 155809 120577
8910 120577 109528 121658 166496 224669 280469 337191 392087 439387 478183 524652 580327 625664
8898 625664 647008 648582 643092 630204 581698 508224 457893 423237 377348 337061 328220 355254
8886C55254L8501K0846n731j4347n942N400L0130P6514J21173J23296Q6075M8023
8874H79192L3854N8980R5737J26046J43534J39101J12472P5959M6976J1044m7000
8863A675895q8967r4328j16773j60109j84544k02620k01194j69032j29897r6851
8853B31580p3273m4520l183m352m9481n0695m351K9271K4183J2420R447J6816
8841I3862N2070P7360O1440M1645L4124K8717O592k9370l9117j0602K5499K4655
8829C66875j5519m7615n1223m9994l4126j409M8324Q9284Q3333N6456N2352N8738
8817E55476L9706L051k8150l1049k0190k2245r931N6615J45118K09851K50181
8806A148433K85478K95888K56303J76484Q7989R411m7243q3843j09777j32784
$$ plain form
8886 355254 393755 414601 408870 394523 388581 393981 424111 500625 621798 745094 831169 879192
8874 879192 913046 972026 1067763 1193809 1337343 1476444 1588916 1664875 1711851 1722895 1675895
8863 1675895 1586928 1492600 1375827 1215718 1031174 828554 627360 458328 328431 231580
8853 231580 158307 113787 110604 106252 56771 6076 1725 30996 55179 67599 77046 93862
8841 93862 145932 223292 284732 326377 360501 389218 395810 366440 327323 316721 342220 366875
8829 366875 351356 303741 252518 202524 168398 166989 215313 304597 387930 444386 496738 555476
8817 555476 595182 598233 570083 539034 518844 496599 486668 543283 688401 898252 1148433
8806 1148433 1433911 1729799 1986102 2162586 2250575 2259986 2212743 2128900 2019123 1886339
8796A886339j54059j58082j40837j32096j30853j20257j17785j15281q5585m8594
8786F82910j7634p272m0355n0602k6076k0990k4341j8164r955K7Q600N333K821
8773D84302Q013j131l8466p0867p8162o5031n0969n6571n5811k6810k490J4601
8761F0608L6849K8583R876J0137K89l4190p0913j15327j70162k02236j77910r5264
8749g19660J37N7916R0085J14977J53879J68996J12778M1217n146n1689r3960
8738a30470q5582k7285K4271M3131M4728L8404L7344M5586M8617N5123P7887P6056
8726B47810L9482k997l3710m6253m8028k9657J6170M5336K7425k6715q1249q9284
8714A8330n2772k5151l0582l3111j3816K4047M7646N5422N1633L9938K3325l639
$$ plain form
8796 1886339 1732280 1574198 1433361 1301265 1170412 1050155 932370 817089 731504 682910
8786 682910 665276 658004 617649 567047 540971 519981 495640 477476 467521 467548 476148 481481 484302
8773 484302 492315 491184 452718 381851 303689 238658 187689 131118 75307 48497 46007 60608
8761 60608 97457 126040 135916 146053 146342 112152 41239 -74088 -244250 -446486 -624396 -719660
8749 -719660 -719523 -661607 -571522 -456545 -302666 -133670 -20892 20325 15179 -36510 -130470
8738 -130470 -216052 -243337 -219066 -175935 -131207 -92803 -55459 -9873 38744 93867 171754 247810
8726 247810 287292 284295 250585 204332 156304 126647 142817 188153 215578 188863 107614 18330
8714 18330 -34442 -59593 -90175 -123286 -137102 -113055 -65409 -9987 41646 81584 104909 101270
8702A01270j3134p554j1867k3942j7575J7433N9098N5530K545l8417n2258n7127
8690A4002p3838j00301r7860o7234n0047l9845J970O1187R3256R5852J08920J33266
8678G9328J24745R4734P9167N0945r24k7806k7767k7353k2546l5152n4193n2172
8666A81006m4204l3435m0559o4832p2298o1409k6583J3259L2466M4658P7556J21443
8654A27068J12829O2177L9994M4451M0297J7145M414J8646J6493q785l0479l9700
8642D04550l7471j1004L1679N8669O8882N7492K0112k5907o3614o7457n0720m3035
8630C42176m9034o9811q3867r0474r0962o0104n423L3844N5070N5868N0023N5876
8618A43182N7344L7674K4723K5825Q058j3084j6256m773J351j6101l5146n3034
$$ plain form
8702 101270 88136 80582 68715 44773 27198 44631 103729 159259 161804 123387 71129 14002
8690 14002 -59836 -160137 -257997 -325231 -375278 -415123 -413153 -351966 -258710 -162858 -53938 79328
8678 79328 204073 298807 377974 428919 427995 400189 372422 345069 322523 287371 233178 181006
8666 181006 136802 103367 62808 -2024 -74322 -135731 -162314 -149055 -116589 -71931 5625 127068
8654 127068 239897 302074 342068 386519 426816 443961 448375 467021 483514 474729 444250 404550
8642 404550 367079 356075 387754 446423 515305 572797 592909 567002 503388 435931 385211 342176
8630 342176 293142 223331 139464 48990 -41972 -102076 -107499 -73655 -18585 37283 87306 143182
8618 143182 200526 238200 262923 288748 296806 283722 267466 262693 264044 247943 212797 159763
8606A59763p5933n8709R124O5935P3932O2213P0634Q5869Q0465N7321L5275L9863
8594F05752O3222P2862P2261P3965P2519P2042P4690J01726J34708J48518J57021
8583A649286J43720J06717N8328r150q2005j33732j57516j52647j23076r4412
8573A205513p2440o6407p1666n3178l6350q4626j56788j71622j50215j28280q8759
8562A25182m0503o788R35l940P012R824N6R496L7045M1920K1615J612J986K0095
8548B25547M9525Q5890J11861J26943J06904N9998K0836j6616o7137r8723q6830
8537E18198n6629j5990L6485P4087Q5306O7192O477l6118j1162L6521N8464O5426
8525H28257Q5090J32691J84710K03193J84382J43590R5898P7494Q8630P7575L9386
$$ plain form
8606 159763 83830 25121 34245 100180 174112 236325 306959 392828 473293 530614 565889 605752
8594 605752 668974 741836 814097 888062 960581 1032623 1107313 1209039 1343747 1492265 1649286
8583 1649286 1793006 1899723 1958051 1948901 1866896 1733164 1575648 1423001 1299925 1205513
8573 1205513 1133073 1066666 995000 941822 905472 820846 664058 492436 342221 213941 125182
8562 125182 84679 77891 78826 74886 81898 91722 91778 101274 138319 180239 201854 203466 205452 225547
8548 225547 275072 360962 472823 599766 706670 766668 787504 770888 703751 605028 518198
8537 518198 461569 445579 482064 556151 641457 708649 715126 679008 667846 704367 762831 828257
8525 828257 913347 1046038 1230748 1433941 1618323 1761913 1857811 1935305 2023935 2101510 2140896
8514B140896J3599R682j4490o3033j08728j45587j68801j59914j12236p0945p3513
8503A246930q0397m8048k7300m9200p1013o4435n8766n0735j9814j4159n8422
8492G04641j01097r8866p0961l4978Q208L7515L9796K4792J5212p977o0538j04358
8480C51389j02996n9705k4820l5467m8309l3835j5177k1167m2915m1956n625O9174
8468a1409J21490R8530M7579J0407r052j0265k367J1501K8510J9634m254k3015
8456B77289j8522j9550n4566p2984n5211k4699j464J2055K8922M4071N4226O7752
8444B37319O3744J1585m9744q4604q4619m7427r598L1780P1927Q5215Q0298M9289
8432C55165k1769p4932o2015l5573k7829j2478J295q850k2251j2101M929O54j7523
$$ plain form
8514 2140896 2154495 2164177 2149687 2086654 1977926 1832339 1663538 1503624 1391388 1320443 1246930
8503 1246930 1166533 1118485 1091185 1041985 970972 906537 847771 797036 777222 763063 704641
8492 704641 603544 504678 433717 398739 406947 444462 484258 509050 524262 516285 455747 351389
8480 351389 248393 188688 163868 128401 80092 46257 31080 9913 -33002 -74958 -80583 -11409
8468 -11409 110081 208611 256190 266597 257545 247280 244913 256414 284924 304558 300304 277289
8456 277289 258767 239217 184651 111667 56456 31757 30293 42348 71270 115341 169567 237319
8444 237319 301063 312648 262904 178300 93681 46254 36656 68436 140363 225578 305876 355165
8432 355165 333396 258464 196449 160876 133047 120569 121864 113014 90763 78662 83591 84245 66722
8419F6722j3491J5076M6083O6199M8695j613k6087k2041n319J9796L0380J5408
8407B39808q933j4482L433J1438j906p320m726o227q323r450O332K0766k720l0966
8393A86724l1214l5362m3786k9458J5407M6190O3729P3994N9441L6317P161k2443
8381C26700m5523p6839r7597q1924n3545l2755K049O3098J14179J14108M0148
8370B72099m1406o8027m6469K201L2210K3595J4910K6717L6578N0791N2923J4803
8358C70925k9906n8727p4939p6270o1044k5949K1659M4138K4721R016L3767O0555
8346B37946M3484Q436q727N635K9392K3323r687k0993j358K553l0455p0802r0780
8333A17967q1222m0107J2389M0664K6091J9313M5121O1454M2073N982r678K0716
$$ plain form
8419 66722 53231 68307 114390 180589 229284 227671 201584 179543 174224 194020 224400 239808
8407 239808 230875 216393 219826 231264 229358 222038 217312 211085 202762 193312 199644 220410 217690 186724
8393 186724 155510 120148 76362 46904 62311 108501 172230 246224 305665 341982 349143 326700
8381 326700 281177 204338 106741 24817 -28728 -61483 -59434 3664 117843 231951 272099
8370 272099 230693 162666 116197 118398 150608 174203 189113 215830 252408 303199 356122 370925
8358 370925 341019 282292 207353 131083 70039 44090 65749 109887 134608 143624 177391 237946
8346 237946 281430 289866 281139 286774 316166 339489 329802 308809 307451 310004 279549 208747 117967
8333 117967 36745 -3362 9027 49691 75782 95095 140216 201670 243743 249725 240047 260763
8321B60763O2404O4496O0491O3244M1678J0287j3455j1249J3201q59m5368o5401
8309D40232n8012l0804n933j3179l7964m0982p367L4918M9803N2908M9262K8355
8297D61237o059l4898l1178q05M9569R9505J13306O7662J824k8923k6933k4690
8285F39617j638L2237L7767J0074j0876l745J2047P549m2464q9632r1142n6055
8273D43739k3861j4174j2120j2041K033M2934Q5669Q3566M1460j3532n0976n7349
8261E15348q7760j09425n3606L4602O3383M4593L3482K3623n014n830J8806R503
8249D81705k4684n3380p8092q7004o7230j7434K4615M1949P0815Q2961L4156l9890
8237C68487p6496n8061o653L3466M3590N8652R4721J37390J46215J00322J6013
$$ plain form
8321 260763 323167 387663 448154 511398 553076 563363 549908 538659 551860 551001 505633 440232
8309 440232 382220 351416 345483 332304 294340 253358 245991 280909 330712 383620 432882 461237
8297 461237 455178 420280 389102 388297 437866 537371 650677 718339 720163 691240 664307 639617
8285 639617 637979 670216 707983 718057 707181 703436 715483 723032 680568 590936 499794 443739
8273 443739 419878 405704 393584 381543 383576 426510 512179 595745 637205 623673 572697 515348
8261 515348 427588 318163 264557 299159 362542 407135 440617 464240 459226 453396 472202 481705
8249 481705 457021 403641 325549 238545 171315 153881 178496 220445 291260 374221 408377 368487
8237 368487 291991 233930 227277 260743 304333 362985 457706 595096 741311 841633 857646
8226H57646o3252q7747q4776r8482r8080m7243K5969Q8863J16880R2821L5098
8215G37697m853j3856j0206p868J8915P0637Q6011M4267k4403o1368m7844k1553
8203G65576q306p663K734M200o076J1193K1986N621p606q04K0526M1004N0069
8190H92454K9286J791J1795L3311M9690P3871R8388J07190R7745P8379M8190J6850
8178A538940q605l1551m4250j4141N7889J03930Q2109J7869k9485l5594k819M4554
8166A678846L9413k8640q3566q1014o4163m8573j7578k655j7061m2787n4811k7960
8154A249451J0181K7042K2257p867l8584m2406m2978m1695j3991K7190P3152J11354
8142A333106J03832L6346m3719p3680m5931R85O818j3689j2832l23n2k0251m1610
$$ plain form
8226 857646 794394 706647 621871 523389 425309 378066 404035 492898 609778 702599 737697
8215 737697 732844 718988 708782 700914 719829 790466 876477 920744 896341 834973 787129 765576
8203 765576 757270 749607 752341 756541 750465 761658 783644 789265 781659 780855 801381 842385 892454
8190 892454 921740 923531 935326 968637 1018327 1092198 1190586 1297776 1395521 1473900 1522090 1538940
8178 1538940 1530335 1498784 1454534 1440393 1498282 1602212 1684321 1702190 1672705 1637111 1634292 1678846
8166 1678846 1718259 1689619 1606053 1525039 1460876 1412303 1394725 1392070 1375009 1332222 1277411 1249451
8154 1249451 1259632 1286674 1308931 1301064 1262480 1220074 1177096 1135401 1121410 1148600 1221752 1333106
8142 1333106 1436938 1473284 1429565 1355885 1309954 1310939 1317757 1304068 1291236 1290913 1290861 1270610 1229000
8129A229000l8137O308P0376Q3801N3331K9654L7350O7308N5799J4801j1930m5285
8117A552376q3575q4615n6658k1794K1705M9115N1461M6485N4558M6267O163k1778
8105A559710j5192R640M1083P0203Q4253Q5839P8804N6292L7518K0435j137k069
8093B025379j095L183L6982Q5858Q6675K1673m1257n9606m6662k3820p421j3224
8081B066665l4477k5808M0594J08008J23327J15388Q9531L5817j2802k9388j0969
8070B465886K0674N1124Q9126J20510J15845P9106K7282j3636j4778r810q580
8059B922749K2803M6458J3684l6756m6344j2121J5273J4917K6046L9834L8387
8048C044930K9274K2017K6203M2275O6765Q8144R0300P3772O0866O7742J02699
$$ plain form
8129 1229000 1190863 1197171 1267547 1351348 1404679 1434333 1471683 1538991 1594790 1609591 1597661 1552376
8117 1552376 1468801 1384186 1327528 1305734 1327439 1376554 1428015 1474500 1529058 1575325 1581488 1559710
8105 1559710 1544518 1554158 1595241 1665444 1749697 1835536 1914340 1970632 2008150 2028585 2027448 2025379
8093 2025379 2024284 2027467 2064449 2150307 2236982 2258655 2217398 2157792 2111130 2087310 2079889 2066665
8081 2066665 2032188 2006380 2046974 2154982 2278309 2393697 2483228 2519045 2506243 2476855 2465886
8070 2465886 2486560 2537684 2626810 2747320 2863165 2942271 2969553 2955917 2941139 2931329 2922749
8059 2922749 2945552 2992010 3005694 2968938 2922594 2910473 2925746 2940663 2966709 3006543 3044930
8048 3044930 3074204 3096221 3122424 3164699 3231464 3319608 3409908 3483680 3544546 3612288 3714987
8037C714987J32503J15566P9966O9047P2168Q3397J50880K31166K55928K45510
8027E151118K36062K34167K37671K30019K10342K06501K19058K32784K35157K53463
8017G446342K88164L30030L55205L56283L89813M54407N27562O39096Q10502J027985
8007A2625389J243157J450559J690229J966389K271861K664939L179555L767481
7999C0859559M356903M845969N135195N136975M742999L829289K396849O46217
7991F1949955j111311k592564l635354m180443m260826m007850l575470l100939
7983C5485198k683937k303840j913442j556095j275590j036841q19640o42045
7975B3253768n12261m22109l74878l87775m10006l54602k62179k11005j94082
$$ plain form
8037 3714987 3847490 3963056 4043022 4112069 4184237 4267634 4418514 4649680 4905608 5151118
8027 5151118 5387180 5621347 5859018 6089037 6299379 6505880 6724938 6957722 7192879 7446342
8017 7446342 7734506 8064536 8419741 8776024 9165837 9620244 10147806 10786902 11597404 12625389
8007 12625389 13868546 15319105 17009334 18975723 21247584 23912523 27092078 30859559
7999 30859559 35216462 40062431 45197626 50334601 55077600 58906889 61303738 61949955
7991 61949955 60838644 58246080 54610726 50430283 46169457 42161607 38586137 35485198
7983 35485198 32801261 30497421 28583979 27027884 25752294 24715453 23895813 23253768
7975 23253768 22741507 22319398 21944520 21556745 21146739 20792137 20529958 20318953 20124871
7966B0124871j51235k1035J65342L32580M58999N74588P12287Q73193J076225
7957B4145815J324061J543627J717600J894163K086017K309374K627068L111953
7949D0759678L750608M515690N412327O454650P698680R195237J0873971J2545701
7941A01206542J4001483J4950642J4949337J3550549J0545301O083591P23555
7934A76011000m711527r380032j2670555j4373856j4637006j3827820j2402280
7927I4007924j0749721r130903p636815o292101n142551m206677l465783k849318
7919D4534055k315540j859130j487516j206500r98668q52749p49118o50782n49951
7910C3864101m37449l02199j39239P5414L59488O79384R84476J243003J475170
$$ plain form
7966 20124871 19973636 19952601 20117943 20450523 20909522 21484110 22196397 23069590 24145815
7957 24145815 25469876 27013503 28731103 30625266 32711283 35020657 37647725 40759678
7949 40759678 44510286 49025976 54438303 60892953 68591633 77786870 88660841 101206542
7941 101206542 115208025 130158667 145108004 158658553 169203854 175287445 176011000
7934 176011000 171299473 161919441 149248886 134875030 120238024 106410204 94007924
7927 94007924 83258203 74127300 66490485 60198384 55055833 50849156 47383373 44534055
7919 44534055 42218515 40359385 38871869 37665369 36666701 35813952 35064834 34414052 33864101
7910 33864101 33426652 33124453 32985214 33060628 33420116 34099500 35083976 36326979 37802149
7901C7802149J710071J969697K297205K705801L193208L756211M422067N255774
7893F3112183O294314P517706Q969403J0748318J2899487J5460661J8444916K1766954
7885A65213942K5201387K8292230L0283142L0258957K7390996K1271556J2252983
7878C40165193J453612r493553j8907561k5562225k8977321k9479019k7868951
7871B01330175k5026513k1709807j8445713j5472249j2873830j0665732q830497
7864H8305834p325694o060462m976358m077478l358777k800175k396007k092260
7856E5218623j837854j619355j436127j271716j066983p89924m59361j33049J86088
7847D6790342N18777Q49107J199380J588130J997585K402415K841821L402101
$$ plain form
7901 37802149 39512220 41481917 43779122 46484923 49678131 53434342 57856409 63112183
7893 63112183 69406497 76924203 85893606 96641924 109541411 125002072 143446988 165213942
7885 165213942 190415329 218707559 248990701 279249658 306640654 327912210 340165193
7878 340165193 341618805 332125252 313217691 287655466 258678145 229199126 201330175
7871 201330175 176303662 154593855 136148142 120675893 107802063 97136331 88305834
7864 88305834 80980140 74919678 69943320 65865842 62507065 59706890 57310883 55218623
7856 55218623 53380769 51761414 50325287 49053571 47986588 47196664 46737303 46604254 46790342
7847 46790342 47309119 48158226 49357606 50945736 52943321 55345736 58187557 61589658
7839F1589658M124420M983630N987692P186855Q630673J0374260J2463746J4988386
7831A30329320J8030813K1572534K5491594K9501894L3069669L5336592L5215299
7824C28547715L1729591K4425801J3719580R24731j2026903k3104466l0833781
7817C33382268l4711310l5142504l3070731k9568672k5553135k1642020j8146725
7810A35547171j5148059j2618125j0509860q754021p283783o073811n102401m286898
7802F5770213l595612l044695k626110k303408k036576j793834j566134j318248
7794D7485596j024897p20417m31232j22888K12874N37901Q39835J154169J527307
7785D9458248J962221K437993K940177L498937M178563N022415O055547P305167
$$ plain form
7839 61589658 65714078 70697708 76685400 83872255 92502928 102877188 115340934 130329320
7831 130329320 148360133 169932667 195424261 224926155 257995824 293332416 328547715
7824 328547715 360277306 384703107 398422687 399347418 387320515 364216049 333382268
7817 333382268 298670958 263528454 230457723 200889051 175335916 153693896 135547171
7810 135547171 120399112 107780987 97271127 88517106 81233323 75159512 70057111 65770213
7802 65770213 62174601 59129906 56503796 54200388 52163812 50369978 48803844 47485596
7794 47485596 46460699 45740282 45309050 45186162 45399036 45936937 46776772 47930941 49458248
7785 49458248 51420469 53858462 56798639 60297576 64476139 69498554 75554101 82859268
7777H2859268Q806888J0621873J2812495J5406039J8380716K1654169K4998672
7770A95540120K7946418K9745147K9499447K6425138K0185233J1115049K49872
7763C40706424j0749670k0129679k6650822k9865933l0118958k8271809k5278815
7756A69640738k1882349j8560611j5563741j2987363j0838170r059429p572421
7749G3176654o334524n310884m464401l770719l201951k715973k308892k031160
7741D3038150j852891j700883j559719j430682j276786j070206q60492o77474
7733C2609017m64635k24153j8289J69865M01338O95403J018087J348830J708859
7724C7244322K130239K599674L092720L646578M325594N186949O260416P538780
$$ plain form
7777 82859268 91666156 102288029 115100524 130506563 148887279 170541448 195540120
7770 195540120 223486538 253231685 282731132 309156270 329341503 340456552 340706424
7763 340706424 329956754 309827075 283176253 253310320 223191362 194919553 169640738
7756 169640738 147758389 129197778 113634037 100646674 89808504 80749075 73176654
7749 73176654 66842130 61531246 57066845 53296126 50094175 47378202 45069310 43038150
7741 43038150 41185259 39484376 37924657 36493975 35217189 34146983 33286491 32609017
7733 32609017 32144382 31920229 31901940 32071805 32473143 33168546 34186633 35535463 37244322
7724 37244322 39374561 41974235 45066955 48713533 53039127 58226076 64486492 72025272
7716G2025272Q981481J0546372J2150796J3583614J4494152J4404698J2855767
7709A59042152R681380N085972l54049n794839j0408029j3601221j5161202j5289151
7701A13201013j4390709j2874924j1108373r392622p882185o620313n595437m736941
7693D0599509l990428l346619k811943k378694k042271j777261j554403j359442
7685B1338448j165991r72866q14021o82075n66238m79000m00525l08166k09826
7676A5739740r6640L2354J32418J80601J93325K01528K52853L82534N53632O95192
7666A8267537P84707Q75415J023814J248227J546494J915674K357941K854922
7658C0874731L396604L939085M385261M613500M511136L991494L008291J594152
$$ plain form
7716 72025272 81006753 91553125 103703921 117287535 131781687 146186385 159042152
7709 159042152 168723532 173809504 173455455 167660616 157252587 143651366 128490164 113201013
7701 113201013 98810304 85935380 74827007 65434385 57552200 50931887 45336450 40599509
7693 40599509 36609081 33262462 30450519 28071825 26029554 24252293 22697890 21338448
7685 21338448 20172457 19199591 18385570 17703495 17137257 16658257 16257732 15949566 15739740
7676 15739740 15643100 15675454 15807872 15988473 16181798 16383326 16636179 17018713 17572345 18267537
7666 18267537 19052244 19927659 20951473 22199700 23746194 25661868 28019809 30874731
7658 30874731 34271335 38210420 42595681 47209181 51720317 55711811 58720102 60314254
7650F0314254j07616j834102l319262m390233m951890n026529m766800m344798
7642C1573024l845245l303448k795925k410354k127418j851120j556754j327710
7634A2355050j163612r85543q06571o61027n60376n04506m67284m34110m10571
7625F361450l93311l68240l30496k84393k31366j97238j80279j64903j51971j36828
7615C922425j20739j12123j26136j50301j48422j41970j48520j25508p9396o1436
7605B707874o8307n4477k7386j2847k262L102m459l1615m0472O605N9428N1226
7593B586410k1308j18607j78634j51341q0061m1105m8282p1438r4467j04633o2601
7582A613933N249K2972L911J2027K6014J9588J6957J9769K6326K6465J8637m318
$$ plain form
7650 60314254 60206638 58372536 55053274 50663041 45711151 40684622 35917822 31573024
7642 31573024 27727779 24424331 21628406 19218052 17090634 15239514 13682760 12355050
7634 12355050 11191438 10205895 9399324 8738297 8177921 7673415 7206131 6772021 6361450
7625 6361450 5968139 5599899 5269403 4985010 4753644 4556406 4376127 4211224 4059253 3922425
7615 3922425 3801686 3689563 3563427 3413126 3264704 3122734 2974214 2848706 2769310 2707874
7605 2707874 2639567 2585090 2557704 2544857 2542595 2545697 2541238 2509623 2469151 2475756 2535184 2586410
7593 2586410 2565102 2446495 2267861 2116520 2036459 1995354 1947072 1875634 1781167 1676534 1613933
7582 1613933 1619182 1642154 1646065 1658092 1684106 1703694 1720651 1740420 1766746 1793211 1811848 1807530
7570A807530n2468p5781o9468q3160q2353n8361o4394q0938n8754r72O0161R2817
7558A333859R1179O0192N877n6634q0957m9018J7K6790L7266N0947L6700r56l7244
7545A418018q1199r2313m4868q790j7578l5626l1012k6811m7194o9432o3402j3738
7533H86055J3467q264j6652P611L5787M9600L7892P585K230J8844K8207J6199
7521A078561P125K4330M5254L7818l56k9882k9030m330n202n0915p9725n5944
7509I37704j6517J9174M4004L3676q977n1750n0997j2840P141L912j6237m7388
7497H40905p2340q9620j00442r4512o1061O190P6121Q6168K7109n0729q3400l4035
7485D50354L4095N1717M5182N4460O6773Q9772J25818J11111K4881m2092n5875
$$ plain form
7570 1807530 1755062 1679281 1609813 1526653 1444300 1385939 1321545 1240607 1181853 1180881 1241042 1333859
7558 1333859 1425038 1485230 1491107 1434473 1353516 1304498 1304515 1331305 1368571 1419518 1456218 1455262 1418018
7545 1418018 1336819 1244506 1199638 1190848 1173270 1137644 1106632 1079821 1032627 963195 899793 886055
7533 886055 899522 891258 874606 882217 918004 967604 1005496 1013081 1015311 1034155 1062362 1078561
7521 1078561 1085686 1110016 1155270 1193088 1192732 1162850 1133820 1129490 1124288 1073373 993648 937704
7509 937704 921187 940361 984365 1018041 1009064 957314 906317 893477 900618 904530 888293 840905
7497 840905 768565 678945 578503 483991 422930 429120 505241 591409 618518 567789 484389 450354
7485 450354 484449 536166 581348 635808 702581 792353 918171 1029282 1054163 1012071 956196
7474I56196m5282m828K0928j9954q2117j09382j05221o9828k8376L556K9012M4821
7462E89525L9742P673k0538j4468J8052M8255L3103m1697r7688p1613j9458k046
7450D68842j0066p460J6631L4847O1398R6139Q7541L9870j8928q0746j11916p7212
7438D98940k7521j4630o179Q947j13j2576j0335J609J7010M8541P9719P2778M7635
7425G03825L5592K1674j2316n1095q8980j16674j20115p8488m890M3755N9220
7414C91508R4931J47256J53984J09890N2318p826m4721l5099k9191p2941j35402
7403F24707j46470j07203m7223K022J9066K6579L6149K9546J7346L2384N1638
7392E38541N1533M5005L2322l834l4173j9364K3193N9782N5710L2018L2614K7566
$$ plain form
7474 956196 910914 906086 927014 907060 824943 715561 610340 540512 512136 515692 544704 589525
7462 589525 629267 636940 616402 601934 619986 668241 701344 659647 561959 490346 470888 468842
7450 468842 458776 451316 467947 502794 564192 660331 747872 787742 768814 688068 576152 498940
7438 498940 471419 456789 450610 459557 459444 446868 436533 438142 455152 503693 583412 656190 703825
7425 703825 739417 761091 748775 697680 608700 492026 371911 293423 288533 332288 391508
7414 391508 486439 633695 787679 897569 949887 942061 897340 862241 833050 760109 624707
7403 624707 478237 371034 323811 325833 344899 371478 407627 437173 454519 486903 538541
7392 538541 590074 635079 667401 663567 629394 610030 633223 693005 748715 780733 813347 840913
7380H40913Q067m824j2260j9400r544K6807M7482Q820l1611j131M5085M8885K9935
7367I77224M5k8864m6977o5289r6610j31461j36765j08328o6508k4890Q338K1461
7355C01376J7192Q459J2836J7026P207o078r766R804K2829R696K947J471j6103
7342C78896k2171j6003l5848o5124p0251n9952m3078j9731K3139P9790J02819
7331B52486R0876N4227K5292L6887O3753Q0383M9310k3057o3752m8258n016K1446
7319E34577J7673P657M697q56l886j747J992J8334K3462N114k2890m9643n7925
7306D76559n0240n1455m4549k650L2039K0165j2772m4579q7164j11431o9849J5670
7294F9744Q7127J11389R0549N4295L8283M5738K8419k1155o4225n9260j8642J0973
$$ plain form
7380 840913 848980 844156 831896 812496 802952 829759 877241 886061 854450 853319 898404 947289 977224
7367 977224 977269 948405 901428 836139 739529 608068 471303 362975 296467 271577 279915 301376
7355 301376 318568 327027 339863 356889 364096 358018 348252 358056 380885 390581 393528 394999 378896
7342 378896 356725 340722 304874 239750 169499 109547 66469 46738 69877 149667 252486
7331 252486 343362 397589 422881 459768 523521 603904 653214 630157 566405 518147 513131 534577
7319 534577 552250 559907 564604 563748 559862 558115 560107 578441 601903 607017 584127 534484 476559
7306 476559 426319 374864 330315 327665 359704 379869 367097 322518 235354 123923 54074 69744
7294 69744 156871 268260 358809 413104 451387 497125 525544 504389 440164 380904 362262 373235
7282C73235L7767M7862J4270m1161q2764r0797p7060n1113j4507K9294N7796M5938
7270B48760J432n0174p2805l9983L0494P1925O0000L5554J6697r804l4076l0427
7258B27593k0825k1923j4495j6100j9683k292J1886j013j3101J6496N6174N0147
7246B52864K901m3913o2599m5981q485M1893P0735L7196q076r075J1328m751m4149
7233A89888o0625p0068r2893r1600m4520J7554N7970O6152O3116N6670M0521L9553
7221A71718L4107N985n779R378K3157J7444P973J0180k469m0948p2879p5376o3653
7208A8838m0388j4734j344M369P05L253L0357N4711M5050J3742j2692k5582r833
7195F6452M2621P3400M8669l615l6994k3156J4993M5516O7781P3366M4446j2168
$$ plain form
7282 373235 411002 458864 473134 431973 349209 258412 181352 130239 115732 145026 202822 248760
7270 248760 250192 200018 127213 87230 117724 189649 249649 285203 301900 292096 258020 227593
7258 227593 206768 184845 170350 154250 134567 132275 144161 143148 130047 146543 202717 252864
7246 252864 255765 211852 149253 103272 94787 136680 207415 244611 236535 227460 238788 234037 189888
7233 189888 129263 59195 -33698 -125298 -169818 -152264 -94294 -28142 34974 91644 132165 171718
7221 171718 205825 211810 206031 215409 238566 256010 263983 274163 271694 230746 157867 82491 18838
7208 18838 -21550 -36284 -37628 -33259 -32554 -29301 1056 55767 100817 114559 101867 76285 66452
7195 66452 109073 182473 231142 227527 190533 167377 182370 227886 295667 369033 413479 401311
7183D01311o1712o1315j8456K2547M7242M8354J4958l9237o6329n0865n074L0028
7171B61452J5356j627J3043L2928M1152K7665R519M601q739m3172p1751r3438
7159A86989r6111o1816k0077q91J2380M2506N7080N4638M2334K4370O675m585
7147B43492J602J007j9278k9900l7575l9595j7966P986P468N192K9779M1478J9439
7134B13129j014J4214K2875l930m8067p3655o0621k4090L858J2686M1958P4609
7122A71952O4052L4938l273l6317k8709l423m859j4801j2054j2672j702L2285
7110A85417N6711N9695M9748M4586K7620r535m0317n8048n8682m3739l2712j5600
7098A65144K7679Q0270R6076M2857m2456q8493p1614l8559m0484n4030l0464J5567
$$ plain form
7183 401311 339599 278284 259828 282375 329617 377971 392929 353692 287363 236498 231424 261452
7171 261452 276808 275181 288224 321152 362304 389969 399488 404089 395350 352178 280427 186989
7159 186989 90878 29062 8985 8094 20474 62980 120060 174698 217032 241402 248077 243492
7147 243492 245094 246101 226823 196923 159348 119753 101787 109773 117241 122433 152212 193690 213129
7134 213129 212115 226329 249204 245274 197207 123552 62931 38841 42699 55385 97343 171952
7122 171952 236004 270942 267669 231352 202643 199220 194361 179560 167506 154834 153132 185417
7110 185417 242128 301823 351571 396157 423777 414242 373925 315877 257195 213456 180744 165144
7098 165144 192823 273093 369169 412026 369570 281077 209463 170904 130420 76390 45926 61493
7086F1493N2160M6932j3486n7870l4755K596J4690K0514M3045M9824K9158J5210
7074B29511P064l1867q7639q8746l0034K5048O0255R6381J12075Q0488K0533l5987
7062C57082o5615q1348q6909l8796L0939L9177J1790R860K8273M0320L6907L3320
7050C15000K9701J1886m762r522j4627k0072k4581k4807k4579k4858j7437N99
7038A91941j0176k9669p318J8743K0130m294k7773k7126j5588j1318j9224j5965
7026F2363J8223N3255N0245J3570j6744l5226m3780m5349k0396L7198Q3901N6343
7014B13603j8490p4320q6186m4650J691L3772O3623P4640N6984L4199L5164M7935
7002C37965M4619N899m1616n6159m4670k3655q992q703k7842o2494q0934n8767
$$ plain form
7086 61493 113653 160585 147099 89229 54474 57070 71760 92274 135319 185143 214301 229511
7074 229511 236575 204708 117069 28323 -1711 23337 83592 179973 292048 372536 393069 357082
7062 357082 291467 210119 123210 84414 115353 154530 166320 176180 204453 244773 281680 315000
7050 315000 344701 356587 351825 342303 327676 307604 283023 258216 233637 208779 191342 191941
7038 191941 181765 152096 144778 163521 183651 179357 151584 124458 108870 97552 78328 62363
7026 62363 80586 133841 184086 197656 180912 145686 101906 56557 36161 73359 157260 213603
7014 213603 195113 120793 34607 -10043 -8352 25420 89043 163683 220667 254866 290030 337965
7002 337965 382584 388483 346867 290708 246038 222383 213391 204688 176846 114352 33418 -25349
6990b5349j4918P318j0783k2736L456L3193K0081k1672n4903n7618j0025O2055
6978i1901R4065O4554K4429J4502P594k0787n6261o4101l8948k3409m1358m6685
6966a78306m526L8680L3692M887O169K8346L5048J7984J5683O5350J20887J28881
6954C12775P9285n297p3310r3137r2483r3721r3340p6053m1996L62L9426P9174
6942e8315R6452O5936K5267J269j8120k5966J159M9247Q2640P0540L1735J522
6930C23366j7678j5098k665r534m0967q0091o8465m0136m9067o1350n7409l2431
6918a51525J7102N9892N0424R138L552J4490j229j9029k9084m1959l6453M975
6906a19706M8453M1003R675q326j3899m372P299L549k3819n5494n2981k4964M791
$$ plain form
6990 -25349 -40267 -32949 -43732 -66468 -63012 -29819 -9738 -31410 -86313 -143931 -153956 -91901
6978 -91901 2164 66718 91147 105649 113243 92456 36195 -27906 -66854 -90263 -131621 -178306
6966 -178306 -182832 -144152 -110460 -105573 -99404 -71058 -36010 -18026 -2343 63007 183894 312775
6954 312775 392060 386763 313453 220316 127833 34112 -59228 -135281 -177277 -176915 -137489 -58315
6942 -58315 38137 104073 129340 130609 112489 86523 87682 136929 219569 290109 321844 323366
6930 323366 305688 290590 287925 278391 237424 157333 88868 48732 -335 -61685 -119094 -151525
6918 -151525 -134423 -74531 -24107 -14969 -11417 3073 1844 -17185 -46269 -88228 -124681 -119706
6906 -119706 -71253 -30250 -20575 -28901 -42800 -47172 -39873 -36324 -60143 -115637 -168618 -193582 -188791
6893a88791L1809M8004L5125M961n403j994N343J4572p660m4816n1978k9314j8202
6880b08344r855L6236P7406P6988O0554M0039J6873o922j0504N130R258J1641
6868I8500J4256J1262O811j3972n2088o5327m3867P537N1444O2089N1012P025
6856A34682l3412k9462j3510j2760l6056p4978j10533j33021j17029n6505K0152
6845d62432O4327N9236M1993M6008O1754O7589O0359L1858k1400o4400q3041o1543
6833b59692j325P1048J19934R1814K4992j3253l3275n5940m6639q82M8396R3341
6821C8519J09637Q0266J9263k6449l5633l0868l0269l6800k5023Q093N809l7042
6809C9503o1770k2756L4915N7632M6231K798m4988n0568k742M5851M2558L5184
$$ plain form
6893 -188791 -156982 -108978 -73853 -68892 -74295 -76289 -70946 -56374 -64034 -108850 -160828 -190142 -208344
6880 -208344 -218199 -181963 -104557 -27569 32985 73024 89897 82975 72471 77601 86859 98500
6868 98500 112756 124018 130829 116857 64769 -558 -44425 -36888 14556 76645 127657 134682
6856 134682 101270 71808 58298 45538 9482 -65496 -176029 -309050 -426079 -482584 -462432
6845 -462432 -398105 -338869 -296876 -250868 -189114 -121525 -61166 -29308 -50708 -115108 -198149 -259692
6833 -259692 -261017 -189969 -70035 21779 46771 33518 243 -55697 -102336 -103218 -54822 38519
6821 38519 148156 228422 247685 221236 185603 154735 124466 87666 62643 70736 76545 39503
6809 39503 -22267 -45023 -10108 47524 93755 96553 51565 997 -1745 44106 86664 121848
6797A21848N4417N8251L4287k3838p3304q2935q0814p5578o7014n4468k8276p443
6785b24867J362j673K0K3774L9854L4976L1033L7754O6791J00210Q3118L3514
6773B25866J804j0719j9377l7285m8842j7296L0408M6893L2837J8651J0333r387
6761B23886j3211J5823M6047N4852N3682M4933K6515O945k011k3178m7049n4122
6749C33112l8445p886q475m0386n9185m2945j6077L38J6602M6977P9385Q0273
6737C43288M4775k479l9127o1095p1525n6478k9000j0815J3274N169n2148p0062
6725A3777j6691N1875R1213R1094O8876L5329P497J842N391q352l3826m3328m0073
6712B24624m5836o2295o7276l3201l521K298K3698L4722J6736j1906m1422n9188
$$ plain form
6797 121848 176265 234516 268803 244965 171661 88726 7912 -67666 -134680 -189148 -217424 -224867
6785 -224867 -223505 -225178 -225158 -201384 -161530 -126554 -95521 -57767 9024 109234 192352 225866
6773 225866 227670 216951 197574 160289 111447 94151 124559 171452 204289 222940 233273 223886
6761 223886 210675 226498 272545 327397 381079 426012 452527 459472 457461 434283 387234 333112
6749 333112 294667 286781 278306 237920 178735 135790 119713 120051 136653 183630 263015 343288
6737 343288 388063 385584 346457 285362 213837 157359 128359 117544 130818 135987 83839 13777
6725 13777 -2914 48961 140174 231268 300144 335473 342970 344812 350203 341851 308025 264697 224624
6712 224624 178788 116493 49217 16016 12495 14793 38491 73213 89949 78043 36621 -22567
6700b2567n2347k4524J0103M1199M3298Q74m7925o8755m9318l377M0802P4983
6688e7554Q1385L9187j2440l9839p0581q1954n2171k35O3180J07575R3210J2019
6676H1782p3059r5801o6498m0356l7330j8788J7206L1873K5748K9185O2450Q5920
6664B332P4640L6582l9650r8421p9153j5564L5706M7007L9718M9913O2487M4452
6652A60049J1086k4466m1633m0139m6225m0501r470K8036O3199Q1702P5175N4679
6640B71492L0507O462j2013j6949l0237n6530o7354n6006l2134K076M3586O7287
6628A50187M9922J655l9782n8581m9911q519L2073L7678K2712j3688n2573n2625
6616A8548l8421m7100m3883j1629N471l932j0998m517k796j2176j5216j778p67
$$ plain form
6700 -22567 -74914 -99438 -89335 -48136 -4838 -3964 -51889 -120644 -169962 -173339 -132537 -57554
6688 -57554 23831 63018 50578 10739 -59842 -141796 -193967 -194202 -131022 -23447 69763 81782
6676 81782 8723 -87078 -153576 -193932 -231262 -250050 -232844 -200971 -175223 -146038 -83588 2332
6664 2332 76972 113554 73904 -24517 -103670 -119234 -83528 -36521 3197 53110 115597 160049
6652 160049 171135 146669 105036 64897 18672 -21829 -31299 -3263 59936 141638 216813 271492
6640 271492 301999 308461 296448 279499 249262 192732 125378 69372 37238 39314 82900 150187
6628 150187 200109 201764 161982 103401 53490 44971 77044 114722 137434 123746 71173 18548
6616 18548 -19873 -66973 -110856 -122485 -117014 -120946 -131944 -136461 -139257 -151433 -166649 -168427 -169194
6603a69194j6095j0389J2083J9909L3687M1048J5804j3201j4960L3308J13999
6592D5999J51659J27126Q9590N0024p100m9552n0162m0172m5515l2584r991k2198
6580B07124n0695n4718o2735p5354l1435L5778N1736J4036p401J9392M5906L1099
6568A22733M006l555J0712J6284n149N015N3345O3328L2414R909K653R655J9472
6555C40822J0103o583p125J8689L8744K9295R652j2718k8633k5172j0287q133
6543C48654k6175o2132q6626o8757k2420J5900K3733L8452P2764Q1857N0853J9111
6531C85214n240m0076o1512n4542m6523l2934j2125j296k724k6649m8036l5824
6519A7733n085L0097K2226l2781n5319l1983j5403j8958N515N1506P3938P9482
$$ plain form
6603 -169194 -185289 -195678 -183595 -163686 -129999 -88951 -73147 -86348 -101308 -68000 45999
6592 45999 197658 324784 414374 464398 457298 407746 357584 317412 271897 239313 229322 207124
6580 207124 156429 101711 38976 -36378 -67813 -32035 19701 33737 26336 45728 91634 122733
6568 122733 126739 123184 133896 150180 145031 150046 203391 266719 299133 309042 311695 321350 340822
6555 340822 350925 344342 337217 355906 394650 423945 433597 420879 392246 367074 356787 348654
6543 348654 322479 260347 173721 104964 82544 98444 122177 160629 233393 315250 366103 385214
6531 385214 379974 339898 278386 223844 177321 144387 132262 130966 128242 101593 53557 17733
6519 17733 12648 42745 64971 32190 -23129 -55112 -70515 -89473 -83958 -32452 41486 120968
6507A20968O8213K7202j3445j7007q838k3672m5758m3133j3743M72q423L970M4190
6494I0996N6102K0244l6923r8591r8392j5438N0867M9474n387o4809p1366j8335
6482a41558M2174N1982M5989N6658N4691M4978L2194K0207M0243N5973K3622m2079
6470B85074j16214j71776j68581j06365l6993n79R361J1436k128k2153k7360j2188
6458c58466O840K7148M0809L1183M8086R1365P6455m225p2440q2733n1596j9258
6446b66832o711p517k0591j7840M638K7666O9525J12825J16177Q5174L0148l0299
6434I6363o0274m7889j6446J1419L2693L6653j278n3823p3804n8508j9419L7612
6422a16701O8196L9223r897k0677L420J3220M520j4641m0181n4820l2446J0405
$$ plain form
6507 120968 189181 216383 202938 185931 177093 153421 107663 64530 50787 51259 42836 46806 90996
6494 90996 147098 167342 130419 31828 -66564 -82002 -31135 18339 12952 -51857 -123223 -141558
6482 -141558 -99384 -47402 -1413 55245 109936 154914 187108 207315 247558 303531 327153 285074
6470 285074 168860 -2916 -171497 -277862 -314855 -315434 -306073 -294637 -296765 -318918 -346278 -358466
6458 -358466 -351626 -324478 -283669 -252486 -204400 -113035 -36580 -40805 -113245 -195978 -247574 -266832
6446 -266832 -273543 -281060 -301651 -319491 -314853 -287187 -217662 -104837 11340 96514 126662 96363
6434 96363 36089 -11800 -28246 -16827 15866 52519 51241 -2582 -76386 -134894 -154313 -116701
6422 -116701 -48505 -9282 -19179 -39856 -36436 -23216 -18696 -33337 -73518 -128338 -160784 -150379
6410a50379K4121L7891O8429R0541R0578P6985N8936L5990K2781L3506M2608L1408
6398D63395j797n8090j03580j15900r6310o2236j3660K8714M1993L7400M2253
6387A62182O2900O7108M5531K5715L3365L6869K3180J7402q111m2203l3316P845
6375C98467L6692L4491J4214q84j1506j0745j0071k0244j7279m229j3583m5633
6363C49690q1036r9291p0251q662K8245J8871R161K9549M4707N6054P7021Q3994
6351D38052Q4917R5348J08339J05435P7628M4155K6467M7688Q5240J04609J23168
6340A341046J35837J45955J79876K11317K01702J50407P9114J8166j1831k1733
6330B429856n1645j06806j45940j26263q2851p3595j11456j78016j99476j50700
$$ plain form
6410 -150379 -126258 -88367 -19938 70603 161181 238166 297102 333092 355873 389379 431987 463395
6398 463395 461598 403508 299928 184028 87718 25482 11822 40536 82529 119929 162182
6387 162182 225082 292190 337721 363436 396801 433670 456850 474252 466141 423938 390622 398467
6375 398467 435159 469650 483864 482980 471474 460729 450658 430414 413135 408906 395323 349690
6363 349690 268654 169363 99112 90450 118695 137566 146727 176276 220983 277037 354058 438052
6351 438052 522969 618317 726656 832091 909719 953874 980341 1028029 1113269 1217878 1341046
6340 1341046 1476883 1622838 1802714 2014031 2215733 2366140 2445254 2463420 2451589 2429856
6330 2429856 2378211 2271405 2125465 1999202 1916351 1842756 1731300 1553284 1353808 1203108
6320A203108r1534l9050J0834L7638N4767O0793L6414k18l8177q3105r9205p9901
6308I72364p5521j01366j16781r0738k7587L4667M3548R760l99L0673N3072M1633
6296G73325L9688O8308J15115J66771J97133K11300K18694J83713J19223N0601
6286B143871k7942r2152j16835j04292r5907q5277n3137m3119q5847j36851j31376
6275A171136p8420l5778j3452r204j9505k5943l5662m3016n6758o8296n1789l2640
6263G00673l0140l1574k1604k4579m4355l7547k0342k0506k1623l1388p4227j10917
6251B31871j10528r3383o4293n1236p1609q0550m9118L376L5364M5651J7579m4052
6239b30928n7624j7205L2773P6523R1696Q3256P3056M7581J5837L992J9917M4308
$$ plain form
6320 1203108 1111574 1072524 1083358 1120996 1175763 1236556 1272970 1272752 1234575 1151470 1052265 972364
6308 972364 896843 795477 678696 587958 560371 595038 638586 648346 647947 678620 731692 773325
6296 773325 813013 881321 996436 1163207 1360340 1571640 1790334 1974047 2093270 2143871
6286 2143871 2115929 2023777 1906942 1802650 1706743 1621466 1568329 1525210 1439363 1302512 1171136
6275 1171136 1092716 1056938 1043486 1034282 1014777 988834 953172 910156 853398 785102 733313 700673
6263 700673 670533 638959 617355 592776 548421 510874 490532 470026 448403 417015 342788 231871
6251 231871 121343 27960 -36333 -87569 -159178 -239728 -288846 -285470 -250106 -204455 -186876 -230928
6239 -230928 -288552 -305757 -272984 -196461 -104765 -21509 51547 99128 114965 118957 138874 183182
6227A83182L2305J6360L4363M5351K1217k0746n5700q2271q3360n0211q247O736
6215C8979j9148m5746j4244N4427Q8468P3894K2363n8434j11461r4846l1813L1494
6203f6067O7101N7070J7712p82Q392K0501J0533K418K4281O1768Q3657O1269K6941
6190C74794J301M063J0645k0816n7743o9034p6438r2640q3391n3304k1405j2964
6178i6932n1193r1910q1858k3675K9124L8728J6370M511K8715M6807M2392M0221
6166i8700N2198P9921R0770N8763J897l3233k7879M775M3314O2992O8566N1825
6154C55209M724m6664o5753n3689k9356J988M0179N2927J0019k5324r877K8464
6142B62847L6265j0780n9834o2952m9160m9556n3502m0623r710J5378Q089k6200
$$ plain form
6227 183182 215487 231847 266210 311561 332778 312032 256332 174061 90701 40490 32243 38979
6215 38979 19831 -25915 -40159 14268 102736 176630 198993 140559 29098 -65748 -97561 -66067
6203 -66067 1034 58104 75816 75034 83426 103927 114460 116878 141159 202927 286584 347853 374794
6190 374794 376095 380158 390803 369987 312244 243210 166772 74132 -9259 -62563 -83968 -96932
6178 -96932 -148125 -240035 -321893 -345568 -316444 -277716 -261346 -256835 -228120 -181313 -138921 -98700
6166 -98700 -46502 33419 124189 182952 184849 151616 123737 128512 171826 234818 303384 355209
6154 355209 359933 313269 247516 193827 164471 166459 206638 259565 269584 244260 234383 262847
6142 262847 299112 288332 228498 165546 116386 66830 13328 -27295 -37005 -21627 -13538 -39738
6130c9738m4567k4022K1539O6687R4886Q7964M7122J9860K7219L9814L6271K0236
6118C53271m57j6029l0675l3476q538J8985L9288O3923Q0134Q1553Q8985Q9227
6106G26191P3780O6808P8923Q2697Q6338J30411J86007K13834K07235J80460J53354
6095B186038J36804J11915N3155j7793n5572o8846q7517j14778j48124j73423
6085A821859j85396j78236j58624j44227j18126o8202j3616n521l8045l7753j054
6074H73059M4763P7831O3137L3912L9297J7730l9277o3224m2833j5219p658k1929
6062I59589k5848j0346j6599k8224p114K7002N7478Q4697J10155J49142J91608
6051A491540J90220J37986P4275K7401N482k410L53m468k9069p5381j16460j07195
$$ plain form
6130 -39738 -84305 -108327 -86788 -20101 74785 162749 209871 229731 256950 296764 333035 353271
6118 353271 352814 336785 306110 272634 264096 283081 322369 386292 466426 547979 636964 726191
6106 726191 799971 866779 945702 1028399 1114737 1245148 1431155 1644989 1852224 2032684 2186038
6095 2186038 2322842 2434757 2487912 2470119 2414547 2345701 2258184 2143406 1995282 1821859
6085 1821859 1636463 1458227 1299603 1155376 1037250 969048 955432 949911 911866 874113 873059
6074 873059 917822 995653 1058790 1092702 1131999 1149729 1110452 1047228 1004395 989176 981518 959589
6062 959589 933741 923395 906796 878572 871458 898460 955938 1040635 1150790 1299932 1491540
6051 1491540 1681760 1819746 1894021 1921422 1926904 1924494 1924847 1920379 1891310 1815929 1699469 1592274
6039A592274n2140j1107k9360o7087q6673q7775p6210m2645N168M0643N2047L4962
6027A272097L190j2706j6057l2709p6626j26027j42735j16641q2624p5078p4715
6016E19369n3497k3033k6169n5536r0921j10260p7876j0455M5290O2377N3608
6005B32897L8820L6781K6311k0959n9198m5077Q081N3625O0547J6883m6506o2429
5993B39776j4818L9812N0147J7316l4417q0835r6651p4840m1980l0377n1947p1837
5981a50651l7917Q044K2723L6677O5782O4253K5942l92L476K0706L3493J4954
5969A07090l0627n2971k7088R631K6j6456p947J6932L8973J8019k2299l1419j3621
5956a1757l626k587J8813L5964K4641K1645K3882Q186k3867m6039n1733m5649
$$ plain form
6039 1592274 1540134 1529027 1499667 1432580 1345907 1258132 1181922 1139277 1144445 1185088 1237135 1272097
6027 1272097 1275287 1262581 1246524 1213815 1137189 1011162 868427 751786 669162 594084 519369
6016 519369 465872 442839 416670 361134 270213 159953 82077 71622 116912 179289 232897
6005 232897 271717 308498 334809 313850 254652 209575 217656 271281 331828 348711 302205 239776
5993 239776 224958 264770 314917 332233 297816 216981 120330 45490 3510 -26867 -78814 -150651
5981 -150651 -188568 -180524 -157801 -121124 -55342 8911 34853 34461 37937 58643 92136 107090
5969 107090 76463 23492 -3596 6035 6061 -10395 -18342 -1410 37563 55582 33283 1864 -11757
5956 -11757 -15383 -17970 843 36807 61448 83093 106975 115161 91294 45255 -6478 -52127
5944e2127l2689k5540j8311r260N239L5680M6929P619m3440m5356o672J6120K5486
5931i6322N5998R9476J38968J50960J01913K4384k4017m6177o0299o0935l0186
5920B53763J9566N0269L9365r634n9293q3445o2006K369Q7582J36271Q6776k6351
5908D35232r6558q4224m0643n285J8806R620k8346o4257p1675j3548P1094Q7095
5896B17311K9384k6049k7217j257J3030J5234O771l18p92l062m492k263K0093
5883B36373N4088M7557j8920q4768q9954m3243J4641M5007M3192J0136k0397J0790
5871B04502O8708J00695R8771N0476l8518j08575j16456q5347m6482l5661n6293
5860C5820p0130l9399K6462O1930M7593J0750k8395n1389m2789l194N0183Q4263
$$ plain form
5944 -52127 -84816 -110356 -128667 -137927 -132688 -97008 -50079 -42460 -85900 -131256 -137928 -121808 -96322
5931 -96322 -40324 59152 198120 349080 450993 475377 451360 405183 344884 283949 253763
5920 253763 273329 323598 362963 353329 294036 210591 148585 150954 238536 374807 461583 435232
5908 435232 338674 254450 213807 208522 227328 236948 208602 144345 72670 59122 130216 217311
5896 217311 246695 220646 193429 192172 205202 220436 227207 226889 226097 223035 218543 216280 236373
5883 236373 290461 338018 319098 234330 144376 101133 115774 160781 203973 214109 193712 204502
5871 204502 273210 373905 472676 523152 484634 376059 259603 174256 127774 92113 35820
5860 35820 -34310 -73709 -47247 14683 62276 73026 44631 -6758 -49547 -52741 -2558 81705
5848H1705Q1249N5042J5693k3167o7194j10659j21494q3334k3472K9379P1120
5837i5132Q3929O1549L9380L8375M9824O2009M8870J4821k0453k9884j3594l118
5825B36576j6923m1820l1771L36J7587m706n2248q2079q5385o0612k8514j6565
5813a66124j0005N302N784r371j0045j09j809O756K9420M9278M2870J4286l515
5800d7282j6208l6849l6323n624J7580R65k6707m4320m1951k7920k7175j6989
5788c08803Q240M252j941K9691N9560P3489Q0339P4275O5801O6070M7296Q696
5776B06965j1541k7791m9827m5145k3831j0580j8443k9754l3964n2330o1895k0390
5764a78526M5273Q8183J01003P9059K8780j8629k9196L836L7787L1225n325l4617
$$ plain form
5848 81705 162954 217996 233689 210522 143328 32669 -88825 -172159 -195631 -166252 -95132
5837 -95132 -11203 50346 89726 128101 177925 239934 288804 303625 283172 253288 239694 236576
5825 236576 219653 177833 146062 146398 163985 159279 107031 24952 -60433 -121045 -149559 -166124
5813 -166124 -176129 -170827 -165043 -174414 -184459 -184568 -186377 -179621 -150201 -100923 -58053 -43767 -47282
5800 -47282 -63490 -100339 -136662 -142286 -124706 -123741 -150448 -194768 -236719 -264639 -291814 -308803
5788 -308803 -300563 -296311 -298252 -268561 -209001 -135512 -55173 19102 84903 150973 198269 206965
5776 206965 195424 167633 117806 72661 48830 38250 19807 -9947 -43911 -96241 -158136 -178526
5764 -178526 -133253 -45070 55933 134992 163772 145143 115947 119783 157570 188795 183470 148853
5752A48853m8743l4703N7K0713P452j5977k6244n4633r3121r3309m5593K6036
5740b09212P7405O3652R154l4277l0804J607J7741J9529K1606L3802L6689R307
5728A6199j8602k2514k2102k3190j6167k1857k9197k2673j0737L265J0972j1908
5716a68511n4526o8260n0002n180O3522J06851R2315L4398k1716k1882J0192J6766
5704f6033j3517m6508n0616j3210L2819N7654N6641K8782j676j4926j6632M022
5692d3200M4088N2793R685m3825p8544p3225l7068j1014J1093M4006Q3775J08047
5680F6611R1911M2330M805j4742n0389q1537p9432m5335p088J4149M1910M7477
5668C0670J5810k382Q303J7579q047n0433o6778l1570K4521L6032J3672J572J0867
$$ plain form
5752 148853 100110 65407 65464 86177 93629 77652 51408 -3225 -96346 -189655 -235248 -209212
5740 -209212 -131807 -68155 -59001 -93278 -124082 -122475 -104734 -85205 -63599 -29797 6892 16199
5728 16199 -2403 -24917 -47019 -70209 -86376 -108233 -137430 -160103 -170840 -167575 -156603 -168511
5716 -168511 -223037 -291297 -341299 -346479 -282957 -176106 -83791 -49393 -71109 -92991 -82799 -66033
5704 -66033 -79550 -126058 -176674 -189884 -157065 -99411 -42770 -13988 -15664 -30590 -47222 -43200
5692 -43200 888 53681 63366 19541 -59003 -132228 -169296 -180310 -169217 -125211 -41436 66611
5680 66611 158522 200852 205657 190915 140526 58989 -20443 -65778 -72866 -58717 -16807 30670
5668 30670 46480 44098 52401 69980 61933 11500 -55278 -86848 -62327 -26295 -12623 -11051 -184
5655a84M5599Q3394O6344P090l5073o1745o2883l0031K066j077j2488j1416j2377
5642b2781j8897j4319J0786J4520j6088m6094n1929k7286M067N812k377J672J2805
5629a50109K7836K5092J8771L2431O6520R4644R1007O0561J0771j7168q561M813
5617B56608j8648n2244l3968J4025L2355J3719j9790p7553j30761j21316o4410
5606b01983j4253J3581L7240M7385L2540K3725K683m2895q0150q0032m6317m672
5594c13148K3763K8867L8482L9824j1547o4819l3466L8313N9655M9376M6844N4447
5582d3409O1954N5397K6478j1577m0039m9042m0184k4679j1110r224j7647k1381
5570a24463M77K2842q92m0259n1171l9460n624M1419N7774N4916M4103O165m018
$$ plain form
5655 -184 45415 128809 195153 202243 167170 105425 42542 12511 14577 13500 1012 -10404 -22781
5642 -22781 -41678 -55997 -45211 -30691 -46779 -92873 -144802 -172088 -168021 -162209 -164586 -162914 -150109
5629 -150109 -122273 -97181 -78410 -45979 20541 115185 206192 266753 277524 260356 251795 256608
5617 256608 237960 185716 151748 165773 198128 211847 192057 114504 -16257 -137573 -201983
5606 -201983 -216236 -202655 -165415 -118030 -85490 -61765 -59082 -101977 -182127 -262159 -308476 -313148
5594 -313148 -289385 -260518 -222036 -182212 -193759 -258578 -292044 -253731 -194076 -144700 -97856 -43409
5582 -43409 18545 73942 100420 88843 48804 -238 -40422 -65101 -76211 -85435 -103082 -124463
5570 -124463 -123986 -101144 -102036 -142295 -193466 -232926 -238550 -197131 -139357 -84441 -40338 -34173 -38191
5557c8191K2671J5431j8387k8362j3504J4052K7493K092k9458l4024l9531n9843
5545a79561o0715l5362L854N2953J03228J28454R7740M7583K4214J9982Q690j0736
5533B00324j1324j0198m6613r6103j07049p2627l2516j7386p248J5278L7522M2756
5521a05184K4897r985k0783k625J5025K7652L2255L5207J4833k8658m4897l5193
5509i7456k6788j9493j5596k3494l8719l4199j1378J8554N6505P8309P4608M6507
5497G360N340l5875o3159m6916R297N1415O0755N9984N2635L1765K3255O3486
5485B19342J24254J20460M4814l4326m8627j8330k0984p2039j14176j05851o7338
5474B7199k3131K5490O3226N3258K702m5084n7828o2911o7527n3055l7159o301
$$ plain form
5557 -38191 -15520 -89 -18476 -46838 -60342 -46290 -18797 -16705 -46163 -80187 -119718 -179561
5545 -179561 -240276 -275638 -271784 -218831 -115603 12851 110591 158174 182388 202370 211060 200324
5533 200324 189000 178802 132189 36086 -70963 -143590 -176106 -193492 -200740 -185462 -147940 -105184
5521 -105184 -80287 -90272 -111055 -113680 -98655 -71003 -38748 -3541 11292 -17366 -62263 -97456
5509 -97456 -124244 -143737 -159333 -182827 -221546 -255745 -267123 -248569 -192064 -113755 -39147 7360
5497 7360 12700 -23175 -86334 -133250 -123953 -72538 -11783 48201 100836 132601 155856 219342
5485 219342 343596 464056 508870 474544 425917 407587 386603 314564 200388 94537 27199
5474 27199 4068 29558 92784 146042 148744 103660 45832 -17079 -84606 -137661 -174820 -181121
5462a81121M8565Q4630R1320Q8850O6830K2695k1438n9621n8010k6598m910m100
5450D7092l0036n8007m6360j2781J5707M8347P1512N4701J6188L601J6209L9678
5438A65851M2125r644q1500j29957j39837r3260M958P5902Q9954P8810M5262n538
5426D3126n1354p5029o4065k6244K0219O1138P7560M5889J7342K5636N2896O8726
5414A95840N8687M1227K0086J3416K6119M2119M5994L8446Q886m9016r8752j26669
5402B16383j33049r0931k0383L1092M5496M0251M2127L5117J4822N651p291m0225
5390A39060p2696q0140n9429k1505k715l348r585j6616j8853j1612J6216N8421
5378h2802R3911R7242N4516j6493n0311k7289n576k4383o1022n2907n301K0817
$$ plain form
5462 -181121 -132556 -47926 43394 132244 199074 221769 200331 140710 82700 56102 51192 47092
5450 47092 17056 -40951 -87311 -100092 -84385 -36038 35474 90175 106363 109964 126173 165851
5438 165851 207976 198332 116832 -13125 -152962 -246222 -241264 -165362 -75408 3402 48664 43126
5426 43126 -8228 -83257 -147322 -173566 -153347 -92209 -14649 31240 48582 74218 127114 195840
5414 195840 254527 295754 315840 329256 355375 397494 443488 481934 490820 441804 343052 216383
5402 216383 83334 -7597 -27980 3112 48608 88859 130986 166103 180925 186576 179285 139060
5390 139060 66364 -13776 -73205 -94710 -97425 -100773 -110358 -126974 -145827 -157439 -141223 -82802
5378 -82802 11109 108351 162867 146374 96063 68774 63198 38815 -22207 -75114 -80415 -59598
5366e9598K8108L1204K0481r02j9169m0299m7163m3176n1485n1511l6911l3295
5354c03716l4222N30N4847P5705P3161R3056J01160O4948L698n9041j13062j54055
5342a96991j54092j17057q2241n8297l4683j7180N885M6334P6137Q3825Q7789
5331c60571R3790R7126P5264R602o7858j01879p7575j6750M3171P5519N4589N23
5319a75049k6675k4650k6499k3279J758K1059J8068j2213n3465o7946l5329J4603
5307c89617M3558M3820K6281K481O95K5570M0973L3462O098k9573n4197n9151
5295c09600m5188r663L1409N1211N1229N0141N3673O3385O7102P0220N4901J2687
5283A41507k3355m5136o4295p3954o2648m1538l184N2333P9221O1955K8558K1217
$$ plain form
5366 -59598 -31490 -286 20195 19293 124 -40175 -87338 -130514 -181999 -233510 -270421 -303716
5354 -303716 -337938 -337408 -282561 -206856 -133695 -40639 60521 125469 129167 70126 -42936 -196991
5342 -196991 -351083 -468140 -550381 -608678 -643361 -660541 -654656 -608322 -532185 -448360 -360571
5331 -360571 -266781 -169655 -94391 -84789 -152647 -254526 -332101 -348851 -305680 -230161 -175572 -175049
5319 -175049 -201724 -226374 -252873 -276152 -274394 -253335 -235267 -247480 -300945 -368891 -404220 -389617
5307 -389617 -346059 -302239 -275958 -273477 -272782 -247212 -206239 -172777 -166679 -196252 -250449 -309600
5295 -309600 -354788 -364451 -333042 -281831 -230602 -180461 -126788 -63403 3699 73919 128820 141507
5283 141507 118152 73016 8721 -65233 -127881 -169419 -172603 -120270 -41049 20906 49464 70681
5271G0681L6667K6426j5467l5403O133N2030N0755L0023J0835J552J1420K2560
5259B68212M440k0160j2289k2174n8393l1714L2350L5135q585l3995l1540j4665
5247A06622M029P313m508m913Q397J0959n714l5431k8029L3073R1701J05017P2677
5234C61193L2337n306o6797j16154j15539o8667j0678L022j1880j5J8390j715
5222A8191m4005q8500j13182r0059k6842K1349O342l9127o1767m5716J1454P4256
5210c77606Q3965M8802K3178K6206K7679mk4771l2575l9741m0106k1280J0097
5198c16156K3919K5111K9163K4740J2208K4799O5731Q0538M9661Q740j2889k1846
5186f281m4551n1019j7516K7444K8235k3312n7073l0794K9256Q6359J08039O1741
$$ plain form
5271 70681 107348 133774 118307 82904 89037 141067 191822 221845 232680 234232 245652 268212
5259 268212 272652 252492 240203 218029 159636 127922 160272 195407 186822 152827 121287 106622
5247 106622 110651 117964 113456 108543 116940 127899 122185 86754 58725 91798 183499 288516 361193
5234 361193 393530 388224 321427 205273 89734 21067 10389 13411 1531 1516 19906 18191
5222 18191 -25814 -114314 -227496 -317555 -344397 -323048 -316706 -355833 -417600 -463316 -451862 -377606
5210 -377606 -293641 -244839 -221661 -195455 -167776 -167780 -192551 -225126 -264867 -304973 -326253 -316156
5198 -316156 -292237 -267126 -237963 -213223 -201015 -176216 -110485 -29947 19714 28454 15565 -6281
5186 -6281 -50832 -101851 -119367 -91923 -63688 -87000 -144073 -174867 -145611 -59252 48787 110528
5174A10528j4350m6384l1128j7194l0932o0294o8414l2161K2012N6721M6550j8073
5162h3119p3534l7453M9619O2155n486o0464p1684o3062n0933j6558N8472J30108
5150a61939J48234R9877J4529n7921q1822m7379n610j995k0551m5018q2424q9286
5138c31305m9916j0293J3576J7426Q892Q117J7531J4548J7906L4263J7687j9854
5126b61422l2384m4366n4760j1803M1591N4186L8005O256l2831l3860J8542P3616
5114b39230Q2433P3413P1370N6809L9988L2038J9996J2039J0033K649O431J2418
5102A80387p431m9455o9390l1778J6214K0738J0248Q99k1722l7077j9228J6165
5090H570K3977O742Q94J5313K2206N197k2397l1117j9460K742N4015J14273J01145
$$ plain form
5174 110528 96178 49794 18666 1472 -29460 -89754 -158168 -190329 -168317 -111596 -65046 -83119
5162 -83119 -156653 -194106 -144487 -82332 -87818 -148282 -219966 -283028 -333961 -350519 -292047 -161939
5150 -161939 -13705 86172 100701 42780 -39042 -86421 -92031 -94026 -114577 -159595 -242019 -331305
5138 -331305 -381221 -391514 -377938 -360512 -351620 -343503 -325972 -311424 -293518 -259255 -241568 -261422
5126 -261422 -293806 -338172 -392932 -404735 -363144 -308958 -270953 -264697 -297528 -331388 -312846 -239230
5114 -239230 -156797 -83384 -12014 44795 84783 116821 136817 148856 158889 161538 167969 180387
5102 180387 172956 123501 54111 22333 38547 59285 69533 70432 48710 11633 -7595 8570
5090 8570 32547 39289 40183 55496 77702 82899 60502 29385 9925 12667 66682 180955 282100
5077B82100q536j03898r6792m7270l0371l0150r181K6778L5505J8865R185P899
5065E4134J1570J1728r40q132j411j2135n1393p9665q2414p2376l5039L4487Q2221
5052a49365Q0911N9000M1767K6941j7697o3899n4762n539K9774L4669O738j4830
5040b6292j3621K038R059k6810p1680o0712r525K3631L6540M0737L9943J4361
5028d2331l7642n5705j9365L660j11j840l63L351R557K7334L6980P544n2431p2342
5014a93704k3895K3400J9664m301m847M079K6614N3163O0215M0965n286p3594
5002g7527j31079j29539p1595J2404Q3008R9673P6113M5144K3995K3218M0568
4991e617M4760K1529m146m3932j04452j33163q6939r379K4426n072n6355p2981
$$ plain form
5077 282100 273564 169666 72874 25604 -4767 -34917 -44098 -17320 18185 37050 46235 54134
5065 54134 65704 77432 76492 68360 66949 54814 3421 -76244 -158658 -231034 -266073 -231586 -149365
5052 -149365 -68454 -9454 32313 59254 41557 -22342 -77104 -82643 -52869 -18200 -11462 -26292
5040 -26292 -39913 -37875 -28816 -55626 -127306 -188018 -197543 -173912 -137372 -96635 -56692 -42331
5028 -42331 -79973 -135678 -155043 -151383 -151494 -153334 -153697 -150346 -140789 -113455 -76475 -68931 -121362 -193704
5014 -193704 -217599 -194199 -174535 -178836 -183683 -179604 -152990 -99827 -39612 1353 -3933 -77527
5002 -77527 -208606 -338145 -409740 -397336 -314328 -214655 -138542 -93398 -69403 -46185 -5617
4991 -5617 39143 60672 56526 12594 -91858 -225021 -311960 -321339 -296913 -301985 -358340 -431321
4979d31321m2402m725J4035K5021M0217N4781O0844N7037L2327J1260m543k8433
4967b15902l8152k6450j6235j3246k3210m8829o5378o4016m5643J7454J03188
4956d36419J43504J21484P4429N4082N0122L9231M3239O0766L5152o479n909K0346
4944A93548M1139M5043K1299k7260n7358l6914J090K1111K4053Q437j0598Q09
4932B24399K7632K6341q678p4493j28838j14128n2033N183K5582k0261p2989n6357
4920b18640L889M9083M0009j8170q3070j07356o4379J7557Q2586R8701P9333N5453
4908f5004N4158P3813R2182Q1479K5593m5093q2570p6770m1346K4856R2722J02804
4896B36824N4168j2880o3273o6537l1258j4493o2979j20326r4193k2538p745l7009
$$ plain form
4979 -431321 -473723 -478448 -464413 -439392 -399175 -344394 -283550 -226513 -194186 -182926 -187469 -215902
4967 -215902 -254054 -280504 -296739 -309985 -333195 -382024 -447402 -511418 -557061 -539607 -436419
4956 -436419 -292915 -171431 -97002 -42920 7202 46433 89672 150438 185590 179111 173202 193548
4944 193548 234687 279730 301029 273769 216411 179497 180587 201698 225751 234188 223590 224399
4932 224399 252031 278372 269694 195201 66363 -47765 -99798 -94615 -69033 -89294 -162283 -218640
4920 -218640 -214751 -165668 -125659 -143829 -226899 -334255 -398634 -381077 -298491 -199790 -120457 -65004
4908 -65004 -10846 62967 155149 236628 262221 217128 134558 57788 16442 41298 134020 236824
4896 236824 290992 278112 214839 148302 117044 102551 39572 -80754 -174947 -197485 -205230 -242239
4884b42239n2101m8166k4552n030j7K4920L9613J5115J1434L5048M3937L3468
4872a68570L7081O6754P4733L9896k199k3690j3573l486j0213J909K9919M5686
4860G4247K7187k2800p6312j16119j15449o1018J0642N3184P7085Q6573P3003
4849A0223L5382p744k1250m111J0959r448o1513r3036q4326k9933N2244Q9153
4837a13400P2719M6319K0675L551j3291l8406o6498r0180q7695l3692L0066L7955
4825b31877p696p3684j17098j04657o7453k2274L6502Q6350J20488J30539J10543
4814a40317Q2026O8960N8288L5159J2052n38K207K0518K2015l34k4831l8508n3999
4801D2698n1359m800M4507K7749l1158p1726q3689o1581l2239m443M1689P3761
$$ plain form
4884 -242239 -294340 -342506 -367058 -372088 -372105 -347185 -307572 -292457 -281023 -245975 -202038 -168570
4872 -168570 -131489 -64735 9998 49894 47695 24005 10432 6946 -3267 -1358 28561 74247
4860 74247 101434 78634 2322 -113797 -229246 -290264 -279622 -226438 -149353 -62780 10223
4849 10223 45605 37861 16611 12500 23459 14011 -47502 -140538 -224864 -254797 -202553 -113400
4837 -113400 -40681 5638 26313 29864 16573 -21833 -88331 -178511 -266206 -299898 -269832 -231877
4825 -231877 -239573 -313257 -430355 -535012 -602465 -624739 -588237 -501887 -381399 -250860 -140317
4814 -140317 -58291 10669 68957 104116 116168 115630 117837 138355 160370 160036 135205 96697 42698
4801 42698 -8661 -13461 31046 58795 27637 -44089 -127778 -189359 -221598 -226041 -184352 -110591
4789a10591M3756j3147l9294m1880k1451N415K0972M5549O3948L9824j6718m7302
4777g0919k9092q628r175l6733p3988p3065m2807j7078q797j029Q584k523k2984
4764c88234j9479K0515Q4810J56577J75529J19572M0385k7391o8450p2844k5429
4753d439K3899K8096K152m1049n3572j8880J8575M0972N6581N0585O678o5671
4741D3927j02878p3896k5677k942j8255n5027o7452k1566N0510J04819J34091
4730c4346J09078L9421k056j2362k0773k0229j3625p984L655L8122P5191O4078
4718B18170j5467r6848j24262j04287n1314l678K5890P4342J21393J28043J09485
4707B81467P8033N0047L1868N410l9188p5868n8699k40N9714J08180J43805J46793
$$ plain form
4789 -110591 -66835 -79982 -119276 -161156 -182607 -177192 -156220 -110671 -46723 -6899 -23617 -70919
4777 -70919 -100011 -108639 -117814 -154547 -228535 -301600 -344407 -361485 -370282 -371311 -362727 -365250 -388234
4764 -388234 -407713 -387198 -302388 -145811 29718 149290 189675 162284 93834 20990 -4439
4753 -4439 19460 47556 49708 8659 -44913 -63793 -45218 -4246 52335 102920 109598 43927
4741 43927 -58951 -132847 -158524 -161466 -179721 -234748 -302200 -323766 -273256 -168437 -34346
4730 -34346 74732 114153 112097 99735 78962 58733 45108 37124 40779 78901 154092 218170
4718 218170 202703 105855 -18407 -122694 -174008 -177686 -151796 -77454 43939 171982 281467
4707 281467 359500 409547 441415 446825 407637 331769 273070 272830 332544 440724 584529 731322
4695G31322R6129M0077K5690K0895j6612n6312o0998o2255q1588q8830p4409n1475
4683D21634j1968K1195L4009J9006j7287m2257m8287n7267p7140p8437m3099J0226
4671A30328N7949P9029O9887N7313K8404j9204m3800m8687o2576q8860q8997k5412
4659D5374M0344M2556P575l1623p1107p3035l2732j7880l8002l7369k2287j4864
4647b03050K063J7141J9624J2337j3644n6342p9077m3869J2980L5839M0062M7848
4635b08088N4245N2970M8835N3225N3930L7645O295l1747n0982m6988m1039l3689
4623a05388k1478l2466n7915n0482k7306k6513l3242J377P4895J31341J02658
4612d4519J2266m4779m5661k4727j8131p867K315J018K6891O9304J00975J00829
$$ plain form
4695 731322 827451 867528 893218 914113 897501 841189 780191 717936 636348 547518 473109 421634
4683 421634 409666 430861 464870 483876 466589 424332 376045 318778 241638 163201 120102 130328
4671 130328 188277 267306 337193 394506 422910 403706 359906 311219 248643 159783 70786 45374
4659 45374 85718 128274 135849 104226 33119 -39916 -72648 -90528 -128530 -165899 -188186 -203050
4647 -203050 -200987 -183846 -164222 -151885 -165529 -221871 -300948 -344817 -331837 -295998 -255936 -208088
4635 -208088 -153843 -100873 -52038 1187 55117 92762 99057 67310 16328 -30660 -71699 -105388
4623 -105388 -126866 -159332 -217247 -267729 -295035 -321548 -354790 -353413 -278518 -147177 -44519
4612 -44519 -32253 -77032 -122693 -147420 -165551 -173418 -171103 -170085 -143194 -73890 27085 127914
4600A27914N3574L243k7570l6863k8000j5258j0531j9917j3859J1899K0699n698
4588E9633l4314m3982l8824j4513K5779L8716K8412K1003J5644J0978N951p649
4576F6834k1412k6585l8166n6347o3916o3621n3368l5320J8000Q6780R6830O5073
4564b5218L0451J0561M08k5487m5603k2249J2421J5342k074j2986n868J1628J1893
4551d6781N695K1864L9720K3354K411K2528N7724M2969j0439n2217p6601n9832
4539b9605p275L2366M7363L7335O539k3290m9932o5535o2031l8458R178O1288
4527h2057Q2764P2054O0215O6886Q2381P5933M1032k5066q9381j01801o5025J8559
4515A36494J09470J49129J56556J69270J62405J09587O0263P3750J50151K60495
$$ plain form
4600 127914 181488 184731 157161 120298 92298 77040 66509 46592 32733 44632 65331 59633
4588 59633 25319 -18663 -57487 -72000 -46221 -7505 20907 41910 57554 68532 74483 66834
4576 66834 45422 18837 -19329 -75676 -139592 -203213 -256581 -291901 -273901 -187121 -90291 -25218
4564 -25218 5233 15794 16202 -9285 -54888 -77137 -64716 -49374 -51448 -64434 -70302 -58674 -46781
4551 -46781 -41086 -19222 20498 43852 46263 68791 126515 169484 159045 106828 30227 -29605
4539 -29605 -36880 -4514 42849 80184 86723 63433 13501 -52034 -114065 -152523 -143345 -82057
4527 -82057 707 72761 132976 199862 282243 358176 399208 374142 284761 182960 117935 136494
4515 136494 245964 395093 551649 720919 883324 992911 1053174 1126924 1277075 1537570
4505A537570L44112K96786R3718j50691k94395l08115k50450j96086j57993j20266
4495G94190p3347l2720l8942o0891o9169q9500q5423l5741o024k9953o1954n6832
4483A53694j1381M0916O4078N1421J1786j6870r110K3528L2444J550k4534l8688
4471B78834m1957j8171J8855M3778M6291K7537k0327q3970j28682j11524l0281
4460a9617M4902O6525N1821K2005k2771o8138q6521m8542J0381L0147l208m8119
4448g1135m8897q345K8891L4705K7239L2001L9988M0473L5544J4569r47J5415
$$ plain form
4505 1537570 1881682 2178468 2272186 2121495 1827100 1518985 1268535 1072449 914456 794190
4495 794190 720843 688123 649181 588290 519121 429621 344198 308457 302433 272480 210526 153694
4483 153694 142313 183229 247307 298728 310514 293644 284534 308062 340506 342056 317522 278834
4471 278834 236877 218706 237561 281339 327630 355167 334840 250870 122188 10664 -19617
4460 -19617 25285 91810 143631 165636 142865 74727 -11794 -60336 -49955 -19808 -23016 -71135
4448 -71135 -120032 -128377 -99486 -64781 -37542 -5541 34447 74920 110464 125033 124086 139501
$$ [...]
##END NTUPLES=NMR SPECTRUM
##END=
