##TITLE=C13_LR-0154-OMe-EtOAc-K2
 DMSO-d6, 250 sc

 14.3.2023
##JCAMPDX= 6.0         $$ Bruker NMR JCAMP-DX V2.0
##DATA TYPE= NMR SPECTRUM
##DATA CLASS= NTUPLES
##ORIGIN= UXNMR, Bruker Analytische Messtechnik GmbH
##OWNER= root
$$ XWIN-NMR		Version 3.5
$$ Wed Mar 15 13:50:53 2023 Russian Standard Time (UT+4h)  she@DPX200
##.OBSERVE FREQUENCY= 50.327896
##.OBSERVE NUCLEUS= ^13C
##.ACQUISITION MODE= SIMULTANEOUS
##.ACQUISITION SCHEME= undefined
##.AVERAGES= 23501
##.DIGITISER RES= 17
##SPECTROMETER/DATA SYSTEM= spect
##.PULSE SEQUENCE= zgpg30
##.SOLVENT NAME= CDCl3
##.SHIFT REFERENCE= (INTERNAL, CDCl3, 0, 222.624)
##AUDIT TRAIL= $$ (NUMBER, WHEN, WHO, WHERE, WHAT)
$$ ##TITLE= Audit trail, XWIN-NMR		Version 3.5
$$ ##JCAMPDX= 5.01
$$ ##ORIGIN= Bruker BioSpin GmbH
$$ ##OWNER= she
$$ F:/spectra/data/she/nmr/c13/1/pdata/1/auditp.txt
$$ ##AUDIT TRAIL=  $$ (NUMBER, WHEN, WHO, WHERE, WHAT)
(   1,<2023-03-15 13:47:33.21 +0400>,<she>,<DPX200>,
      <created by zg, POWCHK disabled, PULCHK disabled
       terminated by command 'halt'
       configuration hash MD5:
       00 E9 B6 7A A2 85 ED C7 34 08 36 98 17 FE 4E 26
       data hash MD5: 32K
       3E 87 2A 74 F2 A9 9A 86 C6 DC A2 E5 33 F6 60 CC>)
(   2,<2023-03-15 13:47:37.76 +0400>,<she>,<DPX200>,
      <Start of raw data processing
       efp BC_mod = 2 LB = 2 FT_mod = 6 PKNL = 1 PHC0 = -335.9195 PHC1 = 57.78452 SI = 32K 
       data hash MD5: 32K
       88 E5 17 8A 7A 64 66 D4 16 EF 8F 9D 1F C5 39 59>)
(   3,<2023-03-15 13:47:41.32 +0400>,<she>,<DPX200>,
      <abs ABSG = 5 
       data hash MD5: 32K
       E4 D3 43 AD 3F AD DB 16 32 F4 0C 41 96 AA 93 0B>)
(   4,<2023-03-15 13:48:26.31 +0400>,<she>,<DPX200>,
      <pk PHC0 = 21.82464 PHC1 = -26.2 
       data hash MD5: 32K
       83 04 46 88 7B 95 49 27 B9 F6 7C 6C 30 5D 67 DD>)
(   5,<2023-03-15 13:48:29.67 +0400>,<she>,<DPX200>,
      <abs ABSG = 5 
       data hash MD5: 32K
       C7 CF D3 0A 40 4E 3D C1 B6 5E 03 D2 24 17 8B C6>)
(   6,<2023-03-15 13:49:06.54 +0400>,<she>,<DPX200>,
      <pk PHC0 = 6.606871 PHC1 = -9.199998 
       data hash MD5: 32K
       08 B6 52 6E 75 ED 11 D1 02 BC 14 B5 FD 40 DA 52>)
(   7,<2023-03-15 13:49:10.26 +0400>,<she>,<DPX200>,
      <abs ABSG = 5 
       data hash MD5: 32K
       3A 58 3A C7 F0 15 1D 2C DB 0A B8 6B 8F 5A 37 50>)
$$ ##END=
$$ 
$$ hash MD5
$$ DE 90 C0 5A 5D 27 8A A1 40 C7 60 FD 54 A6 2A 45
##$RELAX= 
##$RELAX= 
##$RELAX= 
##$RELAX= 
##$RELAX= 
##$RELAX= 
##$RELAX= 
##$RELAX= 
$$ Bruker specific parameters
$$ --------------------------
##$DU= <F:/spectra>
##$EXPNO= 1
##$NAME= <c13>
##$PROCNO= 1
##$TYPE= <nmr>
##$USER= <she>
##$AMP= (0..31)
100 100 100 100 100 100 100 100 100 100 100 100 100 100 100 100 100 100 
100 100 100 100 100 100 100 100 100 100 100 100 100 100 
##$AQSEQ= 0
##$AQ_mod= 1
##$AUNM= <au_zg>
##$AUTOPOS= <>
##$BF1= 50.322709
##$BF2= 200.13
##$BF3= 50.322709
##$BF4= 500.13
##$BF5= 500.13
##$BF6= 500.13
##$BF7= 500.13
##$BF8= 500.13
##$BYTORDA= 1
##$CFDGTYP= 0
##$CFRGTYP= 5
$$ [...]
##$SUBNAM4= <"">
##$SUBNAM5= <"">
##$SUBNAM6= <"">
##$SUBNAM7= <"">
##$SUBNAM8= <"">
##$SUBNAM9= <"">
##$SW= 239.972175391363
##$SWIBOX= (0..15)
0 1 3 0 0 0 0 0 0 0 0 0 0 0 0 0 
##$SW_h= 12077.2946859903
##$TD= 32768
##$TD0= 1
##$TE= 0
##$TE2= 300
##$TE3= 300
##$TEG= 300
##$TL= (0..7)
120 120 120 120 120 120 120 120 
##$TP= (0..7)
150 150 150 150 150 150 150 150 
##$TP07= 0
##$TPNAME0= <>
##$TPNAME1= <>
##$TPNAME2= <>
##$TPNAME3= <>
##$TPNAME4= <>
##$TPNAME5= <>
##$TPNAME6= <>
##$TPNAME7= <>
##$TPOAL= (0..7)
0.5 0.5 0.5 0.5 0.5 0.5 0.5 0.5 
##$TPOFFS= (0..7)
0 0 0 0 0 0 0 0 
##$TUNHIN= 0
##$TUNHOUT= 0
##$TUNXOUT= 0
##$USERA1= <user>
##$USERA2= <user>
##$USERA3= <user>
##$USERA4= <user>
##$USERA5= <user>
##$V9= 5
##$VALIST= <valist>
##$VCLIST= <CCCCCCCCCCCCCCC>
##$VD= 0
##$VDLIST= <DDDDDDDDDDDDDDD>
##$VPLIST= <PPPPPPPPPPPPPPP>
##$VTLIST= <TTTTTTTTTTTTTTT>
##$WBST= 1024
##$WBSW= 4
##$XGAIN= (0..3)
0 0 0 0 
##$XL= 0
##$YL= 0
##$YMAX_a= 151108165
##$YMIN_a= -45006712
##$ZGOPTNS= <>
##$ZL1= 120
##$ZL2= 120
##$ZL3= 120
##$ZL4= 120
##$ABSF1= 222.624
##$ABSF2= -17.3728
##$ABSG= 5
##$ABSL= 3
##$ALPHA= 0
##$AQORDER= 0
##$ASSFAC= 0
##$ASSFACI= 0
##$ASSFACX= 0
##$ASSWID= 0
##$AUNMP= <proc_1d>
##$AZFE= 0.1
##$AZFW= 0.5
##$BCFW= 0
##$BC_mod= 2
##$BYTORDP= 0
##$COROFFS= 0
##$CY= -3
##$DATMOD= 1
##$DC= 0
##$DFILT= <>
##$DTYPP= 0
##$F1P= 0
##$F2P= 0
##$FCOR= 0.5
##$FTSIZE= 32768
##$FT_mod= 6
##$GAMMA= 0
##$GB= 0
##$INTBC= 1
##$INTSCL= 4.134877e-10
##$ISEN= 128
##$LB= 2
##$LEV0= 0
##$LPBIN= 0
##$MAXI= 10000
##$MC2= 0
##$MEAN= 0
##$ME_mod= 0
##$MI= 0.1934396
##$NCOEF= 0
##$NC_proc= 3
##$NLEV= 6
##$NOISF1= 120.0001
##$NOISF2= 80.00006
##$NSP= 0
##$NTH_PI= 0
##$NZP= 0
##$OFFSET= 222.624
##$PC= 1.4
##$PHC0= -307.4879
##$PHC1= 22.38452
##$PH_mod= 1
##$PKNL= yes
##$PPARMOD= 0
##$PSCAL= 0
##$PSIGN= 0
##$REVERSE= no
##$SF= 50.3227315983092
##$SI= 32768
##$SIGF1= 140
##$SIGF2= 120
##$SINO= 11.81781
##$SIOLD= 32768
##$SREGLST= <13C.CDCl3>
##$SSB= 0
##$STSI= 32768
##$STSR= 0
##$SW_p= 12077.2946859903
##$SYMM= 0
##$S_DEV= 0
##$TDeff= 32768
##$TDoff= 0
##$TI= <>
##$TILT= no
##$TM1= 0
##$TM2= 0
##$TOPLEV= 0
##$USERP1= <user>
##$USERP2= <user>
##$USERP3= <user>
##$USERP4= <user>
##$USERP5= <user>
##$WDW= 1
##$XDIM= 32768
##$YMAX_p= 306401012
##$YMIN_p= -865797
$$ End of Bruker specific parameters
$$ ---------------------------------
##NTUPLES= NMR SPECTRUM
##VAR_NAME=  FREQUENCY,     SPECTRUM/REAL,   SPECTRUM/IMAG
##SYMBOL=    X,             R,               I
##VAR_TYPE=  INDEPENDENT,   DEPENDENT,       DEPENDENT
##VAR_FORM=  AFFN,          ASDF,            ASDF
##VAR_DIM=   32768,         32768,           32768
##UNITS=     HZ,            ARBITRARY UNITS, ARBITRARY UNITS
##FACTOR=    0.368581032318806, 1,           1
##FIRST=     11203.0474430531, 0,            0
##LAST=      -874.247242937185, 0,           0
##MIN=       -874.247242937185, -865797,     0
##MAX=       11203.0474430531, 306401012,    0
$$ Real data points
##PAGE= N=1
##DATA TABLE= (X++(R..R)), XYDATA
$$ [...]
$$ plain form
11052 163952 103799 72286 50403 67096 127617 184936 193399 129432 15827 -79145 -137373
11041 -137373 -176029 -199446 -224370 -239340 -220386 -197996 -196482 -189723 -165005 -126500 -63200 30581
11029 30581 123316 184572 218389 198907 114971 10594 -79836 -144615 -152068 -90060 1015 77342
11017 77342 120454 132484 129636 117070 84449 30936 -29372 -74781 -98272 -81821 -40659 -18586
11005 -18586 -24859 -28051 -11351 5642 29357 82485 163306 260742 362060 439746 466192 444349
10993 444349 388983 323146 263779 216807 190553 187668 184147 147518 90192 60203 61219 44348
10981 44348 18188 45470 130347 212990 236249 182499 66657 -78717 -235525 -372280 -438583
10970 -438583 -432673 -407385 -420224 -490337 -599705 -694517 -744559 -772818 -800645 -833268 -856624
$$ packed form
11052A63952o0153l1513k1883J6693O0521N7319Q463o3967j13605r4972n8228
11041a37373l8656k3417k4924j4970J8954K2390J514O759K4718L8505O3300R3781
11029C0581R2735O1256L3817j9482q3936j04377r0430o4779p453O2008R1075P6327
11017G7342M3112J2030k848j2566l2621n3513o0308m5409k3491J6451M1162K2073
11005a8586o273l192J6700J6993K3715N3128Q0821R7436J01318P7686K6446k1843
10993D44349n5366o5837n9367m6972k6254k885l521l6629n7326k9989J016j6871
10981D4348k6160K7282Q4877Q2643K3259n3750j15842j45374j56808j36755o6303
10970d38583N910K5288j2839p0113j09368r4812n0042k8259k7827l2623k3356
$$ plain form
10959 -856624 -836947 -763474 -646403 -492588 -342621 -217578 -94629 2024 27045 6750
10949 6750 23144 74446 85423 13504 -115894 -238070 -348103 -456042 -527836 -549516 -533354
10938 -533354 -472268 -355164 -222613 -113668 -23252 45435 73107 68100 77953 131669 203189
10927 203189 268283 327007 368585 375717 344362 316229 310246 287929 195532 43536 -63589
10916 -63589 -62518 7799 92506 159308 193788 202769 217811 239106 218012 153181 83545 27366
10904 27366 -17185 -56859 -73188 -47491 7823 78845 146892 169563 145742 134203 160300 195673
10892 195673 208855 183222 130474 73685 29933 18559 48739 93368 140368 184413 203286
10881 203286 194464 180485 171489 171765 192630 235893 274141 276555 254130 245216 264484 284410 272525
$$ packed form
10959h56624J9677P3473J17071J53815J49967J25043J22949R6653K5021k0295
10949F750J6394N1302J0977p1919j29398j22176j10033j07939p1794k1680J6162
10938e33354O1086J17104J32551J08945R0416O8687K7672n007R853N3716P1520
10927B03189O5094N8724M1578P132l1355k8133n983k2317r2397j51996j07125
10916f3589J071P0317Q4707O6802L4480Q981J5042K1295k1094o4831o9636n6179
10904B7366m4551l9674j6329K5697N5314P1022O8047K2671k3821j1539K6097L5373
10892A95673J3182k5633n2748n6789m3752j1374L0180M4629M7000M4045J8873
10881B03286q822j3979q996K76K0865M3263L8248K414k2425q914J9268J9926j1885
$$ plain form
10868 272525 229599 186800 189480 254765 355619 451550 522213 551023 508141 394314 256267
10857 256267 140563 62473 37266 47206 53853 26232 -29445 -74882 -100788 -116079 -123206 -108836
10845 -108836 -77316 -42166 7482 59298 95224 106337 103214 113495 125430 111042 84253 69533
10833 69533 69951 84496 113853 151858 203588 256893 291887 289651 228905 156303 109047 18843
10821 18843 -137261 -272562 -322092 -307730 -276785 -263592 -268862 -274272 -269211 -267739 -280338 -295846
10809 -295846 -282381 -241925 -238825 -301821 -366802 -366567 -305844 -235510 -189336 -184405 -214452 -247182
10797 -247182 -263590 -252350 -201982 -130783 -68385 -21653 12114 16308 -19853 -70957 -109546 -119796
10785 -119796 -102999 -66249 -28109 -17178 -40853 -81575 -91081 -41888 40221 111834 147741 144154
$$ packed form
10868B72525m2926m2799K680O5285J00854R5931P0663K8810m2882j13827j38047
10857B56267j15704p8090k5207R940O647k7621n5677m5437k5906j5291p127J4370
10845a08836L1520L5150M9648N1816L5926J1113l123J0281J1935j4388k6789j4720
10833F9533M18J4545K9357L8005N1730N3305L4994k236o0746p2602m7256r0204
10821A8843j56104j35301m9530J4362L0945J3193n270n410N061J472j2599j5508
10809b95846J3465M0456L100o2996o4981K35O0723P0334M6174M931l0047l2730
10797b47182j6408J1240N0368P1199O2398M6732L3767M194l6161n1104l8589j0250
10785a19796J6797L6750L8140J0931k3675m0722r506M9193Q2109P1613L5907l587
$$ plain form
10773 144154 146700 200078 274786 324462 349129 362634 354955 316018 273020 243750 196789 126564
10761 126564 56476 17876 20557 40334 41626 13796 -1991 16224 50499 59255 37035 22956
10749 22956 50338 109981 157725 175437 156318 103718 55744 57399 90904 97420 86066 95351
10737 95351 108730 94518 56724 37377 66010 106864 130393 159053 208247 258514 294500 310745
10725 310745 294595 233860 144284 60367 -14044 -90924 -169429 -248391 -322256 -395580 -464281
10714 -464281 -498743 -474103 -389959 -283447 -170391 -50352 54731 120263 115972 59663 -10238
10703 -10238 -87836 -148530 -163735 -118066 -19987 85718 139276 149296 163011 188827 193543 170814
10691 170814 149064 142803 143692 141816 146098 143950 121759 117984 145759 166670 176666 193999 203179
$$ packed form
10773A44154K546N3378P4708M9676K4667J3505p679l8937m2998k9270m6961p0225
10761A26564p0088l8600K681J9777J292k7830j5787J8215L4275Q756k2220j4079
10749B2956K7382N9643M7744J7712j9119n2600m7974J655L3505O516j1354R285
10737I5351J3379j4212l7794j9347K8633M0854K3529K8660M9194N0267L5986J6245
10725C10745j6150o0735q9576q3917p4411p6880p8505p8962p3865p3324o8701
10714d64281l4462K4640Q4144J06512J13056J20039J05083O5532m291n6309o9901
10703a0238p7598o0694j5205M5669R8079J05705N3558J0020J3715K5816M716k2729
10691A70814k1750o261Q89j876M282k148k2191l775K7775K0911R996J7333R180
$$ plain form
10678 203179 207662 219554 233622 241697 228747 194976 168478 151367 146528 173950 240500 314851
10666 314851 347361 349207 372606 412077 430318 418978 391014 355005 306483 251203 178464 95707
10654 95707 23850 -31180 -63735 -62754 -39045 -36187 -79144 -151121 -225045 -277620 -302719 -315883
10642 -315883 -327105 -348503 -419042 -524379 -571154 -502384 -354388 -229220 -175534 -147841 -90625
10631 -90625 -13107 21123 -13888 -66421 -77005 -43741 -11482 -15903 -62196 -122835 -169309 -195273
10619 -195273 -222555 -268905 -319529 -343518 -347736 -363281 -389520 -417439 -427981 -417856 -401795 -376295
10607 -376295 -341345 -314490 -311101 -318346 -300127 -235442 -143694 -48568 29633 47742 -747 -55838
10595 -55838 -53159 -1124 61915 111594 117851 69555 -23023 -118625 -160219 -138581 -82331 -23049
$$ packed form
10678B03179M483J1892J4068Q075j2950l3771k6498j7111m839K7422O6550P4351
10666C14851L2510J846K3399L9471J8241j1340k7964l6009m8522n5280p2739q2757
10654I5707p1857n5030l2555R81K3709K858m2957p1977p3924n2575k5099j3164
10642c15883j1222k1398p0539j05337m6775O8770J47996J25168N3686K7693N7216
10631i0625P7518L4230l5011n2533j0584L3264L2259m421m6293o0639m6474k5964
10619a95273k7282m6350n0624k3989m218j5545k6239k7919j0542J0125J6061K5500
10607c76295L4950K6855L389p245J8219O4685R1748R5126P8201J8109m8489n5091
10595e5838K679N2035O3039M9679O257m8296r2578r5602m1594K1638N6250N9282
$$ plain form
10583 -23049 13660 26550 27125 47769 121797 218419 270834 273832 288288 310026 275862 193324
10571 193324 119511 56764 -205 -8599 42672 91738 97380 82223 95329 139839 165584 156781
10559 156781 131968 136000 192848 249085 260832 231957 178373 118274 58627 -19437 -139261
10548 -139261 -285866 -404032 -440241 -393762 -310566 -244706 -228495 -250156 -266318 -267814 -283083
10537 -283083 -305840 -306524 -283566 -258951 -247758 -237383 -209398 -163615 -104497 -12082 105165 178748
10525 178748 181331 157941 127056 70165 20398 5924 22867 77090 143861 204541 268112 313427
10513 313427 310032 256019 201248 183575 165591 104207 15506 -67771 -149568 -218529 -244233 -226698
10501 -226698 -205483 -213323 -238064 -222306 -125595 37730 197021 277364 284024 234223 119197
$$ packed form
10583b3049L6709J2890N75K0644P4028R6622N2415K998J4456K1738l4164q2538
10571A93324p3813o2747n6969q394N1271M9066N642j5157J3106M4510K5745q803
10559A56781k4813M032N6848N6237J1747k8875n3584o0099n9647p8064j19824
10548a39261j46605j18166l6209M6479Q3196O5860J6211k1661j6162j496j5269
10537b83083k2757o84K2958K4615J1193J0375K7985M5783N9118R2415J17247P3583
10525A78748K583k3390l0885n6891m9767j4474J6943N4223O6771O0680O3571M5315
10513C13427l395n4013n4771j7673j7984o1384q8701q3277q1797o8961k5704J7535
10501b26698K1215p840k4741J5758R6711J63325J59291Q0343O660m9801j15026
$$ plain form
10490 119197 -30015 -158752 -227077 -232640 -206247 -156121 -78802 13167 115742 250396 379233
10479 379233 411931 340744 222739 103597 -4965 -97055 -165650 -183992 -141338 -77609 -54883
10468 -54883 -119303 -247442 -351465 -382085 -369487 -375157 -416317 -433336 -396321 -335169 -238861
10457 -238861 -98213 38065 104878 84866 18707 -47935 -76160 -63540 -36512 3767 54300
10446 54300 78412 43229 -30986 -86647 -107936 -110560 -95084 -78293 -85825 -101453 -82829 -27041
10434 -27041 15313 11086 -43290 -140326 -240874 -316498 -367018 -391886 -406890 -440253 -495683 -542102
10422 -542102 -558632 -544676 -523850 -493057 -452993 -447382 -486240 -519468 -494316 -396958 -257248
10411 -257248 -137223 -86808 -95698 -110238 -111356 -130274 -184838 -260841 -327624 -365715 -369121 -317042
$$ packed form
10490A19197j49212j28737o8325n563K6393N0126P7319R1969J02575J34654J28837
10479C79233L2698p1187j18005j19142j08562r2090o8595j8342M2654O3729K2726
10468e4883o4420j28139j04023l0620J2598n670m1160j7019L7015O1152R6308
10457b38861J40648J36278O6813k0012o6159o6642k8225J2620K7028M0279N0533
10446E4300K4112l5183p4215n5661k1289k624J5476J6791p532j5628J8624N5788
10434b7041M2354m227n4376r7036j00548p5624n0520k4868j5004l3363n5430m6419
10422e42102j6530J3956K0826L0793M0064N611l8858l3228K5152R7358J39710
10411b57248J20025N0415q890j4540j118j8918n4564p6003o6783l8091l406N2079
$$ plain form
10399 -317042 -209622 -96172 -21756 -3951 -29442 -74271 -103618 -86573 -45518 -3788 28506
10388 28506 16335 -73267 -206579 -343772 -471523 -566395 -595719 -557311 -493746 -444153 -407688
10377 -407688 -375919 -358599 -361046 -376185 -394476 -417589 -466877 -529356 -550190 -480481 -315614
10366 -315614 -98925 118499 293526 403261 439346 406903 365474 354354 337675 273561 171090
10355 171090 76133 17692 -11958 -50548 -119140 -206798 -286230 -307640 -277369 -247841 -217410
10344 -217410 -181403 -161068 -152898 -141147 -128179 -112744 -111585 -144316 -188086 -224350 -263806 -313660
10332 -313660 -386913 -466972 -503797 -455791 -351774 -258456 -218267 -177458 -71987 63995 200953
10321 200953 337507 453661 525552 539359 483063 361692 229860 144983 122251 108772 51810
$$ packed form
10399c17042J07420J13450P4416J7805k5491m4829k9347J7045M1055M1730L2294
10388B8506j2171q9602j33312j37193j27751r4872k9324L8408O3565M9593L6465
10377d07688L1769J7320k447j5139j8291k3113m9288o2479k0834O9709J64867
10366c15614K16689K17424J75027J09735L6085l2443m1429j1120j6679o4114j02471
10355A71090r4957n8441k9650l8590o8592q7658p9432k1410L0271K9528L0431
10344b17410L6007K0335Q170J1751J2968J5435J159l2731m3770l6264l9456m9854
10332c13660p3253q0059l6825M8006J04017R3318M0189M0809J05471J35982J36958
10321B00953J36554J16154P1891J3807n6296j21371j31832q4877k2732j3479n6962
$$ plain form
10310 51810 1159 4190 17285 -9922 -78689 -139221 -124798 -34717 45359 25393 -96950 -224123
10298 -224123 -271907 -260241 -254032 -247202 -222042 -197603 -177740 -160340 -139870 -106415 -70190 -61313
10286 -61313 -73185 -59008 -107 64854 93723 89100 79927 82740 101447 132101 175943 244932
10274 244932 326955 385403 420333 454629 496406 547063 590488 587186 509731 388640 286226
10263 286226 231341 190021 123363 39124 -12762 20452 115872 188296 212687 238668 277938
10252 277938 276087 227310 202498 237158 300361 328786 279993 179367 77784 -358 -30950
10241 -30950 -37534 -61186 -96508 -94355 -38646 23016 67944 108353 152302 183516 192098 184254
10229 184254 171635 159403 129335 79958 37594 14019 19195 51442 86486 115371 135316 127308
$$ packed form
10310E1810n0651L031J3095k7207o8767o0532J4423R0081Q0076j9966j22343j27173
10298b24123m7784J1666O209O830K5160K4439J9863J7400K0470L3455L6225Q877
10286f1313j1872J4177N8901O4961K8869m623r173K813J8707L0654M3842O8989
10274B44932Q2023N8448L4930L4296M1777N0657M3425l302p7455j21091j02414
10263B86226n4885m1320o6658q4239n1886L3214R5420P2424K4391K5981L9270
10252B77938j851m8777k4812L4660O3203K8425m8793j00626j01583p8142l0592
10241c0950o584k3652l5322K153N5709O1662M4928M0409M3949L1214Q582p844
10229A84254j2619j2232l0068m9377m2364k3575N176L2247L5044K8885J9945q008
$$ plain form
10217 127308 64783 -49801 -158915 -196800 -166997 -129176 -126873 -128609 -100519 -82455 -89489 -89118
10205 -89118 -54033 8417 52485 49399 22629 559 -14287 -33470 -71221 -119905 -151206 -154360
10193 -154360 -151322 -162307 -192967 -254956 -348830 -473597 -597716 -655727 -632202 -559463 -475583
10182 -475583 -387738 -271381 -154783 -118090 -189073 -323207 -432492 -457601 -416297 -354218 -303995
10171 -303995 -273739 -264584 -290101 -342338 -387438 -387993 -342062 -267127 -168761 -59214 41551 114032
10159 114032 134063 131618 113030 49516 -30150 -81319 -85159 -66335 -65760 -60862 -12404 34816
10147 34816 20798 -13314 -7806 39673 116011 189755 221128 204898 143396 52186 -14665 -14429
10135 -14429 28986 69883 103017 115917 78999 -17732 -128581 -182461 -161594 -104281 -45428
$$ packed form
10217A27308o2525j14584j09114l7885K9803L7821K303j736K8090J8064p034L71
10205h9118L5085O2450M4068l086k6770k2070j4846j9183l7751m8684l1301l154
10193a54360L038j0985l0660o1989r3874j24767j24119n8011K3525P2739Q3880
10182d75583Q7845J16357J16598L6693p0983j34134j09285k5109M1304O2079N0223
10171c03995L0256R155k5517n2237m5100n55M5931P4935R8366J09547J00765P2481
10159A14032K0031k445j8588o3514p9666n1169l840J8824N75M898M8458M7220
10147C4816j4018l4112N508M7479P6338P3744L1373j6230o1502r1210o6851K36
10135a4429M3415M0897L3134J2900l6918r6731j10849n3880K0867N7313N8853
$$ plain form
10124 -45428 10679 61738 103247 139911 153973 143203 124605 110047 108203 110202 116009 134157
10112 134157 157517 180996 203141 201890 161220 101731 59147 26434 -18177 -65112 -92247 -104814
10100 -104814 -129816 -188137 -259465 -302124 -322333 -355675 -409066 -477736 -561368 -624325 -612117
10089 -612117 -505656 -343248 -202571 -147972 -177683 -243188 -276813 -227694 -128000 -38335 -3865
10078 -3865 -38539 -99378 -154171 -198568 -218726 -191715 -103225 16444 107232 129447 107567 72109
10066 72109 20248 -20406 -21286 11672 54987 77896 55314 15624 -9914 -18037 2889 50140
10054 50140 87925 112022 115676 72463 6055 -54367 -116882 -206485 -311708 -384431 -401498 -373912
10042 -373912 -293680 -162521 -33922 38018 38269 -19418 -121475 -248117 -357502 -417374 -425650
$$ packed form
10124d5428N6107N1059M1509L6664J4062j0770j8598j4558j844J999N807J8148
10112A34157K3360K3479K2145j251m0670n9489m2584l2713m4611m6935k7135j2567
10100a04814k5002n8321p1328m2659k0209l3342n3391o8670q3632o2957J2208
10089f12117J06461J62408J40677N4599k9711o5505l3625M9119R9694Q9665L4470
10078c865l4674o0839n4793m4397k0158K7011Q8490J19669R0788K2215k1880l5458
10066G2109n1861m0654q80L2958M3315K2909k2582l9690k5538q123K0926M7251
10054E0140L7785K4097L654m3213o6408o0422o2515q9603j05223p2723j7067K7586
10042c73912Q0232J31159J28599P1940K51n7687j02057j26642j09385n9872q276
$$ plain form
10031 -425650 -383954 -294469 -198853 -138447 -96932 -58692 -39320 -48514 -88085 -143867 -179947 -168141
10019 -168141 -98982 19806 168778 291170 319540 254884 168123 103401 45115 -6205 -13313
10008 -13313 25024 70679 100828 99430 70852 43656 37549 47075 37160 -9639 -46706 -14562
9996 -14562 71664 145492 170400 157067 114482 76975 56786 14442 -56098 -120326 -152071 -159027
9984 -159027 -149954 -133698 -154735 -217965 -267164 -276437 -265055 -229680 -156649 -57339 52180 129185
9972 129185 141653 123515 94697 39451 -54852 -195575 -339509 -396080 -351126 -265742 -169330
9961 -169330 -76601 -975 49516 68741 68049 78450 89997 70732 49477 65879 102046 117711
9949 117711 96719 78794 72204 30727 -49870 -123384 -158329 -162327 -196273 -295982 -408562 -469870
$$ packed form
10031d25650M1696Q9485R5616O0406M1515L8240J9372r194l9571n5782l6080J1806
10019a68141O9159J18788J48972J22392K8370o4656q6761o4722n8286n1320p108
10008a3313L8337M5655L0149j398k8578k7196o107R526r915m6799l7067L2144
9996a4562Q6226P3828K4908j3333m2585l7507k0189m2344p0540o4228l1745o956
9984a59027R073J6256k1037o3230m9199r273J1382L5375P3031R9310J09519P7005
9972A29185J2468j8138k8818n5246r4303j40723j43934n6571M4954Q5384R6412
9961a69330R2729P5626N0491J9225o92J0401J1547j9265k1255J6402L6167J5665
9949A17711k0992j7925o590m1477q0597p3514l4945l998l3946r9709j12580o1308
$$ plain form
9937 -469870 -479671 -470760 -439212 -382985 -342501 -336913 -356718 -388843 -421605 -435906 -409912 -347390
9925 -347390 -289012 -267331 -276842 -308614 -348677 -376667 -366864 -316620 -264112 -230844 -201393 -160352
9913 -160352 -130793 -145875 -193678 -263323 -349146 -425932 -486288 -535310 -551900 -540731 -531010 -497264
9901 -497264 -412329 -316545 -251918 -213822 -186710 -171647 -179138 -210711 -239811 -244353 -232720 -228924
9889 -228924 -260449 -327127 -377645 -358894 -301755 -276747 -281949 -271815 -230283 -169593 -83472 10528
9877 10528 87241 127562 100373 15956 -68255 -127329 -196670 -285927 -350892 -355951 -316453 -264531
9865 -264531 -195226 -125036 -86470 -76258 -80230 -87722 -99683 -112342 -103698 -51337 38500 103357
9853 103357 88037 26184 6647 65605 160751 228332 232808 211398 213683 232283 230023 208120
$$ packed form
9937d69870r801Q911L1548N6227M0484N588j9805l2125l2762j4301K5994O2522
9925c47390N8378K1681r511l1772m0063k7990R803N0244N2508L3268K9451M1041
9913a60352K9559j5082m7803o9645q5823p6786o0356m9022j6590J1169R721L3746
9901d97264Q4935R5784O4627L8096K7112J5063p491l1573k9100m542J1633L796
9889b28924l1525o6678n0518J8751N7139K5008n202J0134M1532O0690Q6121R4000
9877A0528P6713M0321k7189q4417q4211n9074o9341q9257o4965n059L9498N1922
9865b64531O9305P0190L8566J0212l972p492j1961j2659Q644N2361Q9837O4857
9853A03357j5320o1853j9537N8958R5146O7581M476k1410K285J8600k260k1903
$$ plain form
9841 208120 176817 100277 -27834 -165436 -253842 -263075 -242269 -246771 -278257 -302682 -307910 -300929
9829 -300929 -273701 -219411 -173221 -164079 -165057 -151893 -136907 -137061 -138948 -122646 -91436 -53292 -11356
9816 -11356 30094 58007 66728 69123 78475 96308 113643 127040 154291 186460 198414 189524 192857
9803 192857 210048 220186 241291 268500 260392 198281 108016 35990 2893 -15384 -56915 -116656
9791 -116656 -154988 -143835 -97248 -78396 -108059 -150394 -183046 -215341 -260093 -299716 -287799 -213764
9779 -213764 -124990 -50988 10915 44761 33571 -16004 -88726 -138391 -121488 -28283 116702
9768 116702 239050 287655 299729 311798 312992 296557 268961 208886 88199 -62472 -202405
9757 -202405 -281218 -273996 -210551 -130429 -83709 -79281 -58954 553 54811 91833 147055 239545
$$ packed form
9841B08120l1303p6540j28111j37602q8406r233K0806m502l1486k4425n228O981
9829c00929K7228N4290M6190R142r78J3164J4986j54j887J6302L1210L8144M1936
9816a1356M1450K7913Q721K395R352J7833J7335J3397K7251L2169J1954q890L333
9803A92857J7191J0138K1105K7209q108o2111r0265p2026l3097j8277m1531n9741
9791a16656l8332J1153M6587J8852k9663m2335l2652l2295m4752l9623J1917P4035
9779b13764Q8774P4002O1903L3846j1190m9575p2722m9665J6903R3205J44985
9768A16702J22348M8605J2074J2069J194j6435k7596o0075j20687j50671j39933
9757b02405p8813P222O3445Q0122M6720M428K0327N9507N4258L7022N5222R2490
$$ plain form
9745 239545 335745 371499 320934 205427 65659 -46885 -107260 -128227 -143880 -159709 -118371
9734 -118371 -1256 119186 177066 170390 116820 51922 11384 15804 67964 108246 93708 66512
9722 66512 63653 71195 103566 197035 326014 437993 500057 516581 517446 515857 479632 382254
9710 382254 253621 154085 115195 108931 99536 71346 20757 -44687 -124614 -213800 -287627 -337487
9698 -337487 -353858 -339188 -305758 -258872 -225864 -235807 -273629 -301938 -315714 -329464 -341462 -348821
9686 -348821 -352257 -357969 -360550 -329426 -282440 -257425 -265526 -316111 -400603 -463826 -449642 -371279
9674 -371279 -253118 -93329 75265 178738 195543 195295 236028 290195 295440 228368 108342
9663 108342 -4619 -67864 -89581 -97335 -106856 -111348 -120043 -151406 -195012 -214239 -188867 -158355
$$ packed form
9745B39545R6200L5754n0565j15507j39768j12544o0375k0967j5653j5829M1338
9734a18371J17115J20442N7880o676n3570o4898m0538M420N2160M0282j4538k7196
9722F6512k859P542L2371R3469J28979J11979O2064J6524Q65j589l6225r7378
9710C82254j28633r9536l8890o264r395k8190n0589o5444p9927q9186p3827m9860
9698c37487j6371J4670L3430M6886L3008r943l7822k8309j3776j3750j1998p359
9686c48821l436n712k581L1124M6986K5015q101n0585q4492o3223J4184P8363
9674c71279J18161J59789J68594J03473J6805k48M0733N4167N245o7072j20026
9663A08342j12961o3245k1717p754r521m492q695l1363m3606j9227K5372L0512
$$ plain form
9651 -158355 -147585 -138382 -133420 -138881 -148426 -156637 -175851 -219302 -270518 -298947 -313589 -333167 -337427
9638 -337427 -314263 -283182 -252651 -205985 -142296 -82321 -45403 -47534 -74824 -87589 -62042 -4616
9626 -4616 41312 31344 -4714 421 69431 158512 202459 169645 107019 87572 110920 130369
9614 130369 122134 93386 83603 120926 183088 223991 225368 225004 248481 267000 274472 271092 226010
9601 226010 137730 41628 -42077 -112636 -142972 -112811 -53133 -17856 -25030 -59922 -82159 -82049
9589 -82049 -87790 -78540 -30720 35565 82799 92241 81540 93291 126432 142731 129152 120838 115328
9576 115328 77370 16094 -43806 -88919 -117766 -144744 -174536 -177384 -131109 -41596 42358 83917
9564 83917 91523 80389 75297 62835 15566 -43853 -56728 14249 110353 172770 206605 241731
$$ packed form
9651a58355J0770R203M962n461r545q211j9214m3451n1216k8429j4642j9578m260
9638c37427K3164L1081L0531M6666O3689N9975L6918k131k7290j2765K5547N7426
9626d616M5928r968l6058N135O9010Q9081M3947l2814o2626j9447K3348J9449
9614A30369q235k8748r783L7323O2162M0903J377l64K3477J8519P472l380m5082
9601B26010q8280r6102q3705p0559l0336L0161N9678L5277p174l4892k2237J10
9589h2049n741R250M7820O6285M7234R442j0701J1751L3141J6299j3579q314n510
9576A15328l7958o1276n9900m5113k8847k6978k9792k848M6275Q9513Q3954M1559
9564H3917P606j1134n092j2462m7269n9419j2875P0977R6104O2417L3835L5126
$$ plain form
9552 241731 310742 423946 571364 722194 842365 933217 997539 1022237 980680 853482 674322
9541 674322 492153 324431 175826 47715 -46116 -80190 -51695 20722 98499 148415 179498
9530 179498 205592 228056 248142 255580 227357 161099 98889 79236 78113 51772 17334 -2545
9518 -2545 -21142 -30040 -47649 -94116 -119557 -81528 22956 176481 314971 413510 518268
9507 518268 669123 826110 925446 972247 1000287 1025371 1054220 1084711 1113128 1145181 1185981
9496 1185981 1245551 1325563 1420407 1507179 1568856 1642245 1768267 1929644 2095081 2310861 2604821
9485 2604821 2941334 3315682 3755807 4244679 4736976 5260097 5878939 6593822 7341200 8063890
9475 8063890 8689803 9076349 9083339 8686112 7979353 7103352 6198211 5338290 4545181 3855901
$$ packed form
9552B41731O9011J13204J47418J50830J20171R0852O4322K4698m1557j27198j79160
9541F74322j82169j67722j48605j28111r3831l4074K8495P2417P7777M9916L1083
9530A79498K6094K2464K0086P438k8223o6258o2210j9653j123k6341l4438j9879
9518b545j8597q898j7609m6467k5441L8029J04484J53525J38490R8539J04758
9507E18268J50855J56987R9336M6801K8040K5084K8849L0491K8417L2053M0800
9496A185981N9570Q0012R4844Q6772O1677P3389J26022J61377J65437K15780K93960
9485B604821L36513L74348M40125M88872M92297N23121O18842P14883P47378P22690
9475H063890O25913L86546O990l97227p06759q76001r05141q59921p93109o89280
$$ plain form
9465 3855901 3281193 2782458 2323485 1921921 1614922 1412245 1263000 1130120 1044065 1011458
9455 1011458 999752 1007366 1034811 1052571 1052612 1050144 1041888 1013830 957674 895732 864449 868094 860962
9442 860962 795839 666860 529829 443885 402321 381314 369330 356087 334478 309564 277009
9431 277009 227928 180174 142384 106165 79808 52256 24085 20902 40302 81525 144029 200248
9419 200248 220172 201095 159557 108382 49230 4801 3613 24589 43523 90525 177857 271182
9407 271182 330478 346193 330444 291525 240074 195618 154973 93668 14632 -45379 -57044 -38635
9395 -38635 -13812 14881 50188 115946 226560 357864 470101 523069 512624 492838 529125
9384 529125 627975 740285 798320 772106 690124 604504 536085 451275 337346 215351 107583
$$ packed form
9465C855901n74708m98735m58973m01564l06999k02677j49245j32880q6055l2607
9455A011458j1706P614K7445J7760M1k468q256k8058n6156o1942l1283L645p132
9442H60962o5123j28979j37031q5944m1564k1007j1984j3243k1609k4914l2555
9431B77009m9081m7754l7790l6219k6357k7552k8171l183J9400M1223O2504N6219
9419B00248J9924j9077m1538n1175n9152m4429j188K0976J8934M7002Q7332R3325
9407B71182N9296J5715j5749l8919n1451m4456m0645o1305p9036o0011j1665J8409
9395c8635K4823K8693L5307O5758J10614J31304J12237N2968j0445j9786L6287
9384E29125R8850J12310N8035k6214q1982q5620o8419q4810j13929j21995j07768
$$ plain form
9373 107583 55301 80323 127559 162192 209969 270183 307588 279525 200181 147139 158945 203066
9361 203066 220484 189713 140529 110989 131105 181723 218824 228698 224086 211978 177425 92875
9349 92875 -39608 -167603 -230236 -212325 -153288 -108218 -97707 -91225 -68013 -31843 23133 101758
9337 101758 185034 244301 260449 238416 207472 203125 241592 282561 286154 270973 272839 279391
9325 279391 278278 274079 238274 149378 18450 -113965 -189897 -191191 -128423 -27302 45332 55606
9313 55606 29235 -3439 -37053 -51164 -16998 62828 136730 150275 113761 55849 -13467 -64819
9301 -64819 -89065 -111744 -117543 -81630 -17455 47628 99163 124731 137513 160073 202994 251723
9289 251723 278602 264274 216585 140646 57838 -17152 -126789 -274288 -398249 -455122 -430305
$$ packed form
9373A07583n2282K5022M7236L4633M7777O0214L7405k8063p9344n3042J1806M4121
9361B03066J7418l0771m9184k9540K0116N0618L7101R874m612j2108l4553q4550
9349I2875j32483j27995o2633J7911N9037M5070J0511O482K3212L6170N4976P8625
9337A01758Q3276N9267J6148k2033l0944m347L8467M0969L593j5181J866O552
9325B79391j113m199l5805q8896j30928j32415p5932j294O2768J01121P2634J0274
9313E5606k6371l2674l3614j4111L4166P9826P3902J3545l6514n7912o9316n1352
9301f4819k4246k2679n799L5913O4175O5083N1535K5568J2782K2560M2921M8729
9289B51723K6879j4328m7689p5939q2808p4990j09637j47499j23961n6873K4817
$$ plain form
9278 -430305 -346327 -273094 -238966 -240928 -268044 -303555 -339490 -361441 -354735 -331187 -324545 -354728
9266 -354728 -419350 -463923 -434453 -339409 -211167 -86401 -1943 32479 33933 24945 28333 82695
9254 82695 196550 310851 371947 377309 343742 307184 290739 278174 262736 245338 194920 96816
9242 96816 -10990 -97673 -145761 -141055 -131943 -169525 -227988 -299221 -374724 -411343 -390075 -313108
9230 -313108 -201494 -79429 38874 137501 204533 240309 246541 206021 115322 11883 -48179
9219 -48179 -47758 -30727 -56461 -115225 -169299 -205088 -234701 -250903 -211031 -121053 -59121 -89691
9207 -89691 -167879 -219672 -267650 -338053 -394755 -404247 -383545 -355368 -309478 -248577 -193550 -166101
9195 -166101 -175710 -208386 -249778 -277748 -251105 -156387 -35524 66632 133783 141987 109684 80447
$$ packed form
9278d30305Q3978P3233L4128j962k7116l5511l5935k1951O706K3548O642l0183
9266c54728o4622m4573K9470R5044J28242J24766Q4458L4422J454q988L388N4362
9254H2695J13855J14301O1096N362l3567l6558j6445j2565j5438j7398n0418r8104
9242I6816j07806q6683m8088M706R112l7582n8463p1233p5503l6619K1268P6967
9230c13108J11614J22065J18303R8627O7032L5776O232m0520r0699j03439o0062
9219d8179M21J7031k5734n8764n4074l5789k9613j6202L9872Q9978O1932l0570
9207h9691p8188n1793m7978p0403n6702r492K0702K8177M5890O0901N5027K7449
9195a66101r609l2676m1392k7970K6643R4718J20863J02156O7151Q204l2303k9237
$$ plain form
9183 80447 59462 24843 -26709 -76096 -120670 -145069 -125315 -72004 -22324 13876 36083 42106
9171 42106 38593 42686 63343 85447 66789 6853 -54199 -121386 -174802 -170123 -114572 -71753
9159 -71753 -89461 -163907 -257976 -319800 -321381 -261558 -176966 -93895 -4515 70682 80083 26465
9147 26465 -57902 -160750 -266146 -340218 -368768 -385696 -401391 -402897 -372833 -298106 -214003 -190837
9135 -190837 -258628 -386866 -538820 -661357 -700252 -654871 -549662 -418803 -301526 -205512
9125 -205512 -118378 -34898 26866 43811 45207 60293 73687 81951 90099 85350 69675 75438 128534
9112 128534 194552 254440 341712 472323 608517 696421 689063 578006 423851 301891 237953
9101 237953 214659 205878 181376 122320 22177 -113184 -239334 -333384 -419408 -520762 -625391
$$ packed form
9183H0447k0985l4619n1552m9387m4574k4399J9754N3311M9680L6200K2207O023
9171D2106l513M093K0657K2104j8658n9936o1052o7187n3416M679N5551M2819
9159g1753j7708p4446r4069o1824j581N9823Q4592Q3071Q9380P5197R401n3618
9147B6465q4367j02848j05396p4072k8550j6928j5695j506L0064P4727Q4103K3166
9135a90837o7791j28238j51954j22537l8895M5381J05209J30859J17277R6014
9125b05512Q7134Q3480O1764J6945J396J5086J3394Q264Q148m749j5675N763N3096
9112A28534O6018N9888Q7272J30611J36194Q7904p358j11057j54155j21960o3938
9101B37953k3294q781k4502n9056j00143j35361j26150r4050q6024j01354j04629
$$ plain form
9090 -625391 -683635 -662973 -585006 -508364 -463241 -431522 -396765 -378287 -390325 -399716 -382488 -359337
9078 -359337 -340747 -310994 -275313 -259969 -248653 -204169 -128648 -59213 -7130 47110 123474 204221
9066 204221 226589 163815 57535 -37580 -93376 -117098 -125958 -115126 -56719 31966 78353 64813
9054 64813 31146 3163 -5404 19372 81032 152927 189012 189984 197836 211708 201827 163217 132942
9041 132942 119943 98357 64953 35661 23986 39066 100683 173537 182334 112862 7038 -99174
9029 -99174 -190406 -272357 -319198 -281503 -168129 -56285 -583 -1264 -35306 -64053 -49012 1769
9017 1769 32996 11924 -15892 -10697 2924 -11110 -77444 -185254 -285446 -351926 -398417 -418812
9005 -418812 -380604 -299094 -214304 -140743 -102571 -111771 -143425 -186534 -258361 -344268 -415293 -442767
$$ packed form
9090f25391n8244K0662P7967P6642M5123L1719L4757J8478j2038r391J7228K3151
9078c59337J8590K9753L5681J5344J1316M4484P5521O9435N2083N4240P6364Q0747
9066B04221K2368o2774j06280r5115n5796k3722q860J0832N8407Q8685M6387j3540
9054F4813l3667k7983q567K4776O1660P1895L6085R72P852J3872r881l8610l0275
9041A32942j2999k1586l3404k9292j1675J5080O1617P2854Q797o9472j05824j06212
9029i9174r1232q1951m6841L7695J13374J11844N5702o81l4042k8747J5041N0781
9017A769L1227k1072k7816N195J3621j4034o6334j07810j00192o6480m6491k0395
9005d18812L8208Q1510Q4790P3561L8172r200l1654m3109p1827q5907p1025k7474
$$ plain form
8993 -442767 -405184 -323420 -250628 -226373 -238723 -241876 -218281 -185954 -164326 -162796 -176461 -183678
8981 -183678 -178014 -162874 -114958 -40065 14662 40667 71148 129417 189182 206539 183973 163387
8969 163387 176394 199125 185271 119515 20945 -67271 -113849 -114457 -92698 -90148 -112482 -120700
8957 -120700 -97192 -54035 -23406 -22736 -29750 -28565 -19708 -4185 16743 21211 -25706 -135596 -273584
8944 -273584 -359224 -368085 -330708 -272893 -231666 -205949 -170886 -123227 -72900 -29888 -1215 -236
8932 -236 -36534 -70450 -82559 -81929 -92911 -133129 -177256 -202129 -213116 -214442 -198891 -164906 -99018
8919 -99018 10079 154327 299210 385583 403488 417436 459595 498429 503607 478319 448228
8908 448228 434184 421254 362940 263903 176180 121256 114221 157538 238154 349475 452763
$$ packed form
8993d42767L7583Q1764P2792K4255j2350l153K3595L2327K1628J530j3665p217
8981a83678N664J5140M7916P4893N4727K6005L0481N8269N9765J7357k2566k0586
8969A63387J3007K2731j3854o5756r8570q8216m6578o08K1759K550k2334q218
8957a20700K3508M3157L0629O70p014J185Q857J5523K0928M468m6917j09890j37988
8944b73584q5640q861L7377N7815M1227K5717L5063M7659N0327M3012K8673R79
8932b36l6298l3916j2109O30j0982m0218m4127k4873j0987j326J5551L3985O5888
8919i9018J09097J44248J44883Q6373J7905J3948M2159L8834N178k5288l0091
8908D48228j4044j2930n8314r9037q7723n4924p035M3317Q0616J11321J03288
$$ plain form
8897 452763 485420 464000 464533 497363 517723 508049 477570 435679 397716 369838 374684 417542
8885 417542 459413 513297 607699 710616 762002 739312 671876 592872 528080 501493 509880 527079
8873 527079 555398 612771 700048 806828 918633 1047959 1214426 1380340 1505829 1598315
8863 1598315 1675480 1730979 1746511 1719640 1677428 1652307 1645811 1627066 1562103 1447428 1298706
8852 1298706 1128860 987689 923915 923204 953653 1002319 1043566 1044201 990519 882349 732022
8841 732022 578777 464785 383229 315134 262599 201438 84633 -102508 -303287 -434738
8831 -434738 -470018 -415568 -303508 -179096 -95330 -62281 -32069 25295 101523 179071 256072
8820 256072 318894 344384 339198 341745 384878 448002 512611 583104 645858 688559 721634 776530
$$ packed form
8897D52763L2657k1420N33L2830K0360r674l0479m1891l7963k7878M846M2858
8885D17542M1871N3884R4402J02917N1386k2690o7436p9004o4792k6587Q387J7199
8873E27079K8319N7373Q7277J06780J11805J29326J66467J65914J25489R2486
8863A598315P7165N5499J5532k6871m2212k5121o496j8745o4963j14675j48722
8852A298706j69846j41171o3774p11L0449M8666M1247O35n3682j08170j50327
8841G32022j53245j13992q1556o8095n2535o1161j16805j87141k00779j31451
8831d34738l5280N4450J12060J24412Q3766L3049L0212N7364P6228P7548P7001
8820B56072O2822K5490n186K547M3133O3124O4609P0493O2754M2701L3075N4896
$$ plain form
8808 776530 893976 1084643 1291784 1455736 1567120 1642182 1703794 1764172 1789678 1735830 1618328
8797 1618328 1492480 1386511 1291792 1196847 1114477 1038952 941429 805168 638508 464031
8787 464031 316645 233023 209703 206030 181991 138004 105526 77989 51986 47289 81371 122985
8775 122985 106515 49192 40908 101837 152530 153499 147233 171671 195106 177728 136171 123993
8763 123993 151127 183980 191234 156244 83389 26988 24013 42319 60249 106991 187688 254422
8751 254422 278434 251171 182691 122489 122819 186139 238414 187101 46232 -120911 -274091
8740 -274091 -393070 -480399 -520510 -507437 -462487 -403282 -333754 -259245 -178974 -100605 -51847
8729 -51847 -38824 -35258 -22369 18577 108410 202718 236230 211731 145538 38160 -82197 -151777
$$ packed form
8808G76530J17446J90667K07141J63952J11384P5062O1612O0378K5506n3848j17502
8797A618328j25848j05969r4719r4945q2370p5525r7523j36261j66660j74477
8787D64031j47386q3622k3320l673k4039m3987l2478k7537k6003m697L4082M1614
8775A22985j6470n7323q284O0929N0693R69o266K4438K3435j7378m1557j2178
8763A23993K7134L2853P254l4990p2855n6401k975J8306J7930M6742Q0697O6734
8751B54422K4012k7263o8480o0202L30O3320N2275n1313j40869j67143j53180
8740b74091j18979q7329m0111J3073M4950N9205O9528P4509Q0271P8369M8758
8729e1847J3023L566J2889M0946Q9833R4308L3512k4499o6193j07378j20357o9580
$$ plain form
8717 -151777 -150501 -111269 -55082 5651 64260 125508 172391 174590 148571 140117 163794 222280
8705 222280 295987 348515 384252 441729 511957 541305 510608 445805 398410 404080 455662 519721
8693 519721 557408 560572 543415 512288 457608 361522 240805 148656 98206 44336 -22678 -71513
8681 -71513 -82846 -54282 -2405 37618 71632 126609 197098 254281 291937 314994 330033 350899
8669 350899 351730 275850 123096 -34537 -121482 -110604 -48251 6119 30203 42312 62003 79222
8657 79222 59639 -10203 -102384 -181684 -230909 -253132 -280519 -332049 -366741 -352461 -318825 -307638
8645 -307638 -303482 -258100 -157152 -38240 48046 79647 61909 10518 -59057 -119678 -129196 -69111
8633 -69111 31614 140056 248114 314265 294222 228868 172625 146356 146436 146898 136696 133766
$$ packed form
8717a51777J276L9232N6187O0733N8609O1248M6883K199k6019q454K3677N8486
8705B22280P3707N2528L5737N7477P0228K9348l0697o4803m7395N670N1582O4059
8693E19721L7687L164j7157l1127n4680r6086j20717r2149n0450n3870o7014m8835
8681g1513j1333K8564N1877M0023L4014N4977P0489N7183L7656K3057J5039K0866
8669C50899Q31p5880j52754j57633q6945J0878O2353N4370K4084J2109J9691J7219
8657G9222j9583o9842r2181p9300m9225k2223k7387n1530l4692J4280L3636J1187
8645c07638M156M5382J00948J18912Q6286L1601j7738n1391o9575o0621r518O0085
8633f9111J00725J08442J08058O6151k0043o5354n6243k6269Q0M62j0202k930
$$ plain form
8621 133766 141132 135987 117832 119917 170460 250965 315781 356216 399694 449972 476328 456754
8609 456754 409214 379116 394289 443062 499606 578897 667411 702438 674693 640209 624977 604453
8597 604453 561453 500706 443519 411124 407769 440580 506651 582649 647343 700807 753871 804513
8585 804513 838554 844538 829304 823934 855972 907943 994696 1123512 1253444 1388355 1533098
8574 1533098 1651135 1722125 1738854 1678708 1560109 1432300 1314658 1199912 1087829 985221
8564 985221 885844 789233 699002 619398 564702 515341 460418 419211 407639 416107 401121 330281
8552 330281 225625 155175 159328 228247 285019 281395 268372 279705 304021 330897 360143 383276
8540 383276 371038 340021 339000 386288 462649 559684 652704 696500 706428 714565 714464 694226 655239
$$ packed form
8621A33766P366n145j8155K085N0543Q0505O4816M0435M3478N0278K6356j9574
8609D56754m7540l0098J5173M8773N6544P9291Q8514L5027k7745l4484j5232k0524
8597F04453m3000o0747n7187l2395l355L2811O6071P5998O4694N3464N3064N0642
8585H04513L4041N984j5234n370L2038N1971Q6753J28816J29932J34911J44743
8574A533098J18037P0990J6729o0146j18599j27809j17642j14746j12083j02608
8564I85221r9377r6611r0231p9604n4696m9361n4923m1207j1572Q468j4986p0840
8552C30281j04656p0450M153O8919N6772l624j3023J1333K4316K6876K9246K3133
8540C83276j2238l1017j021M7288P6361R7035R3020M3796R928Q137j01k0238l8987
$$ plain form
8527 655239 607433 545921 497734 506823 556148 622673 708702 810782 937548 1083448 1205662
8516 1205662 1249854 1227061 1183287 1147828 1136636 1145582 1120882 1026429 914792 864443 883847
8505 883847 920011 939883 952212 942968 869442 748024 652108 595198 525829 426381 338692 300711
8493 300711 276676 234006 185480 153538 158483 202434 277158 358257 402092 388813 319502 223519
8481 223519 150526 132426 166630 213958 210241 167202 169513 245656 356198 450925 504370 550306
8469 550306 611484 645663 625607 565478 511170 481084 457604 426722 394879 373485 349098 293153
8457 293153 214199 162563 149742 144912 139171 119138 53377 -25792 -59600 -48236 -32178 -30570
8445 -30570 -40339 -40114 1943 73031 132453 175518 221493 286256 363432 411109 407869 360038 278452
$$ packed form
8527F55239m7806o1512m8187R089M9325O6525Q6029J02080J26766J45900J22214
8516A205662M4192k2793m3774l5459j1192Q946k4700r4453j11637n0349J9404
8505H83847L6164J9872J2329r244p3526j21418r5916n6910o9369r9448q7689l7981
8493C00711k4035m2670m8526l1942M945M3951P4724Q1099M3835j3279o9311r5983
8481B23519p2993j8100L4204M7328l717m3039K311P6143J10542R4727N3445M5936
8469E50306O1178L4179k0056o0129n4308l0086k3480l0882l1843k1394k4387n5945
8457B93153p8954n1636j2821m830n741k0033o5761p9169l3808J1364J6058J608
8445c0570r769K25M2057P1088N9422M3065M5975O4763P7176M7677l240m7831q1586
$$ plain form
8432 278452 210500 217239 280648 338394 360596 353028 339900 344563 377705 434566 494909 533164
8420 533164 545683 543886 515767 452545 375120 307650 264274 264843 327188 411945 459574 453385
8408 453385 427605 420471 414717 380428 355371 383081 443341 481184 478079 437896 360138 280894
8396 280894 253022 288150 339195 360794 335271 253633 136051 14328 -77215 -129489 -139262
8385 -139262 -89241 19807 146395 262130 386168 489918 505408 427810 316135 232358
8375 232358 220200 263562 301666 303453 267854 195435 107555 45587 27569 50605 87753 117431
8363 117431 143905 155023 148706 136351 119403 103119 106737 127673 150767 147544 108247 74161
8351 74161 86018 168720 318048 479585 584604 622679 631961 630560 624503 610813 590467 586734
$$ packed form
8432B78452o7952O739O3409N7746K2202p568j3128M663L3142N6861O0343L8255
8420E33164J2519j797k8119o3222p7425o7470m3376N69O2345Q4757M7629o189
8408D53385k5780p134n754l4289k5057K7710O0260L7843l105m0183p7758p9244
8396B80894k7872L5128N1045K1599k5523q1638j17582j21723r1543n2274r773
8385a39262N0021J09048J26588J15735J24038J03750J5490p7598j11675q3777
8375B32358j2158M3362L8104J787l5599p2419q7880o1968j8018K3036L7148K9678
8363A17431K6474J1118o317j2355j6948j6284L618K0936K3094l223l9297l4086
8351G4161J1857Q2702J49328J61537J05019L8075R282j401o057j3690k0346l733
$$ plain form
8339 586734 621064 689864 759479 795969 769931 696697 609101 506469 394801 296645 229244
8328 229244 204878 218925 225043 181337 101291 -2774 -148921 -315473 -409366 -374458 -256955
8317 -256955 -123053 6960 128612 228376 302542 345535 339874 286120 219807 158169 103893
8306 103893 91501 131470 175248 224433 298132 374392 438692 504959 558853 568023 559982 606043
8294 606043 721648 858984 964779 1013599 1006231 950350 875548 814443 794326 795821 805464 846004
8282 846004 899276 905847 854634 795739 761317 758073 771843 764487 735898 717344 708208 696286
8270 696286 672660 653881 679477 745359 793173 794862 773355 729170 672694 646796 653184 673082
8258 673082 727849 796049 800619 717776 616862 542469 494665 479161 502695 566936 632889 642606
$$ packed form
8339E86734L4330O8800O9615L6490k6038p3234q7596j02632j11668r8156o7401
8328B29244k4366J4047O118m3706q0046j04065j46147j66552r3893L4908J17503
8317b56955J33902J30013J21652R9764P4166M2993n661n3754o6313o1638n4276
8306A03893j2392L9969M3778M9185P3699P6260O4300O6267N3894R170q041M6061
8294F06043J15605J37336J05795M8820p368n5881p4802o1105k0117J495R643M0540
8282H46004N3272O571n1213n8895l4422l244J3770p356k8589j8554r136j1922
8270F96286k3626j8779K5596O5882M7814J689k1507m4185n6476k5898O388J9898
8258F73082N4767O8200M570q2843j00914p4393m7804j5504K3534O4241O5953R717
$$ plain form
8246 642606 581735 479287 401095 396427 450378 521445 578699 621024 678449 756412 843757 921675
8234 921675 942619 906988 878258 896547 953007 1036902 1135125 1211185 1215236 1156231 1093139 1032592
8222 1032592 936569 823019 735114 689717 702759 806034 983703 1174692 1335626 1428424
8212 1428424 1454421 1483110 1538648 1594729 1638042 1643958 1608580 1525148 1389474 1249125 1157750
8201 1157750 1117585 1080359 1027572 1025101 1097613 1199098 1292115 1349768 1343255 1291029 1236726 1205388
8189 1205388 1209909 1257583 1341656 1431258 1481524 1460647 1368895 1245775 1148586 1110294 1122131
8178 1122131 1171657 1236217 1299343 1364664 1428372 1473031 1496981 1519090 1527621 1502282 1443193 1369064
8166 1369064 1314561 1320196 1396496 1495582 1581326 1677037 1795851 1918330 2019726 2072603 2072119
$$ packed form
8246F42606o0871j02448p8192m668N3951P1067N7254M2325N7425P7963Q7345P7918
8234I21675K0944l5631k8730J8289N6460Q3895R8223P6060M051n9005o3092o0547
8222A032592r6023j13550q7905m5397J3042J03275J77669J90989J60934R2798
8212A428424K5997K8689N5538N6081M3313N916l5378q3432j35674j40349r1375
8201A157750m0165l7226n2787k471P2512J01485R3017N7653o513n2226n4303l1338
8189A205388M521M7674Q4073Q9602N0266k0877r1752j23120r7189l8292J1837
8178A122131M9526O4560O3126O5321O3708M4659K3950K2109Q531k5339n9089p4129
8166A369064n4503N635P6300R9086Q5744R5711J18814J22479J01396N2877m84
$$ plain form
8155 2072119 2045159 2021792 2016769 2025826 2023797 2006878 1992009 1986130 1983203 1955263 1889740 1817588
8143 1817588 1801197 1863638 1970501 2082135 2151766 2163008 2155151 2154887 2143634 2087791 1999858 1932687
8131 1932687 1900244 1896112 1925983 1984337 2050371 2122753 2193980 2217278 2172583 2087464 2003410 1943120
8119 1943120 1912333 1925117 1963076 1984930 1989034 2009447 2068384 2164466 2264339 2351148 2418592 2436308
8107 2436308 2383118 2281714 2194463 2156295 2165115 2216295 2300445 2389488 2458383 2509472 2567716
8096 2567716 2637597 2700816 2744851 2745538 2709227 2701383 2739367 2795833 2853569 2909430 2960944 3015452
8084 3015452 3098894 3226983 3377397 3498972 3546575 3521713 3448533 3352709 3262744 3196772 3154009
8073 3154009 3128148 3118591 3128664 3155913 3198755 3228729 3229334 3223672 3239968 3283204 3337383 3404792
$$ packed form
8155B072119k6960k3367n023R057k029j6919j4869n879k927k7940o5523p2152
8143A817588j6391O2441J06863J11634O9631J1242p857k64j1253n5843q7933o7171
8131A932687l2443m132K9871N8354O6034P2382P1227K3298m4695q5119q4054o0290
8119A943120l0787J2784L7959K1854M104K0413N8937R6082R9873Q6809O7444J7716
8107B436308n3190j01404q7251l8168Q820N1180Q4150Q9043O8895N1089N8244
8096B567716O9881O3219M4035O87l6311p844L7984N6466N7736N5861N1514N4508
8084C015452Q3442J28089J50414J21575M7603k4862p3180r5824q9965o5972m2763
8073C154009k5861r557J0073K7249M2842K9974O05n662J6296M3236N4179O7409
$$ plain form
8061 3404792 3495554 3581188 3632558 3664203 3696651 3734424 3767028 3795372 3848221 3926263 3977014
8050 3977014 3961737 3918176 3893177 3921460 4018867 4176631 4358374 4509368 4617717 4728193
8040 4728193 4859548 4988262 5116761 5252465 5365905 5442734 5509061 5609672 5764131 5952164
8030 5952164 6141229 6303467 6434362 6552357 6682418 6847405 7040059 7236623 7441894 7649959
8020 7649959 7855108 8085132 8362230 8686479 9073992 9530453 10034548 10562987 11123943 11750774
8010 11750774 12491044 13388629 14414034 15546094 16834655 18343641 20112567 22166359
8002 22166359 24537110 27243941 30249153 33473186 36837166 40230228 43422437 46080933
7994 46080933 47894951 48661252 48336980 47012830 44883995 42234872 39352157 36481029
$$ packed form
8061C404792R0762Q5634N1370L1645L2448L7773L2604K8344N2849P8042N0751
8050C977014j5277m3561k4999K8283R7407J57764J81743J50994J08349J10476
8040D728193J31355J28714J28499J35704J13440P6829O6327J00611J54459J88033
8030E952164J89065J62238J30895J17995J30061J64987J92654J96564K05271K08065
8020G649959K05149K30024K77098L24249L87513M56461N04095N28439N60956O26831
8010A1750774P40270Q97585J025405J132060J288561J508986J768926K053792
8002B2166359K370751K706831L005212L224033L363980L393062L192209K658496
7994D6080933J814018P66301l24272j324150k128835k649123k882715k871128
$$ plain form
7986 36481029 33813422 31460640 29431483 27705706 26320781 25301407 24583373 24057338
7978 24057338 23638714 23295650 23024859 22824422 22700223 22669494 22734128 22834687 22865606 22803259
7968 22803259 22704638 22585849 22462830 22382358 22380868 22500451 22802916 23318189 24024462 24866921
7958 24866921 25836676 26992786 28411078 30137177 32175292 34500041 37110991 40051798
7950 40051798 43353938 47107610 51491687 56636309 62569304 69333351 77016726 85644669
7942 85644669 95109158 105082218 115002861 124150113 131647006 136551739 138154822 136230358
7934 136230358 131033396 123228110 113765935 103612111 93541022 84115448 75681554 68354498
7926 68354498 62102806 56838301 52464068 48894213 46053085 43822503 42039596 40583547
$$ packed form
7986C6481029k667607k352782k029157j725777j384925j019374p18034n26035
7978B4057338m18624l43064k70791k00437j24199l0729O4634J00559L0919o2347
7968B2803259r8621j18789j23019q0472j490J19583L02465N15273P06273Q42459
7958B4866921R69755J156110J418292J726099K038115K324749K610950K940807
7950D0051798L302140L753672M384077N144622N932995O764047P683375Q627943
7942H5644669R464489R973060R920643R147252P496893M904733J603083j924464
7934A36230358n196962p805286r462175j0153824j0071089r425574q433894p327056
7926F8354498o251692n264505m374233l569855k841128k230582j782907j456049
$$ plain form
7918 40583547 39401972 38473433 37773672 37248881 36803385 36352673 35877852 35426939 35109414
7909 35109414 35004962 35102347 35391976 35912034 36657261 37598407 38750757 40185997 41962622
7900 41962622 44081116 46558540 49487116 52954602 56997863 61678457 67109024 73453188
7892 73453188 80883183 89554792 99658009 111406382 124959562 140397066 157681887
7885 157681887 176559425 196459011 216351801 234732838 249779282 259654138 262959673
7878 262959673 259165097 248779923 233164871 214137430 193599471 173210969 154160376
7871 154160376 137123368 122321620 109672471 98962462 89967173 82490806 76316369
7864 76316369 71205999 66988023 63553505 60769148 58481117 56552211 54884647 53423002
$$ packed form
7918D0583547j181575r28539o99761n24791m45496m50712m74821m50913l17525
7909C5109414j04452R7385K89629N20058P45227R41146J152350J435240J776625
7900D1962622K118494K477424K928576L467486M043261M680594N430567O344164
7892G3453188P429995Q671609J0103217J1748373J3553180J5437504J7284821
7885A57681887J8877538J9899586J9892790J8381037J5046444R874856L305535
7878B62959673l794576j0385174j5615052j9027441k0537959k0388502j9050593
7871A54160376j7037008j4801748j2649149j0710009q995289p476367o174437
7864G6316369n110370m217976l434518k784357k288031j928906j667564j461645
$$ plain form
7856 53423002 52110307 50889105 49772762 48820284 48049045 47457321 47079238 47006019 47316113
7847 47316113 48006346 49059004 50469996 52247488 54453798 57177478 60467473 64347002
7839 64347002 68864164 74134000 80310545 87555548 96074947 106108872 117878612 131539634
7831 131539634 147222494 165067243 185101667 207081941 230316270 253531409 274880595
7824 274880595 292138615 303157639 306401012 301314266 288458772 269399729 246380278
7817 246380278 221761178 197494862 174889779 154631740 136962957 121845261 109062145
7810 109062145 98310505 89292961 81743859 75447281 70225553 65902119 62313253 59301110
7802 59301110 56750683 54571484 52624507 50804351 49100089 47561686 46259680 45252682
$$ packed form
7856E3423002j312695j221202j116343r52478p71239n91724l78083p3219L10094
7847D7316113O90233J052658J410992J777492K206310K723680L289995L879529
7839F4347002M517162N269836O176545P245003Q519399J0033925J1769740J3661022
7831A31539634J5682860J7844749K0034424K1980274K3234329K3215139K1349186
7824B74880595J7258020J1019024L243373n086746j2855494j9059043k3019451
7817B46380278k4619100k4266316k2605083k0258039j7668783j5117696j2783116
7810A09062145j0751640r017544p549102o296578n221728m323434l588866l012143
7802E9301110k550427k179199j946977j820156j704262j538403j302006j006998
$$ plain form
7794 45252682 44553861 44143081 44013557 44164861 44610000 45348480 46363118 47689531 49393133
7785 49393133 51503465 54070999 57172979 60840525 65158392 70303543 76434771 83686694
7777 83686694 92200554 102151051 113733663 127087434 142282514 159296431 177894065
7770 177894065 197460689 216885737 234609013 248832666 257781796 260118396 255353443
7763 255353443 244017406 227513268 207735192 186645490 165879067 146502677 129101275
7756 129101275 113914326 100890123 89820959 80477408 72654941 66109607 60554319 55787948
7748 55787948 51741807 48383340 45626348 43317593 41284536 39432053 37772129 36340768
7740 36340768 35126636 34084807 33160585 32335160 31638377 31095725 30700971 30455875 30421441
$$ packed form
7794D5252682o98821m10780j29524J51304M45139P38480J014638J326413J703602
7785D9393133K110332K567534L101980L667546M317867N145151O131228P251923
7777H3686694Q513860R950497J1582612J3353771J5195080J7013917J8597634
7770A77894065J9566624J9425048J7723276J4223653Q949130K336600m764953
7763B55353443j1336037j6504138j9778076k1089702k0766423j9376390j7401402
7756A29101275j5186949j3024203j1069164r343551p822467o545334n555288m766371
7748E5787948m046141l358467k756992k308755k033057j852483j659924j431361
7740C6340768j214132j041829r24222q25425o96783n42652l94754k45096l4434
$$ plain form
7731 30421441 30646507 31094076 31699051 32458419 33445633 34749963 36441612 38552760 41078460
7722 41078460 44059195 47625774 51902994 56920363 62701897 69329544 76878515 85326918
7714 85326918 94505207 104050791 113397599 121799934 128379146 132285425 132900644 130046215
7706 130046215 124027185 115518230 105406011 94628018 84013534 74156788 65355513 57681019
7698 57681019 51096413 45496913 40736980 36679475 33207475 30213969 27602464 25315277
7690 25315277 23348461 21690756 20293022 19093204 18041422 17134319 16364314 15712714 15188615
7681 15188615 14819218 14574698 14366717 14164094 14023001 13995442 14074110 14216752 14399563 14627678
7671 14627678 14907404 15243402 15643066 16135657 16774729 17592665 18585981 19772180 21161380
$$ packed form
7731C0421441K25066M47569O04975P59368R87214J304330J691649K111148K525700
7722D1078460K980735L566579M277220N017369N781534O627647P548971Q448403
7714H5326918R178289R545584R346808Q402335O579212L906279O15219k854429
7706A30046215o019030q508955j0112219j0777993j0614484r856746q801275p674494
7698E7681019o584606n599500m759933m057505l472000k993506k611505k287187
7690B5315277j966816j657705j397734j199818j051782r07103p70005o51600n24099
7681A5188615l69397k44520k07981k02623j41093k7559P8668J42642J82811K28115
7671A4627678K79726L35998L99664M92591O39072Q17936R93316J186199J389200
$$ plain form
7662 21161380 22763107 24610954 26740666 29161963 31846440 34733625 37732140 40676184
7654 40676184 43299859 45317216 46491584 46652177 45711771 43725748 40928871 37629391
7646 37629391 34119289 30660251 27434992 24542505 22014007 19817397 17887938 16168908
7638 16168908 14636250 13255588 12019454 10957879 10061476 9284501 8600986 7997776 7463332
7629 7463332 6996193 6580583 6186244 5790161 5409167 5105842 4905623 4779262 4687804 4588044
7619 4588044 4448144 4282893 4111961 3937423 3768491 3583838 3358805 3142316 2982709 2862086
7609 2862086 2774040 2725817 2684637 2619072 2554702 2526678 2518696 2459934 2320492 2191949 2160433
7598 2160433 2182330 2166378 2099717 2011425 1875189 1704423 1583777 1556032 1607090 1660874 1677879
$$ packed form
7662B1161380J601727J847847K129712K421297K684477K887185K998515K944044
7654D0676184K623675K017357J174368J60593r40406j986023k796877l299480
7646C7629391l510102l459038l225259k892487k528498k196610j929459j719030
7638A6168908j532658j380662j236134j061575q96403p76975o83515o03210n34444
7629G463332m67139m15610l94339l96083l80994l03325k00219j26361r1458r9760
7619D588044j39900j65251j70932j74538j68932j84653k25033k16489j59607j20623
7609B862086q8046m8223m1180o5565o4370k8024p982n8762j39442j28543l1516
7598B160433K1897j5952o6661q8292j36236j70766j20646k7745N1058N3784J7005
$$ plain form
7587 1677879 1686745 1704301 1757821 1868061 1981395 2032186 2028372 2010746 1976383 1918512 1866499
7576 1866499 1844537 1868536 1911343 1914134 1843035 1732363 1634725 1579846 1561096 1526094 1440544
7565 1440544 1337654 1274429 1260713 1235866 1152069 1042729 962469 930064 923513 912302 881125
7554 881125 860478 889234 934989 954617 936277 873812 789836 719273 671098 628280 587261 580959
7542 580959 618647 669152 695922 685766 642582 569583 505265 525407 627182 758720 901648
7531 901648 1025824 1101989 1119054 1076501 988810 893228 805430 736946 720375 768301 840611
7520 840611 879062 874234 849120 814972 797321 789246 756322 718970 727287 776093 834473 905628
7508 905628 1004561 1102699 1155242 1155137 1124860 1090255 1058312 1018337 977432 950029 919240 887979
$$ packed form
7587A677879Q866J7556N3520J10240J13334N0791l814j7626l4363n7871n2013
7576A866499k1962K3999M2807K791p1099j10672r7638n4879j8750l5002q5550
7565A440544j02890o3225j3716k4847q3797j09340q0260l2405o551j1211l1177
7554H81125k0647K8756M5755J9628j8340o2465q3976p0563m8175m2818m1019o302
7542E80959L7688N0505K6770j0156m3184p2999o4318K0142J01775J31538J42928
7531I01648J24176P6165J7065m2553q7691r5582q7798o8484j6571M7926P2310
7520H40611L8451m828k5114l4148j7651q075l2924l7352Q317M8806N8380P1155
7508I05628R8933R8138N2543j05l0277l4605l1943l9975m0905k7403l0789l1261
$$ plain form
7496 887979 866687 852605 857007 853197 801709 697260 560878 424467 338533 329626 353865 365386
7484 365386 352617 311742 251236 199456 179686 200609 245629 288172 317023 322015 303027 297745
7472 297745 320464 352690 410128 503954 596786 642236 612833 518378 401014 277879 172668
7461 172668 120039 122785 162050 212892 257359 282596 313386 364737 424689 490391 548632 546534
7449 546534 464933 338779 234995 205640 246336 301838 320620 294621 252996 223941 177423
7438 177423 112704 111457 220786 365340 430507 392891 322438 278735 282571 314867 342669 342269
7426 342269 320883 323085 336548 294128 190114 65697 -65541 -182208 -240383 -226185 -177799
7415 -177799 -133255 -89300 -48611 -15875 28881 62000 52667 23158 3072 12035 51092 99431
$$ packed form
7496H87979k1292j4082M402l810n1488j04449j36382j36411q5934q907K4239J1521
7484C65386j2769m0875o0506n1780j9770K0923M5020M2543K8851M992j8988n282
7472B97745K2719L2226N7438R3826R2832M5450k9403r4455j17364j23135j05211
7461A72668n2629K746L9265N0842M4467K5237L0790N1351N9952O5702N8241k098
7449E46534q1601j26154j03784k9355M0696N5502J8782k5999m1625k9055m6518
7438A77423o4719j247J09329J44554O5167l7616p0453m3703L836L2296K7802m00
7426C42269k1386K202J3463m2420j04014j24417j31238j16667n8175J4198M8386
7415a77799M4544M3955M0689L2736M4756L3119r333k9509k0086Q963L9057M8339
$$ plain form
7403 99431 133731 169965 227541 291561 342454 355921 311397 235220 189566 206669 271357 356477
7391 356477 438496 487894 499054 492175 459376 388632 306819 255619 245791 260850 276947 284660
7379 284660 303140 346181 393570 427079 460803 488570 483421 449736 443358 490716 532604 515377
7367 515377 468336 448063 459521 470506 474819 469413 465471 480537 515855 556666 585727 606511
7355 606511 640247 688691 716105 707034 684296 670171 661483 661209 694883 760198 811557 831765
7343 831765 834616 829193 807702 734429 600914 452352 355920 346959 381807 390139 347313 290641
7331 290641 274392 294217 320713 326934 290397 226713 150261 61982 3207 5593 77043 174441
7319 174441 249963 299343 336561 367222 379396 372568 339305 285313 253591 275199 315515 331237
$$ packed form
7403I9431L4300L6234N7576O4020N0893J3467m4524p6177m5654J7103O4688Q5120
7391C56477Q2019M9398J1160o879l2799p0744q1813n1200r828J5059J6097P713
7379B84660J8480M3041M7389L3509L3724K7767n149l3685o378M7358M1888j7227
7367E15377m7041k0273J1458J0985M313n406l942J5066L5318M0811K9061K0784
7355F06511L3736M8444K7414r071k2738j4125q688k74L3674O5315N1359K0208
7343H31765K851n423k1491p3273j33515j48562r6432q961L4848Q332m2826n6672
7331B90641j6249J9825K6496O221l6537o3684p6452q8279n8775K386P1450R7398
7319A74441P5522M9380L7218L0661J2174o828l3263n3992l1722K1608M0316J5722
$$ plain form
7307 331237 300246 236389 177628 163810 184100 176274 118137 27760 -52250 -67426 -18984 23158
7295 23158 16545 -23416 -72440 -109110 -99902 -31002 64088 138927 181700 209815 248536 313334
7283 313334 395672 479103 541444 561400 501914 379200 262837 207326 231429 289155 323423
7272 323423 328544 318508 279128 201918 117559 59332 48124 76844 136851 217883 302388 369270
7260 369270 386593 334070 229779 102092 -29978 -116943 -152184 -169816 -163072 -112416 -35826
7249 -35826 39104 110910 177478 223445 260385 290857 304224 311638 310539 284265 261936 273318
7237 273318 284744 263637 212225 157258 103550 49818 -10651 -82976 -143156 -165741 -163011 -130934
7225 -130934 -46154 72852 204783 335639 429313 448351 414311 358428 269187 137655 -23046
$$ packed form
7307C31237l0991o3857n8761j3818K0290p826n8137r0377q0010j5176M8442M2142
7295B3158o613l9961m9024l6670R208O8900R5090P4839M2773K8115L8721O4798
7283C13334Q2338Q3431O2341J9956n9486j22714j16363n5511K4103N7726L4268
7272C23423N121j0036l9380p7210q4359n8227j1208K8720O0007Q1032Q4505O6882
7260C69270J7323n2523j04291j27687j32070q6965l5241j7632O744N0656P6590
7249c5826P4930P1806O6568M5967L6940L0472J3367P414j099k6274k2329J1382
7237B73318J1426k1107n1412n4967n3708n3732o0469p2325o0180k2585K730L2077
7225a30934Q4780J19006J31931J30856R3674J9038l4040n5883q9241j31532j60701
$$ plain form
7214 -23046 -187184 -297248 -288776 -155699 24993 160455 219836 236816 265714 312472 368534
7203 368534 431412 494849 554283 577076 547163 497177 461634 433400 389900 322463 250534 199981
7191 199981 154943 92802 55502 85005 133481 129640 65852 15972 48686 135464 174265 112695
7179 112695 12078 -50636 -80647 -113652 -158445 -201517 -221083 -196622 -117526 -1117 108945
7168 108945 186194 211598 191589 143750 65509 -30035 -90720 -66572 28853 138654 187161
7157 187161 135116 43805 -9286 -8482 18019 30099 21097 7292 -17651 -46159 -27110 44308
7145 44308 113091 156220 165237 146918 134507 138714 155640 172553 190881 225556 261943 292075
7133 292075 323886 332275 290338 221828 172695 158985 169138 168713 147299 117319 93166 95275
$$ packed form
7214b3046j64138j10064Q472J33077J80692J35462N9381J6980K8898M6758N6062
7203C68534O2878O3437N9434K2793k9913m9986l5543k8234m3500o7437p1929n0553
7191A99981m5038o2141l7300K9503M8476l841o3788m9880L2714Q6778L8801o1570
7179A12695j00617o2714l0011l3005m4793m3072j9566K4461P9096J16409J10062
7168A08945P7249K5404k0009m7839p8241r5544o0685K4148R5425J09801M8507
7157A87161n2045r1311n3091Q04K6501J2080r002j3805k4943k8508J9049P1418
7145D4308O8783M3129R017j8319j2411M207J6926J6913J8328L4675L6387L0132
7133B92075L1811Q389m1937o8510m9133j3710J0153m25k1414k9980k4153K109
$$ plain form
7121 95275 136735 209661 252821 199810 77188 -37631 -113062 -134228 -127080 -111259 -63827 -4621
7109 -4621 43158 71323 79365 98000 120811 132132 175006 281745 432879 596511 749087
7098 749087 843820 852951 800317 716272 632938 589260 574015 536971 446743 314124 194305
7087 194305 122765 83588 46016 -4390 -40360 -27910 13694 15657 -36936 -92246 -99420 -45423
7075 -45423 52224 198224 358886 460129 504041 522910 525234 541837 568232 560314 490613 379521
7063 379521 313196 328045 369024 384623 355387 277501 174697 85815 13113 -56654 -129993
7052 -129993 -204775 -249741 -226728 -138707 -27012 43394 13140 -90682 -181205 -200444 -136307
7041 -136307 -30636 77940 162339 207363 234322 239878 202539 134991 67329 26187 32795 60917
$$ packed form
7121I5275M1460P2926M3160n3011j22622j14819p5431k1166P148J5821M7432N9206
7109d621M7779K8165Q042J8635K2811J1321M2874J06739J51134J63632J52576
7098G49087R4733R131n2634q4045q3334m3678j5245l7044r0228j32619j19819
7087A94305p1540l9177l7572n0406l5970J2450M1604J963n2593n5310p174N3997
7075d5423R7647J46000J60662J01243M3912J8869K324J6603K6395p918o9701j11092
7063C79521o6325J4849M0979J5599k9236p7886j02804q8882p2702o9767p3339
7052a29993p4782m4966K3013Q8021J11695P0406l0254j03822r0523j9239O4137
7041a36307J05671J08576Q4399M5024K6959N556l7339o7548o7662m1142O608K8122
$$ plain form
7029 60917 66445 48326 15753 -23290 -41749 -29879 12994 82027 138118 121675 29011 -76308
7017 -76308 -154786 -196721 -205417 -205824 -205275 -195584 -162791 -106833 -23557 70049 124406 121628 104836
7004 104836 94043 91452 109197 121743 109682 74204 36037 35309 83665 163541 256644 316267
6992 316267 303031 217835 95508 -1883 -54119 -89044 -109167 -104836 -82956 -41596 23426 101831
6980 101831 173527 209216 191105 131705 46150 -42812 -110594 -160879 -183400 -158517 -115213 -89862
6968 -89862 -87864 -94758 -102301 -133299 -156707 -131754 -81563 -25453 1199 -44664 -147626 -257196
6956 -257196 -321411 -305931 -220911 -111804 -32047 -17533 -44201 -67698 -106216 -178068 -242319
6945 -242319 -268151 -251977 -212311 -173029 -143579 -117445 -81204 -42001 -23472 -47193 -97075 -124391
$$ packed form
7029F0917N528j8119l2573l9043j8459J1870M2873O9033N6091j6443r2664j05319
7017g6308p8478m1935q696m07N49R691L2793N5958Q3276R3606N4357k778j6792
7004A04836j0793k591J7745J2546j2061l5478l8167p28M8356P9876R3103N9623
6992C16267j3236q5196j22327r7391n2236l4925k0123M331K1880M1360O5022P8405
6980A01831P1696L5689j8111n9400q5555q8962o7782n0285k2521K4883M3304K5351
6968h9862J998o894p543l0998k3408K4953N0191N6110K6652m5863j02962j09570
6956b57196o4215J5480Q5020J09107P9757J4514k6668k3497l8518p1852o4251
6945b42319k5832J6174L9666L9282K9450K6134L6241L9203J8529k3721m9882k7316
$$ plain form
6933 -124391 -127089 -134127 -155128 -150791 -104864 -49813 5431 54208 82591 79040 41685 19823
6921 19823 66489 155364 218805 213078 156209 102320 67940 38351 28790 41340 13959 -75362
6909 -75362 -156106 -170344 -151026 -128736 -75254 5161 33930 -32821 -129961 -184338 -209314 -228975
6897 -228975 -225171 -206178 -204106 -211221 -194265 -158896 -146805 -191977 -298380 -421992 -494732 -486807
6885 -486807 -428153 -365552 -307490 -267973 -274503 -313843 -359743 -403790 -432884 -444214 -439591 -408005
6873 -408005 -342480 -258346 -163273 -89123 -65099 -72158 -78308 -58042 -43877 -94630 -210387 -341648
6861 -341648 -411948 -408056 -386542 -392024 -439509 -512860 -584230 -635268 -653937 -616045 -527954 -452896
6849 -452896 -408248 -356086 -273497 -159752 -37120 60790 96085 22593 -137979 -253558 -240911
$$ packed form
6933a24391k698p038k1001M337M5927N5051N5244M8777K8383l551l7355k1862
6921A9823M6666Q8875O3441n727n6869n3889l4380k9589r561J2550k7381q9321
6909g5362q0744j4238J9318K2290N3482Q0415K8769o6751r7140n4377k4976j9661
6897b28975L804J8993K072p115J6956L5369J2091m5172j06403j23612p2740P925
6885d86807N8654O2601N8062L9517o530l9340m5900m4047k9094j1330M623L1586
6873d08005O5525Q4134R5073P4150K4024p059o150K0266J4165n0753j15757j31261
6861c41648p0300L892K1514n482m7485p3351p1370n1038j8669L7892Q8091P5058
6849d52896M4648N2162Q2589J13745J22632R7910L5295p3492j60572j15579J2647
$$ plain form
6838 -240911 -146426 -45235 29886 97950 152484 154562 97524 12298 -52687 -78626 -71142 -37439
6826 -37439 10041 45220 38049 -10681 -80092 -143719 -179242 -177823 -170663 -198961 -247547 -298074
6814 -298074 -360454 -426907 -462363 -467608 -465846 -463842 -465989 -467365 -466871 -457218 -438731 -423990 -412242
6801 -412242 -383841 -342999 -332220 -369789 -410408 -395215 -336432 -290779 -267409 -231379 -162292 -87912
6789 -87912 -72644 -123804 -170600 -148329 -77202 -42005 -64809 -84014 -64665 -26089 11030 47662
6777 47662 85817 102371 70509 9575 -32822 -50632 -54951 -36337 1311 28539 18192 -35283
6765 -35283 -108879 -161126 -189793 -198529 -188506 -166565 -120588 -50433 -1845 -3010 -12634 10756
6753 10756 16286 -27048 -54642 -22681 61112 147416 184738 165008 109975 24374 -77943 -163133
$$ packed form
6838b40911R4485J01191P5121O8064N4534K078n7038q5226o4985k5939P484L3703
6826c7439M7480L5179p171m8730o9411o3627l5523J419P160k8298m8586n0527
6814b98074o2380o6453l5456n245J762K004k147j376M94R653J8487J4741J1748
6801d12242K8401M0842J0779l7569m0619J5193N8783M5653K3370L6030O9087P4380
6789h7912J5268n1160m6796K2271P1127L5197k2804j9205J9349L8576L7119L6632
6777D7662L8155J6554l1862o0934m2397j7810m319J8614L7648K7228j0347n3475
6765c5283p3596n2247k8667q736J0023K1941M5977P0155M8588j165r624K3390
6753A0756N530m3334k7594L1961Q3793Q6304L7322j9730n5033q5601j02317q5190
$$ plain form
6741 -163133 -220777 -281001 -357103 -424291 -468287 -480055 -458630 -409945 -334513 -251052 -198264 -181418
6729 -181418 -168583 -139049 -84404 4932 129870 255002 314708 285296 205207 119900 58746
6718 58746 6789 -57792 -106193 -128078 -141273 -138542 -109556 -57998 18881 93925 138568 167896
6706 167896 192839 210303 216167 231064 274802 321965 372148 407019 379649 310749 246186 193728
6694 193728 166497 190178 268162 359678 420484 451860 474343 490427 483721 435244 364194 287586
6682 287586 214821 170195 180988 223360 247589 252670 273147 311139 311538 232771 112925 12693
6670 12693 -63239 -135346 -218928 -270989 -227569 -110964 11309 111854 160535 143292 75558
6659 75558 -15761 -86007 -137376 -209859 -314867 -441687 -558324 -621490 -621106 -591118 -572720 -552253
$$ packed form
6741a63133n7644o0224p6102o7188m3996j1768K1425M8685P5432Q3461N2788J6846
6729a81418J2835K9534N4645Q9336J24938J25132N9706k9412q0089q5307o1154
6718E8746n1957o4581m8401k1885j3195K731K8986N1558P6879P5044M4643K9328
6706A67896K4943J7464N864J4897M3738M7163N0183L4871k7370o8900o4563n2458
6694A93728k7231K3681P7984R1516O0806L1376K2483J6084o706m8477p1050p6608
6682B87586p2765m4626J0793M2372K4229N081K0477L7992L99p8767j19846j00232
6670A2693p5932p2107q3582n2061M3420J16605J22273J00545M8681j7243o7734
6659G5558r1319p0246n1369p2483j05008j26820j16637o3166L84K9988J8398K0467
$$ plain form
6647 -552253 -477312 -348314 -202356 -50746 84150 159106 156876 107850 40435 -21334 -34246
6636 -34246 10360 74995 140238 207829 249462 220262 121051 15377 -50897 -78791 -87558 -92435
6624 -92435 -92923 -96555 -120873 -182705 -289830 -406798 -479938 -481860 -424614 -360888 -334302 -317520
6612 -317520 -266189 -167499 -66391 -16302 -40731 -147667 -275981 -348952 -379723 -418042 -444670
6601 -444670 -411803 -314612 -181084 -47186 54526 121034 156619 142638 74034 -33517 -132660
6590 -132660 -172602 -156489 -118222 -75257 -30768 22449 93273 153919 165717 108418 -8983
6579 -8983 -145587 -260675 -313516 -287185 -208229 -129545 -84927 -57079 -18321 8343 -3585 -64255
6567 -64255 -161895 -245947 -298674 -326622 -316981 -272519 -208692 -142863 -96346 -57981 -37195 -52348
$$ packed form
6647e52253P4941J28998J45958J51610J34896P4956k230m9026o7415o1769j2912
6636c4246M4606O4635O5243O7591M1633k9200r9211j05674o6274k7894q767m877
6624i2435m88l632k4318o1832j07125j16968p3140j922N7246O3726K6586J6782
6612c17520N1331R8690J01108N0089k4429j06936j28314p2971l0771l8319k6628
6601d44670L2867R7191J33528J33898J01712O6508L5585j3981o8604j07551r9143
6590a32660l9942J6113L8267M2965M4489N3217P0824O0646J1798n7299j17401
6579h983j36604j15088n2841K6331P8956P8684M4618K7848L8758K6664j1928o0670
6567f4255r7640q4052n2727k7948R641M4462O3827O5829M6517L8365K0786j5153
$$ plain form
6555 -52348 -74942 -77316 -68318 -85415 -140181 -195753 -228221 -243448 -258181 -265165 -228195 -155627
6543 -155627 -89652 -42360 -113 48273 75627 51434 7212 -21098 -47293 -75824 -85420 -80487
6531 -80487 -67452 -17891 65435 149070 210806 259312 315869 358689 364261 322229 236862 137823
6519 137823 61704 52694 115325 187183 223488 226977 206624 160227 107311 77601 53545 15293
6507 15293 -30601 -70384 -98158 -108820 -95986 -68789 -57443 -89343 -161078 -223419 -221277 -161587
6495 -161587 -97288 -84198 -118965 -135793 -87931 -6056 48204 34919 -43150 -120609 -137118 -110867
6483 -110867 -101278 -148359 -232360 -292353 -319768 -348381 -400212 -481051 -561187 -600994 -597494 -574724
6471 -574724 -534560 -449910 -288725 -79484 84094 163435 190528 197660 201610 214500 242787
$$ packed form
6555e2348k2594k374Q998j7097n4766n5572l2468j5227j4733o984L6970P2568
6543a55627O5975M7292M2247M8386K7354k4193m4222k8310k6195k8531r596M933
6531h0487J3035M9561Q3326Q3635O1736M8506N6557M2820N572m2032q5367r9039
6519A37823p6119r010O2631P1858L6305L489k0353m6397n2916k9710k4056l8252
6507A5293m5894l9783k7774j0662J2834K7197J1346l1900p1735o2341K142N9690
6495a61587O4299J3090l4767j6828M7862Q1875N4260j3285p8069p7459j6509K6251
6483a10867R589m7081q4001n9993k7415k8613n1831q0839q0136l9807L500K2770
6471e74724M0164Q4650J61185K09241J63578P9341K7093P132L950J2890K8287
$$ plain form
6460 242787 269933 289520 292752 251785 181415 112876 47976 -24602 -107534 -196549 -276678 -326928
6448 -326928 -351640 -359370 -345842 -307969 -248547 -160822 -58406 19536 46368 28350 15059 44382
6436 44382 104528 145546 149517 153469 184138 214768 212652 187764 177790 190088 227548 320935 414909
6423 414909 442882 438038 443921 460208 462876 425926 358181 263814 156692 83940 70149 111662
6411 111662 188940 250064 265670 250211 212771 171046 127049 65292 -18831 -108511 -174276 -200869
6399 -200869 -183313 -143249 -116250 -118191 -146908 -171430 -158853 -99924 -13945 75361 146044 176183
6387 176183 198463 280703 416503 524414 556340 537674 490053 403994 289284 192541 141311
6376 141311 125939 131840 142774 168684 265461 412925 497234 467754 372288 241128 94169
$$ packed form
6460B42787K7146J9587L232m0967p0370o8539o4900p2578q2932q9015q0129n0250
6448c26928k4712p730J3528L7873N9422Q7725J02416P7942K6832j8018j3291K9323
6436D4382O0146M1018L971L952L0669L0630k116k4888r974J2298L7460R3387R3974
6423D14909K7973m844N883J6287K668l6950o7745r4367j07122p2752j3791M1513
6411A11662P7278O1124J5606j5459l7440m1725m3997o1757q4123q9680o5765k6593
6399b00869J7556M0064K6999j941k8717k4522J2577N8929Q5979Q9306P0683L0139
6387A76183K2280Q2240J35800J07911L1926j8666m7621q6059j14710r6743n1230
6376A41311j5372N901J0934K5910R6777J47464Q4309k9480r5466j31160j46959
$$ plain form
6365 94169 -29241 -111499 -148694 -143914 -114186 -68313 -17826 35568 126010 263546 405494
6354 405494 503469 548400 550951 540287 525230 511304 530843 588828 655007 695341 689053 654097
6342 654097 644321 688734 764202 820129 818877 773157 741990 769010 831682 895391 946884 995884
6330 995884 1051404 1108116 1146070 1144875 1135819 1187517 1320006 1472151 1611530 1739896 1818866
6319 1818866 1842914 1869085 1905097 1893391 1824601 1747260 1679263 1594766 1463355 1276678 1063890
6308 1063890 866465 732321 665311 626919 587655 507992 401150 344032 362389 415095 454788
6297 454788 473392 459395 405902 357006 330375 304179 263652 228534 223393 247498 302976 407918
6285 407918 557087 712983 832687 895743 915814 907501 859507 772041 682659 629363 620539
$$ packed form
6365I4169j23410q2258l7195M780K9728M5873N0487N3394R0442J37536J41948
6354D05494R7975M4931K551j0664j5057j3926J9539N7985O6179M0334o288l4956
6342F54097r776M4413P5468N5927j252m5720l1167K7020O2672O3709N1493M9000
6330I95884N5520N6712L7954j195r056N1698J32489J52145J39379J28366P8970
6319A818866K4048K6171L6012j1706o8790p7341o7997q4497j31411j86677k12788
6308A063890j97425j34144o7010l8392l9264p9663j06842n7118J8357N2706L9693
6297D54788J8604j3997n3493m8896k6631k6196m0527l5118n141K4105N5478J04942
6285D07918J49169J55896J19704O3056K0071q313m7994q7466q9382n3296q824
$$ plain form
6274 620539 637219 640773 614663 590603 603114 677791 814032 961274 1093813 1219416 1341307
6263 1341307 1468673 1604394 1740913 1873737 1951966 1907415 1745695 1522248 1274300 1010428
6253 1010428 739494 499744 341293 282548 268356 217801 133146 76645 68589 101319 148244
6242 148244 179190 218233 284392 352793 400133 401799 360057 297013 232680 196934 178239 141043
6230 141043 90894 42489 1477 -16062 -1308 35515 92245 178372 254871 277273 257475 232738
6218 232738 217498 209261 208844 221520 272329 352035 405062 407773 373870 321262 304047 364602
6206 364602 469036 548914 562582 520568 444496 352869 293914 281237 283557 297459 335020 390311
6194 390311 450837 503107 539239 555161 534514 504450 503121 513512 518269 530830 516773 442247
$$ packed form
6274F20539J6680L554k6110k4060J2511P4677J36241J47242J32539J25603J21891
6263A341307J27366J35721J36519J32824P8229m4551j61720k23447k47948k63872
6253A010428k70934k39750j58451n8745j4192n0555q4655n6501q056L2730M6925
6242A48244L0946L9043O6159O8401M7340J666m1742o3044o4333l5746j8695l7196
6230A41043n0149m8405m1012j7539J4754L6823N6730Q6127P6499K2402j9798k4737
6218B32738j5240q237m17J2676N0809P9706N3027K711l3903n2608j7215O0555
6206C64602J04434P9878J3668m2014p6072r1627n8955j2677K320J3902L7561N5291
6194C90311O0526N2270L6132J5922k0647l0064j329J0391M757J2561j4057p4526
$$ plain form
6182 442247 342826 277993 276378 321397 373788 426143 487491 546370 573371 529774 420640 296317
6170 296317 197770 118723 48452 -13346 -72625 -114072 -134075 -163398 -190881 -174926 -94651 23176
6158 23176 99595 95881 49524 14539 6550 18738 47952 74170 65974 54491 72974 114486
6146 114486 166246 211606 223575 184364 117269 56843 18379 15265 38065 54098 46407 39135
6134 39135 60297 103705 139870 149016 139895 125731 105048 88887 87309 94328 98628 101339 104960
6121 104960 123613 147444 135167 69541 -30629 -136807 -216785 -240749 -225562 -202369 -176237
6110 -176237 -131269 -41404 85967 208083 290113 330137 350384 353948 328011 268830 181655
6099 181655 87372 22699 -9204 -24466 -42582 -43036 13921 132803 292596 463365 628886
$$ packed form
6182D42247r9421o4833j615M5019N2391N2355O1348N8879K7001m3597j09134j24323
6170B96317r8547p9047p0271o1798n9279m1447k0003k9323k7483J5955Q0275J17827
6158B3176P6419l714m6357l4985p989J2188K9214K6218q196j1483J8483M1512
6146A14486N1760M5360J1969l9211o7095o0426l8464l114K2800J6033p691p272
6134C9135K1162M3408L6165R146r121j4164k0683j6161j578P019M300K711L621
6121A04960J8653K3831j2277o5626j00170j06178p9978k3964J5187K3193K6132
6110a76237M4968Q9865J27371J22116Q2030M0024K0247L564k5937n9181q7175
6099A81655r4283o4673l1903j5262j8116m54N6957J18882J59793J70769J65521
$$ plain form
6088 628886 787052 920854 1006594 1073871 1159539 1239715 1300924 1349622 1403806 1477184 1537423
6077 1537423 1539610 1494028 1422682 1357460 1323994 1279031 1167974 997142 813549 649207 531369
6066 531369 485613 496596 513146 492712 443371 411912 429071 471318 482648 448600 403065 361250
6054 361250 298915 219073 168972 164656 178398 208166 259873 323476 372058 369474 334901 314855
6042 314855 329716 371018 414062 432195 393828 329949 329021 402552 504529 614097 723146
6031 723146 837427 969618 1098205 1215601 1352545 1522621 1693093 1805079 1845481 1845594
6021 1845594 1813850 1771769 1746386 1734260 1726755 1680876 1564718 1408759 1257136 1123906 1004101
6010 1004101 903235 851685 831119 780769 691933 589827 509974 471075 420957 318133 205362
$$ packed form
6088F28886J58166J33802Q5740O7277Q5668Q0176O1209M8698N4184P3378O0239
6077A537423K187m5582p1346o5222l3466m4963j11057j70832j83593j64342j17838
6066E31369m5756J0983J6550k0434m9341l1459J7159M2247J1330l4048m5535m1815
6054C61250o2335p9842n0101m316J3742K9768N1707O3603M8582k584l4573k0046
6042C14855J4861M1302M3044J8133l8367o3879r28P3531J01977J09568J09049
6031G23146J14281J32191J28587J17396J36944J70076J70472J11986M0402J13
6021A845594l1744m2081k5383j2126p505m5879j16158j55959j51623j33230j19805
6010A004101j00866n1550k0566n0350q8836j02106p9853l8899n0118j02824j12771
$$ plain form
5999 205362 130884 95343 99855 148050 235210 333751 388159 401445 407880 429756 480158 549160
5987 549160 594899 629298 683533 727348 697495 561430 378219 226006 114625 49157 37327
5976 37327 46367 29161 -11527 -40903 -46915 -37481 -20491 -22881 -50694 -62668 -49974 -19951 24147
5963 24147 37257 -2866 -77175 -171803 -240540 -236990 -152704 -42147 32325 53392 21697 -37245
5951 -37245 -110500 -164974 -146968 -59758 54983 164451 241868 255071 206786 153499 132894
5940 132894 125000 101478 53702 -29134 -127170 -189802 -195922 -141778 -33361 87218 147717 120606
5928 120606 39737 -46365 -102690 -141227 -174395 -177747 -147771 -114260 -101822 -130779 -207032 -300707
5916 -300707 -367352 -387833 -391799 -403074 -407772 -382926 -335031 -291483 -295080 -349540 -398831 -411905
$$ packed form
5999B05362p4478l5541M512M8195Q7160R8541N4408J3286O435K1876N0402O9002
5987E49160M5739L4399N4235M3815k9853j36065j83211j52213j11381o5468j1830
5976C7327R040j7206m0688k9376o012R434J6990k390k7813j1974J2694L0023M4098
5963B4147J3110m0123p4309r4628o8737L550Q4286J10557P4472K1067l1695n8942
5951c7245p3255n4474J8006Q7210J14741J09468P7417J3203m8285n3287k0605
5940A32894p894k3522m7776q2836r8036o2632o120N4144J08417J20579O0499k7111
5928A20606q0869q6102n6325l8537l3168l352K9976L3511J2438k8957p6253r3675
5916c00707o6645k0481l966j1275m698K4846M7895M3548l597n4460m9291j3074
$$ plain form
5904 -411905 -405208 -389515 -378750 -371627 -344221 -292336 -249441 -254681 -296327 -324319 -318530 -293439
5892 -293439 -267998 -249182 -256519 -293266 -332336 -375046 -427393 -462692 -461411 -450592 -472804 -483134
5880 -483134 -414347 -281018 -148561 -61188 -9324 36964 77265 112858 162150 220494 298119
5869 298119 407553 498890 515148 479419 439202 420868 449257 512416 557507 531042 445928
5858 445928 354858 278377 213597 157385 105752 65282 51667 74987 128113 188611 221671 211070
5846 211070 163746 105312 64102 43415 42485 58339 59780 39606 32518 29878 -4926 -78978 -160405
5833 -160405 -201071 -174578 -90205 19757 101764 139462 153223 147183 129589 118613 119104 127600
5821 127600 145647 175317 182162 140831 76574 13707 -52206 -120312 -167759 -190971 -206077 -209048
$$ packed form
5904d11905O697J5693J0765P123K7406N1885M2895n240m1646k7992N789K5091
5892b93439K5441J8816p337l6747l9070m2710n2347l5299J281J0819k2212j0330
5880d83134O8787J33329J32457Q7373N1864M6288M0301L5593M9292N8344P7625
5869B98119J09434R1337J6258l5729m0217j8334K8389O3159M5091k6465q5114
5858D45928r1070p6481o4780n6212n1633m0470j3615K3320N3126O0498L3060j0601
5846B11070m7324n8434m1210k0687r30J5854J441k0174p088k640l4804p4052q1427
5833a60405m0666K6493Q4373J09962Q2007L7698J3761o040j7594j0976M91Q496
5821A27600J8047K9670O845m1331o4257o2867o5913o8106m7447k3212j5106k971
$$ plain form
5809 -209048 -171567 -63091 110391 267989 328788 280529 156293 10906 -98791 -159111
5799 -159111 -182348 -173860 -154508 -109068 -13579 79321 97413 37860 -34867 -86060 -126101 -164924
5787 -164924 -180786 -134299 -19616 103761 172450 177730 127017 59005 19462 14397 22117 13387
5775 13387 -19262 -44307 -54050 -67826 -99162 -144818 -180139 -171727 -123959 -96001 -98348 -86538
5763 -86538 -71515 -86772 -100614 -75760 -17068 47186 101551 133837 143218 142658 110177 26201
5751 26201 -82505 -183819 -261088 -285815 -246146 -155706 -13004 172303 353873 485785 550513
5740 550513 567916 562469 530890 445295 298307 109097 -83939 -228392 -314795 -374190 -423233
5729 -423233 -441301 -398477 -328427 -277595 -246468 -216508 -192567 -184350 -216026 -283851 -338805 -363935
$$ packed form
5809b09048L7481J08476J73482J57598O0799m8259j24236j45387j09697o0320
5799a59111k3237Q488J9352M5440R5489R2900J8092n9553p2727n1193m0041l8823
5787a64924j5862M6487J14683J23377O8689N280n0713o8012l9543n065P720q730
5775A3387l2649k5045r743j3776l1336m5656l5321Q412M7768K7958k347J1810
5763h6538J5023j5257j3842K4854N8692O4254N4365L2286R381n60l2481q3976
5751B6201j08706j01314p7269k4727L9669R0440J42702J85307J81570J31912O4728
5740E50513J7403n447l1579q5595j46988j89210j93036j44453q6403n9395m9043
5729d23233j8068M2824P0050N0832L1127K9960K3941Q217l1676o7825n4954k5130
$$ plain form
5717 -363935 -362579 -324067 -249883 -151501 -54211 -18064 -63522 -117149 -112869 -57296 2300 18864
5705 18864 -13872 -70563 -140455 -205925 -226591 -169203 -40637 84804 127420 80835 2436
5694 2436 -56699 -89565 -106831 -130133 -185118 -269690 -340226 -363377 -332925 -259047 -171206 -101841
5682 -101841 -73740 -67223 -54577 -46588 -54110 -70691 -89683 -88392 -67080 -53223 -38105 -788
5670 -788 37606 40189 -1766 -51939 -61314 -30013 21390 88833 160414 200095 183175 117080 29939
5657 29939 -60973 -142686 -188668 -208056 -245309 -311249 -379568 -419694 -389901 -272311 -109915
5646 -109915 35808 154982 234674 235444 158017 38526 -79277 -152505 -141589 -39295 113762
5635 113762 265183 379990 441915 439417 396739 328417 233851 150880 107590 111333 152537 196769
$$ packed form
5717c63935J356L8512P4184R8382R7290L6147m5458n3627M280N5573N9596J6564
5705A8864l2736n6691o9892o5470k0666N7388J28566J25441M2616m6585p8399
5694B436n9135l2866j7266k3302n4985q4572p0536k3151L0452P3878Q7841O9365
5682a01841K8101O517J2646P989p522j6581j8992J291K1312J3857J5118L7317
5670g88L8394K583m1955n0173r375L1301N1403O7443P1581L9681j6920o6095q7141
5657B9939r0912q1713m5982j9388l7253o5940o8319m0126K9793J17590J62396
5646a09915J45723J19174P9692P70p7427j19491j17803p3228J0916J02294J53057
5635A13762J51421J14807O1925k498m2678o8322r4566q2971m3290L743M1204M4232
$$ plain form
5623 196769 230262 270296 331987 399848 421504 347206 208816 68525 -39443 -95582 -123514
5612 -123514 -149884 -169897 -172961 -173137 -214054 -311450 -391274 -398266 -349843 -284564 -238209 -207063
5600 -207063 -167619 -103823 -42264 -29663 -64133 -103602 -119957 -109138 -81506 -54634 -66085 -100068
5588 -100068 -94281 -55569 -40352 -74291 -146125 -215970 -250177 -267886 -273669 -254385 -232211 -234844
5576 -234844 -217528 -136813 -38059 23977 36211 9156 -17761 -19721 -14221 -14341 -22423 -44851 -85633
5563 -85633 -118809 -115692 -79693 -46625 -41578 -28919 8527 27784 -8885 -82819 -151455 -184144
5551 -184144 -181310 -155860 -116126 -107835 -161222 -225046 -263324 -295450 -322465 -338612 -347461 -341232
5539 -341232 -329699 -321799 -310153 -299715 -303769 -319402 -339680 -382716 -445965 -493987 -496569 -494832
$$ packed form
5623A96769L3493M0034O1691O7861K1656p4298j38390j40291j07968n6139k7932
5612a23514k6370k0013l064j76m0917r7396p9824o992M8423O5279M6355L1146
5600b07063L9444O3796O1559J2601l4470l9469j6355J0819K7632K6872j1451l3983
5588a00068N787L8712J5217l3939p1834o9845l4207j7709n783J9284K2174k633
5576b34844J7316Q0715R8754O2036J2234k7055k6917j960N500j20q082k2428m0782
5563h5633l3176L117L5999L3068N047J2659L7446J9257l6669p3934o8636l2689
5551a84144K834K5450L9734Q291n3387o3824l8278l2126k7015j6147q849O229
5539c41232J1533P900J1646J0438m054j5633k0278m3036o3249m8022k582J737
$$ plain form
5527 -494832 -523874 -557633 -562483 -509191 -403695 -278464 -173571 -90143 -24849 -11114 -43435
5516 -43435 -89886 -134231 -162600 -160296 -127214 -86790 -61488 -53358 -44041 -18711 769 -8693 -23841
5503 -23841 13745 131473 286903 401246 436401 390570 285723 173417 101890 89952 128670
5492 128670 192660 242189 238204 193463 170120 198373 241543 278110 308682 320089 296365 244145
5480 244145 195865 166653 142343 128156 142612 199306 279396 329829 320495 253964 179157 149239
5468 149239 148955 152921 158397 145507 102000 64118 67707 113885 171221 207586 222515 222695 184612
5455 184612 90339 -7299 -59789 -64460 -30369 22996 67848 85295 68294 49797 65870 88165
5443 88165 63533 -35186 -195526 -357642 -457169 -491095 -489778 -435606 -302150 -101489 103950
$$ packed form
5527d94832k9042l3759m850N3292J05496J25231J04893Q3428O5294J3735l2321
5516d3435m6451m4345k8369K304L3082M0424K5302Q130R317K5330J9480r462j5148
5503b3841L7586J17728J55430J14343L5155m5831j04847j12306p1527j1938L8718
5492A28670O3990M9529l985m4741k3343K8253M3170L6567L0572J1407k3724n2220
5480B44145m8280k9212k4310j4187J4456N6694Q0090N0433r334o6531p4807k9918
5468A49239k84L966N476j2890m3507l7882L589M6178N7336L6365J4929J80l8083
5455A84612r4273r7638n2490m671L4091N3365M4852J7447j7001j8497J6073K2295
5443H8165k4632r8719j60340j62116r9527l3926J317N4172J33456K00661K05439
$$ plain form
5432 103950 235207 268106 235942 166093 82589 7769 -61081 -143128 -219267 -253505 -248172 -233962
5420 -233962 -230250 -217786 -183187 -126060 -59462 -29634 -54006 -100000 -157500 -237375 -316955 -360208
5408 -360208 -360295 -318944 -268295 -256463 -266379 -261009 -230423 -165437 -91882 -74181 -138690 -241482
5396 -241482 -315348 -326878 -267471 -157078 -35748 49622 49365 -33882 -139989 -213384 -242705
5385 -242705 -245423 -225568 -169479 -58120 71643 145167 165566 186855 207907 203723 178706 139790
5373 139790 88842 29408 -30050 -72623 -80484 -52061 22052 135001 235638 305146 346866
5362 346866 346870 326270 312863 296047 277951 292893 337365 367791 349110 276444 165003 25585
5350 25585 -114686 -207276 -231308 -198877 -125767 -39309 13952 6259 -25244 -28791 3968 35155
$$ packed form
5432A03950J31257L2899l2164o9849q3504p4820o8850q2047p6139l4238N333J4210
5420b33962L712J2464L4599N7127O6598K9828k4372m5994n7500p9875p9580m3253
5408c60208q7M1351N0649J1832r916N370L0586O4986P3555J7701o4509j02792
5396b41482p3866j1530N9407J10393J21330Q5370k57q3247j06107p3395k9321
5385b42705k718J9855N6089J11359J29763P3524K0399K1289K1052m184k5017l8916
5373A39790n0948n9434n9458m2573p861K8423P4113J12949J00637O9508M1720
5362C46866Mk0600j3407j6816j8096J4942M4472L0426j8681p2666j11441j39418
5350B5585j40271r2590k4032L2431P3110Q6458N3261p693l1503l547L2759L1187
$$ plain form
5338 35155 42106 55547 89435 123010 129814 74256 -24214 -114279 -193180 -261200 -316991 -365408
5326 -365408 -410233 -452378 -486761 -502762 -498791 -490476 -483157 -470934 -456674 -438912 -417838 -404873
5314 -404873 -420491 -454125 -453796 -394577 -295083 -184518 -99483 -56770 -41792 -30197 -12559 -17468
5302 -17468 -44977 -52923 -17786 45095 80481 75114 64526 54122 16812 -46585 -110944 -167957
5290 -167957 -210005 -220666 -205289 -161825 -71590 22540 65128 51369 21022 -228 -2016 16218
5278 16218 21469 4760 -3653 -175 -13384 -23053 -7497 30228 80131 135644 171646 177845 196450
5265 196450 264936 360121 398422 355195 278542 193861 102308 28830 -2329 17024 65366 101755
5253 101755 85892 -7246 -156451 -289166 -336068 -282287 -149764 -4484 92517 166238 266899
$$ packed form
5338C5155O951J3441L3888L3575O804n5558r8470r0065p8901o8020n5791m8417
5326c65408m4825m2145l4383j6001L971Q315P319J2223J4260J7762K1074J2965
5314d04873j5618l3634L29N9219R9494J10565Q5035M2713J4978J1595J7638m909
5302a7468k7509p946L5137O2881L5386n367j0588j0404l7310o3397o4359n7013
5290a67957m2048j0661J5377M3464R0235R4130M2588j3759l0347k1250j788J8234
5278A6218N251j6709q413L478j3209r669J5556L7725M9903N5513L6002O199J8605
5265A96450O8486R5185L8301m3227p6653q4681r1553p3478l1159J9353M8342L6389
5253A01755j5863r3138j49205j32715m6902N3781J32523J45280R7001P3721J00661
$$ plain form
5242 266899 369989 434970 471718 502380 530215 552871 557465 528180 501414 505852 509537 483619
5230 483619 440154 392742 315672 189607 58894 -10652 -20968 10464 86873 170630 195125
5219 195125 143282 79705 58831 70694 84101 108310 140505 137673 122283 145584 185665 207094
5207 207094 195096 137015 74534 73672 147584 227627 263642 264413 231497 187186 151213 133163
5195 133163 137155 139196 132908 141561 158886 158563 131462 103742 90678 88701 94682 104088 105273 82556
5181 82556 42034 -3261 -34844 -35971 -26081 -29905 -58401 -108764 -157756 -159387 -117486 -81582 -65481
5168 -65481 -54369 -32308 -9483 5858 38266 91611 142970 173641 186185 203663 208914 184702
5156 184702 147621 109826 69722 38446 25403 34770 87711 182269 269301 294544 262373 207152
$$ packed form
5242B66899J03090O4981L6748L0662K7835K2656M594k9285k6766M438L685k5918
5230D83619m3465m7412p7070j26065j30713o9546j0316L1432P6409Q3757K4495
5219A95125n1843o3577k0874J1863J3407K4209L2195k832j5390K3301M0081K1429
5207B07094j1998n8081o2481q62P3912Q0043L6015P71l2916m4311l5973j8050
5195A33163L992K041o288Q653J7325l23k7101k7720j3064j977N981R406J185k2717
5181H2556m0522m5295l1583j127R890l824k8496n0363m8992j631M1901L5904J6101
5168f5481J1112K2061K2825J5341L2408N3345N1359L0671J2544J7478N251k4212
5156A84702l7081l7795m0104l1276j3043R367N2941R4558Q7032K5243l2171n5221
$$ plain form
5144 207152 142231 82868 53802 43857 30687 16413 24960 54037 50972 5800 -22605 -1843
5132 -1843 42909 82189 83451 46155 22563 42437 80751 77821 33516 15661 38253 72314
5120 72314 100180 117410 134584 155498 167071 150231 106419 67754 37079 -7230 -81351 -164789
5108 -164789 -225201 -254262 -241772 -179402 -86793 12864 87709 118990 106047 51004 -31625 -130164
5096 -130164 -211923 -246104 -255471 -257945 -245812 -221709 -192059 -147061 -89932 -64121 -77488 -72453
5084 -72453 -31369 11026 41316 58913 74073 111336 156741 157103 103467 27703 -57767 -127586
5072 -127586 -130808 -63927 21860 94618 171909 266110 338244 371416 375713 375093 405853 467986
5060 467986 522796 534676 508834 475199 430672 350851 274127 258342 261732 199618 81395 -13221
$$ packed form
5144B07152o4921n9363k9066r945j3170j4274Q547K9077l065m5172k8405K0762
5132a843M4752L9280J262l7296k3592J9874L8314k930m4305j7855K2592L4061
5120G2314K7866J7230J7174K0914J1573j6840m3812l8665l0675m4309p4121q3438
5108a64789o0412k9061J2490O2370R2609R9657P4845L1281j2943n5043q2629r8539
5096a30164q1759l4181r367k474J2133K4103K9650M4998N7129K5811j3367N035
5084g2453M1084M2395L0290J7597J5160L7263M5405L62n3636p5764q5470o9819
5072a27586l222O6881Q5787P2758P7291R4201P2134L3172M297o20L0760O2133
5060D67986N4810J1880k5842l3635m4527p9821p6724j5785L390o2114j18223r4616
$$ plain form
5048 -13221 -53128 -63428 -67196 -58598 -23478 7048 13430 17193 52354 126940 209304 260209 276552
5035 276552 262629 217628 149763 53635 -77919 -191002 -258693 -289399 -274188 -217274 -138260
5024 -138260 -72611 -50163 -67449 -116781 -183173 -227260 -218511 -179986 -153909 -139389 -152149 -211206
5012 -211206 -287160 -366040 -426816 -405612 -289834 -177731 -166548 -222063 -244039 -200256 -130498
5001 -130498 -68452 -27920 -20018 -54446 -110485 -136300 -89533 -2677 48338 45093 31471 30879
4989 30879 16257 -18565 -42994 -35069 7300 63603 115110 145654 157855 154889 132499 112278
4977 112278 100173 76644 60983 71175 115200 205729 302503 349810 338841 291309 243351 229921
4965 229921 251080 277729 288288 295395 310570 346978 391250 405262 376184 317272 268851 248104
$$ packed form
5048a3221l9907j0300l768Q598L5120L0526O382L763L5161P4586Q2364N0905J6343
5035B76552j3923m5001o7865r6128j31554j13083o7691l0706J5211N6914P9014
5024a38260O5649K2448j7286m9332o6392m4087Q749L8525K6077J4520j2760n9057
5012b11206p5954p8880o0776K1204J15778J12103J1183n5515k1976M3783O9758
5001a30498O2046M0532P902l4428n6039k5815M6767Q6856N1015l245j3622n92
4989C0879j4622l4822k4429P925M2369N6303N1507L0544J2201k966k2390k0221
4977A12278j2105k3529j5661J0192M4025R0529R6774M7307j0969m7532m7958j3430
4965B29921K1159K6649J0559P107J5175L6408M4272J4012k9078n8912m8421k0747
$$ plain form
4953 248104 238740 229373 187485 96908 -29601 -176691 -292587 -344254 -358383 -368327 -380152 -377776
4941 -377776 -364061 -356242 -351987 -322319 -240641 -137060 -59859 -26025 -20302 -33097 -55937 -72291
4929 -72291 -43778 50822 156736 209727 211346 206346 218621 230471 208798 149476 93120 82436
4917 82436 103734 107753 71662 7187 -72238 -162149 -240243 -282694 -308294 -342704 -376193 -381971
4905 -381971 -355877 -303176 -237461 -178398 -130400 -109011 -104324 -73868 -17156 29680 53985 83213
4893 83213 124367 155201 146529 99244 59077 26764 -19417 -60197 -99814 -175078 -271266 -326461
4881 -326461 -332503 -317055 -272326 -185382 -99128 -69565 -97102 -132432 -155113 -193625 -251637 -265571
4869 -265571 -189444 -54032 78708 140192 101430 15688 -36666 -34853 -26522 -42708 -52796 -35821
$$ packed form
4953B48104r364r367m1888r0577j26509j47090j15896n1667j4129r944j1825K376
4941c77776J3715P819M255K9668Q1678J03581P7201L3834N723j2795k2840j6354
4929g2291K8513R4600J05914N2991J619n000J2275J1850k1673n9322n6356j0684
4917H2436K1298M019l6091o4475p9425q9911p8094m2451k5600l4410l3489n778
4905c81971K6094N2701O5715N9063M7998K1389M687L0456N6712M6836K4305K9228
4893H3213M1154L0834q672m7285m0167l2313m6181m0780l9617p5264r6188n5195
4881c26461o042J5448M4729Q6944Q6254K9563k7537l5330k2681l8512n8012j3934
4869b65571P6127J35412J32740O1484l8762q5742n2354J813Q331j6186j0088J6975
$$ plain form
4857 -35821 -21368 -40464 -75003 -90289 -79019 -49672 -15864 -11762 -57826 -141226 -231654 -294294
4845 -294294 -307243 -277330 -236434 -197648 -153132 -87204 -4646 48736 47970 33696 43814 56430
4833 56430 42699 19693 17284 19985 4784 -17329 -30262 -33949 -38372 -60481 -107211 -193987 -304866
4820 -304866 -373772 -379444 -361989 -330019 -286244 -266591 -269139 -256658 -229016 -206043 -175755 -134421
4808 -134421 -87960 -52663 -66597 -122716 -182556 -219764 -235895 -253806 -297188 -354659 -393504 -406482
4796 -406482 -389587 -362252 -355478 -340033 -284662 -216351 -174778 -159417 -135599 -94832 -63284 -48346
4784 -48346 -54006 -82766 -126163 -150346 -148293 -163486 -220468 -286519 -291340 -209990 -85515 8159
4772 8159 44123 48736 42158 24435 16131 33808 61552 95946 130138 130636 86610 15698 -68732
$$ packed form
4857c5821J4453j9096l4539j5286J1270K9347L3808M102m6064q3400r0428o2640
4845b94294j2949K9913M0896L8786M4516O5928Q2558N3382p66j4274J0118J2616
4833E6430j3731k3006k409K701j5201k2113j2933l687m423k2109m6730q6776j10879
4820c04866o8906n672J7455L1970M3775J9653k548J2481K7642K2973L0288M1334
4808a34421M6461L5297j3934n6119n9840l7208j6131j7911m3382n7471l8845j2978
4796d06482J6895K7335O774J5445N5371O8311M1573J5361K3818M0767L1548J4938
4784d8346n660k8760m3397k4183K053j5193n6982o6051m821Q1350J24475R3674
4772H159L5964M613o578j7723q304J7677K7744L4394L4192M98m4026p0912q4430
$$ plain form
4759 -68732 -161956 -237270 -257682 -221680 -180265 -197038 -282006 -388830 -453553 -458184 -438626 -401797
4747 -401797 -319250 -212876 -118769 -34300 49247 125100 175342 202207 207633 187145 134549 60980
4735 60980 -8152 -77996 -162316 -265563 -351959 -354938 -268374 -169735 -109516 -71415 -38868 4436
4723 4436 51413 57624 3191 -74657 -143837 -188105 -178586 -125024 -74869 -41787 -13606 -5394 -20912
4710 -20912 -35590 -45663 -57029 -52624 -23797 507 -4311 -34045 -43132 -6869 26130 16054
4698 16054 6264 71829 218346 352422 397937 387792 388814 414609 444980 479531 522370 563024
4686 563024 574975 549100 513250 504504 523926 532137 507729 468307 428478 389300 346164 306313
4674 306313 273119 189903 31518 -139948 -259157 -315623 -326325 -305145 -267474 -229121 -178478
$$ packed form
4759f8732r3224p5314k0412L6002M1415j6773q4968j06824o4723m631J9558L6829
4747d01797Q2547J06374R4107Q4469Q3547P5853N0242K6865N426k0488n2596p3569
4735F0980o9132o9844q4320j03247q6396k979Q6564R8639O0219L8101L2547M3304
4723D436M6977O211n4433p7848o9180m4268R519N3562N0155L3082K8181Q212j5518
4710b0912j4678j0073j1366M405K8827K4304m818k9734r087L6263L2999j0076
4698A6054r790O5565J46517J34076M5515j0145J022K5795L0371L4551M2839M0654
4686E63024J1951k5875l5850q746J9422Q211k4408l9422l9829l9178m3136l9851
4674C06313l3194q3216j58385j71466j19209n6466j0702K1180L7671L8353N0643
$$ plain form
4663 -178478 -121008 -74326 -50422 -65439 -101423 -141178 -178599 -193438 -183990 -172986 -164432 -150154
4651 -150154 -141656 -142147 -131455 -83219 -3960 67705 122633 151587 129611 76514 46068 53267
4639 53267 63422 42401 -5044 -48102 -82577 -113876 -118223 -89079 -68586 -87381 -119503 -148902
4627 -148902 -204262 -309601 -423873 -493411 -507649 -501055 -509078 -523798 -525485 -509135 -481746 -443746
4615 -443746 -366649 -243183 -121540 -27969 34893 71058 92265 82698 45009 26792 37340
4604 37340 63975 122718 210134 288969 330800 335746 307524 241661 166525 124346 118639 149583
4592 149583 211705 262203 265382 208684 96656 -30797 -122115 -160477 -142480 -104711 -123023
4581 -123023 -213575 -336218 -440784 -506674 -552561 -568825 -522584 -418388 -295194 -178148 -57373
$$ packed form
4663a78478N7470M6682K3904j5017l5984l9755l7421j4839R448J1004Q554J4278
4651a50154Q498m91J0692M8236P9259P1665N4928K8954k1976n3097l0446P199
4639E3267J0155k1021m7445m3058l4475l1299m347K9144K0493j8795l2122k9399
4627a48902n5360j05339j14272o9538j4238O594q023j4720j687J6350K7389L8000
4615d43746P7097J23466J21643R3571O2862L6165K1207r567l7689j8217J0548
4604C7340K6635N8743Q7416P8835M1831M946k8222o5863p5136m2179n707L0944
4592A49583O2122N0498L179n6698j12028j27453r1318l8362J7997L7769j8312
4581a23023r0552j22643j04566o5890m5887j6264M6241J04196J23194J17046J20775
$$ plain form
4570 -57373 59018 144597 197414 201588 139326 13877 -139798 -250425 -272086 -233545 -191476
4559 -191476 -157870 -150474 -208150 -294703 -348173 -348878 -308553 -268458 -256962 -280862 -318089 -346713
$$ packed form
4570e7373J16391Q5579N2817M174o2262j25449j53675j10627k1661L8541M2069
4559a91476L3606P396n7676q6553n3470p05M0325M0095J1496k3900l7227k8624
$$ [...]
##END NTUPLES=NMR SPECTRUM
##END=
