##TITLE=C13_LR-0138-Cl-EtOAc
 CD3CN, 23200 sc

 21.3.2023
##JCAMPDX= 6.0         $$ Bruker NMR JCAMP-DX V2.0
##DATA TYPE= NMR SPECTRUM
##DATA CLASS= NTUPLES
##ORIGIN= UXNMR, Bruker Analytische Messtechnik GmbH
##OWNER= root
$$ XWIN-NMR		Version 3.5
$$ Wed Mar 22 13:39:31 2023 Russian Standard Time (UT+4h)  she@DPX200
##.OBSERVE FREQUENCY= 50.327896
##.OBSERVE NUCLEUS= ^13C
##.ACQUISITION MODE= SIMULTANEOUS
##.ACQUISITION SCHEME= undefined
##.AVERAGES= 23201
##.DIGITISER RES= 17
##SPECTROMETER/DATA SYSTEM= spect
##.PULSE SEQUENCE= zgpg30
##.SOLVENT NAME= CDCl3
##.SHIFT REFERENCE= (INTERNAL, CDCl3, 0, 222.624)
##AUDIT TRAIL= $$ (NUMBER, WHEN, WHO, WHERE, WHAT)
$$ ##TITLE= Audit trail, XWIN-NMR		Version 3.5
$$ ##JCAMPDX= 5.01
$$ ##ORIGIN= Bruker BioSpin GmbH
$$ ##OWNER= she
$$ F:/spectra/data/she/nmr/c13/1/pdata/1/auditp.txt
$$ ##AUDIT TRAIL=  $$ (NUMBER, WHEN, WHO, WHERE, WHAT)
(   1,<2023-03-22 13:37:08.96 +0400>,<she>,<DPX200>,
      <created by zg, POWCHK disabled, PULCHK disabled
       terminated by command 'halt'
       configuration hash MD5:
       00 E9 B6 7A A2 85 ED C7 34 08 36 98 17 FE 4E 26
       data hash MD5: 32K
       94 EA 58 C5 FC 6A A9 46 5F 0C 18 0E 9B 95 77 48>)
(   2,<2023-03-22 13:37:13.07 +0400>,<she>,<DPX200>,
      <Start of raw data processing
       efp BC_mod = 2 LB = 2 FT_mod = 6 PKNL = 1 PHC0 = -323.3801 PHC1 = 33.01809 SI = 32K 
       data hash MD5: 32K
       DC 0D 30 D6 F8 D7 EF AA 59 AB A5 DE 3B 2F FC 1B>)
(   3,<2023-03-22 13:37:16.26 +0400>,<she>,<DPX200>,
      <abs ABSG = 5 
       data hash MD5: 32K
       D5 EC 4A D5 D7 35 04 EB A4 4D 05 16 DB 50 F5 04>)
(   4,<2023-03-22 13:38:03.14 +0400>,<she>,<DPX200>,
      <pk PHC0 = 7.151918 PHC1 = -7.199999 
       data hash MD5: 32K
       21 F5 F8 40 43 B0 D1 EE 33 5C 4A DB 5F C8 F7 40>)
(   5,<2023-03-22 13:38:06.54 +0400>,<she>,<DPX200>,
      <abs ABSG = 5 
       data hash MD5: 32K
       10 F1 39 43 63 8D B3 3F A5 E3 5A 68 BC 23 3D 39>)
$$ ##END=
$$ 
$$ hash MD5
$$ AB B3 8E CF 00 4B 31 CA B9 C7 76 56 6E 63 9A C1
##$RELAX= 
##$RELAX= 
##$RELAX= 
##$RELAX= 
##$RELAX= 
##$RELAX= 
##$RELAX= 
##$RELAX= 
$$ Bruker specific parameters
$$ --------------------------
##$DU= <F:/spectra>
##$EXPNO= 1
##$NAME= <c13>
##$PROCNO= 1
##$TYPE= <nmr>
##$USER= <she>
##$AMP= (0..31)
100 100 100 100 100 100 100 100 100 100 100 100 100 100 100 100 100 100 
100 100 100 100 100 100 100 100 100 100 100 100 100 100 
##$AQSEQ= 0
##$AQ_mod= 1
##$AUNM= <au_zg>
##$AUTOPOS= <>
##$BF1= 50.322709
##$BF2= 200.13
##$BF3= 50.322709
##$BF4= 500.13
##$BF5= 500.13
##$BF6= 500.13
##$BF7= 500.13
##$BF8= 500.13
##$BYTORDA= 1
##$CFDGTYP= 0
##$CFRGTYP= 5
##$CHEMSTR= <none>
##$CNST= (0..31)
1 1 145 1 1 1 1 1 1 1 1 1 1 1 1 1 1 1 1 1 1 1 1 1 1 1 1 1 1 1 1 1 
##$CPDPRG= <waltz16>
##$CPDPRG1= <>
##$CPDPRG2= <waltz16>
##$CPDPRG3= <>
##$CPDPRG4= <mlev>
##$CPDPRG5= <mlev>
##$CPDPRG6= <mlev>
##$CPDPRG7= <mlev>
##$CPDPRG8= <mlev>
##$CPDPRGB= <>
##$CPDPRGT= <>
##$D= (0..31)
$$ [...]
##$SUBNAM4= <"">
##$SUBNAM5= <"">
##$SUBNAM6= <"">
##$SUBNAM7= <"">
##$SUBNAM8= <"">
##$SUBNAM9= <"">
##$SW= 239.972175391363
##$SWIBOX= (0..15)
0 1 3 0 0 0 0 0 0 0 0 0 0 0 0 0 
##$SW_h= 12077.2946859903
##$TD= 32768
##$TD0= 1
##$TE= 0
##$TE2= 300
##$TE3= 300
##$TEG= 300
##$TL= (0..7)
120 120 120 120 120 120 120 120 
##$TP= (0..7)
150 150 150 150 150 150 150 150 
##$TP07= 0
##$TPNAME0= <>
##$TPNAME1= <>
##$TPNAME2= <>
##$TPNAME3= <>
##$TPNAME4= <>
##$TPNAME5= <>
##$TPNAME6= <>
##$TPNAME7= <>
##$TPOAL= (0..7)
0.5 0.5 0.5 0.5 0.5 0.5 0.5 0.5 
##$TPOFFS= (0..7)
0 0 0 0 0 0 0 0 
##$TUNHIN= 0
##$TUNHOUT= 0
##$TUNXOUT= 0
##$USERA1= <user>
##$USERA2= <user>
##$USERA3= <user>
##$USERA4= <user>
##$USERA5= <user>
##$V9= 5
##$VALIST= <valist>
##$VCLIST= <CCCCCCCCCCCCCCC>
##$VD= 0
##$VDLIST= <DDDDDDDDDDDDDDD>
##$VPLIST= <PPPPPPPPPPPPPPP>
##$VTLIST= <TTTTTTTTTTTTTTT>
##$WBST= 1024
##$WBSW= 4
##$XGAIN= (0..3)
0 0 0 0 
##$XL= 0
##$YL= 0
##$YMAX_a= 131537614
##$YMIN_a= -63395252
##$ZGOPTNS= <>
##$ZL1= 120
##$ZL2= 120
##$ZL3= 120
##$ZL4= 120
##$ABSF1= 222.624
##$ABSF2= -17.3728
##$ABSG= 5
##$ABSL= 3
##$ALPHA= 0
##$AQORDER= 0
##$ASSFAC= 0
##$ASSFACI= 0
##$ASSFACX= 0
##$ASSWID= 0
##$AUNMP= <proc_1d>
##$AZFE= 0.1
##$AZFW= 0.5
##$BCFW= 0
##$BC_mod= 2
##$BYTORDP= 0
##$COROFFS= 0
##$CY= -3
##$DATMOD= 1
##$DC= 0
##$DFILT= <>
##$DTYPP= 0
##$F1P= 0
##$F2P= 0
##$FCOR= 0.5
##$FTSIZE= 32768
##$FT_mod= 6
##$GAMMA= 0
##$GB= 0
##$INTBC= 1
##$INTSCL= 4.134877e-10
##$ISEN= 128
##$LB= 2
##$LEV0= 0
##$LPBIN= 0
##$MAXI= 10000
##$MC2= 0
##$MEAN= 0
##$ME_mod= 0
##$MI= 0.1934396
##$NCOEF= 0
##$NC_proc= 3
##$NLEV= 6
##$NOISF1= 120.0001
##$NOISF2= 80.00006
##$NSP= 0
##$NTH_PI= 0
##$NZP= 0
##$OFFSET= 222.624
##$PC= 1.4
##$PHC0= -316.2282
##$PHC1= 25.81809
##$PH_mod= 1
##$PKNL= yes
##$PPARMOD= 0
##$PSCAL= 0
##$PSIGN= 0
##$REVERSE= no
##$SF= 50.3227315983092
##$SI= 32768
##$SIGF1= 140
##$SIGF2= 120
##$SINO= 11.81781
##$SIOLD= 32768
##$SREGLST= <13C.CDCl3>
##$SSB= 0
##$STSI= 32768
##$STSR= 0
##$SW_p= 12077.2946859903
##$SYMM= 0
##$S_DEV= 0
##$TDeff= 32768
##$TDoff= 0
##$TI= <>
##$TILT= no
##$TM1= 0
##$TM2= 0
##$TOPLEV= 0
##$USERP1= <user>
##$USERP2= <user>
##$USERP3= <user>
##$USERP4= <user>
##$USERP5= <user>
##$WDW= 1
##$XDIM= 32768
##$YMAX_p= 505100174
##$YMIN_p= -956874
$$ End of Bruker specific parameters
$$ ---------------------------------
##NTUPLES= NMR SPECTRUM
##VAR_NAME=  FREQUENCY,     SPECTRUM/REAL,   SPECTRUM/IMAG
##SYMBOL=    X,             R,               I
##VAR_TYPE=  INDEPENDENT,   DEPENDENT,       DEPENDENT
##VAR_FORM=  AFFN,          ASDF,            ASDF
##VAR_DIM=   32768,         32768,           32768
##UNITS=     HZ,            ARBITRARY UNITS, ARBITRARY UNITS
##FACTOR=    0.368581032318806, 1,           1
##FIRST=     11203.0474430531, 0,            0
##LAST=      -874.247242937185, 0,           0
##MIN=       -874.247242937185, -956874,     0
##MAX=       11203.0474430531, 505100174,    0
$$ Real data points
##PAGE= N=1
##DATA TABLE= (X++(R..R)), XYDATA
$$ [...]
21518A3421K7462k9887j02722j00047n2639l0183l5351l9426l4779k8024j8541
21507d30716k241L9965Q9097R6474P8233N6549M7561O8790Q6647O1762Q715l5464
21495A65372l6622L3460Q8084M3339n3505j26075j33540p4463q99J4507k7074
21484a07416o1622m8050j0427L0425M0124Q337p522J6202M5599N3579K9905p580
21472a8446l0320k4153K119K1377J9239K0202J5058k1305l5195l8245p5574q2960
21460b48203m7423p942L7376O7417O8563N9724M1133K1530K554l1805n6293m8627
21448a41996n624O8174J41151J39686N4702j3320k4640k0612j6973j6629k9036
21437A34883l1409j0462K1070N3670M1934k0626q3135j24086j42062j33158r4370
$$ plain form
21518 13421 40883 10996 -91726 -191773 -244412 -274595 -309946 -349372 -384151 -412175 -430716
21507 -430716 -432957 -392992 -303895 -207421 -129188 -72639 -25078 43712 130359 192121 200836 165372
21495 165372 128750 162210 250294 293633 240128 114053 -19487 -93950 -94849 -80342 -107416
21484 -107416 -169038 -217088 -227515 -197090 -156966 -148629 -156151 -139949 -94350 -40771 -10866 -18446
21472 -18446 -48766 -72919 -70800 -49423 -30184 -9982 5076 -16229 -51424 -89669 -165243 -248203
21460 -248203 -295626 -303568 -266192 -198775 -130212 -70488 -29355 -7825 -5271 -37076 -93369 -141996
21448 -141996 -147620 -79446 61705 201391 256093 242773 218133 197521 180548 163919 134883
21437 134883 103474 93012 114082 167752 209686 189060 105925 -18161 -160223 -293381 -387751
21426c87751k6267M3703P2612O6039N8376L8766J1679j0016k6926k2805k66J9540
21414a63316J3907L19k818k883L958K4528L8104j768p1578r9520n6299r337K854
21401c23849P068K6132M2571K6816M743K714R520J7601L3818M4270N6192O5813
21389A3409N3881L0649K6405K8951J7097J1757q191m6224l2627J7663K4031j5887
21377A20914m6809m1523m670L5520K3800j8046m2039n5997m5330j4628J0291K6063
21365e2454K9717L1302K5933P602j0562k4427l4364j3220M3182O3307J6097m9823
21353C2290q1277o6671m7980o5921r1050p7019k7986J7779N0022P1776R2913R7270
21341i5854N2009k0734q3569p8654k484M6401N0742M8956N9139Q1211R0059P7746
$$ plain form
21426 -387751 -414018 -370315 -297703 -231664 -173288 -134522 -122843 -132859 -159785 -182590 -182856 -163316
21414 -163316 -149409 -149090 -151908 -154791 -150833 -126305 -88201 -89969 -161547 -261067 -317366 -326703 -323849
21401 -323849 -316781 -290649 -248078 -221262 -216519 -213805 -204285 -186684 -152866 -108596 -52404 13409
21389 13409 67290 97939 124344 153295 170392 182149 173958 127734 95107 112770 136801 120914
21377 120914 74105 32582 27912 63432 87232 69186 27147 -28850 -74180 -88808 -78517 -52454
21365 -52454 -22737 8565 34498 42100 31538 7111 -27253 -40473 2709 66016 82113 32290
21353 32290 -48987 -115658 -163638 -229559 -320609 -397628 -425614 -407835 -357813 -286037 -193124 -95854
21341 -95854 -43845 -64579 -148148 -226802 -229286 -182885 -132143 -83187 -24048 57163 147222 224968
21329B24968O6012J6392o3964q1229m0192Q602M2515M7896L9186N4725P7009N7781
21317D49701l702m8292n7581l7286J5036L2248k541k4094k4340j8313J1372N2277
21305C44485O3570M1889K2956J2933o191m0182o6974l7032L4149R9411J18551
21294E87565P4849K9786L5486O4664Q9970J10071J04089N8653k524n7165q0861
21283A014583o5634m8943j7384K1679J4010j7741l1778k0681q00K3052L1413L757
21271I05533o3760j16883j15230r1954m3521M6822J18763J25353J37210J99494
21261A101827K10791J25441K6382l4407o4260o5514m8040k4419R461K5627K3823
21250A286712M5311Q1068J06207J38622J87075K19910J90304R7240m2157j69111
$$ plain form
21329 224968 290980 307372 243408 162179 121987 130589 173104 221000 260186 314911 391920 449701
21317 449701 445999 397707 340126 302840 317876 350124 347583 323489 299149 280836 292208 344485
21305 344485 408055 449944 472900 485833 479642 439460 372486 335454 369603 469014 587565
21294 587565 662414 692200 727686 792350 882320 992391 1096480 1155133 1152609 1095444 1014583
21283 1014583 948949 900006 882622 904301 918311 900570 868792 848111 847311 870363 901776 905533
21271 905533 841773 724890 609660 517706 474185 521007 639770 765123 902333 1101827
21261 1101827 1312618 1438059 1464441 1430034 1365774 1300260 1252220 1227801 1237262 1262889 1286712
21250 1286712 1332023 1413091 1519298 1657920 1844995 2064905 2255209 2352449 2310292 2141181
21240B141181k01599j47435n8378M137n689l9477m5486n511O4110J13990J18771
21229A938614R3850K8049m2594l4336N5598J69516K75724L42245L41605L39371
21219C507642M05639N27060O56999P96931R99769J326346J795547K386897L087495
21210A5490325L833718M347677L921770J734970j533458l766225m238167l747024
21202A6043586k993086k308608j760692j315982r68224p22945n71367m63041l62935
21193D576706k84333k54662k74627l18733l58762l43375k67652k08238j78709
21184B087615j42163j27018j26596j24546j29517j48805j66117j48722j03003
21175H71128n1587r711p445k9827m0997k2628l315k0326n2480n5280j3666J6447
$$ plain form
21240 2141181 1939582 1792147 1733769 1737906 1732217 1692740 1647254 1641743 1705853 1819843 1938614
21229 1938614 2032464 2060513 2017919 1983583 2039181 2208697 2484421 2826666 3168271 3507642
21219 3507642 3913281 4440341 5097340 5894271 6894040 8220386 10015933 12402830 15490325
21210 15490325 19324043 23671720 27593490 29328460 27795002 24028777 19790610 16043586
21202 16043586 13050500 10741892 8981200 7665218 6696994 5974049 5402682 4939641 4576706
21193 4576706 4292373 4037711 3763084 3444351 3085589 2742214 2474562 2266324 2087615
21184 2087615 1945452 1818434 1691838 1567292 1437775 1288970 1122853 974131 871128
21175 871128 819541 809830 802385 772558 731561 708933 705618 685292 632812 577532 563866 580313
21163E80313l661l3996n5689q5693j09886r5645n3684j7767M728J2616j886j4550
21151A25200j6422k093L4178N5842L6407L1634N4160N3046L9887K9593j439l6724
21139D03269m1899n2687p3505o7061m3866k4628o488K8514Q7231J20001R4408
21128D23289M5242j7061p1727q3970o3746l2971j0311J6283M9006M5173J898n7167
21116B43938j10465j12304p0993l4485j7582k2219j6667K6752P5837R6407J02233
21105A60452J21118J28110P3970l3039r5328p5945l6922j6264J1347K5629p437
21094B55691k7505j2229k373K5368P0283P7690N1244J982n2839q5593o9436j9787
21082B12496L1041M6125L5378L0188K7429K3908j6517p9148j10445j00185o0459
$$ plain form
21163 580313 576652 542656 486967 401274 291388 195743 142059 124292 129020 141636 139750 125200
21151 125200 108778 106685 140863 196705 233112 264746 318906 371952 411839 441432 439993 403269
21139 403269 361370 308683 235178 168117 124251 99623 93135 121649 208880 328881 423289
21128 423289 468531 451470 379743 295773 232027 199056 188745 205028 254034 299207 301105 243938
21116 243938 133473 21169 -49824 -84309 -101891 -124110 -140777 -114025 -38188 58219 160452
21105 160452 281570 409680 483650 450611 355283 279338 242416 226152 237499 263128 255691
21094 255691 228186 215957 213584 238952 309235 386925 438169 440151 387312 301719 232283 212496
21082 212496 243537 289662 325040 355228 382657 406565 390048 310900 200455 100270 39811
21071C9811k9659j3534J6919M4688N5945N0969J7950j7459l1346k5149j2202q441
21059H8492p615K1423N1047M4493J1089l2136o1268n8067l7896k2075m3071p9490
21047a25074p8624n4700l2548j0546p28j3188k6300k4855m647M1536O4024M8209
21035b17441J7378O694M4427Q7673R0163M1710j4355l8149l6565k2446k5072m1114
21023a07097j7160L1209N5617O9576Q7089J21255J38648Q2961j1255q8775j27247
21012B34821j08679l9159K2077O0323O4658O753o7649j05336j01889o2263l5061
21001a31404n0059n1120m349N8858O8075M1360L5605L8616K6774n299l2071l1927
20989c6941r181j6092n6425q6441p4947k1320N0615Q4782O8225M5832P0609J21204
$$ plain form
21071 39811 10152 -3382 13537 58225 114170 165139 183089 165630 134284 109135 96933 88492
21059 88492 80877 102300 153347 197840 208929 176793 115525 57458 19562 -2513 -45584 -125074
21047 -125074 -203698 -258398 -290946 -301492 -302220 -315408 -341708 -366563 -371210 -329674 -265650 -217441
21035 -217441 -200063 -193369 -148942 -61269 28894 70604 56249 18100 -18465 -40911 -65983 -107097
21023 -107097 -124257 -93048 -37431 32145 119234 240489 379137 462098 450843 362068 234821
21012 234821 126142 86983 109060 169383 234041 240794 173145 67809 -34080 -96343 -131404
21001 -131404 -181463 -232583 -236932 -178074 -109999 -68639 -33034 5582 32356 27057 -5014 -36941
20989 -36941 -46122 -62214 -118639 -205080 -280027 -301347 -250732 -165950 -97725 -51893 18716 139920
20977A39920J29657J10729R2936P5252O6323Q6553R1839N9190M0149K8456k5345
20966H95659j05335j39821r6880r271N8008Q3059Q5835Q4052Q9417J10736J47986
20955A203445J71945J46489P4706Q274k2896o3578j33611j67542j53407j16642
20945I47183q5862r2339j02595q0756l2062J7016K5550M804j5241m5760r3363
20934D46575j16729q8062k0809M2626P0014M0402k9773r4430j27448j22719j05691
20923a06044m7478N0746Q9475O0527L1403K090j7746n854Q818K8187P1338J05999
20911B71461P1563m460n3545n9503m1444l3213j5788L667m595l2049n9998n9701
20899a7605m5727l6960n920K9770L5898J8827K4164O4602O5671M2420N7311Q6928
$$ plain form
20977 139920 269577 380306 473242 548494 614817 701370 793209 852399 892548 921004 895659
20966 895659 790324 650503 553623 544352 602360 685419 771254 855306 944723 1055459 1203445
20955 1203445 1375390 1521879 1596585 1604859 1581963 1518385 1384774 1217232 1063825 947183
20945 947183 861321 768982 666387 585631 553569 570585 596135 600939 585698 539938 446575
20934 446575 329846 241784 220975 263601 333615 374017 344244 249814 122366 -353 -106044
20923 -106044 -153522 -102776 -13301 47226 78629 80719 62973 57119 65937 94124 165462 271461
20911 271461 343024 338564 285019 225516 184072 150859 135071 138738 134143 102094 42096 -17605
20899 -17605 -63332 -100292 -106212 -76442 -40544 -21717 2447 67049 132720 175140 232451 319379
20887C19379J07793R5172M8026j8576q2778j21830j34451r4420j6399N0823P4902
20876B27641N3176L1273K2627k8564r6257r9418l6567J3829J6433Q112K1275M7074
20864A80634M8047J8094p884q918j2894l8025l2772J0955M4022M6514N475n2070
20852B01178q5347p4579l1531M260Q015m99m360l1594n3129l2959K747K4891M0208
20839c2699N0983M2068J876o0853j19654j27785n8558K8952N0283K9383N1796
20828a44208J07500J14288N8996j289k3528r882J3553K4598j643p643J3610P465
20816A51817l137Q084R268J6742K2950n986m3873n2355l9173k0634J0726L9558
20804I3987O5837Q1793O5765K4381j6076k4315M422K0644K590j6999k7187k8687
$$ plain form
20887 319379 427172 522344 570370 551794 469016 347186 212735 118315 101916 152739 227641
20876 227641 280817 312090 334717 306153 209896 110478 73911 87740 104173 112285 133560 180634
20864 180634 228681 246775 238891 229973 217079 179054 146282 157237 201259 247773 253248 201178
20852 201178 115831 41252 9721 13981 21996 21497 17137 -14457 -67586 -100545 -97798 -72907 -32699
20839 -32699 18284 60352 62228 1375 -118279 -246064 -304622 -275670 -225387 -196004 -144208
20828 -144208 -36708 77580 136576 135287 111759 101877 115430 140028 138385 130742 144352 151817
20816 151817 148680 156764 166032 182774 205724 199738 155865 103510 64337 43703 54429 93987
20804 93987 159824 241617 307382 331763 315687 291372 295794 316438 319028 302029 274842 246155
20792B46155q736K2294L6412L6714K2041j5708o3185q5442o8134m1666l0392m6289
20780D064q2708r3024n7163r915K2877K6218K2905J4634j1101k3589j2687N514
20768a93975Q607J8555M2751O3002N7227k357m8385j3451L6217L3840L3081O3157
20756I8269N4615j2627p4312o2420J6072O7303M0697k4225o4607n9156l4557q063
20744f3011o101j3097p721j6556k1814L244M0476O3549K8759l1375m2130k0433
20732h6210j0212j4068p561J8351M2123N4416O5907Q5065Q2011M8466J4672m43
20720B92517P773M0214O0617N2519J6866k8790n8281p0857n9859m9478o7666q8749
20708D6826p6733m1261K349L0977O281o9474j33492j27246q3028k9321J3938K7136
$$ plain form
20792 246155 237419 259713 296125 332839 354880 339172 275987 190545 122411 80745 50353 4064
20780 4064 -78644 -171668 -228831 -238746 -215869 -189651 -166746 -152112 -163213 -186802 -199489 -193975
20768 -193975 -185368 -166813 -124062 -61060 -3833 -6190 -54575 -68026 -31809 2031 35112 98269
20756 98269 152884 140257 65945 3525 19597 86900 127597 103372 38765 -20391 -54948 -63011
20744 -63011 -69112 -82209 -89930 -106486 -128300 -125056 -84580 -21031 7728 -23647 -65777 -86210
20732 -86210 -96422 -110490 -118051 -99700 -57577 -3161 62746 147811 229822 278288 292960 292517
20720 292517 300290 340504 401121 453640 470506 441716 383435 312578 252719 203241 135575 46826
20708 46826 -29907 -71168 -68819 -37842 -31561 -101035 -234527 -361773 -444801 -474122 -460184 -433048
20696d33048K3965L5690N8741N6458J5266k1495k5546k4532j339N5782N5220k6013
20684b30851j13688j42615r5331j7586M1734Q4358J13261J05120P9519M4694J4191
20673a17194M55l982K089J4344L7713N7325M3954R645k2070j9004Q230J9083J8443
20660D9031K870l4128p0842p8253n3249l3265l2879j3533K9646L0150j3895n3892
20648b72239o2990l4762K3885N1851J5880k8315n0523m9492m2804l4094K435N0798
20636d30370P6544P6148O7858O0347M5827K4959L0795M3937J3967l8530r8203
20625a26721j27188j05921p4800m0249K1501P6422P3460K1223m1107n2086K5340
20614c50126J16249J18633O5707J8651j9874n3932m1537J8854M5605m702n6700
$$ plain form
20696 -433048 -409083 -373393 -314652 -258194 -242928 -264423 -289969 -314501 -315840 -260058 -204838 -230851
20684 -230851 -344539 -487154 -582485 -600071 -558337 -473979 -360718 -255598 -176079 -131385 -117194
20673 -117194 -116739 -120721 -118632 -104288 -66575 -9250 34704 44349 22279 3275 11505 30588 49031
20660 49031 51901 17773 -53069 -131322 -184571 -217836 -250715 -264248 -234602 -204452 -218347 -272239
20648 -272239 -335229 -369991 -346106 -294255 -278375 -306690 -357213 -406705 -449509 -483603 -481168 -430370
20636 -430370 -353826 -277678 -209820 -149473 -103646 -78687 -47892 -3955 10012 -28518 -126721
20625 -126721 -253909 -359830 -434630 -474879 -453378 -376956 -303496 -282273 -323380 -375466 -350126
20614 -350126 -233877 -115244 -49537 -30886 -50760 -104692 -146229 -127375 -81770 -86472 -143172
20603a43172l5639K8460N8964N5541P5016R1456N3476j6066p0580p9841m4380
20592b6765q807p857k0988r714J7565K7296J1000j5201j4976j473j8792l5956
20580a04668k0470n83K0263L6396K4030J0878L8488Q7539J19667J19457R6709
20569D27706O3502M1262M1866L8880L5238M8034R6332J74362K24490K48782L00362
20558A740816L79318M59609N43432O62221Q05674Q46781N64353r7180p42335r64217
20548D198472q39130o46735n25658m66157m28450l84435l16034k17827j19425
20539B54621o3762n5672o2657m1059l062O196n660n233J203j1616k6797m1397
20527e4895n7100n3123l3798p482L3396M4180L9747N6532N2386K5105k6201o9978
$$ plain form
20603 -143172 -178811 -150351 -91387 -35846 39170 130626 184102 168036 97456 17615 -26765
20592 -26765 -35572 -43429 -64417 -74131 -56566 -29270 -18270 -33471 -48447 -49920 -68712 -104668
20580 -104668 -125138 -125721 -105458 -69062 -45032 -34154 4334 91873 211540 330997 427706
20569 427706 491208 532470 574336 613216 648454 696488 792820 967182 1191672 1440454 1740816
20558 1740816 2120134 2579743 3123175 3785396 4591070 5437851 6002204 5905024 5162689 4198472
20548 4198472 3359342 2712607 2186949 1720792 1292342 907907 591873 374046 254621
20539 254621 190859 135187 72530 31471 28409 34605 28945 23712 24915 13299 -13498 -54895
20527 -54895 -111995 -165118 -198916 -206398 -173002 -128822 -89075 -32543 19843 44948 18747 -51231
20515e1231q9397j01239q1297k2978K9776N9815Q5520R0447P8697Q0078P2072
20504A50263K1692l8176o7070q3588q1815n7359l3153M69L3577L5020J6375J0986
20492i2779K7455K4957j1455k7105r822k336o835Q33J7638K2394R694k6595p8344
20479a52300j09461q4251j4875K1327o93k9739m6408m3881k2245J0115N7539R8650
20467c16222R3026N1628L9978N6895N1507L6206J1859o454j6595l9149q2415r3287
20455b13023k2398K5530j3840m7220j4663L1630M1492J5893j640K1329K3823o641
20443a59728k2356p05M2666M4173k022m8336o3904n3655k3035J7709K9444L1129
20431b08620R280n0381q1049o5273o2026o8493j9630M0422K5466j8388j6284L7417
$$ plain form
20515 -51231 -140628 -241867 -323164 -346142 -316366 -256551 -171031 -80584 -1887 78191 150263
20504 150263 171955 133779 66709 -16879 -98694 -156053 -189206 -188737 -155160 -120140 -103765 -92779
20492 -92779 -65324 -40367 -51822 -78927 -88749 -91085 -97920 -97087 -79449 -57055 -47361 -73956 -152300
20479 -152300 -261761 -346012 -360887 -339560 -340253 -369992 -416400 -460281 -482526 -472411 -414872 -316222
20467 -316222 -223196 -171568 -131590 -74695 -23188 13018 24877 18423 1828 -37321 -119736 -213023
20455 -213023 -235421 -209891 -223731 -270951 -285614 -253984 -212492 -196599 -198239 -176910 -153087 -159728
20443 -159728 -182084 -182789 -140123 -95950 -97972 -146308 -210212 -263867 -286902 -269193 -239749 -208620
20431 -208620 -199340 -249721 -330770 -396043 -458069 -526562 -546192 -505770 -480304 -498692 -514976 -477559
20419d77559J02647J40224J40179Q8531O19m8249j9676K6730L0190k0032m9850
20408h6246M369P1609Q0447M5962J1924l2066p8981r4980o1157J0717O2885Q8015
20396B2498Q4272M7086K5531M0825O3229Q3415Q2503N3807O763o2649j32681j60201
20384A54398j29921n6643J0719L5790L3569L2662N4274N2816N203m1389q4896
20373F6582j13176r1961m4121m306K4406L8476K7759J2878Q382K236r290k5744
20361a07879k5885O958M9618N9615M1717K1365M574k3764l1515J1268N7576R4109
20349A57757J15441P9392P19n2067o2941p3577o7687l3319M09K580l826R004L1336
20336A03221M1090M3920L0132q132m3163m3585l1854m1105m8010m5795k5246J1097
$$ plain form
20419 -477559 -374912 -234688 -94509 -5978 -5359 -53608 -73284 -46554 -16364 -36396 -86246
20408 -86246 -81877 -10268 70179 116141 128065 95999 17018 -77962 -139119 -128402 -65517 22498
20396 22498 106770 153856 179387 220212 283441 366856 449359 503166 509929 447280 314599 154398
20384 154398 24477 -32166 -21447 14343 47912 80574 134848 187664 192867 151478 66582
20373 66582 -46594 -138555 -182676 -186982 -162576 -124100 -96341 -83463 -75081 -72845 -82135 -107879
20361 -107879 -133764 -126806 -77188 -17573 24144 45509 50083 26319 -5196 6072 63648 157757
20349 157757 273198 352590 353309 301242 238301 164724 97037 63718 64127 66707 62881 71885 103221
20336 103221 144311 188231 218363 210231 167068 123483 91629 50524 2514 -43281 -68527 -57430
20324e7430K4636J4799J728n779p525k0545l4549j9559R269L8700Q8362J38058
20312A70165J25576L7614m7992r0483j04623r4615o2510j8169K0048M8129O9182
20301E2322P8759O3669J5418m5913r1170j26206j27707r7994m1036M7455R3050
20290a79353P9014L1413q209m154J5571J3417r269j3598Q379K1607M4372R0675
20278H9865J10671O2211j2068o0240q4641o6363k1710L013J6205J1973j3070m5907
20266a0061o6126o1707n0069m3193l1676P722O4287R0653P6730N1071L0762M3101
20254A01494N7526L3937Q425q218l0000m0804l8444j9526K6026P1153R3322P6779
20242C31670K9127j5596l8789l8608l5937m9161n4130l1130N555L1446L7776K4907
$$ plain form
20324 -57430 -32794 -17995 -16267 -22046 -29571 -50116 -84665 -104224 -94955 -56255 32107 170165
20312 170165 295741 333355 285363 194880 90257 -4358 -66868 -85037 -64989 -16860 52322
20301 52322 131081 194750 210168 164255 73085 -53121 -180828 -278822 -319858 -272403 -179353
20290 -179353 -100339 -68926 -77135 -81289 -65718 -52301 -61570 -75168 -66789 -45182 -810 89865
20278 89865 200536 262747 250679 190439 105798 39435 17725 20738 36943 48916 35846 -10061
20266 -10061 -76187 -137894 -187963 -231156 -262832 -255110 -190823 -100170 -23440 27631 58393 101494
20254 101494 159020 192957 201382 193164 163164 122360 83916 64390 90416 161569 254891 331670
20242 331670 360797 345201 306412 267804 231867 182706 128576 97446 103001 134447 172223 197130
20230A97130j604j9804k9028l2476k9277l8630o3663n5590n2242n8402l7620K456
20218b18750N4687Q2189Q1529P5800M8593n599m5043n3643n7205m2679R513O5681
20206d927P1025J6140m0414m8899l8694n7665q7720q1484l3803J3207L6241K6724
20194b30269R647J2069K2413L5029L6640K1292J0995K7283N0588N0989M0943K6719
20182A14338J2172L6760O7265L3843j8576j7407K2365M9831N5339O0098N4327
20171D70355K7497K5963N0636M8141L4498M0722K8477l3374q1901m7601K8642
20160E92055O0607N6828O3111N5815P799k1356K031L7315L8782L1087M6238O3800
20148A034112P2662R9056J39191J93939K76184L48751L25550J00964k23494m12061
$$ plain form
20230 197130 195526 175722 146694 114218 84941 46311 -17352 -72942 -125184 -183586 -221206 -218750
20218 -218750 -164063 -81874 -345 75455 124048 118449 73406 19763 -37442 -80121 -70608 -4927
20206 -4927 66098 82238 41824 -7075 -45769 -103434 -191154 -272638 -306441 -293234 -256993 -230269
20194 -230269 -220622 -208553 -186140 -151111 -114471 -93179 -82184 -54901 -4313 46676 87619 114338
20182 114338 126510 163270 230535 264378 245802 228395 250760 300591 355930 416028 470355
20171 470355 497852 523815 574451 622592 657090 697812 726289 692915 611014 563413 592055
20160 592055 652662 709490 772601 828416 836215 814859 816890 854205 892987 924074 970312 1034112
20148 1034112 1106774 1205830 1345021 1538960 1815144 2163895 2489445 2590409 2366915 1954854
20138A954854m11558l19315k19184j34751m6302L7455Q4951P5558K4149l5757
20128A010100r0374j07795j07110j17036r3061l4878j8693n5112o8214m5067j4930
20117B57830K1621M2221J5525j6972P405Q2583J40418J21309L8805l8330o2767
20106F09648m3403j3210P703P501L537r874l3561l1544m458L9670Q2804J14577
20094G29390J31474J01085K7373n3262j04386p8845j9253p488l9760o2786m9687
20083E73855k1538l042J9431N5755J13612J81636K02576J85222K37148L73973
20073A918628N12272N98686O62189P58514R47228J259095J637352J894190J627727
20064A1815881M64874j030027j832073j850276j526603j154016q48485o10716
$$ plain form
20138 1954854 1543296 1223981 1004797 870046 823744 861199 946150 1021708 1045857 1010100
20128 1010100 919726 811931 704821 587785 494724 459846 441153 386041 317827 272760 257830
20117 257830 279451 321672 337197 320225 327630 410213 550631 671940 710745 672415 609648
20106 609648 566245 553035 560738 568239 571776 561902 528341 496797 492339 532009 614813 729390
20094 729390 860864 961949 989322 936060 831674 752829 733576 726088 686328 623542 573855
20083 573855 552317 549275 568706 624461 738073 919709 1122285 1307507 1544655 1918628
20073 1918628 2430900 3029586 3691775 4450289 5397517 6656612 8293964 10188154 11815881
20064 11815881 12280755 11250728 9418655 7568379 6041776 4887760 4039275 3428559
20056C428559m19073k87106k45473k66539k83614k53626j65873p1300m4067r3249
20046A298639j53558j55871j04158n6733k6421j3907l232J4565K3299n623p6626
20035G40374j51318j68553j33338q6247k3845K1265J4797k5880m3135j6610J7236
20024A44746K4428L3435Q2318J48312J87076J48539Q4719O4726M2135n490k9846
20013I25098j2811J049k9001o8328q3690q0648o4940n4575n6860m1023J975N2495
20001D88741P3653P5362P8436M7543j3983o5101r8354j19578j41857j51846j12005
19990F1011l9276J2920L8705N7142P4593Q7862J02865J11134J12080R7702P3478
19979G90216N0947M6683N2977L5588k4284o6101m1825L3165Q4797O8363Q991n1682
$$ plain form
20056 3428559 3009486 2722380 2476907 2210368 1926754 1673128 1507255 1435955 1391888 1298639
20046 1298639 1145081 989210 885052 828319 801898 787991 784759 799324 822623 817000 740374
20035 740374 589056 420503 287165 200918 177073 198338 213135 187255 144120 127510 144746
20024 144746 169174 202609 284927 433239 620315 768854 853573 918299 960434 954944 925098
20013 925098 912287 913336 884335 816007 732317 651669 586729 532154 475294 434271 436246 488741
20001 488741 562394 637756 716192 763735 749752 684651 586297 466719 324862 173016 61011
19990 61011 21735 34655 73360 130502 205095 292957 395822 506956 619036 716738 790216
19979 790216 841163 887846 940823 976411 952127 886026 844201 877366 962163 1030526 1039517 987835
19967I87835o4808k255P3296J05604J32363J48637J15345M6590J927j2063k5649
19956A506822l7941r508N8106J15729J41106J21519P5771M8524M7772P0294J07550
19945B245744J29684J23452R3158Q8800J45029J94581J98580K00011K27749K86048
19935C932836L68534M20505M23182M34600M69897N38309O72446Q79350J126838
19926I266497J371602J640033J991866K453907K906879K986385K250889R68708
19918B5836766J69986Q3310J24826j15307n64272p43422m55816R8162P45139J408170
19908B6587542K084384K832761L736089M861631O248858P954274J0085836J2663072
19900G7054447J5359535J6915283J4706486O216600n884765j4210376j5846567
$$ plain form
19967 987835 923027 920772 994068 1099672 1232035 1380672 1496017 1542607 1544534 1532471 1506822
19956 1506822 1468881 1459373 1517479 1633208 1774314 1895833 1971604 2020128 2067900 2138194 2245744
19945 2245744 2375428 2498880 2592038 2680838 2825867 3020448 3219028 3419039 3646788 3932836
19935 3932836 4301370 4721875 5145057 5579657 6049554 6587863 7260309 8139659 9266497
19926 9266497 10638099 12278132 14269998 16723905 19630784 22617169 24868058 25836766
19918 25836766 26006752 26090062 26214888 26099581 25535309 24791887 24336071 24434233 25179372 26587542
19908 26587542 28671926 31504687 35240776 40102407 46351265 54305539 64391375 77054447
19900 77054447 92413982 109329265 124035751 130252351 124367586 110157210 94310643
19893I4310643j3572774j0340785p492829n332814l632455k056518m80814J011471
19885E2413125J863089P51865k779988o028334o729464n785604m593181l671226
19877B5440282k936726k283075j741653j349855j073595q54386o37162m26909
19869A4136921k26626n0751N8688J05059J71365L10678M47941N07007M59529K67838
19859A6187649o1980l82099n08707m28407k22430O3216L40422N05304N48886N52690
19849A6594544O23078P82424R13153R55637J051074J282430J564801J725248J694976
19840B7187365J583643J427577J212818J034950J143557J650469K424431L354215
19832D1019025M484560N938234P675648R202410R514217P730646M659419K067297
$$ plain form
19893 94310643 80737869 70397084 62904255 57571441 53938986 51882468 51401654 52413125
19885 52413125 54276214 55028079 52248091 46219757 39490293 33704689 29111508 25440282
19877 25440282 22503556 20220481 18478828 17128973 16055378 15200992 14563830 14136921
19869 14136921 13910295 13859544 13918232 14023291 14194656 14505334 14953275 15460282 15919811 16187649
19859 16187649 16125669 15743570 15234863 14806456 14584026 14647242 14987664 15492968 16041854 16594544
19849 16594544 17217622 18000046 18913199 19868836 20919910 22202340 23767141 25492389 27187365
19840 27187365 28771008 30198585 31411403 32446353 33589910 35240379 37664810 41019025
19832 41019025 45503585 51441819 59117467 68319877 77834094 85564740 90224159 92291456
19824I2291456o0779l051976o664446q991602r274786q270305o829552n345280
19816D3802730l960195k765547j821217j083352m26958K27676R04992J599070
19808C6477199K340299L203493M159460N038075N415422M463120J684068k119958
19800F0661178n279582o665467o495047n639010m697218l874486l195152k650403
19792B2164813k206723j826190j533757j312909j132674r80847q63008p79951
19784A1528754o90335o14430n86126n72508n46793n07027m65887m53739m53591
19775F638318m29675l47392k61318k09653j84473k05967k60134l10775l20636
19766D108295k88073k32766j59299j13647j14010j16236p5990j2983j0607o4808
$$ plain form
19824 92291456 92230677 89178701 82514255 73522653 64247867 55977562 49148010 43802730
19816 43802730 39842535 37076988 35255771 34172419 33745461 33973137 34878129 36477199
19808 36477199 38817498 42020991 46180451 51218526 56633948 61097068 62781136 60661178
19800 60661178 55381596 48716129 42221082 36582072 31884854 28010368 24815216 22164813
19792 22164813 19958090 18131900 16598143 15285234 14152560 13171713 12308705 11528754
19784 11528754 10838419 10223989 9637863 9065355 8518562 8011535 7545648 7091909 6638318
19775 6638318 6208643 5861251 5599933 5390280 5205807 4999840 4739706 4428931 4108295
19766 4108295 3820222 3587456 3428157 3314510 3200500 3084264 3008274 2995291 2984684 2919876
19756B919876j10134j45987j47797j08357o9561m9103j8655K5263M0728K3885
19746B360158J5136M8478Q3677P2089J3419n5491j02004j18917j01473o2920j1292
19735B140860K5162K6943K8978N1669O2674Q1382J34637K14350L33214M34266
19725C534135M38591M03743M53953N79390P47409R60333J250592J668317K175464
19716A2211927K632407K581721J251652j085617k709974k924836k416186j780170
19708G760924j257332q90135o43389m95692m14953l37339k39659j39323n8192
19699C284910k3628l3526o2642q7327q2304j8301O7890J35559J60596J69850K10999
19688C722076L02149M22430N27664O29302P75342R86491J290226J723315K324527
$$ plain form
19756 2919876 2809742 2663755 2515958 2407601 2338040 2288937 2270282 2295545 2336273 2360158
19746 2360158 2375294 2423772 2507449 2579538 2592957 2537466 2435462 2316545 2215072 2152152 2140860
19735 2140860 2166022 2192965 2221943 2273612 2336286 2417668 2552305 2766655 3099869 3534135
19725 3534135 3972726 4376469 4830422 5409812 6157221 7117554 8368146 10036463 12211927
19716 12211927 14844334 17426055 18677707 17592090 14882116 11957280 9541094 7760924
19708 7760924 6503592 5613457 4970068 4474376 4059423 3722084 3482425 3343102 3284910
19699 3284910 3261282 3227756 3165114 3077787 2995483 2977182 3045072 3180631 3341227 3511077 3722076
19688 3722076 4024225 4446655 4974319 5603621 6378963 7365454 8655680 10378995 12703522
19679A2703522L113093M060834M833856M392817J512385k577420m825488m765813
19671A8447786l806994k847520k133428j608031j201742r23874p45371o17965
19663D562861n25686m58435m31050m05064l41275k64485j92703j38785j23549
19654A681829j33078j45850j60750j50671q8288j1948K3328J0551k3663l7460
19644I64000k4856j8462m2702o5490l9415J3963N3176M8110J8756J9116L7763
19633I63959K6907k1847m9776l8672j7378j6293l1770m3064m5565m1875l6587
19622F48039k5989j6736r302j6151k3506j4603o798j9239m6104o1337m2265Q789
19610C74798P4647J07181P1554k7835j10675j10757p5269o5544n0756m9691o2417
$$ plain form
19679 12703522 15816615 19877449 24711305 29104122 30616507 28039087 23213599 18447786
19671 18447786 14640792 11793272 9659844 8051813 6850071 5926197 5180826 4562861
19663 4562861 4037175 3578740 3147690 2742626 2401351 2136866 1944163 1805378 1681829
19654 1681829 1548751 1402901 1242151 1091480 1003192 991244 1014572 1025123 1001460 964000
19644 964000 939144 920682 877980 812490 773075 787038 840214 888324 907080 926196 963959
19633 963959 990866 969019 919243 880571 863193 846900 815130 772066 726501 684626 648039
19622 648039 622050 605314 596012 579861 556355 541752 534954 515715 469611 408274 366009 374798
19610 374798 449445 556626 628180 600345 489670 378913 303644 238100 187344 137653 75236
19599G5236k3761M9638J15415J35510R4692M7970L8926K6444l0003p7942r3175
19588C58950r2535n8563J1005L9822J7547L314J415j2774l0683j3943N1322J25508
19576D00385J50495J20990Q8621P1961M7079L0788O0156R6496R9514N6620k3888
19565A199217j13262j73790j64472j17519q3087p1194p7273q3123q6641q0014
19555A48842n2952k3945L757L0139M3397M1076K1598K0866L9812K4368j0310k2303
19543B64345j4332n0088j22864j47566j05017k0681O2473Q4244M9885K9248N3175
19532H2822Q7073R6869R3294P0265J3538k8092k3438m528K5300M8918J0992n8284
19520D14729p5856m7927l2156m8215m0057L570J5792j5046j7136N853J9280M3125
$$ plain form
19599 75236 51475 101113 216528 352038 446730 494700 533626 560070 530067 452125 358950
19588 358950 266415 207852 218857 258679 276226 279540 280955 268181 237498 223555 274877 400385
19576 400385 550880 671870 760491 832452 879531 910319 970475 1066971 1166485 1223105 1199217
19565 1199217 1085955 912165 747693 630174 547087 475893 398620 315497 228856 148842
19555 148842 95890 71945 75702 105841 149238 190314 211912 232778 272590 296958 286648 264345
19543 264345 250013 199925 77061 -70505 -175522 -196203 -133730 -49486 399 29647 82822
19532 82822 169895 266764 360058 430323 443861 415769 392331 387803 413103 462021 473013 414729
19520 414729 338873 290946 258790 210575 170518 174088 189880 174834 157698 163551 182831 225956
19508B25956N7006L6579J026k0020k7580l6454m8587n5322o6940r4786j14803
19497a43925j13745q1873k3030J6107M0746Q0872J20919J13358M3021m6281r1824
19486h5655j01148j11254j07200p1184k764O6940J08267J22322J23774J09297
19476E1395O2897j268n1283p2786p3197n6241l9291l1261p595J6010K3082M0481
19464a39057P4616Q0858N3806M2556K8088p65l3823n0394k4507Q701J3201M267
19452E7547k337j4649l3407k8960j6400k3044k0750M432M7202Q4676J14553J15115
19440B83978P8207K1389m1327p8645p4410o2123o2361o0650n3886m4955l4777
19429a29560k8388k7491l7652m4844l9686k9875M768M7492O4112P1991O2328L2714
$$ plain form
19508 225956 282962 319541 320567 300547 272967 236513 187926 132604 65664 -29122 -143925
19497 -143925 -257670 -339543 -362573 -346466 -305720 -224848 -103929 9429 52450 6169 -85655
19486 -85655 -186803 -298057 -405257 -476441 -479205 -412265 -303998 -181676 -57902 51395
19476 51395 114292 113024 61741 -11045 -84242 -140483 -179774 -211035 -218630 -202620 -179538 -139057
19464 -139057 -64441 16417 70223 112779 140867 140102 106279 55885 31378 40079 53280 57547
19452 57547 55210 40561 7154 -21806 -38206 -61250 -82000 -77568 -30366 54310 168863 283978
19440 283978 362185 383574 342247 263602 189192 127069 64708 4058 -49828 -94783 -129560
19429 -129560 -157948 -185439 -223091 -267935 -307621 -337496 -332728 -285236 -221124 -149133 -86805 -54091
19417e4091J4587j184j8843j9170j1708l785K3325N4298M5465j8712n7834M21
19405d7231P2619P8421N3263M3304L6609J9376J3094R057l9265j10233j24519
19394D495j02243r6132r4510p2639k2583K5129M8681N4864O1106R5138J04727
19383F033P5839O6751Q1170Q3188M7053k5261r3242r0825k4617N5328J25002J41135
19371D47554Q4575L142o7882r3283n8129j6792k9460o6402p8263n8932j7182R570
19359E8516L1373M4225J7269j9935m0322l7283j9418k69J4808K0041J9264n973
19347H2296m2145n0990l7883l6116o0139q2557p6051n5615l3750k509L6539O5049
19335b93871P8711P9113O8424N3084L1396K4065L7423M4975M0942K2795J1774
$$ plain form
19417 -54091 -39504 -40688 -59531 -78701 -90409 -94194 -70869 -16571 28894 10182 -47652 -47231
19405 -47231 25388 103809 157072 200376 236985 256361 269455 278512 239247 129014 4495
19394 4495 -97748 -193880 -288390 -361029 -383612 -358483 -309802 -254938 -193832 -98694 6033
19383 6033 81872 148623 229793 312981 360034 334773 241531 150706 126089 181417 306419 447554
19371 447554 532129 535271 467389 374106 315977 299185 269725 203323 125060 66128 48946 58516
19359 58516 89889 134114 151383 131448 91126 53843 34425 34156 48964 69005 88269 82296
19347 82296 40151 -10839 -48722 -84838 -144977 -227534 -303585 -359200 -392950 -395459 -358920 -293871
19335 -293871 -215160 -136047 -67623 -14539 16857 40922 78345 123320 164262 187057 198831
19324A98831J4254K2080K7741J3051r105l2083l5822j0890J1230p32m7376q2479
19312F8700p7971q5224j04515p2885j2544J1847n496j2986p160k5575n0652l7062
19300d11523q286r774l1260l4325j9209J1710L8441L7645J6357P191K7519P3129
19288c02385J20603J07901M7682o257n2046o6994m8913k3915j1414N787N1447
19277a78504P7461L9587j7406j7509K7264L9660J7061q71k383j4830m2606m0478
19265a13554r160J5202J4539j4776k5144M644L3792L9420K1086k291k6445l5683
19253i8370J68O0423O5754R173k5543k4438l2704l0474j5397j8412l1661m9696
19241a91177p3946r6822j09556q4569l3022j6985l1319j4821N9923J22980J20234
$$ plain form
19324 198831 213085 235165 262906 275957 266852 234769 198947 188057 199287 198555 151179 68700
19312 68700 -9271 -94495 -199010 -271895 -284439 -272592 -278088 -291074 -298234 -323809 -374461 -411523
19300 -411523 -419809 -429583 -460843 -495168 -514377 -502667 -464226 -426581 -410224 -403033 -375514 -302385
19288 -302385 -181782 -73881 -26199 -32456 -84502 -151496 -200409 -224324 -235738 -229951 -178504
19277 -178504 -101043 -61456 -78862 -96371 -69107 -29447 -12386 -13257 -15640 -30470 -73076 -113554
19265 -113554 -122714 -107512 -92973 -107749 -132893 -128249 -94457 -55037 -33951 -36242 -62687 -98370
19253 -98370 -98202 -37779 27975 37148 11605 -12833 -45537 -76011 -91408 -109820 -141481 -191177
19241 -191177 -265123 -361945 -471501 -556070 -589092 -606077 -637396 -652217 -592294 -469314 -349080
19230c49080R7317O9925J9480r275J9380N4472M9170J209n3367q0122o4727j9848
19218b65466L4500O0254M6953R160k1478o221M0463N3738J5565j0259J4793O0747
19206C2749P7054P8842R0518P0483J1706m0736n4373k3802K3455L8864J438n7588
19194B48610q0835n3061j4685k0378q4762j36170j07709j6808R3403J47092J18126
19183I2823O8571K7500m025j6726Q277M6653L5503l7304r8959n7893M3248J10469
19171B18137Q9478J0434n2647p9722p3980n1835k5533j577K694j6713k7247q523
19159a7034K9956N0743M7674J4818n7422r7665p0823n149M7663K3617l5522n0615
19147a19759k9547J8284O6652O7009J4906l9044o0512m8837Q748P8368J24255
$$ plain form
19230 -349080 -251763 -181838 -162358 -171633 -152253 -97781 -48611 -47402 -100769 -180891 -245618 -265466
19218 -265466 -230966 -170712 -123759 -114599 -136077 -142298 -101835 -48097 -32532 -42791 -27998 32749
19206 32749 109803 188645 279163 349646 361352 320616 266243 242441 265896 304760 306198 248610
19194 248610 167775 114714 100029 79651 -5111 -141281 -248990 -265798 -172395 -25303 92823
19183 92823 161394 188894 184869 168143 176420 223073 258576 221272 122313 64420 107668 218137
19171 218137 307615 318049 265402 185680 111700 59865 34332 32755 35449 18736 -8511 -17034
19159 -17034 12922 63665 111339 126157 68735 -28930 -99753 -104902 -57239 -33622 -69144 -119759
19147 -119759 -149306 -131022 -64370 2639 17545 -21499 -82011 -130848 -122100 -43732 80523
19136H0523J28357Q1984K0560j2401k1445l8674p1082p0970k1346J9593J2228
19125A07327j9761n6281n7201j9933k0411o0904p2845m4697j7061j6624k4791
19114c03182l3187m4305l9522J676O5111Q8118M9061J931l270J6375L7687P0288
19102i3219Q4207N3037M51m0470n7461m3199q72M5990O8120M1748k6404p7132
19090d5204r3277r9983j06134r4877k5369P4726J24502J00771M9548K3935K2522
19079f8840J9951k322m1561o7418m2138n863O148K5219M8602M9628J9587j0075
19067f9082j9428r733j4820n0155q5147r8201r0892o7566l5241O643O5073J11980
19055c56569J03105N1702K2724K0801J4807K68n785J1566K6221L7820M7885L4991
$$ plain form
19136 80523 208880 290864 311424 299023 277578 238904 167822 96852 75506 95099 107327
19125 107327 87566 31285 -25916 -45849 -66260 -127164 -200009 -244706 -261767 -278391 -303182
19114 -303182 -336369 -380674 -420196 -418520 -353409 -265291 -216230 -214299 -217569 -201194 -163507 -93219
19102 -93219 -9012 44025 44476 4006 -53455 -96654 -97526 -51536 16584 58332 31928 -45204
19090 -45204 -138481 -238464 -344598 -439475 -464844 -390118 -265616 -164845 -115297 -91362 -68840
19079 -68840 -48889 -51211 -92772 -160190 -202328 -208191 -202043 -176824 -128222 -78594 -59007 -69082
19067 -69082 -88510 -98243 -113063 -163218 -248365 -346566 -437458 -505024 -540265 -533622 -468549 -356569
19055 -356569 -253464 -201762 -179038 -158237 -143430 -143162 -148947 -137381 -111160 -73340 -25455 9536
19043I536p39l9212m2612k5432m3145m7399j6028J928j50R246K2014K2664q392
19030a57721n7744p7330n9446k0314J0142J4088p552l7716m3646j7744j3829m8382
19018e17194o7780o3709n2448j7106M6308Q7065P8238O5759P2504O9089L7861
19007b61413J2344J1334J9843K2795j737j4127J4791M0157J7416j0133j9000l7960
18995b05690n5983p6766j03172j11172q3056l6803L67J6821R780j5220K837N9883
18983e98174Q6184P5154N1573N2095P7355Q5568P2636L1700k1648j9921J7777
18972h9701K9832K7417K1705P059j4144o183Q943j1046q752N7409J16675R1856
18960B31070L775o3934p5009n9809l8328k8217r413J5458M0205O1826M4399m310
$$ plain form
19043 9536 8797 -30415 -73027 -98459 -141604 -189003 -205031 -203103 -203253 -194007 -171993 -149329 -157721
19030 -157721 -215465 -292795 -352241 -372555 -362413 -348325 -355877 -393593 -437239 -454983 -468812 -517194
19018 -517194 -584974 -648683 -701131 -718237 -671929 -584864 -506626 -440867 -368363 -299274 -261413
19007 -261413 -249069 -237735 -217892 -195097 -196834 -210961 -196170 -156013 -138597 -148730 -167730 -205690
18995 -205690 -261673 -338439 -441611 -552783 -635839 -672642 -672275 -655454 -645674 -660894 -658057 -598174
18983 -598174 -511990 -436836 -385263 -333168 -255813 -170245 -97609 -65909 -87557 -107478 -89701
18972 -89701 -59869 -32452 -10747 -3688 -17832 -24015 -15072 -26118 -34870 22539 139214 231070
18960 231070 234845 170911 95902 36093 -2235 -30452 -39865 -24407 15798 77624 122023 117713
18948A17713k9234j4396j0418k7048k3286K090K7995L3720R244k0850m5727q5164
18936f5361j06547q4467m2900L930L6449M9936M6078M0302J6844n0020q5621m3269
18924b84646J2839K1995K1835M9871P3819P9633O1077j0151r2953j43677j50996
18913c61354j06212l0618L6087P4317Q3587P4195P3798P6473P1276O6920O8263
18902A26732M2933j5053m4696l7429m2140o1614q1009p0584j9180L1457L5304
18891a35279J1521o605O209L9816M0393Q716P794N8846J18945J30953Q2406L4001
18879C97716O459l6568p1255l1460L3703M9421K2948j1839j2813J100M925R529
18867C61866M188k1098l6415j9231K065J2348L129k1589l0037q073J6695J5352
$$ plain form
18948 117713 88479 74083 63665 36617 13331 15421 43416 77136 86380 65530 19803 -65361
18936 -65361 -171908 -256375 -299275 -295345 -258896 -208960 -162882 -122580 -105736 -155756 -241377 -284646
18924 -284646 -271807 -249812 -227977 -178106 -104287 -24654 36423 26272 -66681 -210358 -361354
18913 -361354 -467566 -498184 -462097 -387780 -304193 -229998 -156200 -79727 -8451 58469 126732
18902 126732 169665 154612 109916 72487 30347 -31267 -112276 -182860 -202040 -170583 -135279
18891 -135279 -123758 -130363 -124154 -84338 -43945 -35229 -27435 31411 150356 281309 363715 397716
18879 397716 404175 367607 296352 264892 298595 348016 370964 359125 346312 347412 352337 361866
18867 361866 366054 344956 308541 289310 291375 303723 306852 285263 255226 247153 263848 279200
18855B79200J1875K5881L5470l311n9609n4029o294J1373Q228P975J3609Q184
18843B78552j3520m1553n4337l1159k2362m5387n5033l1028j4961l6390o2072
18832a29250n5186o278M8818P3263N9245J6126j3170j6321k0238l7048l5790P095
18820a08734N8944O7275K8665Q85K5308N6325N1729N3910P0549M3023k9731o9298
18808B48850q4240j09107j14126p9954j3092L2306K7769K0811L1922M0331N6246
18797E7716O7760Q2093R6512Q7963L3859k3502k3976q223N69P672j2468j7433
18785C48542l778n667j9598l8387n9313q3480q5193n4051k337O9770J21135J02566
18773B90209M2455r508l8349m5185l7494k9283k3784j3695P491J9687R842J7832
$$ plain form
18855 279200 291075 316956 352426 349115 289506 235477 229183 240556 248784 256759 270368 278552
18843 278552 265032 223479 169142 137983 115621 70234 15201 -15827 -30788 -67178 -129250
18832 -129250 -184436 -190714 -141896 -68633 -9388 6738 -6432 -22753 -42991 -80039 -115829 -108734
18820 -108734 -49790 17485 46150 47035 72343 128668 180397 234307 304856 347879 318148 248850
18808 248850 164610 55503 -58623 -138577 -151669 -119363 -91594 -70783 -38861 1470 57716
18797 57716 125476 207569 304081 392044 425903 402401 378425 370202 370771 378443 365975 348542
18785 348542 344764 339097 319499 281112 221799 138319 53126 -925 -3262 66508 187643 290209
18773 290209 332664 323156 284807 239622 202128 172845 149061 135366 142857 162544 172386 190218
18761A90218M2381N0822M6528K8591M314J800p141o2186j08553r4029m3529J2984
18749F2200M2281L4782L8078O0602P0363N2978K408n1100m6381Q513M1946L6963
18737C53633K4928J4614j1911l2853l5728l2228J1480Q8772J46572J44070R5161
18726G66510M3046k922m1059p4016r7768q7188l1596K6152M9955K3001m1003p7738
18714D55374p7832q4438j00922p5438j0337L9703M2232M4084Q9583J30284J12350
18703E64643P5550O1776O2480L3478j2185k6677N75M1644M2937K7359K0041O81
18691H92302j9383k5787k7033j2226L5618P4408P8342M8710o514n9053p9310o4336
18679H35738m5808k4046J2796M9479Q7433J45462J54365M0047j04374j58531j22371
$$ plain form
18761 190218 232599 283421 329949 358540 362854 364654 357513 295327 186774 92745 49216 62200
18749 62200 104481 139263 177341 237943 308306 361284 363692 312592 266211 274724 316670 353633
18737 353633 378561 393175 381264 348411 312683 280455 291935 380707 527279 671349 766510
18726 766510 809556 806634 765575 691559 593791 506603 475007 501159 551114 574115 533112 455374
18714 455374 377542 293104 192182 116744 106407 146110 188342 232426 322009 452293 564643
18703 564643 640193 701969 764449 797927 785742 759065 759640 801284 844221 871580 891621 892302
18691 892302 872919 847132 820099 807873 843491 917899 996241 1044951 1038437 979384 900074 835738
18679 835738 789930 765884 778680 828159 915592 1061054 1215419 1255466 1151092 992561 870190
18668H70190o2114m415L1847M8058P3062J08109J28475J06620O7166L3501j3640
18657A386859n9904q5661j02189j01762p2026n4263n7439m2127l0223k2523K6933
18646G85675J11729J46045Q4968P085m8618o6800k2424N1611Q1455O1023K3141
18635A214890K325J6878L2576r42o7089q6084l9182J1739J7848m368J1506O3223
18623A173320J02512J17943J17655J21189J01134M0577m2241j01231r5503j7496
18613A517859P1478J06349P9914P952p0940q8907m2490J0839M9286P4202Q5981
18602A801523P5891M0390J278l9475q4877r6722o1278j7644j0625m5565o9716
18591A493180m3142N760L1945L5959M0704M9819L5527q268k2083J380l082m6846
$$ plain form
18668 870190 808076 803661 835508 883566 956628 1064737 1193212 1299832 1366998 1400499 1386859
18657 1386859 1326955 1241294 1139105 1037343 965317 911054 853615 811488 781265 758742 785675
18646 785675 897404 1043449 1128417 1135502 1086884 1020084 997660 1049271 1130726 1191749 1214890
18635 1214890 1217215 1234093 1266669 1265727 1198638 1112554 1073372 1085111 1102959 1098591 1110097 1173320
18623 1173320 1275832 1393775 1511430 1632619 1733753 1774330 1732089 1630858 1535355 1517859
18613 1517859 1589337 1695686 1775600 1783552 1712612 1623705 1581215 1592054 1641340 1715542 1801523
18602 1801523 1877414 1917804 1919082 1879607 1794730 1698008 1636730 1619086 1608461 1562896 1493180
18591 1493180 1450038 1455798 1487743 1523702 1564406 1614225 1649752 1641484 1619401 1620781 1617699 1570853
18579A570853o9980l2679O2410J63885K07084J89506J25385J9662o4268p0311
18569B101547l0327J1610N6187J02006J21142J10396P6676J0881o2118j00126
18559B397874r4061m0241K9292N5063K5466p909j8826l562R031j1597l1939j8106
18547B290485N882J0437N084J7749L9638O1241P8578P4139P1766R7588J39218
18536B891805J24832N1591K1066O674m3766q2311q7896m0806N2924J35781J87103
18525C216997K19576J99621J45585R8998O4060M6538N1297L5438J018l390r270
18514D066468l4715m5808j090N8998Q1166J02952J47612J78326J51030J05691
18504D810630J02725J13622J00328J02238J66178K18252J91651J45465J36096
$$ plain form
18579 1570853 1500873 1468194 1530604 1694489 1901573 2091079 2216464 2236126 2171858 2101547
18569 2101547 2071220 2082830 2139017 2241023 2362165 2472561 2549237 2560118 2498000 2397874
18559 2397874 2303813 2263572 2292864 2347927 2373393 2365484 2346658 2343096 2352127 2340530 2308591 2290485
18547 2290485 2296367 2306804 2311888 2329637 2369275 2430516 2509094 2583233 2654999 2752587 2891805
18536 2891805 3016637 3068228 3089294 3095968 3052202 2969891 2881995 2841189 2894113 3029894 3216997
18525 3216997 3436573 3636194 3781779 3880777 3944837 3991375 4042672 4078110 4079128 4075738 4066468
18514 4066468 4031753 3985945 3984855 4043853 4125019 4227971 4375583 4553909 4704939 4810630
18504 4810630 4913355 5026977 5127305 5229543 5395721 5613973 5805624 5951089 6087185
18495F087185J48213J88899K51669L00528L08920K93727K99151L34281L74337
18486H586910L86450L74426L57286L09769K51565K37426K65427L01782L20029
18477A1391070L02248K57353K36775K70296K84358K55481K44660K49524K51570
18468A3743335K62255K69441K80845K92303L04357L22371L28165L11482K76173
18459A6390727K48787K56626L27314M48431N32902N53232O04153O96853P58640
18450B0817665P76810Q03364Q43360R01584R90277J095297J180268J258767J356759
18441C0024151J434232J522288J669330J852136J999313K121685K291567K516003
18433D5430705K730022K926526L184312L539255L958545M388404M825181N309350
$$ plain form
18495 6087185 6235398 6424297 6675966 6976494 7285414 7579141 7878292 8212573 8586910
18486 8586910 8973360 9347786 9705072 10014841 10266406 10503832 10769259 11071041 11391070
18477 11391070 11693318 11950671 12187446 12457742 12742100 12997581 13242241 13491765 13743335
18468 13743335 14005590 14275031 14555876 14848179 15152536 15474907 15803072 16114554 16390727
18459 16390727 16639514 16896140 17223454 17671885 18204787 18758019 19362172 20059025 20817665
18450 20817665 21594475 22397839 23241199 24142783 25133060 26228357 27408625 28667392 30024151
18441 30024151 31458383 32980671 34650001 36502137 38501450 40623135 42914702 45430705
18433 45430705 48160727 51087253 54271565 57810820 61769365 66157769 70982950 76292300
18425G6292300N879879O536817P296134Q191599R215635J0327241J1533959J2847682
18417A48121246J4271155J5836615J7538222J9282389K0937558K2414272K3688102
18410B82089559K4750240K5523610K5853776K5606482K4719551K3169259K0949050
18403D52661527J8104339J4720418J0854082O608473K151335k326794o695736
18396D96077644j0878937j4749446j8159457k0970885k3104472k4570323k5410207
18389C58233917k5657133k5364743k4599138k3469476k2113403k0620960j9026172
18382A97382892j7350651j5675207j4082214j2632176j1356280j0226324r205914
18375A06854126q267274p378367o565788n894501n330837m824837m380198m009464
$$ plain form
18425 76292300 82172179 88708996 96005130 104196729 113412364 123739605 135273564 148121246
18417 148121246 162392401 178229016 195767238 215049627 235987185 258401457 282089559
18410 282089559 306839799 332363409 358217185 383823667 408543218 431712477 452661527
18403 452661527 470765866 485486284 496340366 502948839 505100174 502773380 496077644
18396 496077644 485198707 470449261 452289804 431318919 408214447 383644124 358233917
18389 358233917 332576784 307212041 282612903 259143427 237030024 216409064 197382892
18382 197382892 180032241 164357034 150274820 137642644 126286364 116060040 106854126
18375 106854126 98586852 91208485 84642697 78748196 73417359 68592522 64212324 60202860
18367F0202860l701860l433552l188200k953844k723014k496494k264428k042433
18359C7399035j850860j702875j599972j500909j404513j336317j278940j201892
18351B5522757j115373j034688r33917q18197p41014o99929o46464n86893n55075
18342A8391207n61301n78414n55566m83550m05017l73520l63205l29779k82480
18333A4458375k06330j46004j63720k08327k37429k54947k70759k66891k51754
18324A2452214k70348l06557k99513k67133k57401k88152l20631l44117l74226
18315I724136m06133m13347l75047l05133k38170k08737k07942k10628k22690
18306G136309k25938j86698j24519p3263p8665j63477k47700k58684k35096k07027
$$ plain form
18367 60202860 56501000 53067448 49879248 46925404 44202390 41705896 39441468 37399035
18359 37399035 35548175 33845300 32245328 30744419 29339906 28003589 26724649 25522757
18351 25522757 24407384 23372696 22438779 21620582 20879568 20179639 19533175 18946282 18391207
18342 18391207 17829906 17251492 16695926 16212376 15807359 15433839 15070634 14740855 14458375
18333 14458375 14252045 14106041 13942321 13733994 13496565 13241618 12970859 12703968 12452214
18324 12452214 12181866 11875309 11575796 11308663 11051262 10763110 10442479 10098362 9724136
18315 9724136 9318003 8904656 8529609 8224476 7986306 7777569 7569627 7358999 7136309
18306 7136309 6910371 6723673 6599154 6525891 6447226 6283749 6036049 5777365 5542269 5335242
18296E335242j61475j04975o2302n0720p7733j28674j79495k11364k20760k17298
18286C920446j86913j37930j08659j14426j16539q4199j9392L3772L7348J0362
18276C233870j2428k5873m4058p1285p7776n1278l2245m2108p5260j07647r8054
18265B595858n7702k6251j3241P869N1786R6702J13539Q1767K7097l0987q5064
18254B761373j15953r6668n0236m2772q4214j00746n0659L112j4815p9230j27723
18243B001469j41709j09142k3917M7928M2114j8441n2395m3665m5137n7789o6719
18232A532597p9172p9039o6341n5548m9227n7599o8973m3883j3005n995J4465
18221A028280O5177Q8140L5810m0676o8739m4535o637P502J665L206M4303J13242
$$ plain form
18296 5335242 5173767 5068792 5006490 4955770 4878037 4749363 4569868 4358504 4137744 3920446
18286 3920446 3733533 3595603 3486944 3372518 3255979 3171780 3152388 3186160 3223508 3233870
18276 3233870 3221442 3195569 3151511 3080226 3002450 2951172 2918927 2876819 2801559 2693912 2595858
18265 2595858 2538156 2511905 2498664 2506533 2558319 2655021 2768560 2850327 2877424 2846437 2761373
18254 2761373 2645420 2548752 2498516 2455744 2371530 2270784 2220125 2223237 2208422 2129192 2001469
18243 2001469 1859760 1750618 1726701 1774629 1816743 1798302 1745907 1702242 1657105 1599316 1532597
18232 1532597 1453425 1374386 1308045 1252497 1203270 1145671 1076698 1032815 1019810 1013815 1028280
18221 1028280 1093457 1181597 1217407 1176731 1107992 1063457 1056820 1064322 1065987 1069193 1113496 1226738
18209A226738J47909J29082Q1473J9987j7557k7557l6129m3453m5330n2183p6356
18198A306624q6626o3315j611N3544N7288M9931L8007m774m0443o1256o3654n3167
18186A130548n4771m2680j2420L432O777P306j4822j5617L0059O4756N1513J6298
18174A170379k6257n3615n5602p3057r7979j02632q6324p9361p6997m4683K360
18163D76232M4705O9684K9759m5111n1622O5K7797K1803r430k9181o52K0151Q336
18150E62536p967j6369o195M2161R1286R3038O0302J7300l4449p5500q4758n3697
18138E87688j6688k1490l9656l0848L062J9689K0385M6645P1283O7175N9304J9666
18126G86215l1258l1404r330K628N023j4856l3443j7035L689l91O551J8640O269
$$ plain form
18209 1226738 1374647 1503729 1585202 1605189 1587632 1560075 1523946 1480493 1435163 1382980 1306624
18198 1306624 1219998 1156683 1155072 1208616 1265904 1315835 1353842 1349068 1308625 1247369 1183715 1130548
18186 1130548 1075777 1033097 1020677 1024109 1030886 1038192 1023370 1007753 1037812 1102568 1154081 1170379
18174 1170379 1144122 1090507 1034905 961848 863869 761237 674913 595552 518555 473872 476232
18163 476232 520937 590621 620380 575269 523647 523712 551509 573312 563882 534701 534049 554200 562536
18150 562536 554569 538200 532005 574166 665452 758490 818792 836092 801643 726143 641385 587688
18138 587688 571000 549510 509854 479006 482068 501757 522142 568787 640070 707245 766549 786215
18126 786215 754957 723553 714223 716851 721874 707018 673575 656540 660229 659838 666389 685029 691298
18113F91298n189O310K8712L4799J5186l8535j02339j20692q7392l9169J5442
18102C98431N2647L5433J179k582L7528R4218J09479P3878J3350l1747l8043l0164
18090G13607q107J2833l457k9357k0045J8103M0564L5464M632l9850o6394o6570
18078E91423n6730m1702j0963M9968Q1288M9414k779o3940j16545j03812l2233
18067C43389K0088L8979M8537O3051P1560M1199O029m147q416k0189l7331m6828
18055E15921n7769q0260o9469q944N8605P4207K4323n1760r4797r8663r8954q8710
18043B3730l9850J4120K1088J6326J2666r034l5413n2616k6159K3260L8400L8442
18031B4960K0207k2895m2828j5929K3097N1903P1135N9592L3991Q799j4759j1771
$$ plain form
18113 691298 686109 692419 721131 755930 771116 732581 630242 509550 422158 382989 398431
18102 398431 451078 486511 487690 485108 522636 616854 726333 800211 813561 781814 743771 713607
18090 713607 705500 718333 714876 685519 665474 683577 724141 759605 764237 724387 657993 591423
18078 591423 534693 492991 482028 531996 613284 662698 659919 595979 479434 375622 343389
18067 343389 363477 402456 450993 514044 585604 626803 632832 628685 620269 600080 562749 515921
18055 515921 458152 377892 308423 299479 358084 432291 456614 404854 310057 211394 112440 23730
18043 23730 -16120 -2000 19088 35414 48080 39046 3633 -48983 -75142 -51882 -13482 24960
18031 24960 45167 22272 -20556 -36485 -13388 38515 109650 169242 203233 212032 197273 185502
18019A85502L398j4355m8974n8319l1072J1770J1206j8249l6971m7535n0546k8893
18007a23038J0148M1569M0224Q530l0894n1869m7648o0930q3362o7700j8531K7135
17995c56366M9107O5549R3697J12640Q6465N3262M6112M8431M2477L5369M0322
17984C17065N1102N7687L5232l0168r3888q9776l0809L1758N5845L1068J2961
17973C48077L3304K7562l4691j03763j21179p2958j7351o744j9817k4010k4606
17962a6176l7915o7933q2325n1480K797K9453K8341K9542L5722L8388J3156j3903
17950i2333j8221l1229m3778k6968R088L1337M4650O1316O1759L8162K0585O411
17938F0779j0875k1921k3236q25L2433K2178n2504j16590j21385p8245q330O4196
$$ plain form
18019 185502 188900 174545 125571 67252 36180 47950 59156 40907 3936 -43599 -94145 -123038
18007 -123038 -112890 -71321 -31097 -22567 -53461 -105330 -152978 -213908 -297270 -364970 -383501 -356366
17995 -356366 -307259 -241710 -148013 -35373 51092 104354 150466 198897 241374 276743 317065
17984 317065 368167 425854 461086 430918 337030 247254 216445 248203 304048 335116 348077
17973 348077 381381 408943 374252 270489 149310 76352 59001 52257 32440 8430 -16176
17962 -16176 -54091 -122024 -204349 -255829 -253032 -223579 -195238 -165696 -129974 -91586 -78430 -92333
17950 -92333 -110554 -141783 -185561 -212529 -203441 -172104 -127454 -66138 -4379 33783 54368 60779
17938 60779 49904 27983 4747 3922 36355 58533 6029 -110561 -231946 -310191 -318521 -254325
17926b54325Q9028O7536L6485m208J753O2213J06950J09040P6456P995n9548o3695
17914A75680p944M2027O4409M6859p23k3292M744N1790O8729J0219j07582j90279
17902A34637j90957j31076o6491k1149J8400N7409J00712J09947M0657m7866r7355
17891i3132j04411p3972m6991m8825m1597j3952N620K7878K9898n658j8421J4626
17879c68937O8237J32434J83449J59621J00325P9397J23228K17658K82136K20749
17869A198297J5231j82224k52859k45264k18851j80434j04601k1728R432J722
17859A8721o757m647K9805O8065N8950J0078m2221o1053l1204o974j4848l3527
17847a5612o5408o7473p835L9719L5211L7281L3507o074j2232L9307N9611L870
$$ plain form
17926 -254325 -165297 -97761 -61276 -65484 -63731 -1518 105432 214472 290928 298923 239375 175680
17914 175680 167736 209763 274172 321031 320308 297016 301760 353550 422279 432498 324916 134637
17902 134637 -56320 -187396 -253887 -275036 -256636 -199227 -98515 11432 52089 4223 -93132
17891 -93132 -197543 -271515 -318506 -367331 -408928 -422880 -417260 -389382 -359484 -365142 -383563 -368937
17879 -368937 -300700 -168266 15183 174804 275129 354526 477754 695412 977548 1198297
17869 1198297 1213528 1031304 778445 533181 314330 133896 29295 7567 16999 18721
17859 18721 11964 7317 37122 105187 164137 174215 131994 70941 39737 32763 17915 -15612
17847 -15612 -81020 -148493 -156328 -116609 -81398 -44117 -10610 -16684 -28916 10391 70002 73872
17835G3872m9111m9816l0170j161q583j3490K2066M6237M2408M2349M6484K6195
17823A47280J1081L0687L4353k5042q7923p7147l0112l874J2226K0892J9797K0491
17811G2709J2764o88j6362k5751J4411P2174Q2668M2561j7992p1958q6608n4554
17799B3374k4945l9612p3906q3508k9410P9188J59978J72394J09638J3619l6995
17788B69815l8283l3323k2615k0302l4988k1474J341n335l1220m9773m3239l9279
17776f8675o2720p8187o4578j9385K6908L9929K0396k5978o9654n9989l383N0777
17764c14539O9421M3851K0310J4267J710m5302q3520m9410J6328N2503O0039M6034
17752a68308N1022P8632R2026N9962k7978r3040p3567k4836J9609O2137Q5267
$$ plain form
17835 73872 24761 -25055 -55225 -56386 -64969 -78459 -56393 -10156 32252 74601 121085 147280
17823 147280 158361 189048 223401 198359 110436 33289 3177 -697 11529 32421 52218 72709
17811 72709 85473 84785 68423 42672 57083 129257 211925 254486 236494 164536 77928 23374
17799 23374 -1571 -41183 -115089 -198597 -228007 -148819 11159 183553 293191 306810 269815
17788 269815 231532 198209 175594 155292 120304 98830 100171 94836 63616 13843 -29396 -68675
17776 -68675 -131395 -209582 -274160 -293545 -266637 -226708 -206312 -232290 -301944 -361933 -365316 -314539
17764 -314539 -245118 -201267 -180957 -166690 -164980 -210282 -293802 -343212 -326884 -274381 -214342 -168308
17752 -168308 -117286 -38654 53372 113334 85356 -7684 -81251 -106087 -86478 -24341 60926
17741F0926P1892K7650K466J3557J2986k3072p3681q8992m9070j0724p331k908
17729f6301J4778L5485P7397J04203O3478R925M77j5349o8799j09746r3576m7263
17717i5291j3599P586K5690M5402M3715J4557J3527M3881O8091P3849N7977J5899
17705C01284o901J0446L432l1460n3796o0021m5347l4473l2517j2384J3343O297
17693E7903r695j6175k2759k5090l0668k7595j5759q917k796L0358Q6753J21469
17681A37029Q0753j4453r0298j17297r6111l7990M6118J14545J18923O0040j1574
17670A89685l9102m5587m0694n077K6945L0254m719m6697o5032p6189q8336q2860
17658b47409o4333o0802p2501n6245j6711J4495N3382J11539J45605J25271Q0543
$$ plain form
17741 60926 132818 160468 162934 176491 189477 166405 92724 3732 -45338 -56062 -63393 -66301
17729 -66301 -51523 -16038 61359 165562 229040 238965 239442 224093 155294 45548 -48028 -95291
17717 -95291 -108890 -101304 -75614 -30212 13503 28060 41587 85468 153559 227408 285385 301284
17705 301284 294383 304829 308261 276801 223005 162984 117637 83164 50647 38263 51606 57903
17693 57903 48208 32033 9274 -15816 -46484 -74079 -89838 -98755 -101551 -71193 15560 137029
17681 137029 217782 203329 113031 -4266 -100377 -138367 -92249 22296 141219 201259 189685
17670 189685 150583 104996 64302 59225 86170 116424 111705 65008 -24 -76213 -164549 -247409
17658 -247409 -311742 -372544 -445045 -501290 -518001 -503506 -450124 -338585 -192980 -67709 12834
17647A2834K7156k8616m3794m7288p0968n3514J3236O8039Q2459O4049N1656O2879
17635A38128Q4685P9285L4289J1446K521m3469j10292j55081j77216j66467j25119
17624d27290o5438J239M2559O1707R2421J16626P9335j3373r4367q8877j2673
17613c08131O6813R5840O3540n71p0619r8743o7311l2404m0964o2496o2712l6569
17601e54327O085L8955Q1792J13172P5676J270l3544k0497o375k0532k6860J0913
17589c34272O4652Q3460N8188M1912M3265K1019j1045n728L1545P3339P4758J5935
17577A57028n1913q9044n9100J2756O1836O9432M9132N124j8375K0193P0606P8340
17565C06015N1045j4683q6674j04350p2391l6363j390L4500L2154L520k4458m9752
$$ plain form
17647 12834 39990 11374 -32420 -79708 -150676 -204190 -190954 -122915 -40456 23593 75249 138128
17635 138128 222813 302098 336387 347833 350354 306885 196593 41512 -135704 -302171 -427290
17624 -427290 -492728 -491489 -448930 -387223 -294802 -178176 -98841 -112214 -206581 -295458 -308131
17613 -308131 -241318 -145478 -81938 -82509 -153128 -251871 -319182 -351586 -392550 -455046 -517758 -554327
17601 -554327 -548242 -509287 -427495 -314323 -238647 -237377 -270921 -291418 -297793 -318325 -345185 -334272
17589 -334272 -269620 -186160 -127972 -86060 -42795 -21776 -32821 -38549 -7004 66335 141093 157028
17577 157028 105115 16071 -43029 -30273 31563 100995 150127 155251 136876 157069 227675 306015
17565 306015 357060 342377 255703 151353 78962 42599 41209 75709 107863 111383 86925 37173
17553C7173m1834n862M499j1977j8468j1828k3058l6195l5869j8765J0972L4080
17541a17132M5855K2465k6662n7318n6973n9089o9233o5305m0870Q404P2186J16865
17529b26807J11955O2563k006n2589m2285J1861M9103O9901R4352R2258P3706
17518B42012O6540M5646L342j6453j3046j9441n9716j09778j22922j01833n8491
17507a44140j649N1548Q0397M7038l4634p4377j4141M6055N9744O1570L0929p586
17495A00754k6902l3054k1488j9987p7006j49246j64891j19168o5190n5670n3641
17484f85489P809J11030J54684R7211K2275j4426k5831j1057L1772N3694L4710
17473b23618O057P204K6244N9932J15488J59040J41930N4359m6960j01226r9179
$$ plain form
17553 37173 -4661 -10523 -6024 -18001 -36469 -48297 -71355 -107550 -143419 -162184 -151212 -117132
17541 -117132 -71277 -48812 -75474 -132792 -189765 -248854 -318087 -383392 -424262 -415858 -343672 -226807
17529 -226807 -114852 -52289 -54295 -106884 -149169 -137308 -88205 -18304 76048 168306 242012
17518 242012 308552 354198 357540 341087 328041 308600 248884 139106 16184 -85649 -144140
17507 -144140 -145789 -94241 -13844 33194 -1440 -75817 -89958 -43903 15841 77411 108340 100754
17495 100754 73852 40798 19310 -677 -77683 -226929 -391820 -510988 -576178 -631848 -685489
17484 -685489 -677680 -566650 -411966 -314755 -292480 -306906 -332737 -343794 -312022 -258328 -223618
17473 -223618 -217561 -210357 -184113 -124181 -8693 150347 292277 346636 299676 198450 99271
17462I9271r8522j19057j31927j07053n8284k9275j7785m592J7171P1124J39766
17451b39163J52643J11216O9222M6823M104o1302r4431o8393j4665L7106O0888
17440D048P4610Q9744Q6464M3813k4968m8521j7854K836n48j3168l4343n0214
17428A11899n9042n0314k9135k6878k8892j2208J1109J2730o4k488n033q748J4032
17415g3032N7569Q1922O3924J9613j8251k1380J204K6010N0619N7247L5456K3957
17403C04858M1763P7213P0361P724o1578r2688q2429p7726q2497m6003l756j4666
17391D0576m2116m0875j2769j72j6394l7033p2958r9720r3381n4627p84K6254
17379d03999J8727J8139K4983K716j9240j1806J0102K8093L1447J3541j3926k8446
$$ plain form
17462 99271 749 -118308 -250235 -357288 -415572 -444847 -462632 -467224 -450053 -378929 -239163
17451 -239163 -86520 24696 93918 140741 144845 83543 -10888 -79281 -93946 -56840 4048
17440 4048 78658 168402 254866 298679 273711 225190 207336 210172 209624 196456 162113 111899
17428 111899 52857 2543 -26592 -53470 -82362 -94570 -83461 -70731 -70795 -73283 -78316 -87064 -73032
17415 -73032 -15463 66459 130383 149996 131745 110365 111569 137579 188198 245445 280901 304858
17403 304858 346621 423834 494195 501919 440341 347653 265224 187498 105001 58998 55242 40576
17391 40576 -1540 -42415 -55184 -55356 -71750 -108783 -181741 -281461 -374842 -429469 -430253 -403999
17379 -403999 -385272 -367133 -342150 -339434 -358674 -370480 -360378 -332285 -300838 -287297 -301223 -329669
17367c29669l3156k2894K577J8057K5668M0528M8325K9240k455q561m468k1635
17355b58443k0230K0696N9886Q0597O6889L5501L1195K5062j0598m9221m5539
17344f4205l2590m1819n3441o2720l7640n271k094n350K173J7052J4530m721l1942
17331c08038m1023L7052J74715K46430J89818Q4337m289p3901r2336n5281l519
17320A53965M0456N4057K6504r052m7281r4224j05345q8642o7652k7357J8396
17309a46175L6682p51n5797p9150m2506K6207N2065M0483J5989L92J5524K3233
17297a13804k1818q6572r8945k9742P1132J16633R0249J9763m3484o0906m0051
17286a97545k7640l5806j8336L8792Q3551N8090j8449o5564l7224K1609M9227
$$ plain form
17367 -329669 -362825 -385719 -383142 -365085 -339417 -298889 -250564 -221324 -223779 -232340 -236808 -258443
17355 -258443 -278673 -257977 -198091 -117494 -50605 -15104 16091 41153 30555 -18666 -64205
17344 -64205 -96795 -138614 -192055 -254775 -292415 -297686 -299780 -305130 -302957 -285905 -271375 -276096 -308038
17331 -308038 -349061 -312009 -137294 109136 298954 383291 379002 305101 212765 157484 153965
17320 153965 194421 248478 274982 265930 218649 124425 19080 -69562 -137214 -164571 -146175
17309 -146175 -109493 -110244 -166041 -245191 -287697 -261490 -209425 -168942 -152953 -152561 -137037 -113804
17297 -113804 -135622 -222194 -321139 -350881 -279749 -163116 -72867 -53104 -96588 -157494 -197545
17286 -197545 -225185 -260991 -279327 -240535 -156984 -98894 -117343 -182907 -220131 -198522 -149295
17275a49295L0417j2444k5814j5020j1388P918M8765P5562Q8094R2088O1224J7861
17263B07968k7327o6595q4931q0294n6768l1228o33O2262J34900J43589O8281
17252B69224l2750q2766p6806o1468o2368o7125q3559j09471j10470o6327M394
17241d79492N9021O3301M3938M3653L8137J196l5800m6146m8384n8099o0040m2842
17229e21557J0090N6600P0334P6791P4223P9957J14904J43751J33436J05864Q8398
17218D32791R0520O5996K739l6836j4696K7257N738p5382j15154p5911k2463p223
17206B77376k8228j6859L3287M7198K8812K2712L2645J5314m0467q3023q7741
17195B01026q0978n9917j0144L9444O2119N9811N0264L5863L0996J0280k3356
$$ plain form
17275 -149295 -118878 -131322 -157136 -172156 -183544 -175626 -126861 -51299 36795 128883 190107 207968
17263 207968 180641 114046 29115 -51179 -107947 -139175 -139808 -77546 57354 200943 269224
17252 269224 236474 153708 76902 15434 -46934 -114059 -197618 -307089 -417559 -483886 -479492
17241 -479492 -420471 -357170 -313232 -269579 -231442 -230246 -266046 -312192 -360576 -418675 -478715 -521557
17229 -521557 -511467 -454867 -384533 -307742 -233519 -153562 -38658 105093 238529 344393 432791
17218 432791 523311 589307 592046 555210 540514 567771 573509 498127 382973 307062 284599 277376
17206 277376 249148 232289 265576 312774 341586 364298 396943 412257 371790 288767 201026
17195 201026 120048 60131 49987 89431 151550 211361 261625 297488 328484 338764 315408
17184C15408l9410n3153o6015m7060l0558k1485p823r648q364J0151K9726L2147
17172A03916K2600K0028L3100O8049J06754R1609K9057k1951l5735l2522l3177
17161C51728m5076n3335l9962k708L2051L0837K737k1810k6181l5439m5829k2153
17149A24860J8375L5986J8077N176J9300K1531l70l8635o1844n7690n6246n3972
17137b5452k5770m284L824M1733Q5389R1623O2173M192k8203j6564P641L9114
17125B35416N8716M6690J6039m805k3524o5715j05310j08548r7719q7857m9670
17114a86287k517L5985O1794M2205J2756o16O162K7310K8353L4858N2003M3144
17102A55150L0580L1772L5873L3879K2354q282o1037j13642j06440m1352K0816
$$ plain form
17184 315408 275998 222845 156830 109770 79212 57727 49904 40256 31892 42043 71769 103916
17172 103916 126516 146544 179644 247693 354447 446056 475113 453162 417427 384905 351728
17161 351728 306652 253317 213355 210647 242698 273535 276272 254462 228281 192842 147013 124860
17149 124860 143235 179221 197298 202474 221774 243305 242935 204300 142456 84766 28520 -25452
17137 -25452 -51222 -55506 -51682 -9949 75440 167063 229236 233428 205225 188661 196302 235416
17125 235416 294132 340822 356861 352056 328532 262817 157507 48959 -48760 -136617 -186287
17114 -186287 -188804 -152819 -91025 -48820 -36064 -36680 -30518 -3208 25145 60003 112006 155150
17102 155150 185730 217502 253375 287254 309608 301326 240289 126647 20207 -21145 -329
17091c29N2463N6684N2259M0763J3682l695J2356J4302l1059o8486l9414R248
17079A08774J6688P57m28l359l4709l3166L4296P4906M7935j856n4276p2572l0477
17066E2513J2371L839n206J5448J7877j5807n3032p5690o7188k4902M576R784
17054a25417K3144L1643K3219J5926J671q785O669K7011N7130P9260N9578L4584
17042B25633J8148K669J8468M2245M2820K4195n487l5860o7561p1756n6158m8296
17030H9060k6736k0758n8889p6411o0358n5661n2172j5907K2891K0605J8332O3472
17018a52532J26534J43725J07477M5940m6915j09830p6199j6457J5198L3762L5365
17007A06068J2521k5044l5974J1854R8379J62926J52942R7446M8722R083j1011
$$ plain form
17091 -329 52134 108818 161077 201840 215522 211827 224183 238485 207426 138940 99526 108774
17079 108774 125462 126219 125791 122432 87723 54557 88853 163759 211694 209838 155562 82990 52513
17066 52513 64884 68723 63517 78965 96842 81035 28003 -47687 -114875 -139777 -135201 -125417
17054 -125417 -102273 -70630 -47411 -31485 -29814 -38599 -31930 -4919 52211 131471 191049 225633
17042 225633 243781 246450 264918 307163 349983 374178 368691 332831 265270 193514 137356 89060
17030 89060 62324 41566 -17323 -93734 -154092 -209753 -261925 -277832 -254941 -234336 -216004 -152532
17018 -152532 -25998 117727 225204 271144 224229 114399 38200 21743 36941 70703 106068
17007 106068 118589 93545 57571 69425 167804 330730 483672 581118 629840 638923 627912
16996F27912j6819j7996j0503n558J2117L4510J1920o2958j25178j31573p5471
16985B40403j0191J3218j9296m9949k7058J4389K1446q983m7995o2170l5828q381
16973A9605M287J7858L9833O2159P6603P5250L5641j798J736O312j6795l7033
16961B83658k6308l812J5419M2985P6203P5670N2843N7862O9283K7578l3720n9670
16949E77991o2858n7533j8617K3667K1730m017k7717m1879n2218l2397K1697N1110
16937C98959K4553m6525j18715j21874o1684o053J2062M462k6468n4992m1294
16926c7569K579M2426O1293N1733L1660J3099l0584o8144n2695m699M0652O9113
16914A18864O8242L8157R959k5406o9884o5772j4125L5763M7059K2674l199R962
$$ plain form
16996 627912 611093 593097 582594 577036 589153 623663 635583 572625 447447 315874 240403
16985 240403 230212 243430 224134 174185 147127 161516 182962 173979 125984 63814 27986 19605
16973 19605 23892 41750 81583 143742 220345 295595 331236 329438 331174 337486 320691 283658
16961 283658 257350 253538 268957 311942 388145 463815 516658 574520 643803 671381 637661 577991
16949 577991 515133 457600 438983 462650 484380 480363 452646 410767 358549 326152 347849 398959
16937 398959 423512 376987 258272 136398 74714 68661 80723 85185 58717 3725 -37569
16926 -37569 -34990 7436 68729 120462 152122 165221 134637 66493 13798 9099 49751 118864
16914 118864 187106 225263 235222 209816 139932 74160 60035 95798 142857 165531 162332 172294
16902A72294L4132K7167J0309j1651l4872l7599l1538k0903L2149J09386J50743
16891C99617J20758N0424p605p2797j37329j32807o7505k2202j0293L442Q763
16880A32466k3014p1315q6381o9443m1695R21K9414L6043M8553Q8451J40795J65485
16868C50280J42343Q3845L3448M5970P7614N8841K6458Q212l5370j12127j66461
16857E13053j58904j13426o1681k0917K1785Q7096J35649J19300O0270J086o5121
16846E18190j36557j69984j43161o7432j733K5586K1084p119m5196p2154p6518
16835a54994m8236m329J9097J8883K1396K4163R631j3662k6358p692K2522M6646
16823i2933P0458Q2609P6538P3671O5138M3576J6698L411K3906P7073J06043J03193
$$ plain form
16902 172294 206426 233593 243902 232251 197379 159780 128242 107339 139488 248874 399617
16891 399617 520375 570799 563194 490397 353068 220261 152756 130554 120261 123703 132466
16880 132466 109452 38137 -48244 -117687 -159382 -158461 -129047 -93004 -44451 44000 184795 350280
16868 350280 492623 576468 609916 655886 733500 792341 818799 827011 791641 679514 513053
16857 513053 354149 240723 179042 158125 179910 267006 402655 521955 582225 583311 518190
16846 518190 381633 211649 68488 1056 -677 24909 45993 38874 -6322 -78476 -154994
16835 -154994 -203230 -207559 -188462 -169579 -148183 -124020 -114389 -128051 -154409 -162101 -139579 -92933
16823 -92933 -22475 60134 136672 210343 275481 319057 335755 339166 363072 440145 546188 649381
16811F49381Q9627N5976p009n8157o6579o5431p5447p1498o7995n3682p368J3532
16799C35350k0824l9730k8115o576K6823L6728r28n2152o0084l2842j6722J5050
16787A55978M8081O0923O1884K4690k9318l2327j5216m5012r2619r8577o0834
16776b2347n934M3786N7354M2979K565l3636j2746J6698P888M722K0266K0716
16764A42311r512l0438j3353J2040P43j9017j5491q09K1955M3576M6509J5841
16752A94355l1783m0801j2956j3196n1555o9407n9120m4140l4021l8361m7714
16741b48699k8421N2966J20813Q3620p529m9070m7509m5841l6782j7510K0676
16730b03286O1353O1658K7304j3957m0002o2711q8263q2178n9490r556M9337P4099
$$ plain form
16811 649381 739008 794984 787975 729818 663239 597808 522361 450863 382868 329186 321818 335350
16799 335350 314526 274796 246681 240105 266928 303656 302728 250576 190492 157650 140928 155978
16787 155978 204059 264982 326866 351556 322238 289911 274695 229683 137064 38487 -22347
16776 -22347 -28281 15505 72859 115838 118403 84767 72021 88719 96607 101329 121595 142311
16764 142311 132799 102361 89008 101048 101791 82774 67283 66474 88429 132005 178514 194355
16752 194355 162572 121771 108815 95619 44064 -25343 -84463 -128603 -162624 -200985 -248699
16741 -248699 -277120 -224154 -103341 -19721 -27250 -76320 -123829 -169670 -206452 -223962 -203286
16730 -203286 -141933 -80275 -52971 -66928 -106930 -169641 -257904 -340082 -399572 -409128 -359791 -285692
16718b85692R0284J13903J07019M0433m5037o2049j8257J724p724k0685o6246
16707a52327j18225j08818n4908j8881K156L9146N5679J7929m1097n1916j5269
16696d46531L6271P8087Q8669R8651J04821P5214K6219L044K4290L3457l125o1503
16684E7564j03897p2252J3174P3684Q1299M9155k967m4073n6328n5765o4545p8359
16672b03310n8092J7594J02906J55624J27194M6540K6350N4548M2742j6515o2457
16661B33124p8226r3066j01232q9091m6170J2520O0083R0888J02537P4519K6837
16650A92723K7409P0761Q3262K8978k9361l5313j6059K053N086j5523n1151o1214
16638B01651l7595n208j108l6216o2294o6157m4043k0810k8154l5339j9227q973
$$ plain form
16718 -285692 -195408 -81505 25514 65947 20910 -41139 -59396 -57672 -65396 -86081 -152327
16707 -152327 -270552 -379370 -434278 -453159 -451003 -411857 -356178 -338249 -379346 -431262 -446531
16696 -446531 -410260 -332173 -243504 -144853 -40032 35182 61401 64445 88735 122192 119067 57564
16684 57564 -46333 -118585 -105411 -31727 49572 98727 95760 51687 -4641 -60406 -124951 -203310
16672 -203310 -261402 -243808 -140902 14722 141916 188456 214806 269354 312096 295581 233124
16661 233124 154898 61832 -39400 -128491 -174661 -162141 -102058 -11170 91367 165886 192723
16650 192723 220132 290893 374155 403133 373772 338459 322400 324453 329539 314016 262865 201651
16638 201651 164056 158848 157740 121524 59230 -6927 -50970 -71780 -99934 -135273 -154500 -163473
16626a63473k7855n4438n5849l5451P904Q2309J55211J62021J04825N1084J3774
16615B40062r451l8576p8340r0860o7396k2822J5527K7334l740o0265o7436n5842
16603b11805o4190m8936l8761m7593m6509k3000R934L4054N5205P7473O7255L1776
16591b05097L0951N8964P8469P5474M1743K271o865j5272n0626p6862o6773m0537
16579a74160p740M1512P4866N5749p903p1256j15490j28903q9056j0738N1944
16568c81175O8145N3829J6935j7854l8582k4092K9829P1356P1201K7518m3133
16557a66023r1787q4826n8152o3439q3226p9358n0298j3468N862K7557O9506R0332
16545d97320Q8906Q5552O2279Q346l2903k7750j4890j9451k4692j2728J229J6576
$$ plain form
16626 -163473 -191328 -245766 -301615 -337066 -329162 -246853 -91642 70379 175204 226288 240062
16615 240062 230611 192035 113695 22835 -44561 -67383 -51856 -24522 -28262 -88527 -155963 -211805
16603 -211805 -275995 -324931 -363692 -411285 -457794 -480794 -470860 -436806 -381601 -304128 -236873 -205097
16591 -205097 -174146 -115182 -36713 38761 80504 82775 75910 60638 10012 -66850 -133623 -174160
16579 -174160 -181900 -140388 -65522 -9773 -17676 -88932 -204422 -333325 -422381 -433119 -381175
16568 -381175 -313030 -259201 -242266 -260120 -298702 -322794 -292965 -221609 -150408 -122890 -166023
16557 -166023 -257810 -342636 -400788 -464227 -547453 -626811 -677109 -690577 -684715 -657158 -587652 -497320
16545 -497320 -408414 -322862 -260583 -252237 -285140 -312890 -327780 -347231 -371923 -384651 -383422 -366846
16533c66846L2946P2239J39733J72722J39487O0744k0288n8714j8727M1501L2833
16522B27630j5375n3815q0519q9586r3234q7698p7703p4258p3551p3181m3811
16511e35101Q878J8023l1082n4949p992M3366O3422P1310O3560N7902N6351M2296
16499b04016M2262O1178O9028M4771r601n3220n2504l7534k9359j054M8977P5713
16487d5359P0639M9646K7977J7010R6Q907L3275N0991O7636N4165m314o1826q4748
16474A84095q5795n4160k106R324j0998r995l091O179L3008N8520N7368K0987
16462B03336l8150q7225r5484o3605l8164l9333n3762p1667n9422j7744K6194
16451c35026P8261J27346J12758L8622j5462m3145p2413j03863r6487l6130K3447
$$ plain form
16533 -366846 -333900 -261661 -121928 50794 190281 251025 230737 172023 153296 194797 227630
16522 227630 212255 158440 77921 -11665 -104899 -192597 -270300 -344558 -418109 -491290 -535101
16511 -535101 -526223 -508200 -539282 -594231 -602223 -558857 -495435 -424125 -360565 -302663 -246312 -204016
16499 -204016 -161754 -100576 -31548 13223 3622 -49598 -102102 -139636 -168995 -170049 -121072 -45359
16487 -45359 25280 74926 102903 119913 120009 128916 162191 213182 280818 334983 330669 268843 184095
16474 184095 98300 44140 42034 51358 40360 30365 27274 33453 66461 124981 182349 203336
16462 203336 165186 77961 -17523 -81128 -119292 -158625 -212387 -284054 -343476 -361220 -335026
16451 -335026 -256765 -129419 -16661 21961 6499 -36646 -109059 -212922 -309409 -345539 -322092
16440c22092N1786O1925M8311O894J0771O5595R4567O9408K2325j6575l9473m1726
16428A1716l3296k3285j5840o028J5985M5825P2468O1300J3806k7365l2475k7580
16416E5231l9334n6185m6919l1809l6460k2773k115j2458m6963p1278n3949m799
16404c69811L4754K9584j2298m2468k4533K0926N1127N0754L0945o406m5522l5970
16392c18918l650L483K768K5892N2542O7221O7582P0117J00829J23529J01147
16381B92542N2105l379m2113l4184j3991k2357k5431k2196n5238r2862n1365L3983
16369A5514P2628N3352J4674j3890k3130j1064K0366N1640M6449J1605j6576k840
16357B18728J3730j9988n8231m9198j3291J5673L9945O6238P5508L4401j9040
$$ plain form
16440 -322092 -270306 -208381 -160070 -153176 -142405 -76810 17757 87165 109490 92915 53442 11716
16428 11716 -21580 -44865 -60705 -66733 -50748 -4923 67545 128845 142651 115286 82811 55231
16416 55231 15897 -40288 -87207 -119016 -155476 -178249 -180364 -192822 -239785 -311063 -365012 -369811
16404 -369811 -335057 -305473 -317771 -360239 -384772 -363846 -312719 -261965 -231020 -237426 -282948 -318918
16392 -318918 -322568 -319085 -316317 -290425 -237883 -170662 -103080 -32963 67866 191395 292542
16381 292542 344647 341268 299155 264971 250980 228623 203192 180996 125758 32896 -18469 15514
16369 15514 88142 141494 156168 142278 119148 108084 128450 180090 226539 238144 221568 218728
16357 218728 232458 212470 154239 105041 91750 107423 147368 213606 289114 323515 304475
16346C04475l3188m031J9962r744p0319r5600q0357m8244l9000m3525K953N6707
16334c9911O6547O8184Q7647R2465P2615L9903j9872p0608n6702K778J0600m7018
16322B06628r5848j25704j26689r4280n7802n4599o2874m5368k9294l1890j8092
16311e35812J6537N9522R2305J04585R7638P5013M2848J2074k3295o3456p8726
16300b00767n8163m5059m2714j4649J610m948o540M261N1411J08189J18609P0243
16288a8517j5447p7847q7023o4764l8545J503M2425N4681N4626M3714J2986K885
16276h9323K8501O7318R2189P6484M3555M5233Q1617R3821P0339L0753j1598k6100
16264E02789k0356j3449j8931l0105m2088n4547m6835l2451l7129l8555j9730
$$ plain form
16346 304475 271287 267256 287218 277474 207155 111555 31198 -17046 -56046 -99571 -96618 -39911
16334 -39911 26636 94820 182467 274932 347547 387450 367578 296970 240268 243046 253646 206628
16322 206628 110780 -14924 -141613 -235893 -293695 -348294 -411168 -456536 -485830 -517720 -535812
16311 -535812 -519275 -459753 -367448 -262863 -165225 -90212 -47364 -35290 -58585 -122041 -200767
16300 -200767 -258930 -303989 -346703 -361352 -359742 -364690 -371230 -366969 -315558 -207369 -88760 -18517
16288 -18517 -33964 -111811 -198834 -263598 -302143 -300640 -258215 -203534 -148908 -105194 -92208 -89323
16276 -89323 -60822 6496 98685 175169 218724 263957 345574 439395 509734 540487 528889 502789
16264 502789 482433 468984 450053 419948 377860 323313 276478 244027 206898 168343 148613
16253A48613L2k299k1466j8076p217j2057k0808m4497o9795m3854j517J1854k616
16240h3703k1832k5393j7563J9653P7352J19328J20718P4288M0866L2532P447
16229C43693k8850n2216o4033o0219m0245m5289o6788o4554p3632j09810j07858
16218c69801n7847q697J4871K2186L5235N9794Q7211Q0374L0688K625J7764M9061
16206c6536Q1948P4115L4578J2353J6875J5188j1473l0052k0642k5073l9726j6002
16194E5553J5249O035o820J1543P259m2939p3069k7003N6333O6569m587o4395
16182b72p1614m8145k2357Q155L6107N5695O3314M0178M74j2638q57K3929O3663
16169A35632O8445L0847m289l2295m6203m7150l7048j4508j286p453j0238o277
$$ plain form
16253 148613 148645 146346 124880 106804 99587 87530 66722 22225 -47570 -91424 -92941 -81087 -83703
16240 -83703 -105535 -130928 -148491 -128838 -51486 67842 188560 262848 303714 336246 343693
16229 343693 314843 262627 198594 138375 98130 52841 -13947 -78501 -152133 -261943 -369801
16218 -369801 -427648 -436345 -421474 -399288 -364053 -304259 -217048 -136674 -105986 -103361 -85597 -36536
16206 -36536 45412 119527 154105 166458 183333 198521 187048 156996 136354 111281 71555 55553
16194 55553 70802 76837 70017 81560 88819 45880 -27189 -54192 2141 68710 64123 -272
16182 -272 -71886 -120031 -142388 -134233 -98126 -42431 20883 61061 61535 48897 48040 71969 135632
16169 135632 204077 234924 230635 198340 152137 104987 67939 53431 52145 44692 34454 28177
16157B8177j1774k4831l7202m0037l6494j8285R525J3115p081k4347o541M1003
16145a14772P7969P6056M3152J1426k7640p4648r1357o6074j4953R891k0285l6186
16133b27421O478K3624k7123o7797n1776l5601n1262n3678j9164O4507J45548
16122b93665J69424J30067N6354o157l9771n0628m9443l6985j0980K3922O2543
16111d5319R2215Q1741J5565q1441j34256r0733j163M5417N0951M6820M5618M1659
16099F7074K4421q823p0227j09638n8936L2958P4082M7491O117l5464r0634j03857
16087b25436n3795N771N0485P9138P5199M2065J2752j0592j7184K2554N6319J3354
16075E0630l5678l4208j9832R298M3024L8730l16l6853m7502k1072K6334M8085
$$ plain form
16157 28177 16403 -8428 -45630 -85667 -122161 -140446 -130921 -117806 -124887 -149234 -155775 -114772
16145 -114772 -36803 39253 82405 93831 66191 -8457 -99814 -165888 -180841 -170950 -191235 -227421
16133 -227421 -220943 -197319 -224442 -292239 -344015 -379616 -430878 -484556 -503720 -439213 -293665
16122 -293665 -124241 5826 62180 56023 16252 -34376 -83819 -120804 -131784 -107862 -45319
16111 -45319 46896 128637 144202 62761 -71495 -162228 -163391 -117974 -67023 -20203 25415 67074
16099 67074 91495 82672 12445 -97193 -156129 -123171 -49089 -1598 4519 -30945 -121579 -225436
16087 -225436 -279231 -273460 -222975 -143837 -68638 -26573 -13821 -24413 -41597 -19043 37276 50630
16075 50630 14952 -19256 -39088 -29790 13234 51964 51648 14795 -32707 -53779 -27445 20640
16063B0640N0271O3461P1390M8556M186j1681N456O651j1648l3625m5937k9715
16051A38005J6707O7011Q0325O4773M4459K819n2558q2600n6193j0563R978m545
16039B17618n7538j03859j04266p1331l5294l5397m7181j5555L1146N6503O2186
16028a02968L9950P942R587L0380L6085K0180L109Q008J4933J0213P269K653k3389
16015F3952m7505m2065l4447l7546r6P8522J35429J52944J21827N1034r222m4900
16003C87927n5188m6497j5823J1192j9721r4956j30880q2711j6176L342q70j1870
15991g2231k2416j9405n770L0394Q0241Q4450K8947l2558o6677o4807l0633J135
15979h9330P37n268j72l1K5567O1695P1950O5483M3878N959l791L6292P9674R5478
$$ plain form
16063 20640 70911 134372 205762 254318 258504 246823 252279 258930 247282 213657 167720 138005
16051 138005 154712 221723 302048 366821 411280 414099 361541 278941 222748 212185 222163 217618
16039 217618 160080 56221 -48045 -119376 -154670 -190067 -237248 -252803 -221657 -165154 -102968
16028 -102968 -63018 -55076 -45489 -15109 20976 41156 44265 52273 67206 77419 84688 87341 63952
16015 63952 16447 -25618 -60065 -97611 -97707 -19185 116244 269188 391015 442049 432827 387927
16003 387927 332739 286242 270419 281611 261890 166934 36054 -46657 -62833 -59491 -60361 -72231
15991 -72231 -94647 -114052 -119822 -89428 -9187 75263 104210 71652 4975 -59832 -90465 -89330
15979 -89330 -88593 -93861 -94033 -94064 -68497 -6802 65148 130631 174509 180468 176677 212969 292643 388121
15965C88121Q0734M8063J9943k2113j04833j85858k03209j59778j02481m0756
15955b82167Q367J0610j5852q563L5234P0307O8442M1841L4951O0626Q0268O2551
15943A66615R786m3487m3851J0030N2139P0929L9733j7027k5243k5445l0623p184
15931A56372L4412Q7772J09832P0636q820m9104k5523k0265n0096n5733o0561
15920A88922j08098j36808j04615n7340m66M9826N4558J5117l4130n8862n0934
15909b42830j1937N0600R5777O8676j1291o3094n5608k1149k189j1893k8119k3921
15897b56978j2624p682P814J4878J2992O392j0056k5061m2547m5659j3837M0332
15885c32036Q4634O3499j0925o2798p4342n8542l3125k6609j4466N296j4361l0625
$$ plain form
15965 388121 468855 516918 536861 514748 409915 224057 20848 -138930 -241411 -282167
15955 -282167 -273800 -263190 -279042 -287605 -252371 -182064 -113622 -71781 -36830 23796 104064 166615
15943 166615 176401 132914 89063 99093 151232 222161 261894 244867 219624 194179 163556 156372
15931 156372 190784 278556 388388 459024 450204 401100 375577 355312 305216 249483 188922
15920 188922 80824 -55984 -160599 -217939 -218405 -168579 -114021 -98904 -133034 -191896 -242830
15909 -242830 -254767 -204167 -108390 -39714 -51005 -114099 -169707 -190856 -193045 -204938 -233057 -256978
15897 -256978 -269602 -277284 -269470 -254592 -241600 -235208 -245264 -270325 -312872 -358531 -372368 -332036
15885 -332036 -247402 -183903 -194828 -257626 -331968 -390510 -423635 -450244 -464710 -459414 -473775 -504400
15873e04400J0068N2371N9926P2716J15711J47144J26013Q1169K7065k7136n5613
15862A05034n0298l1402l0141m1671l1914K9100R9296J00440L7989m5532j11273
15851B9628r9725k3106L9722L5650q396m5168l5348K2059Q2416P7953Q432o6735
15839A7382j15755j08889n0669R53k147m1024o5400m6130m083L9529Q9366Q8459
15827a98408M3294L0781N3654O6758O2120M6040J4591M659L6867P2619R1934O9533
15815C94442o767n4544o6233o6597k9732J7995M3980M0961K6988K7247J8806k2784
15803C23762o5323q9447j00821r2776n0619K542J7420J676k5975m3456j2927K6776
15791a09168P022k2323J0882M9049M2020L5087O0444N5552r615n9720m6788j0472
$$ plain form
15873 -504400 -494332 -441961 -382035 -309319 -193608 -46464 79549 160718 187783 160647 105034
15862 105034 54736 23334 -6807 -48478 -80392 -51292 48004 148444 186433 140901 29628
15851 29628 -70097 -93203 -53481 -17831 -26227 -71395 -106743 -84684 -2268 75685 84117 17382
15839 17382 -98373 -207262 -257931 -256978 -259125 -300149 -365549 -411679 -415762 -376233 -286867 -198408
15827 -198408 -155114 -124333 -70679 -3921 58199 104239 118830 123489 160356 232975 324909 394442
15815 394442 387675 333131 266898 200301 170569 188564 232544 273505 300493 327740 346546 323762
15803 323762 258439 168992 68171 -24605 -75224 -72682 -55262 -53586 -79561 -123017 -135944 -109168
15791 -109168 -102146 -124469 -113587 -64538 -22518 12569 73013 128565 118950 59230 12442 1970
15779A970n668l2392m4620k4966j4312j4313j0465k5564k8806J5470N7986N8507
15767f7173K4639j9845m1346k4165J2272M9741O9948M9414j2631n3754l8465q991
15755f0356k60q162j6196o205L6037J06471J78589J94472J36774M0545l5258o0966
15743E05485o9972q8409r2207p0746m7062l3577j5996P27q736j3767O855J1826
15731H4421r387k6030j4687J7794L6518M135m8045m1723J4178O2425P2065N3201
15719B04865K6526M098j1147p001J4286J5759n044j4708k5599n4316p3807q7004
15707a3092q8984n3549k1275k2744j9883k079R030K6451M6409N5953N6300L4022
15695F559j9787o4599m9085l399K1072J5339Q214J9210L7311J1581j6314N841
$$ plain form
15779 1970 -3698 -36090 -80710 -105676 -119988 -134301 -144766 -170330 -199136 -183666 -125680 -67173
15767 -67173 -42534 -62379 -103725 -127890 -115618 -65877 4071 53485 40854 -12900 -51365 -60356
15755 -60356 -60616 -68778 -84974 -91179 -55142 51329 229918 424390 561164 601709 566451 505485
15743 505485 435513 347104 254897 184151 137089 103512 87516 88243 79507 65740 72595 84421
15731 84421 75034 49004 34317 52111 88629 92764 44719 2996 17174 79599 151664 204865
15719 204865 231391 235489 224342 217341 231627 247386 242342 227634 202035 147719 73912 -13092
15707 -13092 -102076 -155625 -176900 -199644 -219527 -221606 -212576 -186125 -139716 -83763 -27463 6559
15695 6559 -13228 -77827 -126912 -130311 -109239 -93900 -85686 -66476 -29165 -17584 -33898 -28057
15683b8057M8296P7875Q0006N5958K1730j3644m0672o8845j02469q4888k4564
15672g9274K1670L3029J4412k1672n9243m2127J8109O6359R0556Q7932N9690M1336
15660B30777N0474M0961K5930K1809K6955J6873l2555p2657q7573j02875j17945
15649A74j05500o0804j8906P627N383p943k3236j1506L7060Q6733R2578O7405
15637F9065N5264K8382K803J6666L3018J0760k6149n6954r2491j15557j22617
15626a97810r0531m0369k610M8913J00943J22432R4317M6589L1394K2795j2181
15615A23882k8411j4515l4266q6289r7466n9284l0818j3405K5620N0468N1466
15604a13018N8568O8278O5495L3506m1820j10733j16276o8567M310N9108O0232
$$ plain form
15683 -28057 20239 98114 178120 234078 255808 242164 201492 132647 30178 -54710 -79274
15672 -79274 -57604 -24575 -10163 -31835 -91078 -133205 -115096 -48737 41819 129751 189441 230777
15660 230777 281251 322212 348142 369951 396906 413779 381224 308567 220994 118119 174
15649 174 -105326 -166130 -185036 -177409 -172026 -179969 -203205 -214711 -177651 -90918 1660 69065
15637 69065 124329 152711 155514 172180 205198 215958 189809 132855 40364 -75193 -197810
15626 -197810 -288341 -328710 -331320 -282407 -181464 -59032 35285 81874 113268 136063 123882
15615 123882 95471 80956 46690 -39599 -137065 -196349 -227167 -240572 -214952 -164484 -113018
15604 -113018 -54450 13828 79323 112829 71009 -39724 -156000 -224567 -220257 -161149 -100917
15593a00917J9384J7963P1669J02687Q3311L0532O958J9611J3433j977R937K8649
15581C01240J7160j7031l9939l3212m7403p8942o4338k1394J2444M5035O2030
15570A35650M3367r032o4464o6212k1307L666j773L193N664j4373j5217K577K0426
15557B2165M9156P0829P0420N2542K5297P583o604l3901m5987m7392o2614q4170
15545A7324r8320q8195l2553L9278P8789Q0122N1067J3468M765R772j3348k6189
15533C5980j7243q954J4655L6747J791m9036p1996j04538j07572o1195k5639l245
15521c60245M2033O2138J7737p6087j45047j25659l6559M0840O0342N5993M7200
15510d17314L6108K8889K8488M3386O9348P5803N0012N979j1421K1261K9494J1781
$$ plain form
15593 -100917 -81533 -63570 8099 110786 194097 224629 231587 251198 264631 262654 272591 301240
15581 301240 318400 301369 261430 228218 180815 101873 37535 16141 28585 73620 135650
15570 135650 179017 169985 105521 39309 18002 21668 19895 23088 28752 14379 -838 1739 22165
15557 22165 71321 142150 212570 265112 290409 297992 291388 257487 211500 164108 101494 17324
15545 17324 -80996 -169191 -201744 -162466 -83677 -3555 47512 60980 65745 75517 62169 35980
15533 35980 18737 9783 24438 61185 62976 13940 -58056 -162594 -270166 -331361 -357000 -360245
15521 -360245 -318212 -256074 -238337 -314424 -459471 -585130 -621689 -580849 -520507 -464514 -417314
15510 -417314 -381206 -352317 -323829 -280443 -211095 -135292 -85280 -79301 -90722 -69461 -39967 -28186
15498b8186J925n333q252l4382m6119k0004K3731O7455J08914J33353J01041L6189
15486C30332j7785o2291p3865m0155j7681j3747O458L4183L0916m658m8889n9338
15474F3480p691M1613J8346n4431j22211j22220o7116l9351l0628j2805j0226
15463c43240j1797L8811J02414R1861L3092j4445k0383J5167K0622l9552r0718
15452b18168p4477j1791K8725M2762N9718N9676M6654L4338q503o6686p8003n1025
15440b36780l6025r994M6146R4428R1300L4431k2581k0918J2814J878l1413l8388
15428a15102n5977q2584n7697k46K8573K5930K97l1038n3494n1001k4911J1242
15416d06008K5439o241k8581l463K7159J256n5110r1986q2228l0807M0261R7852
$$ plain form
15498 -28186 -26261 -31594 -39846 -74228 -120347 -140351 -116620 -49165 59749 193102 294143 330332
15486 330332 312547 250256 176391 136236 118555 104808 111266 145449 176365 171707 122818 63480
15474 63480 55789 97402 115748 61317 -60894 -183114 -250230 -289581 -320209 -333014 -343240
15463 -343240 -355037 -316226 -213812 -121951 -88859 -103304 -123687 -108520 -87898 -127450 -218168
15452 -218168 -292645 -304436 -275711 -232949 -173231 -113555 -66901 -32563 -41066 -107752 -185755 -236780
15440 -236780 -272805 -282799 -236653 -142225 -50925 -16494 -39075 -59993 -47179 -45301 -76714 -115102
15428 -115102 -171079 -253663 -311360 -311606 -283033 -257103 -256806 -287844 -341338 -392339 -417250 -406008
15416 -406008 -380569 -386810 -415391 -418854 -391695 -390439 -445549 -537535 -619763 -650570 -610309 -512457
15404e12457J14446R9281P3700M9228M3739M9491K7666K652j9890l9382m0076
15393a51602j2954K8899J6240m2677q1311q6505n0088O831N1800Q5847J18624
15382a16896J59629J51320P1241j8061r8787j64439j84968j63478j01112l5075
15372e00626j3850p231P942K4044L0853M2373P9642R9038P2890K8012r366j6941
15360a63220L428K2999J9125M911J373Q539M8837J25452J58110J16306N0698l780
15348C92778j7342P039L7389O5643Q8725Q1165M2533P188j4861j7080P825K7947
15336G08949J4992m1246j01638r7991o9805o8249n2716l8763n5243n9283k0570
15325A18437J8797L683n3919q8752o3726l1502j6098l591P631K2379K6239J2714
$$ plain form
15404 -512457 -398011 -298730 -225030 -175802 -132063 -82572 -54906 -52254 -72144 -111526 -151602
15393 -151602 -164556 -135657 -119417 -162094 -243405 -329910 -379998 -373167 -321367 -235520 -116896
15382 -116896 42733 194053 265294 247233 148446 -15993 -200961 -364439 -465551 -500626
15372 -500626 -514476 -521707 -513765 -489721 -458868 -416495 -336853 -237815 -164925 -136913 -146279 -163220
15360 -163220 -159792 -136793 -117668 -112757 -111384 -102845 -54008 71444 229554 345860 396558 392778
15348 392778 375436 382475 419864 485507 574232 655397 697930 705118 690257 673177 681002 708949
15336 708949 723941 682695 581057 483066 413261 345012 292296 253533 198290 139007 118437
15325 118437 137234 140917 86998 -1754 -65480 -96982 -113080 -116671 -109040 -86661 -60422 -47708
15313d7708J5173K3754j3386o4399q0803q2113p0366l5936o009P098P719j7546
15301c64522n2887m7869j2640P2m987j3023k1257J084L3820L5153K5343J4796
15289d06917J0637N1641Q8858O6456l044n7271o9002p7281p8375m0684J6455M6257
15277d52270K6837k449J559J1525Q523K965m751O957O1879J11037J10560Q8808
15265b8820N9452J0458l9551n2676l1425r447j5016k0702j3230j0357r474o38
15253a61426j4875m3990m5309k0069k065k5102n0005m2343k9434j6469J2116L3024
15241d05947L9092N9287Q9828J10793R7101L7042j2463o344J6882K2839q558n6062
15229a6510p4993p2231o1687o0822m9918j7923R911K2110L9978N6268N3014M7030
$$ plain form
15313 -47708 -32535 -8781 -22167 -86566 -167369 -249482 -319848 -355784 -361793 -354695 -346976 -364522
15301 -364522 -417409 -465278 -477918 -477846 -482833 -495856 -517113 -516029 -482209 -447056 -421713 -406917
15289 -406917 -396280 -344639 -255781 -189325 -192369 -249640 -318642 -395923 -474298 -514982 -498527 -452270
15277 -452270 -425433 -427882 -426323 -414798 -406275 -403310 -408061 -401104 -339225 -228188 -117628 -28820
15265 -28820 30632 41090 1539 -51137 -82562 -92009 -107025 -127727 -140957 -151314 -160788 -161426
15253 -161426 -176301 -220291 -265600 -285669 -287734 -312836 -362841 -405184 -434618 -451087 -438971 -405947
15241 -405947 -366855 -307568 -217740 -106947 -9846 27196 14733 8389 25271 48110 39552 -16510
15229 -16510 -91503 -163734 -225421 -286243 -336161 -354084 -344173 -322063 -282085 -225817 -172803 -125773
15217a25773M7951L0056K2388L6568L2671K2580J7401M835k7633q4449j20539
15206a43944r5083m8467k6620j8555j2574j7332l5457n8622p4870p6660p0830
15195f79014p2210n0961J2050O1764Q6246J16616J21956O8280j0150o6300o1288
15184d73011j674O8531J12532Q1973J6513j1792m617J0252K4033L1861J3571k6530
15172a58358n8427m9977j1185K3940M5469L7569J5444n186k6545o7456j15749
15161c70461j11671n9994o656L8976P0903P1653M8343L8172L1987J7025J5022
15150b16701L0359J7840j1204p928k316J0106L9592K1223m2601p2311p0208o9689
15138c73838p4488p7467o8975m7249j4771L7418J02742J49958J18820K6760l2607
$$ plain form
15217 -125773 -77822 -47766 -25378 11190 43861 66441 83842 88677 61044 -23405 -143944
15206 -143944 -239027 -287494 -314114 -332669 -345243 -362575 -398032 -456654 -531524 -608184 -679014
15195 -679014 -751224 -802185 -790135 -728371 -642125 -525509 -403553 -335273 -345423 -411723 -473011
15184 -473011 -474685 -406154 -293622 -211649 -195136 -206928 -211545 -201293 -177260 -145399 -131828 -158358
15172 -158358 -216785 -266762 -277947 -254007 -208538 -170969 -155525 -160711 -187256 -254712 -370461
15161 -370461 -482132 -542126 -548782 -509806 -438903 -367250 -318907 -280735 -248748 -231723 -216701
15150 -216701 -186342 -168502 -179706 -187634 -189950 -179844 -140252 -119029 -161630 -233941 -304149 -373838
15138 -373838 -448326 -525793 -594768 -642017 -656788 -619370 -516628 -366670 -247850 -221090 -253697
15127b53697k8839j1912o622P127L2858L6494K1571M0189N8041K7385j5289k1592
15115a14286M820O3238J02212O3540n705m6596m3322j0653L9733R9796J09825
$$ plain form
15127 -253697 -282536 -294448 -301070 -293943 -261085 -224591 -203020 -162831 -104790 -77405 -92694 -114286
15115 -114286 -109466 -46228 55984 119524 113819 67223 23901 13248 52981 152777 262602
$$ [...]
##END NTUPLES=NMR SPECTRUM
##END=
