##TITLE=C13_IPEDM2907
 CDCl3, 300 sc

 31.7.2019
##JCAMPDX= 6.0         $$ Bruker NMR JCAMP-DX V2.0
##DATA TYPE= NMR SPECTRUM
##DATA CLASS= NTUPLES
##ORIGIN= UXNMR, Bruker Analytische Messtechnik GmbH
##OWNER= root
$$ XWIN-NMR		Version 3.5
$$ Wed Jul 31 16:43:40 2019 Russian Standard Time (UT+4h)  she@DPX200
##.OBSERVE FREQUENCY= 50.327896
##.OBSERVE NUCLEUS= ^13C
##.ACQUISITION MODE= SIMULTANEOUS
##.ACQUISITION SCHEME= undefined
##.AVERAGES= 300
##.DIGITISER RES= 17
##SPECTROMETER/DATA SYSTEM= spect
##.PULSE SEQUENCE= zgpg30
##.SOLVENT NAME= CDCl3
##.SHIFT REFERENCE= (INTERNAL, CDCl3, 0, 225.252)
##AUDIT TRAIL= $$ (NUMBER, WHEN, WHO, WHERE, WHAT)
$$ ##TITLE= Audit trail, XWIN-NMR		Version 3.5
$$ ##JCAMPDX= 5.01
$$ ##ORIGIN= Bruker BioSpin GmbH
$$ ##OWNER= she
$$ F:/spectra/data/she/nmr/c13/1/pdata/1/auditp.txt
$$ ##AUDIT TRAIL=  $$ (NUMBER, WHEN, WHO, WHERE, WHAT)
(   1,<2019-07-31 16:42:45.04 +0400>,<she>,<DPX200>,
      <created by zg, POWCHK disabled, PULCHK disabled
       terminated by command 'halt'
       configuration hash MD5:
       00 E9 B6 7A A2 85 ED C7 34 08 36 98 17 FE 4E 26
       data hash MD5: 32K
       C6 AD 98 A6 3C 20 AE 34 CA 71 26 4E 1A 5C 7A 4F>)
(   2,<2019-07-31 16:42:46.42 +0400>,<she>,<DPX200>,
      <Start of raw data processing
       efp BC_mod = 2 LB = 1 FT_mod = 6 PKNL = 1 PHC0 = -364.8677 PHC1 = 28.60641 SI = 32K 
       data hash MD5: 32K
       FB 44 94 64 C9 B4 B0 C1 92 9C F7 93 28 CF 64 56>)
(   3,<2019-07-31 16:42:51.15 +0400>,<she>,<DPX200>,
      <abs ABSG = 5 
       data hash MD5: 32K
       A9 3B A2 4A 31 FD 41 8E E8 C2 70 AB 9E 99 2C E7>)
$$ ##END=
$$ 
$$ hash MD5
$$ 32 57 97 74 2C 09 24 E6 F2 77 CA 2F FC 48 B6 1E
##$RELAX= 
##$RELAX= 
##$RELAX= 
##$RELAX= 
##$RELAX= 
##$RELAX= 
##$RELAX= 
##$RELAX= 
$$ Bruker specific parameters
$$ --------------------------
##$DU= <F:/spectra>
##$EXPNO= 1
##$NAME= <c13>
##$PROCNO= 1
##$TYPE= <nmr>
##$USER= <she>
##$AMP= (0..31)
100 100 100 100 100 100 100 100 100 100 100 100 100 100 100 100 100 100 
100 100 100 100 100 100 100 100 100 100 100 100 100 100 
##$AQSEQ= 0
##$AQ_mod= 1
##$AUNM= <au_zg>
##$AUTOPOS= <>
##$BF1= 50.322709
##$BF2= 200.13
##$BF3= 50.322709
##$BF4= 500.13
##$BF5= 500.13
##$BF6= 500.13
##$BF7= 500.13
##$BF8= 500.13
##$BYTORDA= 1
##$CFDGTYP= 0
##$CFRGTYP= 5
##$CHEMSTR= <none>
##$CNST= (0..31)
1 1 145 1 1 1 1 1 1 1 1 1 1 1 1 1 1 1 1 1 1 1 1 1 1 1 1 1 1 1 1 1 
##$CPDPRG= <waltz16>
##$CPDPRG1= <>
##$CPDPRG2= <waltz16>
##$CPDPRG3= <>
##$CPDPRG4= <mlev>
##$CPDPRG5= <mlev>
##$CPDPRG6= <mlev>
##$CPDPRG7= <mlev>
##$CPDPRG8= <mlev>
##$CPDPRGB= <>
##$CPDPRGT= <>
##$D= (0..31)
0 2 0.00345 0 0 0 0 0 0 0 0 0.03 2e-05 3e-06 0 0 0 0 0 0 0 0 0 0 0 0 0 
0 0 0 0 0 
##$DATE= 1564576024
##$DBL= (0..7)
120 120 120 120 120 120 120 120 
##$DBP= (0..7)
150 150 150 150 150 150 150 150 
##$DBP07= 0
##$DBPNAM0= <>
##$DBPNAM1= <>
##$DBPNAM2= <>
##$DBPNAM3= <>
##$DBPNAM4= <>
##$DBPNAM5= <>
##$DBPNAM6= <>
##$DBPNAM7= <>
##$DBPOAL= (0..7)
0.5 0.5 0.5 0.5 0.5 0.5 0.5 0.5 
$$ [...]
##$SUBNAM4= <"">
##$SUBNAM5= <"">
##$SUBNAM6= <"">
##$SUBNAM7= <"">
##$SUBNAM8= <"">
##$SUBNAM9= <"">
##$SW= 239.972175391363
##$SWIBOX= (0..15)
0 1 3 0 0 0 0 0 0 0 0 0 0 0 0 0 
##$SW_h= 12077.2946859903
##$TD= 32768
##$TD0= 1
##$TE= 0
##$TE2= 300
##$TE3= 300
##$TEG= 300
##$TL= (0..7)
120 120 120 120 120 120 120 120 
##$TP= (0..7)
150 150 150 150 150 150 150 150 
##$TP07= 0
##$TPNAME0= <>
##$TPNAME1= <>
##$TPNAME2= <>
##$TPNAME3= <>
##$TPNAME4= <>
##$TPNAME5= <>
##$TPNAME6= <>
##$TPNAME7= <>
##$TPOAL= (0..7)
0.5 0.5 0.5 0.5 0.5 0.5 0.5 0.5 
##$TPOFFS= (0..7)
0 0 0 0 0 0 0 0 
##$TUNHIN= 0
##$TUNHOUT= 0
##$TUNXOUT= 0
##$USERA1= <user>
##$USERA2= <user>
##$USERA3= <user>
##$USERA4= <user>
##$USERA5= <user>
##$V9= 5
##$VALIST= <valist>
##$VCLIST= <CCCCCCCCCCCCCCC>
##$VD= 0
##$VDLIST= <DDDDDDDDDDDDDDD>
##$VPLIST= <PPPPPPPPPPPPPPP>
##$VTLIST= <TTTTTTTTTTTTTTT>
##$WBST= 1024
##$WBSW= 4
##$XGAIN= (0..3)
0 0 0 0 
##$XL= 0
##$YL= 0
##$YMAX_a= 1890000
##$YMIN_a= -384231
##$ZGOPTNS= <>
##$ZL1= 120
##$ZL2= 120
##$ZL3= 120
##$ZL4= 120
##$ABSF1= 225.2522
##$ABSF2= -14.74524
##$ABSG= 5
##$ABSL= 3
##$ALPHA= 0
##$AQORDER= 0
##$ASSFAC= 0
##$ASSFACI= 0
##$ASSFACX= 0
##$ASSWID= 0
##$AUNMP= <proc_1d>
##$AZFE= 0.1
##$AZFW= 0.5
##$BCFW= 0
##$BC_mod= 2
##$BYTORDP= 0
##$COROFFS= 0
##$CY= -3
##$DATMOD= 1
##$DC= 0
##$DFILT= <>
##$DTYPP= 0
##$F1P= 0
##$F2P= 0
##$FCOR= 0.5
##$FTSIZE= 32768
##$FT_mod= 6
##$GAMMA= 0
##$GB= 0
##$INTBC= 1
##$INTSCL= 4.134877e-10
##$ISEN= 128
##$LB= 1
##$LEV0= 0
##$LPBIN= 0
##$MAXI= 10000
##$MC2= 0
##$MEAN= 0
##$ME_mod= 0
##$MI= 0.1934396
##$NCOEF= 0
##$NC_proc= -3
##$NLEV= 6
##$NOISF1= 120.0001
##$NOISF2= 80.00006
##$NSP= 0
##$NTH_PI= 0
##$NZP= 0
##$OFFSET= 225.2522
##$PC= 1.4
##$PHC0= -364.8677
##$PHC1= 28.60641
##$PH_mod= 1
##$PKNL= yes
##$PPARMOD= 0
##$PSCAL= 0
##$PSIGN= 0
##$REVERSE= no
##$SF= 50.3225993700027
##$SI= 32768
##$SIGF1= 140
##$SIGF2= 120
##$SINO= 11.81781
##$SIOLD= 32768
##$SREGLST= <13C.CDCl3>
##$SSB= 0
##$STSI= 32768
##$STSR= 0
##$SW_p= 12077.2946859903
##$SYMM= 0
##$S_DEV= 0
##$TDeff= 32768
##$TDoff= 0
##$TI= <>
##$TILT= no
##$TM1= 0
##$TM2= 0
##$TOPLEV= 0
##$USERP1= <user>
##$USERP2= <user>
##$USERP3= <user>
##$USERP4= <user>
##$USERP5= <user>
##$WDW= 1
##$XDIM= 32768
##$YMAX_p= 307786101
##$YMIN_p= -15816357
$$ End of Bruker specific parameters
$$ ---------------------------------
##NTUPLES= NMR SPECTRUM
##VAR_NAME=  FREQUENCY,     SPECTRUM/REAL,   SPECTRUM/IMAG
##SYMBOL=    X,             R,               I
##VAR_TYPE=  INDEPENDENT,   DEPENDENT,       DEPENDENT
##VAR_FORM=  AFFN,          ASDF,            ASDF
##VAR_DIM=   32768,         32768,           32768
##UNITS=     HZ,            ARBITRARY UNITS, ARBITRARY UNITS
##FACTOR=    0.368581032318806, 1,           1
##FIRST=     11335.2760802109, 0,            0
##LAST=      -742.018605779436, 0,           0
##MIN=       -742.018605779436, -15816357,   0
##MAX=       11335.2760802109, 307786101,    0
$$ Real data points
##PAGE= N=1
##DATA TABLE= (X++(R..R)), XYDATA
$$ [...]
$$ plain form
7066 762822 1219319 564157 -505925 -1725554 -1431522 -116753 638219 1162063 673062
7057 673062 -434175 -512663 -604411 -392214 270739 2776 730096 2050185 3262731 4082720
7047 4082720 2693237 561207 -193399 47135 817011 1831275 2706459 2411831 2635926
7038 2635926 2463956 62847 -1760410 -59544 2387248 3815111 3050165 2018532 1621813
7029 1621813 455450 239510 -117346 -740984 -1021582 -1148507 -893324 -1469170 -1823463
7020 -1823463 -2582242 -2646518 -1958535 -2103380 -1530600 -71308 1094400 464152 204999
7011 204999 985089 635724 268274 1279017 1574973 2208669 1663582 534628 1024374
7002 1024374 674073 -637571 -1038317 -1591181 -1820345 -606261 466068 1322950 2019339
$$ packed form
7066G62822M56497o55162j070082j219629K94032J314769P54972N23844m89001
7057F73062j107237p8488r1748K12197O62953k67963P27320J320089J212546Q19989
7047D082720j389483k132030p54606K40534P69876J014264Q75184k94628K24095
7038B635926j71970k401109j823257J700866K446792J427863p64946j031633l96719
7029A621813j166363k15940l56856o23638k80598j26925K55183n75846l54293
7020a823463p58779o4276O87983j44845N72780J459292J165708o30248k59153
7011B04999P80090l49365l67450J010743K95956O33696n45087j128954M89746
7002A024374l50301j311644m00746n52864k29164J214084J072329Q56882O96389
$$ plain form
6993 2019339 1816001 1932311 2666773 3330525 4471118 5438955 4662176 3437168 3207084
6984 3207084 2921877 1148678 595193 1084253 1600295 2849090 2494198 1759282 698340
6975 698340 -203850 -1176965 -1802628 -2152386 -2788422 -3079799 -2657018 -1422073 -1034281 -2361299
6965 -2361299 -509879 2825043 3468368 3923611 3639764 2175102 1250699 679861 304011
6956 304011 768574 2469924 2525362 831805 -96259 -184609 -286405 -1093298 -260749 797660
6946 797660 113255 -325936 -1696094 -2474823 -2056992 -1224541 -439740 60825 471182 472881
6936 472881 -528362 -555984 1222277 2399135 1419306 -1181807 -2635909 -2209776 -1426390
6927 -1426390 -1396962 -1749396 -1590903 -1801875 -1383192 -73479 2305088 1931642 -845413
$$ packed form
6993B019339k03338J16310P34462O63752J140593R67837p76779j225008k30084
6984C207084k85207j773199n53485M89060N16042J248795l54892p34916j060942
6975F98340r02190r73115o25663l49758o36036k91377M22781J234945L87792j327018
6965b361299J851420L334922O43325M55243k83847j464662r24403n70838l75850
6956C04011M64563J701350N5438j693557r28064q8350j01796q06893Q32549J058409
6946G97660o84405m39191j370158p78729M17831Q32451P84801N00565M10357J699
6936D72881j001243k7622J778261J176858r79829k601113j454102M26133P83386
6927a426390K9428l52434J58493k10972M18683J309713K378567l73446k777055
$$ plain form
6918 -845413 -1696431 -1736380 -1342592 751754 2790524 3686758 3143732 2209670 1550613 1862181
6908 1862181 1964882 935993 -274844 -421628 64107 1866043 1840930 69799 -247964
6899 -247964 257650 -95082 -823153 -1240125 -1616768 -964451 148565 647044 -6107 596144
6889 596144 -721395 -356143 827254 -695329 -1668541 -2148791 -2191996 -1367227 -1578726
6880 -1578726 -2199643 -2170730 -1594834 -1224565 -1264062 -1399539 -1282821 -1099036 -954002 -928586
6870 -928586 -967077 418388 2000260 2313674 1325205 983247 117530 -596769 -227153 1054712
6860 1054712 1847263 723585 -296537 -800471 -1520388 -67964 2503146 4018739 4118120
6851 4118120 2346688 -263369 -1346641 -1151034 -473867 969268 2224684 3484495 4087961
$$ packed form
6918h45413q51018l9949L93788K094346K038770Q96234n43026r34062o59057L11568
6908A862181J02701j028889j210837j46784M85735J801936k5113j771131l17763
6899b47964N05614l52732p28071m16972l76643O52317J113016M98479o53151O02251
6889E96144j317539L65252J183397j522583r73212m80250m3205Q24769k11499
6880a578726o20917K8913N75896L70269l9497j35477J16718J83785J45034K5416
6870i28586l8491J385465J581872L13414r88469l41958q65717p14299L69616J281865
6860A054712P92551j123678j020122n03934p19917J452424K571110J515593R9381
6851D118120j771432k610057j083272J95607O77167J443135J255416J259811O03466
$$ plain form
6842 4087961 3791058 2454760 -165108 -1575867 -660410 -608899 -1565478 -3493846 -4917560
6833 -4917560 -5180408 -4927893 -3438305 -1468566 761735 3451503 4186940 2873789 1068808
6824 1068808 -101617 -844392 -710497 -1004582 -1618823 -1693348 -1757870 -1905940 -1366603 -263608
6814 -263608 1090618 1143587 1298828 1187995 1085654 1945624 1054885 793629 1960472 1822156
6804 1822156 -183879 -1174939 -724004 607398 1713094 1880727 1538068 285452 -1007534
6795 -1007534 -1097585 -1016980 -735052 295629 279028 -681915 -1252263 -1623712 -1014731 -919652
6785 -919652 -671914 -72580 580116 1108629 128959 -241330 -223908 -509797 -800139 -538032
6775 -538032 226249 -490059 -1298331 -1279907 -1837748 -1834734 -1159365 -128931 -11048 -669329
$$ packed form
6842D087961k96903j336298k619868j410759R15457N1511r56579j928368j423714
6833d917560k62848K52515J489588J969739K230301K689768P35437j313151j804981
6824A068808j170425p42775J33895k94085o14241p4525o4522j48070N39337J102995
6814b63608J354226N2969J55241j10833j02341Q59970q90739k61256J166843j38316
6804A822156k006035r91060M50935J331402J105696J67633l42659j252616j292986
6795a007534r0051Q0605K81928J030681j6601r60943n70348l71449O08981R5079
6785i19652K47738N99334O52696N28513r79670l70289J7422k85889k90342K62107
6775e38032P64281p16308q08272J8424n57841L014O75369J030434J17883o58281
$$ plain form
6765 -669329 -1329010 -2021475 -1862622 -1213226 -475498 257984 1089690 1593715 527424 -179858
6755 -179858 -959263 -1636098 -571347 383317 605543 1146104 1901669 2193132 1983432 1667822
6745 1667822 2277392 4041173 4049974 1556960 -1373109 -3620954 -3964246 -3419622 -773110
6736 -773110 1089567 1121788 -254020 -3145132 -3706551 -2230169 -3043160 -3538718 -2513416
6727 -2513416 -1240113 -90991 -801207 -1444904 -1022580 -691078 1151398 2648237 2985460
6718 2985460 2044780 817603 486074 1288653 2313791 2918715 2952225 3266645 3226921 1986265
6708 1986265 107490 286705 642430 156740 1210913 670979 78365 175923 565700
6699 565700 1738605 3111128 2775286 1586735 1590184 2860553 3101067 2237559 1287117
$$ packed form
6765f69329o59681o92465J58853O49396P37728P33482Q31706N04025j066291p07282
6755a79858p79405o76835J064751R54664K22226N40561P55565K91463k09700l15610
6745A667822O09570J763781Q801k493014k930069k247845l43292N44624K646512
6736g73110J862677L2221j375808k891112n61419J476382q12991m95558J025302
6727b513416J273303J149122p10216o43697M22324L31502J842476J496839L37223
6718B985460r40680j227177l31529Q02579J025138O04924L3510L14420l9724j240656
6708A986265j878775J79215L55725m85690J054173n39934n92614R7558L89777
6699E65700J172905J372523l35842j188551L449J270369K40514q63508r50442
$$ plain form
6690 1287117 803873 1272248 601133 -438132 -834743 -1576180 -845358 125352 -774517
6681 -774517 -2300301 -3308122 -3682500 -3640347 -3630942 -3074456 -2752764 -2496397 -2472151 -2758062
6671 -2758062 -3111002 -2000186 -239545 -551319 -2325312 -2877523 -3995650 -4404681 -3696385
6662 -3696385 -3812494 -3004650 -2534718 -565451 2200208 2684868 3688927 4401591 4407360
6653 4407360 2712604 1181878 1262387 1919190 1122051 -1062502 -1443517 42186 679213
6644 679213 -45565 -1554521 -3243060 -3847960 -3341246 -4269963 -4870327 -4100914 -3935625
6635 -3935625 -3232198 -2370573 -2061002 -2625776 -2272360 -1206037 -853465 -1006086 -667467
6626 -667467 828368 1279181 1434686 1196748 -134335 -1800095 -1873998 -2053126 -2078349 -301397
$$ packed form
6690A287117m83244M68375o71115j039265l96611p41437P30822R70710q99869
6681g74517j525784j007821l74378M2153R405N56486L21692K56367K4246k85911
6671b758062l52940J110816J760641l11774j773993n52211j118127m09031P08296
6662c696385j16109Q07844M69932J969267K765659M84660J004059P12664N769
6653D407360j694756j530726Q0509O56803p97139k184553l81015J485703O37027
6644F79213p24778j508956j688539o04900N06714r28717o00364P69413J65289
6635c935625P03427Q61625L09571n64774L53416J066323L52572j52621L38619
6626f67467J495835M50813J55505k37938j331083j665760p3903j79128k5223J776952
$$ plain form
6616 -301397 944501 1560425 916014 -128904 975902 1527636 1099259 1364675 397660
6607 397660 -1764331 -2442162 -1789833 -1944870 -612691 91169 -350977 -127585 -198892 -1316449
6597 -1316449 -1083827 -1247567 -3527890 -4896632 -5162783 -4102934 -2687042 -1977047 -1464945
6588 -1464945 -1803588 -279507 1816631 2556570 2903356 3342507 3679286 3287535 2918298
6579 2918298 831230 -1252252 -1545545 -852995 -86121 354898 2076751 4257269 5685338
6570 5685338 4112363 2239360 1781804 -635534 -2282879 -970249 1585089 2582595 1304073
6561 1304073 477935 1395590 1651015 1879985 2588709 960377 -242006 106423 1648114
6552 1648114 1312835 112234 -688216 -1637611 -1034720 -103670 -1381939 -3133938 -2479461
$$ packed form
6616c01397J245898O15924o44411j044918J104806N51734m28377K65416r67015
6607C97660k161991o77831O52329j55037J332179P03860m42146K23392p1307j117557
6597a316449K32622j63740k280323j368742k66151J059849J415892P09995N12102
6588a464945l38643J524081K096138P39939L46786M39151L36779l91751l69237
6579B918298k087068k083482k93293O92550P66874M41019J721853K180518J428069
6570E685338j572975j873003m57556k417338j647345J312630K555338R97506j278522
6561A304073q26138R17655K55425K28970P08724j628332j202383L48429J541691
6552A648114l35279j200601q00450r49395O02891R31050j278269j751999O54477
$$ plain form
6543 -2479461 924099 1636546 165081 -539424 143588 -307350 -799814 -1506061 -2971276
6534 -2971276 -3636022 -3960034 -3430542 -2431805 -996468 337977 486634 -1233054 -1607209
6525 -1607209 -991623 -780212 -65169 1352941 2925591 4289205 4882927 5309789 4435021
6516 4435021 2507970 1856181 1281114 -460501 -1213013 -589522 52053 645701 443308
6507 443308 -630181 -867664 -436895 66096 181086 -39328 -421877 -773026 -2594199
6498 -2594199 -3933801 -4306969 -2571821 -227903 170005 481872 942934 1402125 1017136
6489 1017136 -924649 -3570471 -3558758 -1587453 307750 651789 -758590 -2583990 -2074497
6480 -2074497 591910 2224121 1184391 832284 2233955 1970989 1076832 1441394 1303093
$$ packed form
6543b479461L403560P12447j471465p04505O83012m50938m92464p06247j465215
6534b971276o64746l24012N29492R98737J435337J334445J48657j719688l74155
6525a607209O15586K11411P15043J418110J572650J363614N93722M26862q74768
6516D435021j927051o51789n75067j741615p52512O23491O41575N93648k02393
6507D43308j073489k37483M30769N02991J14990k20414l82549l51149j821173
6498b594199j339602l73168J735148K343918L97908L11867M61062M59191l84989
6489A017136j941785k645822J1713J971305J895203L44039j410379j825400N09493
6480b074497K666407J632211j039730l52107J401671k62966q94157L64562j38301
$$ plain form
6471 1303093 940531 1947841 2320688 3138327 3294868 2769065 1197546 -837955 -2889070
6462 -2889070 -3925742 -4215811 -3515447 -2930954 -3573825 -4487146 -3960929 -2995027 -3689041
6453 -3689041 -4164177 -3697873 -3022086 -2646610 -1921171 -2156007 -1510766 -487064 -1483678
6444 -1483678 -1857645 -979177 -183435 258149 688386 2362768 2362419 2110409 2407635 2125974
6434 2125974 2729352 2603990 2986676 4662335 5385453 4494976 3406113 3013737 3734432
6425 3734432 4722855 3763751 3330244 3446209 2684077 1907368 3096750 4360223 4091793
6416 4091793 3640443 3073134 2279633 1514455 83243 500520 2377730 3683880 5134929
6407 5134929 8602488 13909179 15156263 13730670 11439140 8269128 4392473 1891960
$$ packed form
6471A303093l62562J007310L72847Q17639J56541n25803j571519k035501k051115
6462b889070j036672k90069P00364N84493o42871r13321N26217R65902o94014
6453c689041m75136M66304O75787L75476P25439k34836O45241J023702r96614
6444a483678l73967Q78468P95742M41584M30237J674382l49k52010K97226k81661
6434B125974O03378j25362L82686J675659P23118q90477j088863l92376P20695
6425C734432R88423r59104m33507J15965p62132p76709J189382J263473k68430
6416D091793m51350n67309p93501p65178j431212M17277J877210J306150J451049
6407E134929L467559N306691J247084j425593k291530l170012l876655k500513
$$ plain form
6399 1891960 1068522 594339 566488 1101594 1958056 861562 -127280 -662942 -1711696
6390 -1711696 -2283545 -1004322 462632 899818 690519 -7433 -647269 -265674 -103694
6381 -103694 -871810 -1909683 -2257365 -2227780 -3208370 -3057482 -1227707 1669993 2420188
6372 2420188 1987939 3204260 3836936 3605497 2849601 1877460 1598099 1097523 208719
6363 208719 559529 1813726 2246281 2232715 2428211 2075336 2245121 1107446 -96904
6354 -96904 -218155 314024 452144 -473474 -1101781 -2598128 -3243898 -1915320 -1035461 -429561
6344 -429561 474413 839203 1381382 2078177 3653703 2652349 -299928 -1297876 61386
6335 61386 871327 426174 -581200 -897096 -901047 -1694568 -1650539 -1169619 -992704 -289570
$$ packed form
6399A891960q23438m74183k7851N35106Q56462j096494r88842n35662j048754
6390a711696n71849J279223J466954M37186k09299o97952o39836L81595J61980
6381a03694p68116j037873l47682K9585r80590J50888J829775K897700P50195
6372B420188m32249J216321O32676k31439p55896r72141k79361n00576q88804
6363B08719L50810J254197M32555j3566J95496l52875J69785j137675j204350
6354i6904j21251N32179J38120r25618o28307j496347o45770J328578Q79859O05900
6344d29561R03974L64790N42179O96795J575526j001354k952277r97948J359262
6335F1386Q09941m45153j007374l15896l951p93521M4029M80920J76915P03134
$$ plain form
6325 -289570 -89352 1068339 2363115 3243057 3118757 1587375 -135589 -739694 257370
6316 257370 1383028 1683630 2061825 932947 -1336818 -3280698 -3710428 -2626458 -1164704
6307 -1164704 99966 1408621 3011334 4125038 5079505 3531268 1380540 918325 583632
6298 583632 -1037118 -2737254 -3409487 -2455623 -713032 -659859 -931245 -865591 -660352 696019
6288 696019 1613367 2268433 2516277 1425859 792645 976932 998568 702027 1017706 1827963
6278 1827963 1634632 1430915 1250991 640799 -177183 -58227 1555646 2648032 2708219
6269 2708219 1026679 823712 2074945 2703820 3413539 2955881 2288345 2172259 1543564
6260 1543564 998102 1179177 -394721 -1715317 -950615 -311560 1214433 2382815 2269101
$$ packed form
6325b89570K00218J157691J294776Q79942j24300j531382j722964o04105R97064
6316B57370J125658L00602L78195j128878k269765j943880m29730J083970J461754
6307a164704J264670J308655J602713J113704R54467j548237k150728m62215l34693
6298E83632j620750j700136o72233R53864J742591N3173k71386O5654K05239J356371
6288F96019R17348O55066K47844j090418o33214J84287K1636k96541L15679Q10257
6278A827963j93331k03717j79924o10192q17982J18956J613873J092386O0187
6269B708219j681540k02967J251233O28875P09719m57658o67536j16086o28695
6260A543564n45462J81075j573898j320596P64702O39055J525993J168382j13714
$$ plain form
6251 2269101 1977179 1714613 1977627 1628439 1036300 272082 -22129 528230 31905 18033
6241 18033 35319 596143 2268752 2044928 188384 -1725238 -1698781 598558 2168476
6232 2168476 1264878 -461938 -1101654 -1120780 -1971346 -3054282 -2201736 -781298 46260
6223 46260 52985 -961869 -1550753 -2491804 -3126043 -1307404 553314 553525 -280818 961320
6213 961320 2281137 2722498 3282851 1833935 1074513 367219 444756 -271624 -1256537 -1628218
6203 -1628218 -1552861 -300644 -1029424 -1859363 -566026 895421 1659205 1522125 872409
6194 872409 587263 1776681 2051322 379462 -415960 420569 757189 426379 274232
6185 274232 -308300 -2557622 -3795539 -2292967 -1495591 -1597493 -2497567 -3369631 -3693642
$$ packed form
6251B269101k91922k62566K63014l49188n92139p64218k94211N50359m96325j3872
6241A8033J7286N60824J672609k23824j856544j913622K6457K297339J569918
6232B168476r03598j726816o39716j9126q50566j082936Q52546J420438Q27558
6223D6260O725j014854n88884r41051o34239J818639J860718K11q34343J242138
6213I61320J319817M41361N60353j448916p59422p07294P7537p16380r84913l71681
6203a628218P5357J252217p28780q29939J293337J461447P63784j37080o49716
6194H72409k85146J189418K74641j671860p95422Q36529L36620l30810j52147
6185B74232n82532k249322j237917J502572P97376j01902r00074q72064l24011
$$ plain form
6176 -3693642 -4342644 -4650710 -3660731 -2065579 -1183446 -1231501 -647764 402546 1537115
6167 1537115 2258632 2432946 855191 -1443823 -929249 2003758 4352317 5928749 5591751
6158 5591751 4355004 2965845 1271144 -1251484 -3513441 -3738975 -3433468 -3300334 -3516726
6149 -3516726 -3052280 -2558863 -2144014 -1539771 -1009268 -570727 152234 -890856 -2069261
6140 -2069261 -2038655 -1690710 -2305158 -1785464 -604188 469623 601984 -82989 -93911 785798
6130 785798 1136345 566414 -726253 -1615814 -2009012 -3007946 -3486528 -2005599 -398155
6121 -398155 1205665 746994 -417613 596162 1856098 2205308 2004473 1700342 1562310
6112 1562310 3113449 3245839 2235992 769725 1090133 1713390 648062 -527472 -1009320
$$ packed form
6176c693642o49002l08066R89979J595152Q82133m8055N83737J050310J134569
6167A537115P21517J74314j577755k299014N14574K933007K348559J576432l36998
6158E591751j236747j389159j694701k522628k261957k25534L05507J33134k16392
6149c516726M64446M93417M14849O04243N30503M38541P22961j043090j178405
6140b069261L0606L47945o14448N19694J181276J073811J32361o84973j0922Q79709
6130G85798L50547n69931j292667q89561l93198r98934m78582J480929J607444
6121c98155J603820m58671j164607J013775J259936L49210k00835l04131j38032
6112A562310J551139J32390j009847j466267L20408O23257j065328j175534m81848
$$ plain form
6103 -1009320 -1162440 -365308 673394 -102346 -1515639 -2794199 -2025745 -570010 -686908
6094 -686908 -2742551 -3283565 -1413576 -940050 -1402425 -326512 1052641 661160 1530734
6085 1530734 2812356 2544674 2237864 990359 746815 678795 -779907 -1647309 -1828439
6076 -1828439 -1971364 -2056679 -2826780 -3715288 -3170343 -2205046 -2107968 -2631598 -2439149 -1229514
6066 -1229514 -650481 477063 2494971 2785461 2841371 2997848 2077223 1435671 483331
6057 483331 -1214434 -2815148 -3255594 -2488247 -1221133 229748 268976 1003129 1096738
6048 1096738 130269 284376 363736 -67187 -1518513 -1567334 153526 2939698 3272449
6039 3272449 1510818 18069 -671894 -822680 -1826600 -1863929 -1096734 464954 684836
$$ packed form
6103a009320j53120P97132J038702p75740j413293j278560P68454J455735j16898
6094f86908k055643n41014J869989M73526m62375J075913J379153l91481Q69574
6085A530734J281622k67682l06810j247505k43544o8020j458702q67402j81130
6076a828439j42925q5315p70101q88508N44945R65297R7078n23630J92449J209635
6066a229514N79033J127544K017908K90490N5910J56477r20625o41552r52340
6057D83331j697765j600714m40446P67347J267114J450881L9228P34153R3609
6048A096738r66469J54107P9360m30923j451326m8821J720860K786172L32751
6039C272449j761631j492749o89963j50786j003920l7329P67195J561688K19882
$$ plain form
6030 684836 -18381 -689203 -917950 127024 69703 -133492 1086403 757085 -132318 -963817
6020 -963817 -1029384 -406346 -1060802 -1524705 -611386 883116 611036 -838389 -458672 -215720
6010 -215720 -1278287 -2029046 -1340105 121800 430778 739507 304251 -704632 -1132061
6001 -1132061 -1918844 -2921248 -4079415 -4255787 -3360837 -819835 1709501 1347097 -984772
5992 -984772 -903702 -1555549 -2519483 -2469836 -2602110 -2365459 -2847068 -2153798 -1618195 -1362395
5982 -1362395 -8678 1305277 2232993 1745382 1337488 440943 -530939 -1415476 -2200369
5973 -2200369 -1148722 1210676 457280 -1468818 -733370 733642 3088277 3916770 2982601
5964 2982601 2892212 2924142 2492690 1926242 1313345 3191087 5806453 6357983 4624866
$$ packed form
6030F84836p03217o70822k28747J044974n7321k03195J219895l29318q89403q31499
6020i63817o5567O23038o54456m63903R13319J494502k72080j449425L79717K42952
6010b15720j062567p50759O88941J461905L08978L08729m35256j008883m27429
6001a132061p86783j002404j158167j76372Q94950K541002K529336l62404k331869
5992i84772Q1070o51847r63934M9647j32274K36651m81609O93270N35603K55800
5982a362395J353717J313955R27716m87611m07894q96545r71882q84537p84893
5973b200369J051647K359398p53396j926098P35448J467012K354635Q28493r34169
5964B982601r0389L1930m31452n66448o12897J877742K615366N51530j733117
$$ plain form
5955 4624866 3324234 2828236 1617871 36024 801189 2764024 3469960 3253572 2939860
5946 2939860 3233075 3464355 3662985 2949258 1654708 -370417 -696693 596466 149516
5937 149516 389099 1485425 953978 -907196 -1219206 -1489121 -2447353 -3455716 -2648178
5928 -2648178 -1010827 443134 844355 26831 -971266 439834 2609927 2742777 2013130
5919 2013130 1473493 1706010 466922 91334 2726976 3712890 2692860 2592985 1139549
5910 1139549 369708 1669860 5220157 7490465 6037066 4207953 2396302 -73203
5902 -73203 -2154957 -2918320 -3205164 -3374642 -3570321 -2853215 -2476193 -2382724 -1664690 -1447566
5892 -1447566 596570 2195206 2423633 1522752 958123 1626856 2524343 1814544 1825474
$$ packed form
5955D624866j300632m95998j210365j581847P65165J962835P05936k16388l13712
5946B939860K93215K31280J98630p13727j294550k025125l26276J293159m46950
5937A49516K39583J096326n31447j861174l12010k69915r58232j008363Q07538
5928b648178J637351J453961M01221q17524r98097J411100K170093J32850p29647
5919B013130n39637K32517j239088l75588K635642R85914j020030r9875j453436
5910A139549p69841J300152L550297K270308j453399j829113j811651k469505
5902g3203k081754p63363k86844j69478j95679P17106L77022R3469P18034K17124
5892a447566K044136J598636K28427r00881n64629O68733Q97487p09799J0930
$$ plain form
5883 1825474 2490103 2971224 2308426 2319094 2081402 1101621 166082 465187 2092835 2988206
5873 2988206 2542734 1809869 837741 259746 1030394 1478784 725606 -1004429 -692186
5864 -692186 888218 2223633 1666763 451748 -37682 1024758 535122 -358226 -308212
5855 -308212 -646697 -723553 -232252 -242436 -686900 -1292040 -1681024 -1154812 -599637 246430
5845 246430 1343211 2128188 1767573 1763755 1743106 1428328 2399832 2481445 98735 -1565415
5835 -1565415 -2644064 -3329201 -3074860 -3463558 -3882671 -1860226 966025 3244779 3539598
5826 3539598 2152692 2654800 3476477 3258353 2188213 1108776 656258 -11633 -68777
5817 -68777 31422 22547 -654893 -1183898 -1184582 -1261946 -984693 102643 556482 -492613 -855610
$$ packed form
5883A825474O64629M81121o62798J0668k37692r79781r35539K99105J627648Q95371
5873B988206m45472p32865r72128n77995P70648M48390p53178j730035L12243
5864f92186J580404J335415n56870j215015m89430J062440m89636q93348N0014
5855c08212l38485p6856M91301j0184m44464o05140l88984N26212N55175Q46067
5845B46430J096781P84977l60615l818k0649l14778R71504Q1613k382710j664150
5835a565415j078649o85137K54341l88698m19113K022445K826251K278754K94819
5826C539598j386906N02108Q21677k18124j070140j079437m52518o67891n7144
5817f8777J00199q875o77440n29005o84p7364K77253J087336M53839j049095l62997
$$ plain form
5806 -855610 -388507 -222732 802156 2598298 1988714 406161 -1394377 -1123296 804149
5797 804149 -46950 -1310601 166341 690746 -583959 -955892 -133461 105409 -20510
5788 -20510 -1070353 -2504610 -3295569 -2558382 -898144 573148 -94698 -1537496 -1840334
5779 -1840334 -1761387 -2191472 -2203330 -2206979 -2678779 -2544811 -1869099 -1914797 -863518 30201
5769 30201 -92827 -577227 -1503918 -1439732 -513541 996284 574505 -904436 -972284 63198
5759 63198 654577 442863 1256237 1896852 1613323 1230171 815442 -232724 -871189 315290
5749 315290 1799358 2685969 2920032 3360000 2777507 780517 100174 1012717 1276493
5740 1276493 138164 646123 1554804 383275 -1325288 -3164157 -2296118 -294456 1181598
$$ packed form
5806h55610M67103J65775J024888J796142o09584j582553j800538K71081J927445
5797H04149q51099j263651J476942N24405j274705l71933Q22431K38870j25919
5788b0510j049843j434257p90959P37187J660238J471292o67846j442798l02838
5779a840334P8947m30085j1858l649m71800J33968O75712m5698J051279Q93719
5769C0201j23028m84400r26691O4186R26191J509825m21779j478941o7848J035482
5759F3198N91379k11714Q13374O40615k83529l83152m14729j048166o38465J186479
5749C15290J484068Q86611K34063M39968n82493j996990o80343R12543K63776
5740A276493j138329N07959R08681j171529j708563j838869Q68039K001662J476054
$$ plain form
5731 1181598 1614669 1235548 261228 504203 1251478 1471451 -112347 -1302144 63877
5722 63877 1317208 2857965 5019726 7017285 6624953 5725133 5362579 4841154 3711475
5713 3711475 2463852 2378523 3041923 4980229 6226485 5684188 5417655 4843169 4818683
5704 4818683 7425660 10753467 12922599 15306517 20002992 28113771 39597347 55349341
5696 55349341 74164440 91915931 100855184 96707057 83366894 68794780 55283234
5689 55283234 42851082 33446244 28482682 24767816 20037222 16200016 15397281 14482709
5681 14482709 12761316 11947904 11124643 11018212 12440707 13615742 13024535 12194097 13120928
5672 13120928 13577119 14551392 14864389 13951371 13144839 13046817 14153724 17601003 21136360
$$ packed form
5731A181598M33071l79121r74320K42975P47275K19973j583798j189797J366021
5722F3877J253331J540757K161761J997559l92332q99820l62554n21425j129679
5713C711475j247623q5329O63400J938306J246256n42297k66533n74486k4486
5704D818683K606977L327807K169132K383918M696475Q110779J1483576J5751994
5696E5349341J8815099J7751491Q939253m148127j3340163j4572114j3511546
5689E5283234j2432152r404838m963562l714866m730594l837206q02735r14572
5681A4482709j721393q13412q23261j06431J422495J175035n91207q30438R26831
5672A3120928M56191R74273L12997r13018q06532r8022J106907L447279L535357
$$ plain form
5663 21136360 25618826 34474133 48050022 66433256 86577481 103505316 109295868 101591893
5655 101591893 85459075 66683263 51662825 41876794 32993514 26200056 21866377 18185698
5647 18185698 14807278 12042300 10274363 8933957 8417386 8317855 7769771 6914778 7753490
5638 7753490 8819140 6922053 5069608 5704239 7526059 8886723 9793134 10073546 9502607
5629 9502607 7045574 4673536 3560389 2475553 1593815 1375387 2181919 4120864 5427671
5620 5427671 5167813 3964974 2920568 1280373 562618 912627 777521 550692 1182173
5611 1182173 2224704 1567734 55622 -221748 1107101 2796009 3334096 2323771 2308426
5602 2308426 3337038 4121103 5360201 5054073 3695972 2551178 1576025 1002255 998842
$$ packed form
5663B1136360M482466Q855307J3575889J8383234K0144225J6927835N790552p703975
5655A01591893j6132818j8775812j5020438r786031q883280o793458m333679l680679
5647A8185698l378420k764978j767937j340406n16571r9531n48084q54993Q38712
5638G753490J065650j897087j852445O34631J821820J360664R06411K80412n70939
5629I502607k457033k372038j113147j084836q81738k18428Q06532J938945J306807
5620E427671k59858j202839j044406j640195p17755L50009j35106k26829O31481
5611A182173J042531o56970j512112k77370J328849J688908N38087j010325j5345
5602B308426J028612P84065J239098l06128j358101j144794r75153n73770l413
$$ plain form
5593 998842 1192648 1706176 3338192 6001575 7928761 8295699 7667425 5699360 3784821
5584 3784821 2529776 1656427 2735266 2926715 1529138 -418638 -63786 1957690 3568456
5575 3568456 5253642 6925211 7503153 7763111 7717068 7428939 6670230 6820388 6715222
5566 6715222 6094435 5198670 4433054 3373536 2344294 3797181 4949841 4657150 4350118
5557 4350118 4775036 5199284 5174439 4330121 4619070 6781864 7694271 9939934 13101074
5548 13101074 14382993 16424410 20262011 27945917 39238429 54026796 76083539 107620243
5540 107620243 148936130 197515259 239237339 256369524 244884219 210682116 165669284
5533 165669284 121894970 87302057 64635668 48356443 35876684 28820078 23285512
$$ packed form
5593I98842J93806N13528J632016K663383J927186L66938o28274j968065j914539
5584C784821j255045q73349J078839J91449j397577j947776L54852K021476J610766
5575C568456J685186J671569N77942K59958m6043k88129p58709J50158j05166
5566F715222o20787q95765p65616j059518j029242J452887J152660k92691l07032
5557D350118M24918M24248k4845q44318K88949K162794R12407K245663L161140
5548A3101074J281919K041417L837601P683906J1292512J4788367K2056743L1536704
5540A07620243M1315887M8579129M1722080J7132185j1485305l4202103m5012832
5533A65669284m3774314l4592913k2666389j6279225j2479759p056606n534566
$$ plain form
5526 23285512 17855544 14606116 12723460 11597609 10143560 8498413 7195139 5968743
5518 5968743 4259228 2033060 1226698 2499392 3310190 2933172 2840211 3020978 4720533
5509 4720533 4528621 2878572 2163301 1196251 658306 246459 172833 2055390 3388518
5500 3388518 3522555 3296021 3305071 3770145 2445415 1181631 1805662 433384 -2027851
5491 -2027851 -2140131 -1436797 -1135242 -345907 -79973 338742 -93441 29405 -16341 -305505
5481 -305505 128321 1396796 2386615 3192543 3160641 2080222 1313679 458890 434341 702382
5471 702382 1182602 951128 -1517142 -2644752 -2190759 -1629511 -1682141 -1003830 -431615 -1776848
5461 -1776848 -2729803 -1147885 415551 310943 291532 617881 1298709 1923571 3542631
$$ packed form
5526B3285512n429968l249428j882656j125851j454049j645147j303274j226396
5518E968743j709515k226168q06362J272694Q10798l77018r2961J80767J699555
5509D720533j91912j650049p15271r67050n37945m11847p3626J882557J333128
5500C388518J34037k26534R050M65074j324730j263784O24031j372278k461235
5491b027851j12280P03334L01555P89335K65934M18715m32183J22846m5746k89164
5481c05505M33826J268475R89819Q05928l1902j080419p66543q54789k4549K68041
5471G02382M80220k31474k468270j127610M53993N61248n2630O78311N72215j345233
5461a776848r52955J581918J563436j04608j9411L26349O80828O24862J619060
$$ plain form
5452 3542631 4265091 3089507 2075975 2199751 1421749 1004288 2460761 2759112 1829647
5443 1829647 2773654 4158162 4169786 3337865 3981531 2998159 656731 95134 1308906
5434 1308906 2328895 3037487 2282950 2832167 3888568 4549802 4553149 3501634 1808437
5425 1808437 1717660 1956459 1968618 3065726 3684183 2977815 2534035 3028055 2047374 1063977
5415 1063977 1945038 3582287 5427425 4760969 3366280 1615158 -277408 -2133970 -3885188
5406 -3885188 -3273942 269004 2479128 2184650 254512 -1211629 -1358447 -2403472 -3530451
5397 -3530451 -4203475 -3966763 -3363206 -2910083 -2049458 -1441714 -1157182 -741012 -482064 -678801
5387 -678801 -635874 253704 -851142 -2337962 -3085223 -2376538 -1141370 -744066 -1106347
$$ packed form
5452C542631P22460j175584j013532J23776p78002m17461J456473K98351r29465
5443A829647R44007J384508J1624q31921O43666r83372k341428n61597J213772
5434A308906J019989P08592p54537N49217J056401O61234L347j051515j693197
5425A808437r0777K38799J2159J097108O18457p06368m43780M94020r80681r83397
5415A063977Q81061J637249J845138o66456j394689j751122j892566j856562j751218
5406c885188O11246L542946K210124k94478j930138j466141j46818j045025j126979
5397c530451o73024K36712O03557M53123Q60625O07744K84532M16170K58948j96737
5387f78801M2927Q89578j104846j486820p47261P08685J235168L97304l62281
$$ plain form
5378 -1106347 -724713 26500 1184286 3431020 3371356 2366590 591815 -1051490 -2159177
5369 -2159177 -3845061 -4312090 -3375316 -3012762 -2424216 -2050022 -1445142 585334 1991988
5360 1991988 2083724 1794656 855328 613976 100781 -645068 183865 1834662 2847277
5351 2847277 2894079 1738164 26060 -1310211 -2501710 -2660556 -652920 425711 -357814
5342 -357814 -840393 -1393602 -2817728 -4492637 -5620597 -5153548 -2974467 -1508343 -2342808
5333 -2342808 -2209073 -1781994 -3302323 -4427033 -3909988 -3221960 -1756114 -610072 -613077
5324 -613077 -243445 1531070 3153944 4778377 5057122 2615237 951720 387650 -138515
5315 -138515 -265105 1599851 2347920 1662292 655828 453744 -99336 -1374328 -1400616
$$ packed form
5378a106347L81634P51213J157786K246734n9664j004766j774775j643305j107687
5369b159177j685884m67029R36774L62554N88546L74194O04880K030476J406654
5360A991988R1736k89068r39328k41352n13195p45849Q28933J650797J012615
5351B847277M6802j155915j712104j336271j191499j58846K007636J078631p83525
5342c57814m82579n53209j424126j674909j127960M67049K179081J466124q34465
5333b342808J33735M27079j520329j124710N17045O88028J465846J146042l005
5324f13077L69632J774515J622874J624433K78745k441885j663517n64070n26165
5315a38515j26590J864956P48069o85628j006464k02084n53080j274992k6288
$$ plain form
5306 -1400616 -138418 2405682 4760998 5888108 5791640 5250352 3684217 2445980 2361975
5297 2361975 2814119 3232709 4472731 6515564 6561080 4021822 778420 -480160 -1029403
5288 -1029403 -3404752 -4904728 -3807380 -2555242 -2109400 -645594 95299 697446 3579293
5279 3579293 5847896 6193526 5392153 4306111 3675787 5068439 4605770 3159379 3109683
5270 3109683 3747427 3589493 2293454 479005 -1352539 -2891787 -3241585 -2196675 -736080
5261 -736080 262096 317495 -325035 192071 2813401 3884158 4148687 4881685 4829775 4237644
5251 4237644 3895421 4769948 6714587 8015546 7478521 8035847 10111861 10606776 8741158
5242 8741158 7170723 7388462 9506888 11459535 14001420 18341518 23908665 30830214
$$ packed form
5306a400616J262198K544100K355316J127110r6468n41288j566135j238237q4005
5297B361975M52144M18590J240022K042833M5516k539258l243402j258580n49243
5288a029403k375349j499976J097348J252138M45842J463806P40893O02147K881847
5279C579293K268603L45630q01373j086042o30324J392652m62669j446391m9696
5270C109683O37744j57934j296039j814449j831544j539248l49798J044910J460595
5261g36080R98176N5399o42530N17106K621330J070757K64529P32998n1910n92131
5251D237644l42223Q74527J944639J300959n37025N57326K076014M94915j865618
5242H741158j570435K17739K118426J952647K541885M340098N567147O921549
$$ plain form
5234 30830214 38769953 50351951 68543036 94145403 126532540 162350778 191352402
5227 191352402 201239299 187731051 157019151 123526157 96813022 76033671 60225761
5220 60225761 48434348 39821233 32262788 25438112 21719617 18883034 15075894 14362754
5212 14362754 14333521 11050685 8171233 8095808 8616467 9617210 11095274 11547512 11621483
5203 11621483 9621613 7345707 7933089 8026874 8728101 9658004 11422189 13261484 13690716
5194 13690716 13947138 13884564 13893114 12012819 12223549 13775746 13515302 12434536 11611107
5185 11611107 10106035 8554357 8443157 9705517 9261855 7744977 6044677 5414257 5363031
5176 5363031 4600260 3267200 3317782 2038794 232525 -172291 256403 -496164 -1602617
$$ packed form
5234C0830214P939739J1581998J8191085K5602367L2387137L5818238K9001624
5227A91352402R886897j3508248l0711900l3492994k6713135k0779351j5807910
5220F0225761j1791413q613115p558445o824676l718495k836583l807140p13140
5212A4362754k9233l282836k879452p5425N20659J000743J478064M52238P3971
5203A1621483j999870k275906N87382R3785P01227R29903J764185J839295M29232
5194A3690716K56422o2574Q550j880295K10730J552197k60444j080766q23429
5185A1611107j505072j551678j11200J262360m43662j516878j700300o30420n1226
5176E363031p62771j333060N0582j278988j806269m04816M28694p52567j106453
$$ plain form
5167 -1602617 -350983 774793 541283 621354 122451 308198 239761 1885067 3118802
5158 3118802 1529173 -47986 222676 1702239 2089793 1622666 1225468 1548619 2388526
5149 2388526 2834060 3401115 3653255 3471797 4541098 5081884 3219313 980317 -494730
5140 -494730 468116 2255224 3044130 2010363 639634 817019 1320448 1670218 768756
5131 768756 -127229 -1902185 -2595703 -1388197 -1211385 -82008 -356531 -1043749 -566195
5122 -566195 -973506 -1478924 -1213249 -897868 -1412130 -2089642 -2735599 -904883 1060742
5113 1060742 1218460 -276928 -1577103 -1457374 -2327573 -2535172 -1049192 -46000 964926
5104 964926 1964286 1802610 -422798 -1004676 -316788 1133955 1835905 852161 589704
$$ packed form
5167a602617J251634J125776k33510Q0071m98903J85747o8437J645306J233735
5158C118802j589629j577159K70662J479563L87554m67127l97198L23151Q39907
5149B388526M45534N67055K52140j81458J069301N40786j862571k238996j475047
5140d94730R62846J787108P88906j033767j370729J77385N03429L49770r01462
5131G68756q95985j774956o93518J207506J76812J129377k74523o87218M77554
5122e66195m07311n05418K65675L15381n14262o77512o45957J830716J965625
5113A060742J57718j495388j300175J19729q70199k07599J485980J003192J010926
5104I64926R99360j61676k225408n81878O87888J450743P01950r83744k62457
$$ plain form
5095 589704 1503982 1959923 2532041 422283 -96459 235759 -522555 696828 2607359
5086 2607359 2409298 716433 558480 1126528 1343427 856035 251020 -247616 -1638058
5077 -1638058 -3603573 -5115947 -4623014 -2870642 -750593 -909051 107841 529945 -15318
5068 -15318 -88139 -679224 -441476 -450786 -1960833 -3967876 -2645438 -1381880 -755856 -1311945
5058 -1311945 -2060337 -1621254 -190709 249641 327125 508244 1402561 1920384 1688484 2750098
5048 2750098 2401079 1079518 606905 1785399 3698700 4669298 3719074 1868261 851018
5039 851018 1582086 2608407 2006473 1351582 462681 -2262783 -3528094 -1114369 108338
5030 108338 -847075 -684213 536410 1778990 1671198 -145180 -1670459 -2162679 -921974
$$ packed form
5095E89704R14278M55941N72118k109758n18742L32218p58314J219383J910531
5086B607359j98061j692865j57953N68048K16899m87392o05015m98636j390442
5077a638058j965515j512374M92933J752372K120049j58458J016892M22104n45263
5068a5318p2821n91085K37748r310j510047k007043J322438J263558O26024n56089
5058a311945p48392M39083J430545M40350P7484J81119Q94317N17823k31900J061614
5048B750098l49019j321561m72613J178494J913301R70598r50224j850813j017243
5039H51018P31068J026321o01934o54891q88901k725464j265311K413725J222707
5030A08338r55413J62862J220623J242580j07792j816378j525279m92220J240705
$$ plain form
5021 -921974 1074828 926978 345371 -408822 -1299386 -1812384 -1032296 128083 887231
5012 887231 1112057 -233755 -1458740 -1749829 -870724 -1698011 -2558731 -1257078 -564131
5003 -564131 -412717 -2820228 -5759137 -5144571 -4116488 -3262514 -1851523 -1196805 -1997042
4994 -1997042 -2330248 -1831547 -662804 -452196 -468773 203728 -119056 -728428 -400159 575009
4984 575009 984828 1072353 573667 663093 898762 42711 -1548574 -2568042 -2984898 -2083212
4974 -2083212 -288512 544522 134358 -1614591 -3515544 -3317021 -3155595 -3114732 -2174473
4965 -2174473 -1429121 -1045675 -1305039 -3151399 -4777952 -3808608 -2749052 -1249375 -250235
4956 -250235 -669088 -1405453 -891129 -1216277 -2880518 -3345869 -2258635 -1486043 -1796587
$$ packed form
5021i21974J996802j47850n81607p54193q90564n12998P80088J160379P59148
5012H87231K24826j345812j224985k91089Q79105q27287q60720J301653O92947
5003e64131J51414k407511k938909O14566J028083Q53974J410991O54718q00237
4994a997042l33206M98701J168743K10608j6577O72501l22784o09372L28269R75168
4984E75009M09819Q7525m98686Q9426K35669q56051j591285j019468m16856R01686
4974b083212J794700Q33034m10164j748949j900953J98523J61426M0863R40259
4965b174473P45352L83446k59364j846360j626553R69344J059556J499677R99140
4956b50235m18853p36365N14324l25148j664241m65351J087234P72592l10544
$$ plain form
4947 -1796587 -1330873 -164731 -98800 283881 763149 1620446 2541676 1648564 -425492
4938 -425492 -1561761 307795 1488067 254766 -1557387 -647331 1669356 2070461 1421179
4929 1421179 648356 -32529 -2210671 -2372518 -998770 -731262 240877 260463 947826
4920 947826 2423548 2209985 1212884 733446 1333698 870821 300289 1023547 1872723 1790566
4910 1790566 2540752 2711614 1134915 540368 -1423687 -2260270 -1684152 -1293219 -1584733
4901 -1584733 -982314 276816 973813 516083 -775833 -266257 1470640 1953533 1598764
4892 1598764 737661 276975 358347 570455 1719463 3111770 2475333 933897 -524527
4883 -524527 -441874 -367804 94506 575766 581943 -193243 -870271 446523 2261808 2431799
$$ packed form
4947a796587M65714J166142O5931L82681M79268Q57297R21230q93112k074056
4938d25492j136269J869556J180272j233301j812153R10056K316687M01105o49282
4929A421179p72823o80885k178142j61847J373748K67508R72139J9586O87363
4920I47826J475722k13563r97101m79438O00252m62877n70532P23258Q49176q2157
4910A790566P50186J70862j576699n94547j964055q36583N76118L90933k91514
4901a584733O02419J259130O96997m57730j291916N09576J736897M82893l54769
4892A598764q61103m60686Q1372K12108J149008J392307o36437j541436j458424
4883e24527Q2653P4070M62310M81260O177p75186o77028J316794J815285J69991
$$ plain form
4873 2431799 1472271 446508 894037 1278675 74347 228195 1852833 2306758 1354811
4864 1354811 453939 -727861 -1695161 -2052523 -1577869 -709700 444661 621252 1447869
4855 1447869 2973575 3155482 3572321 2179534 262473 354885 1202402 1413982 3138673
4846 3138673 3274394 2895753 2668810 1844331 537203 -561572 -1216186 -2029047 -1128970
4837 -1128970 -774250 -66460 559463 717134 201432 -387021 -147246 350657 1219637 1241288
4827 1241288 199200 -2349729 -3801551 -3339822 -1994774 -258259 569301 1067663 1900390
4818 1900390 1269777 -190658 -1000414 -2391397 -3980485 -4056540 -1941913 509958 2141877
4809 2141877 3144341 3261776 2959749 2096965 983615 1293611 1737564 1431297 2112253
$$ packed form
4873B431799r59528j025763M47529L84638j204328J53848J624638M53925r51947
4864A354811r00872j181800r67300l57362M74654Q68169J154361J76591Q26617
4855A447869J525706J81907M16839j392787j917061R2412Q47517K11580J724691
4846C138673J35721l78641k26943q24479j307128j098775o54614q12861R00077
4837a128970L54720P07790O25923J57671n15702n88453K39775M97903Q68980K1651
4827A241288j042088k548929j451822M61729J345048J736515Q27560M98362Q32727
4818A900390o30613j460435q09756j390983j589088p6055K114627K451871J631919
4809B141877J002464J17435l02027q62784j113350L09996M43953l06267O80956
$$ plain form
4800 2112253 3408962 641517 -1557884 -570052 577772 1022310 1584342 392634 -1439280
4791 -1439280 -1411357 -463068 13382 -472538 -2101929 -2199082 -1603827 -990741 -89216 96298
4781 96298 -861870 -1847570 -3323327 -4440543 -3933718 -1232612 1820967 3223374 2425167
4772 2425167 310833 -875551 -944267 -310353 1238750 2018367 2739505 1617394 305780
4763 305780 256167 1204150 823137 278232 -551047 -1200569 -1063290 -995200 -501326 231329
4753 231329 -188093 -1414244 -2014671 -1817810 -1632978 -1247182 847508 798585 -1306755
4744 -1306755 -2692307 -3195146 -3261282 -3624540 -4227167 -3229145 -1535550 -1346239 -1170676
4735 -1170676 -454186 -90478 143456 42014 -574108 -1664976 -1626587 -320356 -1189090
$$ packed form
4800B112253J296709k767445k199401R87832J147824M44538N62032j191708j831914
4791a439280K7923R48289M76450m85920j629391r7153N95255O13086R01525J85514
4781I6298r58168r85700j475757j117216N06825K701106L053579J402407p98207
4772B425167k114334j186384o8716O33914J549103P79617P21138j122111j311614
4763C05780m9613R47983l81013n44905q29279o49522J37279O8090M93874P32655
4753B31329m19422j226151o00427J96861J84832L85796K094690m8923k105340
4744a306755j385552n02839o6136l63258o02627R98022J693595J89311J75563
4735a170676P16490L63708K33934j01442o16122j090868L8389J306231q68734
$$ plain form
4726 -1189090 -4775140 -4894893 -4284195 -3145054 -1678813 -1703314 -1656413 -2434045 -2623206
4717 -2623206 -1711979 -1152000 -1862145 -2647585 -3029560 -3429526 -2933557 -1617611 76415
4708 76415 1466213 2073030 3324357 3272038 1662539 -345687 -1680129 -943110 520525
4699 520525 2344891 5128442 6556337 5778430 3378989 604969 -1275097 -2271781 -2873369
4690 -2873369 -3837598 -4957027 -4171509 -3019369 -2409242 -596478 2071521 3504972 3617370
4681 3617370 3393029 2111959 414213 -687273 -809919 -663410 -2113016 -1794909 -1769044
4672 -1769044 -2677202 -2389965 -3095412 -3084197 -996524 364184 627970 225419 -360889
4663 -360889 51619 870624 1081904 105926 -296293 -285480 -711090 -245316 806584 -390806
$$ packed form
4726a189090l586050j19753O10698J139141J466241k4501M6901p77632j89161
4717b623206R11227N59979p10145p85440l81975l99966M95969J315946J694026
4708G6415J389798O06817J251327n2319j609499k008226j334442P37019J463635
4699E20525J824366K783551J427895p77907k399441k774020j880066r96684o01588
4690b873369r64229j119429P85518J152140O10127J812764K667999J433451J12398
4681C617370k24341j281070j697746j101486j22646J46509j449606L18107K5865
4672a769044r08158K87237p05447J1215K087673J360708K63786m02551n86308
4663c60889M12508Q19005K11280r75978m02219J0813m25610M65774J051900j197390
$$ plain form
4653 -390806 -1627105 -719487 -762113 -3860503 -5892298 -5180329 -2450143 228056 1239565
4644 1239565 791987 15240 -656324 954128 2010474 1202763 927962 1519859 1994616
4635 1994616 915699 -423316 -1675640 -1778708 -1628169 35576 1260008 220898 -438443
4626 -438443 -472210 320141 1735476 3129362 3809238 2482539 397447 -1522473 -1443288
4617 -1443288 -678809 126885 268222 -191043 109856 403437 532067 933492 1398690 507509
4607 507509 398347 213179 41974 2155042 4463622 3234059 1739420 2200979 2630973
4598 2630973 1882343 821915 353219 -968567 -1727317 -2032521 -2329016 -387297 2093677
4589 2093677 2827668 2643826 3119573 3765306 4752004 4527437 4293083 3046126 1914118
$$ packed form
4653c90806j236299R07618m2626l098390k031795P11969K730186K678199J011509
4644A239565m47578p76747o71564J610452J056346q07711k74801N91897M74757
4635A994616j078917j339015j252324j03068J50539J663745J224432j039110o59341
4626d38443l3767P92351J415335J393886O79876j326699k085092j919920P9185
4617a443288P64479Q05694J41337m59265L00899K93581J28630M01425M65198q91181
4607E07509j09162j85168j71205K113068K308580j229563j494639M61559M29994
4598B630973p48630j060428m68696j321786p58750l05204k96495J941719K480974
4589B093677P33991j83842M75747O45733R86698k24567k34354j246957j132008
$$ plain form
4580 1914118 914827 -880881 -1300719 -654896 869785 2292008 1930732 542104 -2148348
4571 -2148348 -2590364 -1277089 -2352592 -4542091 -6325148 -4848536 -1533338 1830340
4563 1830340 2847541 984536 -348151 -1321070 -931163 1528507 4275158 4752717 2169270
4554 2169270 -472168 -1213532 -690879 -120976 -235877 369381 2098394 2995047 909905
4545 909905 -2590331 -3876763 -3701728 -2864072 -2969195 -4494354 -4419343 -2640565 -680843
4536 -680843 514945 1517384 1992560 1364473 -946850 -3650725 -3718424 -2557502 -4228013
4527 -4228013 -4371235 -2031393 -354228 -118976 -1069124 -657482 1340585 1926036 662221
4518 662221 -897695 -775726 309791 -95700 175492 76410 -100983 253404 579047 1566006
$$ packed form
4580A914118r99291j795708m19838O45823J524681J422223l61276j388628k690452
4571b148348m42016J313275j075503k189499j783057J476612L315198L363678
4563A830340J017201j863005j332687r72919L89907K459670K746651M77559k583447
4554B169270k641438p41364N22653N69903j14901O05258J729013Q96653k085142
4545I09905l500236j286432J75035Q37656j05123j525159P5011J778778J959722
4536f80843J195788J002439M75176o28087k311323k703875o7699J160922j670511
4527d228013j43222K339842J677165K35252r50148M11642J998067N85451j263815
4518F62221j559916J21969J085517m05491K71192r9082j77393L54387L25643R86959
$$ plain form
4508 1566006 1091295 230522 -760648 -2374593 -1139436 81446 -322499 -74039 34272
4499 34272 -462921 -284211 -766476 -2071180 -2282633 -2675906 -3399527 -2632494 -1070616 -965759
4489 -965759 -2137567 -3158108 -4408283 -4973303 -4061811 -3982185 -5511054 -7305795 -8364877
4480 -8364877 -6948889 -4008204 -3176313 -4396813 -4828109 -4100472 -3845827 -3050748 -1921195
4471 -1921195 -1643705 -1419875 -587442 42649 1678778 1954958 384484 -2287336 -3772891
4462 -3772891 -1877259 -525840 -1008717 -936222 -498315 -524386 -355120 -940422 -549646 302596
4452 302596 -684269 12170 1184305 -777314 -3285809 -2768370 -790399 -42695 -1105556
4443 -1105556 -2136683 -3330432 -3197984 -2975848 -2007056 -1136480 -2417306 -3480970 -3247128
$$ packed form
4508A566006m74711q60773r91170j613945J235157J220882m03945K48460J08311
4499C4272m97193J78710m82265j304704k11453l93273p23621P67033J561878J04857
4489i65759j171808j020541j250175n65020R11492P9626j528869j794741j059082
4480h364877J415988K940685Q31891j220500m31296P27637K54645P95079J129553
4471a921195K77490K23830Q32433O30091J636129K76180j570474k671820j485555
4462c772891J895632J351419m82877P2495M37907k6071J69266n85302L90776Q52242
4452C02596r86865O96439J172135j961619k508495N17439J977971P47704j062861
4443a105556j031127j193749J32448K22136R68792Q70576j280826j063664K33842
$$ plain form
4434 -3247128 -1281356 976680 2363628 3412139 4912946 5355818 3961188 2452045
4426 2452045 1995277 2295430 2347167 1424030 217431 -528452 -967147 133870 2294753
4417 2294753 2112330 -458054 -2871419 -2927139 -1216896 654742 1294667 1897583 3371204
4408 3371204 4261869 3213969 2187732 1336854 432256 -983141 4542 1302982 1242761
4399 1242761 531054 1681269 2898193 3259753 3338057 3685996 4168161 3149258 2146161
4390 2146161 1369036 2176080 1256920 -1038097 -1907796 -1592736 -731063 -382167 -517197
4381 -517197 -956719 -1128668 -392736 -1435691 -2688632 -3118020 -2777599 -1191335 1289126
4372 1289126 2811713 3980720 4175753 3624582 2463915 966540 2691490 4860192 5236422
$$ packed form
4434c247128J965772K258036J386948J048511J500807M42872j394630j509143
4426B452045m56768L00153N1737r23137j206599p45883m38695J101017K160883
4417B294753j82423k570384k413365n5720J710243J871638O39925O02916J473621
4408C371204Q90665j047900j026237q50878r04598j415397R87683J298440o0221
4399A242761p11707J150215J216924L61560P8304L47939M82165j018903j003097
4390B146161p77125Q07044r19160k295017q69699L15060Q61673L48896j35030
4381e17197m39522j71949P35932j042955j252941m29388L40421J586264K480461
4372A289126J522587J169007J95033n51171j160667j497375J724950K168702L76230
$$ plain form
4363 5236422 4334250 1979980 -383912 -575602 487078 1239544 3312247 4971104 5787992
4354 5787992 7938362 9493243 10850480 14166397 19863354 27261131 36439174 48673306
4346 48673306 69514809 101900799 149083220 213688874 280280649 307786101 273138053
4339 273138053 204401549 142348806 98327100 67879509 49107680 36795495 28189270
4332 28189270 21917811 16581613 12655604 9474130 6366172 3671546 3494547 4178328
4324 4178328 4252742 3339523 4038805 4352307 3665577 3013230 3429521 4184886 2746343 1355394
4314 1355394 1440843 1256830 785923 851903 1369539 1426894 1511120 2408418 3005586 3536065
4304 3536065 4172398 4717231 4614478 3744610 2844960 1375136 411298 539036 422035
$$ packed form
4363E236422r02172k354270k363892j91690J062680P52466K072703J658857Q16888
4354E787992K150370J554881J357237L315917N696957P397777R178043J2234132
4346D8673306K0841503L2385990M7182421O4605654O6591775K7505452l4648048
4339B73138053o8736504o2052743m4021706l0447591j8771829j2312185q606225
4332B8189270o271459n336198l926009l181474l107958k694626j76999O83781
4324D178328P4414r13219O99282L13502o86730o52347M16291P55365j438543j390949
4314A355394Q5449j84013m70907O5980N17636N7355Q4226Q97298N97168N30479
4304C536065O36333N44833j02753q69868q99650j469824r63838J27738j17001
$$ plain form
4295 422035 869587 606429 446425 1316004 2602937 3821237 4305611 4617220 2725250
4286 2725250 2508919 2158890 559669 -515968 -1249039 -842974 520976 1485092 2343798
4277 2343798 4558172 4644481 3735340 2942812 2345659 968117 -1698515 -2919769 -1877485
4268 -1877485 -1095833 -306667 -708933 -166025 1208826 1610215 1162910 520556 1595519
4259 1595519 2910627 2917055 1679603 1039404 309855 -893091 -1572102 -2607868 -2430882
4250 -2430882 -1713507 -1477234 -552729 -754024 -1129373 -2038485 -2700748 -1692955 -293786
4241 -293786 1744986 2968266 2173021 1322070 3256850 4781752 4628183 5235768 5104955
4232 5104955 4415138 4042082 3596349 2918947 1545719 -554729 -2763894 -3226854 -3113494
$$ packed form
4295D22035M47552k63158j60004Q69579J286933J218300M84374L11609j891970
4286B725250k16331l50029j599221j075637p33071M06065J363950R64116Q58706
4277B343798K214374Q6309r09141p92528n97153j377542k666632j221254J042284
4268a877485P81652P89166m02266N42908J374851M01389m47305o42354J074963
4259A595519J315108O428j237452o40199p29549j202946o79011j035766J76986
4250b430882P17375K36273R24505k01295l75349r09112o62263J007793J399169
4241b93786K038772J223280p95245q50951J934780J524902j53569O07585j30813
4232E104955o89817l73056m45733o77402j373228k100448k209165m62960J13360
$$ plain form
4223 -3113494 -4617463 -5383734 -4991614 -5344291 -4076297 -2544113 -1968668 -1867341 -1319136
4214 -1319136 -638749 849465 2976554 2859351 2013736 1496344 1252560 -307218 -1936961
4205 -1936961 -2406809 -3368718 -4018957 -3873179 -3316907 -2399035 -793673 262421 1029325
4196 1029325 1896037 2077410 2286433 2176758 1646979 1918792 2088046 1889122 857641
4187 857641 -1772011 -3424385 -2863713 -1557437 -2900729 -4411658 -3276974 -2264042 -2485186
4178 -2485186 -1776627 -1219714 -1650329 -1896718 -1424650 73993 833194 214473 677935
4169 677935 906156 -352021 -407737 -709821 -1566335 -2592693 -2713228 -1235669 506047
4160 506047 876798 1724924 2548171 2297230 2125238 1399524 547584 627636 11798 -1142585
$$ packed form
4223c113494j503969p66271L92120l52677J267994J532184N75445J01327N48205
4214a319136O80387J488214K127089j17203q45615n17392k43784j559778j629743
4205a936961m69848r61909o50239J45778N56272R17872J605362J056094P66904
4196A029325Q66712J81373K09023j09675n29779K71813J69254j98924j031481
4187H57641k629652j652374N60672J306276j343292j510929J134684J012932k21144
4178b485186P08559N56913m30615k46389M72068J498643P59201o18721M63462
4169F77935K28221j258177n5716l02084q56514j026358j20535J477559J741716
4160E06047L70751Q48126Q23247k50941j71992p25714q51940Q0052o15838j154383
$$ plain form
4150 -1142585 -1866658 -1103395 198714 350901 -696142 -1062654 -643825 -8687 -957841
4141 -957841 -1396535 723826 2364417 3035656 2564248 2246401 2830187 3213720 1997160
4132 1997160 88918 -320909 1888039 3648019 3026253 1411300 696317 -835446 -2003049
4123 -2003049 -1665443 -1393415 -1247544 -661099 651845 1784842 1110970 -775159 -533778
4114 -533778 411109 -852266 -2079904 -2175900 -1822098 -2172640 -2225665 -1474333 -2251611 -4161801
4104 -4161801 -4416507 -2946092 -1667999 -1928818 -2156216 -966723 -73547 87912 1036785
4095 1036785 2477252 3227092 4225219 4473143 2533450 1568450 1924513 1343009 -450804
4086 -450804 -528076 1627373 3724993 4669987 4804666 4756070 3301289 1162228 672450
$$ packed form
4150a142585p24073P63263J302109J52187j047043l66512M18829O35138r49154
4141i57841m38694K120361J640591O71239m71408l17847N83786L83533j216560
4132A997160j908242m09827K208948J759980o21766j614953p14983j531763j167603
4123b003049L37606K72028J45871N86445J312944J132997o73872j886129K41381
4114e33778R44887j263375j227638r5996L53802l50542n3025P51332p77278j910190
4104d161801k54706J470415J278093k60819k27398J189493Q93176J61459R48873
4095A036785J440467P49840R98127K47924j939693r65000L56063n81504j793813
4086d50804p7272K155449K097620R44994J34679m8596j454781k139061m89778
$$ plain form
4077 672450 1378837 1743536 888154 -61656 531853 1147746 -707634 -1774254 -1458190
4068 -1458190 -2535673 -3733909 -3359386 -2878077 -2785071 -3447052 -4853678 -3994620 -579877
4059 -579877 1955048 1086492 -98819 -495179 -954914 -1512144 -1485172 -1402935 -1873138 -978209
4049 -978209 173484 1255220 2742536 2782843 2591035 2128378 784063 423389 1155597
4040 1155597 384838 -1290755 -2011510 -1671282 -1899321 -450516 1125934 324541 -1632444
4031 -1632444 -2401977 -1151779 -173180 126749 1143854 411102 -623517 -787342 1200838
4022 1200838 3064568 3293354 3528593 4292407 2717337 669047 -139723 -949229 -994866
4013 -994866 29182 904565 1433651 2536152 3270910 3827755 4036767 3156671 1565925
$$ packed form
4077F72450P06387L64699q55382r49810N93509O15893j855380j066620L16064
4068a458190j077483j198236L74523M81309R3006o61981j406626Q59058L414743
4059e79877K534925q68556j185311l96360m59735n57230K6972Q2237m70203Q94929
4049i78209J151693J081736J487316M0307j91808m62657j344315l60674P32208
4040A155597p70759j675593p20755L40228k28039J448805J576450q01393j956985
4031a632444p69533J250198R78599K99929J017105p32752j034619j63825J988180
4022A200838J863730K28786K35239P63814j575070k048290q08770q09506m5637
4013i94866J024048Q75383N29086J102501P34758N56845K09012q80096j590746
$$ plain form
4004 1565925 858401 2207573 2877451 3352851 3687538 2707209 1691890 946021 1543622
3995 1543622 1884728 1317940 952403 1115318 2941839 3670098 2598729 2035468 2009233
3986 2009233 1767584 1330410 1511276 1530174 1786914 2043882 1788092 1431295 1446195 829041
3976 829041 553260 737855 467410 631706 579951 312458 -234021 -1363108 -3680572 -5645488
3966 -5645488 -4835025 -3289531 -2270458 -630236 -750194 -1916197 -1127635 -360847 631410
3957 631410 2266322 4349722 4815974 4342775 1841992 -723342 -1316722 -883697 -1029776
3948 -1029776 -427438 -548222 -842307 -1261806 -1879734 -1895633 -1688674 -2441366 -2366679 -2083801
3938 -2083801 -2148240 -1507019 -1971286 -3611133 -3347410 -1849760 -2051149 -2956103 -2251535
$$ packed form
4004A565925p07524J349172O69878M75400L34687r80329j015319p45869N97601
3995A543622L41106n66788l65537J62915J826521P28259j071369n63261k6235
3986B009233k41649m37174J80866J8898K56740K56968k55790l56797J4900o17154
3976H29041k75781J84595k70445J64296n1755k67493n46479j129087k317464j964916
3966e645488Q10463J545494J019073J640222j19958j166003P88562P66788R92257
3957F31410J634912K083400M66252m73199k500783k565334n93380M33025j46079
3948a029776O02338j20784k94085m19499o17928j5899K06959p52692P4687K82878
3938b083801o4439O41221m64267j639847K63723J497650k01389r04954P04568
$$ plain form
3929 -2251535 -716413 -204213 -439728 -2088243 -2836476 -902728 1260733 2027083 2015582
3920 2015582 1964411 3256503 4181097 3385548 1898284 668417 222183 -708732 -1517264
3911 -1517264 -810668 380895 162040 109308 -214503 -1523194 -1713202 -864581 -61663
3902 -61663 1213244 848299 415045 1314058 1205348 617474 539468 1240788 1872418 3069547
3892 3069547 5192007 5817762 5029834 4893443 4703873 3350625 1667544 66427 121769
3883 121769 1294663 837066 504960 443369 938270 697183 -644600 -2472009 -3100320
3874 -3100320 -3524168 -2476415 -1424074 -2279400 -2891844 -3033865 -2810909 -2757411 -3541552
3865 -3541552 -3547083 -644046 1885592 602348 -867092 -957175 -1135662 -1024117 -499374
$$ packed form
3929b251535J535122N12200k35515j648515p48233J933748K163461P66350j1501
3920B015582n1171J292092R24594p95549j487264j229867m46234r30915q08532
3911a517264P06596J191563k18855n2732l23811j308691j90008Q48621Q02918
3902f1663J274907l64945m33254Q99013j08710n87874p8006P01320O31630J197129
3892C069547K122460O25755p87928j36391j89570j353248j683081j601117N5342
3883A21769J172894m57597l32106o1591M94901k41087j341783j827409o28311
3874c100320m23848J047753J052341q55326o12444j42021K22956N3498p84141
3865c541552n531K903037K529638j283244j469440r0083j78487J11545N24743
$$ plain form
3856 -499374 -162328 -275280 606273 366883 -135072 1503124 2807332 1360775 -731817
3847 -731817 -279313 1547796 2795329 2809744 1511450 955941 861358 783123 -591945 -1729420
3837 -1729420 -1008371 528968 1767320 2291696 2605358 2189813 568055 -3107 438827
3828 438827 443747 305150 -394029 -506541 -333861 -155206 -283230 -544390 -283380 937271
3818 937271 1714274 992763 1288677 3184338 3744780 1872105 -220667 -1064876 -1678800
3809 -1678800 -2854582 -3341207 -1951481 613308 1222050 -743042 -705213 753023 1841360
3800 1841360 1922561 1635731 -631329 -2089208 -1204365 433433 614370 -1126370 -2426442
3791 -2426442 -1435957 709120 1522817 405228 -1701514 -2920563 -2499583 -2134845 -2382332
$$ packed form
3856d99374L37046j12952Q81553k39390n01955J638196J304208j446557k092592
3847g31817M52504J827109J247533J4415j298294n55509r4583p8235j375068j137475
3837a729420P21049J537339J238352N24376L13662m15545j621758n71162M41934
3828D38827M920j38597o99179j12512J72680J78655j28024k61160K61010J220651
3818I37271P77003p21511K95914J895661N60442j872675k092772q44209o13924
3809a678800j175782m86625J389726K564789O08742j965092L7829J458236J088337
3800A841360Q1201k86830k267060j457879Q84843J637798J80937j740740j300072
3791b426442R90485K145077Q13697j117589k106742j219049M20980L64738k47487
$$ plain form
3782 -2382332 -2343450 -1148718 -92396 -777520 -2557915 -4073798 -4774615 -4079687 -3820227
3773 -3820227 -4611762 -4926468 -5908588 -7986942 -8342514 -5999932 -2756867 -859424 -181219
3764 -181219 -531928 -1400695 -1642516 -1711113 -1410595 -1393129 -1673641 -2140843 -1722858 -751188
3754 -751188 -923956 -2211269 -1059027 448161 -248302 -2069718 -2398112 -1123062 -118735
3745 -118735 -392007 -463079 -12390 -415209 -1362 894874 754733 491965 1160975 936248
3735 936248 -507158 -1627694 -2274563 -1593939 -570248 -97677 -195821 197672 802711
3726 802711 1404570 2075088 1996731 2312207 2428212 1644812 831538 633003 1421761 1155849
3716 1155849 -280766 57749 1850572 2812314 2652094 2381060 1225357 678193 1040521
$$ packed form
3782b382332L8882J194732J056322o85124j780395j515883p00817O94928K59460
3773c820227p91535l14706r82120k078354l55572K342582L243065J897443O78205
3764a81219l50709q68767k41821o8597L00518J7466k80512m67202M17985R71670
3754g51188j72768j287313J152242J507188o96463j821416l28394J275050J004327
3745a18735k73272p1072M50689m02819M13847Q96236j40141k62768O69010k24727
3735I36248j443406j120536o46869O80624J023691M72571r8144L93493O05039
3726H02711O01859O70518p8357L15476J16005p83400q13274j98535P88758k65912
3716A155849j436615L38515J792823R61742j60220k71034j155703n47164L62328
$$ plain form
3707 1040521 548324 392997 848718 2222240 3788908 3877784 2595191 2680824 1566190
3698 1566190 165725 -505811 -58412 518122 1266948 1928749 2143752 1916669 900322
3689 900322 944355 1384324 462163 -573335 -1280734 -1581053 -1525804 -1842677 -1514437 -1315900
3679 -1315900 -1180303 -2132470 -3689344 -4460483 -5080650 -4968113 -4543229 -3110075 -2529941
3670 -2529941 -2656522 -1012726 -142906 13959 -1676985 -3751004 -4283069 -3942201 -1914159
3661 -1914159 623176 1517724 1328939 1334388 2124424 1649595 -1370022 -1939262 -1070281 -1044591
3651 -1044591 -1926766 -1724622 -1652466 -2005576 -3656600 -5415781 -4832926 -3346271 -1551712
3642 -1551712 -256304 1058841 1106077 649901 -708744 -1335717 -1895211 -1782010 -221978
$$ packed form
3707A040521m92197j55327M55721J373522J566668Q8876j282593Q5633j114634
3698A566190j400465o71536M47399N76534P48826O61801K15003k27083j016347
3689I00322M4033M39969r22161j035498p07399l00319N5249l16873L28240J98537
3679a315900J35597r52167j556874p71139o20167J12537M24884J433154N80134
3670b529941j26581J643796Q69820J56865j690944k074019n32065L40868K028042
3661a914159K537335Q94548j88785N449P90036m74829l019617n69240Q68981K5690
3651a044591q82175K02144P2156l53110j651024j759181N82855J486655J794559
3642a551712J295408J315145M7236m56176j358645o26973n59494J13201J560032
$$ plain form
3633 -221978 1234396 1338110 967428 613429 817333 1855216 2391687 2278703 2021817
3624 2021817 2111251 2614042 2994069 2131487 905173 -78290 -209550 386343 -360029 -2285015
3614 -2285015 -3254534 -2881570 -1241803 -844510 -2702696 -4111906 -3734396 -2786385 -1767840
3605 -1767840 468077 2234130 2339962 2037944 1503051 1501518 1141691 -283098 -2104579
3596 -2104579 -3474580 -2320428 -1641387 -960289 291912 374519 50419 576962 2232429
3587 2232429 2282524 382120 -1158217 -917003 -84350 126218 -130215 -2215868 -3833923
3578 -3833923 -2841169 -709441 -487239 -1208701 -1077114 -619774 -196177 -132949 -221214 -323099
3568 -323099 470161 2003098 2518701 2060082 2170023 1482952 -46585 -1078075 -372805
$$ packed form
3633b21978J456374J03714l70682l53999K03904J037883N36471j12984k56886
3624B021817Q9434N02791L80027q62582j226314r83463j31260N95893p46372j924986
3614b285015r69519L72964J639767L97293j858186j409210L77510R48011J018545
3605a767840K235917J766053J05832l02018n34893j533l59827j424789j821481
3596b104579j370001J154152O79041O81098J252201Q2607l24100N26543J655467
3587B232429N0095j900404j540337K41214Q32653K10568k56433k085653j618055
3578c833923R92754K131728K22202p21462J31587M57340M23597O3228q8265j01885
3568c23099P93260J532937N15603m58619J09941o87071j529537j031490P05270
$$ plain form
3559 -372805 2593236 4041521 2987367 1921120 2042847 1473541 489144 -1084655 -2200442
3550 -2200442 -1319033 -151638 1226408 1953181 1952363 1824308 -106744 -1738956 -1488268
3541 -1488268 -741343 -762209 196263 884569 737317 123896 -1109477 -1852279 -1554592 392365
3531 392365 953217 -720671 -1748594 -1663854 -1289250 -1200148 -312757 -258572 -665097 -403795
3521 -403795 79290 197510 -202358 -235959 -698628 -2149837 -3222413 -2804390 -2004879 -1757825
3511 -1757825 -1493183 -314810 1363609 1527269 1132545 382445 -572136 -1005692 -1790354
3502 -1790354 -2720221 -3480064 -3527275 -3275840 -3482321 -4328872 -3366437 -1855439 -857225 -413479
3492 -413479 -172658 -147678 690992 1834614 1311985 -246821 -2590111 -3174362 -972439
$$ packed form
3559c72805K966041J448285j054154j066247J21727n69306r84397j573799j115787
3550b200442Q81409J167395J378046P26773q18j28055j931052j632212K50688
3541a488268P46925k0866R58472O88306j47252o13421j233373p42802K97687J946957
3531C92365N60852j673888j027923Q4740L74604Q9102Q87391N4185m06525K61302
3521d03795M83085J18220l99868l3601m62669j451209j072576M18023P99511K47054
3511a757825K64642J178373J678419J63660l94724p50100r54581m33556p84662
3502a790354r29867p59843m7211K51435k06481q46551R62435J510998R98214M43746
3492d13479K40821K4980Q38670J143622n22629j558806k343290n84251K201923
$$ plain form
3483 -972439 747317 -610833 -2044806 -2959228 -2924566 -1857260 296465 2167014 2512708
3474 2512708 2061655 1254240 394518 -634016 -983769 -575101 -612510 -1202144 -686301 524388
3464 524388 901637 -83018 -1202683 -946586 -812717 -1100426 -804890 -1824934 -1472581
3455 -1472581 320833 2447837 2855274 2670554 2479808 1619138 1485892 2557176 2212758
3446 2212758 1675495 1987370 1351579 1147021 917839 -78949 -1180831 -1535530 -78866
3437 -78866 755134 620009 -370516 -882448 -889523 -1189651 -990419 -1063278 -1979468 -2549055
3427 -2549055 -2184618 -1915565 -1997572 -2175144 -1625888 -1031761 -1660179 -2137446 -965211 1379175
3417 1379175 3646526 2897934 952266 416588 666725 1068307 869020 1700740 2772035
$$ packed form
3483i72439J719756j358150j433973r14422L4662J067306K153725J870549L45694
3474B512708m51053q07415q59722j028534l49753M08668l7409n89634N15843J210689
3464E24388L77249r84655j119665K56097J33869k87709K95536j020044L52353
3455a472581J793414K127004M07437j84720j90746q60670j33246J071284l44418
3446B212758n37263L11875o35791k04558k29182r96788j101882l54699J456664
3437g8866Q34000j35125r90525n11932p075l00128J99232p2859r16190n69587
3427b549055L64437K69053q2007j77572N49256N94127o28418m77267J172235K344386
3417A379175K267351p48592j945668n35678K50137M01582j99287Q31720J071295
$$ plain form
3408 2772035 1324950 -833132 -1568807 -2178077 -1789501 -1540278 -2554517 -2689056 -1811476
3399 -1811476 -614016 1008642 1246287 339479 -47839 -1255736 -3079808 -3582560 -3296980
3390 -3296980 -3876207 -3756928 -3458350 -1967940 1539525 3833608 4028888 1029479 -821510
3381 -821510 -623467 -763145 -1172479 -1946276 -2072806 -823134 -782798 -1700183 -1704685 -1185633
3371 -1185633 217460 989014 750892 106240 -29630 242690 1419983 1970582 442559
3362 442559 471283 1358270 97013 -1125945 -1026434 230460 224607 -354534 -160976 1028102
3352 1028102 1068514 277647 51019 52012 1278856 1391031 1580519 2061458 2287170 2408955
3342 2408955 2109164 962193 -1024297 -1772870 -2402872 -3086032 -2682467 -2649599 -3955412
$$ packed form
3408B772035j447085k158082p35675o09270L88576K49223j014239j34539Q77580
3399a811476J197460J622658K37645r06808l87318j207897j824072n02752K85580
3390c296980n79227J19279K98578J490410L507465K294083J95280k999409j850989
3381h21510J98043j39678m09334p73797j26530J249672M0336r17385m502N19052
3371a185633J403093P71554k38122o44652j35870K72320J177293N50599j528023
3362D42559K8724Q86987j261257j222958R9511J256894n853n79141J93558J189078
3352A028102M0412p90867k26628R93J226844J12175J89488M80939K25712J21785
3342B408955k99791j146971j986490p48573o30002o83160M03565L2868j305813
$$ plain form
3333 -3955412 -4124513 -4989960 -5015191 -4077154 -3115379 -3372446 -4074652 -3968466 -3387862 -2023732
3323 -2023732 -1080635 -841070 -953732 -857120 382736 426699 -575066 -452624 -1027294 -1151051
3313 -1151051 -645354 -624975 365899 1719167 2502151 3665453 3325556 809194 -139483
3304 -139483 903901 1381211 2473261 2939019 1554350 853478 1613672 1397656 -465662
3295 -465662 -1317552 -1249326 -1075585 -559371 -589531 -1608890 -3532903 -4172764 -3668405 -2563297
3285 -2563297 -2538947 -2461555 -1863409 -504441 232543 62233 60767 -1318078 -3021807 -3628466
3275 -3628466 -3217029 -1404837 872619 1926424 1472984 -124673 -2327446 -4028175 -4689336
3266 -4689336 -3760863 -1939110 -417195 699352 -270756 -1771930 -1965259 -1990704 -2631412
$$ packed form
3333c955412j69101q65447k5231R38037R61775k57067p02206J06186N80604J364130
3323b023732R43097K39565j12662R6612J239856M3963j001765J22442n74670j23757
3313a151051N05697K0379R90874J353268P82984J163302l39897k516362r48677
3304a39483J043384M77310J092050M65758j384669p00872P60194k16016j863318
3295d65662q51890O8226J73741N16214l0160j019359j924013o39861N04359J105108
3285b563297K4350P7392N98146J358968P36984j70310j466j378845j703729o06659
3275c628466M11437J812192K277456J053805m53440j597657k202773j700729o61161
3266d689336R28473J821753J521915J116547r70108j501174j93329k5445o40708
$$ plain form
3257 -2631412 -3409414 -4035498 -2987882 -1840777 -242146 506481 -1293951 -2384596 -747185
3248 -747185 858061 229013 92636 1097610 2987166 2869581 2237180 3169037 2809177
3239 2809177 2360570 2552086 2684571 1710434 191586 -335331 -2072611 -3379418 -2274829
3230 -2274829 -1331810 -539137 212229 1033239 1361182 -39903 -563843 379716 1296521
3221 1296521 944727 854302 1064337 1598952 1171915 -264249 -1063026 -1485346 -1173428 -1030923
3211 -1030923 -1376409 -1023110 473227 1389104 1319934 1768348 3145742 3190498 2459455 2379907
3201 2379907 1476955 261726 852646 1351051 965226 638974 467374 -1184467 -2055756
3192 -2055756 -2957883 -3147630 -827819 1738406 2002762 576254 647005 1008443 671702
$$ packed form
3257b631412p78002o26084J047616J147105J598631P48627j800432j090645J637411
3248g47185J605246o29048j36377J004974J889556j17585o32401R31857l59860
3239B809177m48607J91516J32485r74137j518848n26917j737280j306807J104589
3230b274829R43019P92673P51366Q21010L27943j401085n23940R43559R16805
3221A296521l51794r0425K10035N34615m27037j436164p98777m22320L11918J42505
3211a030923l45486L53299J496337R15877o9170M48414J377394M4756p31043p9548
3201B379907r02952j215229N90920M98405l85825l26252j71600j651841q71289
3192b055756r02127j89747K319811K566225K64356j426508P0751L61438l36741
$$ plain form
3183 671702 -753402 -1835966 -2908016 -2674499 -826174 237218 802960 569862 328904
3174 328904 -586606 -1189897 179346 1351796 -32444 -1574131 -669344 929961 1794015
3165 1794015 2797676 4030993 4095192 2991476 1776581 458058 -593868 -1055567 -1785812
3156 -1785812 -1431121 260235 1678591 2176408 1055896 -1294803 -1891298 -863832 -763066
3147 -763066 -684024 -347128 -1511200 -2017842 -1093844 21277 344855 204606 -759355 -1142951
3137 -1142951 -863966 -743980 83056 592965 953318 592449 365901 -243232 -332683 -726740
3127 -726740 -2104105 -1931723 -939791 -196412 138862 -1238184 -1250304 1483876 2908207
3118 2908207 2793580 2672106 2078907 1845602 619229 -1183508 -2009897 -1787018 -363047
$$ packed form
3183F71702j425104j082564j072050K33517J848325J063392N65742k33098k40958
3174C28904r15510o03291J369243J172450j384240j541687R04787J599305Q64054
3165A794015J003661J233317O4199j103716j214895j318523j051926m61699p30245
3156a785812L54691J691356J418356M97817j120512k350699n96495J027466J00766
3147g63066P9042L36896j164072n06642R23998J115121L23578j40249r63961l83596
3137a142951K78985J19986Q27036N09909L60353l60869k26548o09133q9451l94057
3127g26740j377365J72382R91932P43379L35274j377046j2120K734180J424331
3118B908207j14627j21474n93199k33305j226373j802737q26389K22879J423971
$$ plain form
3109 -363047 1802019 2242726 66144 -1003470 -480322 -546614 -1145778 -2048599 -3013456
3100 -3013456 -3241349 -1305991 2126 -334449 -554106 376847 2000382 1716629 1075808
3091 1075808 114092 -665534 -950417 -2003495 -1598498 -382639 373889 -2081923 -4677666
3082 -4677666 -4318010 -3290356 -1860429 -618234 -1477826 -1830905 -671430 -1522716 -432739
3073 -432739 2246902 2502509 1135016 -1163611 -4248642 -4527772 -2481475 -1010171 -1113111
3064 -1113111 -708785 100396 -665729 -1818335 -1233257 -717032 -130582 1128596 674978
3055 674978 27612 181202 54494 -750037 -1462775 -1978475 -1064712 1319558 2199826 460573
3045 460573 -909550 -1270788 -1864222 -803191 170592 -845506 -2636209 -2389212 -2264719
$$ packed form
3109c63047K165066M40707k176582j069614N23148o6292n99164r02821r64857
3100c013456k27893J935358J308117l36575k19657R30953J623535k83753o40821
3091A075808r61716p79626k84883j053078M04997J215859P56528k455812k595743
3082d677666L59656J027654J429927J242195q59592l53079J159475q51286J089977
3073d32739K679641K55607j367493k298627l085031k79130K046297J471304j02940
3064a113111M04326Q09181p66125j152606N85078N16225N86450J259178m53618
3055F74978o47366J53590j26708q04531p12738n15700R13763K384270Q80268j739253
3045D60573j370123l61238n93434J061031R73783j016098j790703K46997J24493
$$ plain form
3036 -2264719 -2047632 -1076914 -271873 315700 519795 28940 120209 -299763 -1656210 -3060203
3026 -3060203 -3774031 -3164481 -1789988 -882926 -1619443 -1705464 -727803 431789 559786
3017 559786 -531983 -1480274 -1604799 -1589191 -1766897 -738575 -1045349 -3016604 -3496529
3008 -3496529 -1684537 -406298 8702 1823295 3321820 2557754 1728843 902333 1729644
2999 1729644 2518696 2988650 1214134 82812 640843 1512042 2475243 2849397 3425140
2990 3425140 1997937 -432286 -1842388 -2331867 -1873019 -1526630 -869644 562882 911069
2981 911069 1482474 1827255 1465986 609933 739940 1147240 1588383 3117042 4048888 2620002
2971 2620002 1853432 3941271 5226173 4025270 3787239 3172439 1910611 93418 -969322
$$ packed form
3036b264719K17087R70718Q05041N87573K04095m90855R1269m19972j356447j403993
3026c060203p13828O09550J374493R07062p36517q6021R77661J159592J27997
3017E59786j091769r48291j24525J5608j77706J028322l06774j971255m79925
3008c496529J811992J278239M15000J814593J498525p64066q28911q26510Q27311
2999A729644P89052M69954j774516j131322N58031Q71199R63201L74154N75743
2990C425140j427203k430223j410102m89479M58848L46389O56986J432526L48187
2981I11069N71405L44781l61269q56053J30007M07300M41143J528659R31846j428886
2971B620002p66570K087839J284902j200903k38031o14800j261828j817193j062740
$$ plain form
2962 -969322 -51136 1079597 579873 -956713 -1191280 -324095 1610701 3054145 2802807
2953 2802807 1742740 -160792 -685738 25779 829056 1359738 1715374 1176681 922282
2944 922282 -1055941 -2160713 -2240420 -2484684 -2873855 -2765896 -2665062 -2001891 -1673551 -1175338
2934 -1175338 -758664 -1219629 -1408931 -840064 -513784 -459194 487597 1542261 2030782 1171187
2924 1171187 -592214 -2055672 -2359065 274018 2950203 3159650 1889770 857652 1144829
2915 1144829 1235899 2000768 2473499 1459629 1077839 1227320 190472 -527171 -2129615
2906 -2129615 -3305368 -2271612 -971551 987637 1787687 1338603 681085 -731005 -901213
2897 -901213 -1431885 -1775089 -1200988 -1101826 -1576074 -1458224 -1549570 177589 2984816 3412592
$$ packed form
2962i69322R18186J130733m99724j536586k34567Q67185J934796J443444k51338
2953B802807j060067j903532n24946P11517Q03277N30682L55636n38693k54399
2944I22282j978223j104772p9707k44264l89171J07959J00834O63171L28340M98213
2934a175338M16674m60965j89302N68867L26280N4590R46791J054664M88521q59595
2924A171187j763401j463458l03393K633083K676185K09447j269880j032118K87177
2915A144829R1070P64869M72731j013870l81790J49481j036848p17643j602444
2906b129615j175753J033756J300061J959188Q00050m49084o57518j412090j70208
2897i01213n30672l43204N74101R9162m74248J17850r1346J727159K807227M27776
$$ plain form
2887 3412592 1714015 606995 422922 829886 794294 202562 -1936 205919 425410
2878 425410 493051 983332 404176 1113508 3110954 3351889 2041934 1506613 1540130 1601545
2868 1601545 1571838 1258266 1190035 278137 -609825 -699944 -677975 -504523 448199 2250029
2858 2250029 2745081 3186001 3400447 2134361 -1820727 -3242945 -1583245 -715306 -538323
2849 -538323 -150375 -174613 -641230 17625 729212 -260952 -438929 -68737 1344244 1590667
2839 1590667 287509 777002 1287492 1773793 1565329 1923831 2214332 1250940 485874
2830 485874 1063498 1429219 2075444 2930153 3065540 2396048 1192557 -1140043 -1516065
2821 -1516065 -993813 -616541 -309845 439342 2105685 3068494 3254814 2631504 1227614
$$ packed form
2887C412592j698577j107020j84073M06964l5592n91732k04498K07855K19491
2878D25410O7641M90281n79156P09332J997446K40935j309955n35321L3517O1415
2868A601545k9707l13572o8231r11898q87962r0119K1969J73452R52722J801830
2858B250029M95052M40920K14446j266086l955088j422218J659700Q67939J76983
2849e38323L87948k4238m66617O58855P11587r90164j77977L70192J412981K46423
2839A590667j303158M89493N10490M86301k08464L58502K90501r63392p65066
2830D85874N77624L65721O46225Q54709J35387o69492j203491k332600l76022
2821a516065N22252L77272L06696P49187J666343R62809J86320o23310j403890
$$ plain form
2812 1227614 1030610 2406527 3301809 2017928 342453 250073 -70300 -1538713 -2405624
2803 -2405624 -1076411 888046 952426 409452 -57897 -1037188 -1952157 -2495951 -2165247
2794 -2165247 -1302455 -762620 -43926 1188114 1001392 363323 1207037 1707742 2536868
2785 2536868 2146817 257629 -839978 -116369 -607198 -2676679 -3801270 -3759080 -1888249
2776 -1888249 -1098150 -77797 1355612 373716 -2056318 -2243890 126545 641003 -830333
2767 -830333 -286200 983670 560175 314935 1217621 1724627 1006601 -526919 -494238 1184086
2757 1184086 2284970 2750728 3281842 3148537 1626856 1089350 1474147 2416512 3288101
2748 3288101 2395505 329279 -433547 888295 2741080 3600630 3300979 1762453 533230
$$ packed form
2812A227614j97004J375917Q95282j283881j675475r2380l20373j468413q66911
2803b405624J329213J964457O4380n42974m67349r79291r14969n43794L30704
2794b165247Q62792N39835P18694J232040j86722o38069Q43714N00705Q29126
2785B536868l90051j889188j097607P23609m90829k069481j124591M2190J870831
2776a888249P90099J020353J433409r81896k430034j87572K370435N14458j471336
2767h30333N44133J269870m23495k45240R02686N07006p18026j533520L2681J678324
2757A184086J100884M65758N31114j33305j521681n37506L84797R42365Q71589
2748C288101q92596k066226p62826J321842J852785Q59550k99651j538526j229223
$$ plain form
2739 533230 -111615 -746928 -921554 -1628589 -3878456 -5235576 -5355282 -5376396 -4936070 -4441792
2729 -4441792 -3118306 -1411992 -1366710 -433732 1378767 2613907 2545437 2566895 1612723
2720 1612723 -415061 -2034901 -3360179 -1752488 -1190558 -1905696 -1672877 -2319360 -1672626
2711 -1672626 -421820 -770380 -915349 -1195400 -718394 -368290 -199572 979082 1424611
2702 1424611 1394864 1457614 495757 -1040176 -3197807 -4556548 -5147553 -5488465 -4035103
2693 -4035103 -3120338 -3028541 -2789134 -2713415 -2032230 -1500307 -593503 185136 -646899 -4054461
2683 -4054461 -6165630 -5559695 -5109153 -4632359 -3868312 -1927334 541619 2592063 2403954
2674 2403954 2725007 3414208 1393840 288789 305558 1268497 2301163 1621194 1277789
$$ packed form
2739E33230o44845o35313j74626p07035k249867j357120j19706k1114M40326M94278
2729d441792J323486J706314M5282R32978J812499J235140o8470K1458r54172
2720A612723k027784j619840j325278J607691N61930p15138K32819o46483O46734
2711a672626J250806l48560j44969k80051M77006L50104J68718J178654M45529
2702A424611k9747O2750r61857j535933k157631j358741n91005l40912J453362
2693d035103R14765R1797K39407P5719O81185N31923R06804P78639q32035l407562
2683d054461k111169O05935M50542M76794P64047J940978K468953K050444j88109
2674B403954L21053O89201k020368j105051J6769R62939J032666o79969l43405
$$ plain form
2665 1277789 2056462 2967528 2906401 1793594 950371 1969323 2802054 1691018 129973
2656 129973 601057 688379 -493931 -831578 -420991 427536 1254442 194811 -1113423
2647 -1113423 -1643586 -2189539 -2135045 -306193 1366039 1694602 1123681 1283067 1524417
2638 1524417 1598506 686889 -486144 -281114 1204613 766545 -189667 -477576 -2815648
2629 -2815648 -4368939 -2608074 -1167822 -694074 416230 1268584 1764909 1902938 1752190
2620 1752190 2279113 2860332 1525735 1465589 1940621 1021365 -1441937 -2458119 -1528624
2611 -1528624 -681650 -1394285 -1030374 141237 918676 651149 50452 399755 68174
2602 68174 -930317 -2082810 -2858697 -2202736 -1424778 -610782 811618 970414 115674 540889
$$ packed form
2665A277789P78673R11066o1127j112807q43223J018952Q32731j111036j561045
2656A29973M71084Q7322j182310l37647M10587Q48527Q26906j059631j308234
2647a113423n30163n45953N4494J828852J672232L28563n70921J59386K41350
2638A524417P4089r11617j173033K05030J485727m38068r56212k87909k338072
2629b815648j553291J760865J440252M73748J110304Q52354M96325J38029j50748
2620A752190N26923N81219j334597o0146M75032r19256k463302j016182R29495
2611a528624Q46974p12635L63911J171611P77439k67527o00697L49303l31581
2602F8174r98491j152493p75887O55961P77958Q13996J422400J58796q54740M25215
$$ plain form
2592 540889 808989 2724923 3434869 1315625 -57283 134920 758965 1339927 231243
2583 231243 30120 276721 958744 1840369 1414316 932967 -192590 -2198448 -2493147
2574 -2493147 -1682112 -1197879 -687113 -1103139 -1792792 -2328357 -1224401 -574563 -600706 -378467
2564 -378467 282293 67939 -1208478 -1652877 -2790856 -3696037 -3184571 -1828878 -2385982
2555 -2385982 -3664148 -4299159 -3164221 -788711 1108224 3070438 4392523 3665249 1406033
2546 1406033 1673957 2905908 2913188 2442848 2811473 4319078 5322921 4397255 2903739
2537 2903739 2448000 2235239 3067094 5290403 6776001 6247753 5878106 3892946 -101154
2528 -101154 -2299987 -2675915 -1041269 999839 1429541 1032118 1415058 2954573 4356043
$$ packed form
2592E40889K68100J915934P09946k119244j372908J92203O24045N80962j108684
2583B31243k01123K46601O82023Q81625m26053m81349j125557k005858k94699
2574b493147Q11035M84233N10766m16026o89653n35565J103956O49838k6143K22239
2564c78467O60760k14354j276417m44399j137979r05181N11466J355693n57104
2555b385982j278166o35011J134938K375510J896935J962214J322085p27274k259216
2546A406033K67924J231951P280m70340L68625J507605J003843r25666j493516
2537B903739m55739k12761Q31855K223309J485598n28248l69647j985160l994100
2528a01154k198833l75928J634646K041108M29702l97423L82940J539515J401470
$$ plain form
2519 4356043 5643447 6141371 6459467 7923822 8202099 7252710 6452030 5434430 4503269
2510 4503269 4290198 4419206 4518832 5694895 5868178 4302170 2841873 1882134 285582
2501 285582 -383256 934302 830138 -323008 29605 -94185 -672990 -333961 -752266
2492 -752266 -1287951 -563911 336153 229858 1063663 2152635 2714157 2077039 -23547
2483 -23547 -2720918 -3508046 -1935175 67754 1437010 1150239 852330 481562 891983
2474 891983 1493657 607419 -44775 1639308 2943966 1625362 -381690 -2237022 -2333826
2465 -2333826 586073 1841997 191306 -1777858 -2833417 -2276604 -2442497 -1223805 -138823
2456 -138823 -1182839 -1489247 -1236112 -1042448 -1144531 -963195 -1629805 -2070035 -1981989 -1305143
$$ packed form
2519D356043J287404M97924L18096J464355K78277r49389q00680j017600r31161
2510D503269k13071J29008R9626J176063J73283j566008j460297r59739j596552
2501B85582o68838J317558j04164j153146L52613j23790n78805L39029m18305
2492g52266n35685P24040R00064j06295Q33805J088972N61522o37118k100586
2483b3547k697371p87128J572871K002929J369256k86771k97909l70768M10421
2474H91983O01674q86238o52194J684083J304658j318604k007052j855332r6804
2465b333826K919899J255924j650691j969164j055559N56813j65893J218692J084982
2456a38823j044016l06408K53135J93664j02083J81336o66610m40230Q8046O76846
$$ plain form
2446 -1305143 -259097 -776448 -1498988 -1629644 -1157948 -1046422 560626 2223606 1824584
2437 1824584 898963 1135034 880047 1071425 2586906 3994742 4162823 4310250 4026797
2428 4026797 3522199 2498078 1571486 886862 1133731 1611050 1089920 1334854 2493394
2419 2493394 3076840 3989340 3842653 1743785 660576 609190 515655 327283 714352 893145
2409 893145 242295 -927109 -1340887 -1973085 -3809578 -3886196 -3099366 -1996778 -1396466
2400 -1396466 -215708 -213716 -1461631 -1735429 -1105251 -145568 -617823 273713 404464 -1206971
2390 -1206971 -1665283 -658819 -1465746 -2998997 -3994445 -4866472 -4412903 -3393404 -2041835
2381 -2041835 -1956101 -2831758 -2267557 544153 2487150 2885669 1322790 -188884 44395
$$ packed form
2446a305143J046046n17351p22540j30656M71696J11526J607048J662980l99022
2437A824584r25621K36071k54987J91378J515481J407836J68081J47427k83453
2428D026797n04598j024121r26592o84624K46869M77319n21130K44934J158540
2419B493394N83446R12500j46687k098868j083209n1386r3535j88372L87069J78793
2409H93145o50850j169404m13778o32198j836493p6618P86830J102588O00312
2400a396466J180758J992j247915k73798O30178R59683m72255Q91536J30751j611435
2390a206971m58312J006464q06927j533251r95448q72027M53569J019499J351569
2381b041835Q5734q75657N64201K811710J942997L98519j562879j511674K33279
$$ plain form
2372 44395 940718 2734668 4727651 5364368 4658607 4814378 5450651 5692286 4633179
2363 4633179 3241336 2003729 389648 171415 1127993 1262617 798264 -562726 -1701246
2354 -1701246 -1816156 -1117253 644715 1834377 1806234 1427406 600001 -678530 -1035656
2345 -1035656 -1173821 -51330 2435041 2533145 1909562 38718 -1438683 -354256 -279434
2336 -279434 -75997 527100 1343623 2814220 2410071 912348 610302 444020 59362
2327 59362 24951 135482 673055 938969 810055 1783978 3517036 3637471 3151524 298432
2317 298432 -2560303 -2402232 -677796 -144199 -469348 -721936 -205506 446053 -170363
2308 -170363 20924 655134 85398 -2077779 -2887437 -2426172 -2127215 -1995809 -1625549 -2279732
$$ packed form
2372D4395Q96323J793950J992983O36717p05761J55771O36273K41635j059107
2363D633179j391843j237607j614081k18233R56578J34624m64353j360990j138520
2354a701246j14910O98903J761968J189662k8143l78828q27405j278531l57126
2345a035656j38165J122491K486371R8104o23583j870844j477401J084427P4822
2336b79434K03437O03097Q16523J470597m04149j497723l02046j66282l84658
2327E9362l4411J10531N37573K65914j28914R73923J733058J20435m85947k853092
2317B98432k858735J58071J724436N33597l25149k52588N16430O51559o16416
2308a70363J91287O34210n69736k163177q09658M61265K98957J31406L70260o54183
$$ plain form
2298 -2279732 -1952351 -2102366 -3387496 -4244939 -4321869 -3118520 -2994168 -2842080 -2552950
2289 -2552950 -2223665 -1549939 -569265 -504518 -1239314 -1019168 39953 -53506 -854697 1101038
2279 1101038 3612117 2843653 1132258 -801978 -3268884 -4593624 -4546734 -2994838 -1765120
2270 -1765120 -1703173 -2152002 -1541018 -435002 1131209 2995143 2849138 2757095 2242516
2261 2242516 2187260 1139503 857839 2049885 1578789 154818 -2279953 -3629395 -2723104
2252 -2723104 -2461663 -3204474 -3599978 -3859105 -2774697 -473027 1897944 2026732 380476
2243 380476 -2362174 -4446322 -3488781 -2607397 -3308757 -4593422 -3448772 -832944 -142086
2234 -142086 -1329029 -2311411 -2657330 -2029909 -760628 -145345 -609932 -1730997 -2236543
$$ packed form
2298b279732L27381j50015j285130q57443p6930J203349J24352J52088K89130
2289b552950L29285O73726R80674O4747p34796K20146J059121r3459q01191J955735
2279A101038K511079p68464j711395j934236k466906j324740M6890J551896J229718
2270a765120O1947m48829O10984J106016J566211J863934j46005r2043n14579
2261B242516n5256j047757k81664J192046m71096j423971k434771j349442R06291
2252b723104K61441p42811l95504k59127J084408K301670K370971J28788j646256
2243C80476k742650k084148R57541Q81384p01360j284665J144650K615828O90858
2234a42086j186943r82382l45919O27421J269281O15283m64587j121065n05546
$$ plain form
2225 -2236543 -2081468 -1847163 145156 2770505 3538330 2621480 2490314 2488342 1541935 1053227
2215 1053227 1250289 1638992 3239613 3838116 2285602 82689 23400 1337053 1545299
2206 1545299 1549879 1328354 701218 136820 -574116 -951594 -20479 623716 389785 867511
2196 867511 1085610 -847908 -2829466 -2116167 -1423534 -1754953 -1916562 -697135 2278785
2187 2278785 3187060 875095 -1591551 -1378081 -341137 22478 -88714 -543864 -2190287
2178 -2190287 -3602640 -4419661 -3842446 -2697501 -1491728 -575543 -776468 -795263 -1550236
2169 -1550236 -2852995 -3980425 -4020637 -2124882 -1267999 -1728013 -2093275 -1400184 -579876
2160 -579876 -486752 -492059 -969596 -831674 -2022922 -3949122 -3708629 -2276033 -527935 566992
$$ packed form
2225b236543J55075K34305J992319K625349P67825r16850j31166j972r46407m88708
2215A053227J97062L88703J600621N98503j552514k202913n9289J313653K08246
2206A545299M580k21525o27136n64398p10936l77478R31115O44195k33931M77726
2196H67511K18099j933518j981558P13299O92633l31419j61609J219427K975920
2187B278785R08275k311965k466646K13470J036944L63615j11192m55150j646423
2178b190287j412353q17021N77215J144945J205773R16185k00925j8795p54973
2169a550236j302759j127430m0212J895755Q56883m60014l65262O93091Q20308
2160e79876R3124n307m77537J37922j191248j926200K40493J432596J748098J094927
$$ plain form
2150 566992 456100 -288582 -404838 871161 1191774 108226 -451377 -1461590 -2262086
2141 -2262086 -2650046 -2286069 -1917301 -1388294 285876 1208008 1036061 1839829 2553740
2132 2553740 2367512 2754261 2937922 3053056 3275258 2237436 301683 -1693708 -1830837
2123 -1830837 -434666 1960974 3174137 3441293 4038020 3711168 2224854 2664030 4210942
2114 4210942 5115181 4992464 4590538 2930083 435531 -662859 -554267 -584509 -1148846
2105 -1148846 -1793231 -950808 -591567 -777519 -513198 -796618 -1482195 -1719690 -695618
2096 -695618 89118 1116007 701461 -1127897 -1969929 -1478044 -750934 263010 1086874
2087 1086874 1270398 1690664 2200298 1233395 -469178 -937167 578607 1060560 -968667
$$ packed form
2150E66992j10892p44682j16256J275999L20613j083548n59603j010213q00496
2141b262086l87960L63977L68768N29007J674170R22132j71947Q03768P13911
2132B553740j86228L86749J83661J15134K22202j037822j935753j995391j37129
2123a830837J396171K395640J213163K67156N96727l26852j486314M39176J546912
2114D210942R04239j22717m01926j660455k494552j098390J08592l0242n64337
2105a148846o44385Q42423L59241j85952K64321k83420o85577k37495J024072
2096f95618P84736J026889m14546j829358q42032M91885P27110J013944Q23864
2087A086874J83524M20266N09634r66903j702573m67989J515774M81953k029227
$$ plain form
2078 -968667 -2086901 -1553723 571712 1538897 291430 16462 308769 397045 166610
2069 166610 -753635 -1000284 772770 1711834 -144936 -561792 1344055 2217673 1340976
2060 1340976 -164731 -1748605 -1913674 -1802420 -2676063 -3420020 -4217404 -5483614 -5468265
2051 -5468265 -2214098 -271166 -615376 -1177930 -635087 -1667968 -2745839 -1262975 324740
2042 324740 1807085 3108990 3482607 2404081 1258277 71378 -100175 -1684975 -2480941
2033 -2480941 -1380030 -444911 -1028536 -1652165 -1062569 -1847973 -2969237 -3057080 -1135014
2024 -1135014 768028 301692 -327010 -254635 -510254 491448 1590931 2137036 3618589
2015 3618589 5418993 6591522 6110130 4217212 2483346 730831 231302 -524311 -196082
$$ packed form
2078i68667j118234N33178K125435R67185j247467k74968K92307Q8276k30435
2069A66610r20245k46649J773054R39064j856770m16856J905847Q73618q76697
2060A340976j505707j583874j65069J11254q73643p43957p97384j266210J5349
2051e468265L254167J942932l44210n62554N42843j032881j077871J482864J587715
2042C24740J482345J301905L73617j078526j145804j186899j71553j584800p95966
2033b480941J100911R35119n83625o23629N89596p85404j121264q7843J922066
2024a135014J903042m66336o28702P2375k55619J001702J099483N46105J481553
2015C618589J800404J172529m81392j892918j733866j752515m99529p55613L28229
$$ plain form
2006 -196082 953057 895878 -73424 -152051 809388 1010743 -115347 -3185025 -4731224
1997 -4731224 -2811677 -1197958 -796469 186909 244808 -303683 -225147 -779230 -2167847
1988 -2167847 -3180751 -2067884 -1310442 -1174651 231277 1503155 2702011 3783636 3497367
1979 3497367 2265335 340551 -601929 -1587420 -956102 1441012 2329666 1429080 403048
1970 403048 -1194760 -2236835 -2649416 -3288584 -2626030 -634661 -351068 -893364 -1110834
1961 -1110834 -1661768 -1795428 -1232798 -1160880 215302 2534945 1960336 -64298 -245004
1952 -245004 -218908 1518048 204630 -2120953 -2189115 -1546158 -2076532 -3132562 -2224016
1943 -2224016 -950276 -991494 -499038 1612884 2575718 1256157 -276978 -915206 -2132007
$$ packed form
2006a96082J149139n7179r69302p8627R61439K01355j126090l069678j546199
1997d731224J919547J613719M01489R83378N7899n48491P8536n54083j388617
1988b167847j012904J112867P57442J35791J405928J271878J198856J081625k86269
1979C497367j232032j924784r42480r85491O31318K397114Q88654r00586j026032
1970D03048j597808j042075m12581o39168O62554J991369K83593n42296k17470
1961a110834n50934j33660N62630P1918J376182K319643n74609k024634j80706
1952b45004K6096J736956j313418k325583o8162O42957n30374j056030R08546
1943b224016J273740m1218M92456K111922R62834j319561j533135o38228j216801
$$ plain form
1934 -2132007 -2307996 -2077902 -1394603 -1951590 -2517357 -898899 1622761 2508715 758696
1925 758696 -919688 -1657276 -1709282 -960943 295173 275318 -1952716 -2736412 -2420049 -2198335
1915 -2198335 -12213 1002597 174102 184819 599416 -406864 -908486 -229674 47085
1906 47085 -220452 -825366 -1665117 -2106205 -2140991 -890453 390250 27695 27017 557957
1896 557957 1232495 1417552 -87140 -242529 600855 740257 1566236 1420680 151294
1887 151294 -665123 -92970 -735235 -2007316 -1875656 -993978 -1291064 -2349285 -3182852
1878 -3182852 -3980990 -4567711 -4172877 -3373774 -2720754 -2580563 -1482833 -865812 -719588
1869 -719588 301853 348175 -153353 494301 1111478 1618574 1201400 1872356 1834639 484714
$$ packed form
1934b132007j75989K30094O83299n56987n65767J618458K521660Q85954j750019
1925G58696j678384p37588n2006P48339J256116j9855k228034p83696L16363K21714
1915b198335K186122J014810q28495J0717M14597j006280n01622O78812K76759
1906D7085k67537o04914q39751m41088l4786J250538J280703l62555o78N30940
1896E57957O74538J85057j504692j55389Q43384J39402Q25979j45556j269386
1887A51294q16417N72153o42265j272081J31660Q81678k97086j058221q33567
1878c182852p98138n86721L94834P99103O53020J40191J097730O17021J46224
1869g19588J021441M6322n01528O47654O17177N07096m17174O70956l7717j349925
$$ plain form
1859 484714 -154198 -457065 -1164849 -1069594 -721816 -1611152 -1772182 -488167 535883 1658849
1849 1658849 1734532 1222733 1986722 2851689 2878097 1390190 -933247 -1809413 -1267947 -524143
1839 -524143 -450902 -1014692 -605530 -1288804 -3141985 -1910549 73874 854077 706061
1830 706061 -922203 -2852284 -3300506 -2902479 -1875219 -1816767 -2373799 -2769050 -556685
1821 -556685 1148573 482705 -13223 -677844 -1375920 -1511414 -108272 1675300 1399894
1812 1399894 1873102 2348525 1507172 1443529 3225975 4440290 2862835 -296019 -1987913
1803 -1987913 -2371532 -1865464 -1450635 -2239028 -1608812 -1183887 -1685155 -1745455 -732424 -584052
1793 -584052 151169 810983 890290 822910 17028 -988582 -2936891 -3645959 -1972793 -426862
$$ packed form
1859D84714o38912l02867p07784R5255L47778q89336j61030J284015J024050J122966
1849A658849P5683n11799P63989Q64967K6408j487907k323437q76166N41466P43804
1839e24143P3241n63790M09162o83274j853181J231436J984423P80203j48016
1830G06061j628264j930081m48222L98027J027260N8452n57032l95251K212365
1821e56685J705258o65868m95928o64621o98076j35494J403142J783572k75406
1812A399894M73208M75423q41353o3643J782446J214315j577455l158854j691894
1803a987913l83619N06068M14829p88393O30216M24925n01268o0300J013031J48372
1793e84052P35221O59814P9307o7380q05882j005610j948309p09068J673166J545931
$$ plain form
1783 -426862 -1609621 -2153275 -1734048 -1091261 -463698 -599728 -271777 636932 1532059 2147036
1773 2147036 1836624 703744 731504 751789 1562623 3142844 2729104 1543303 824234
1764 824234 28654 -105125 329440 655226 1847165 1681862 776388 732414 421453 66444
1754 66444 -75407 256786 506732 1336757 2006748 562161 -799147 -603396 -680798 -6893
1744 -6893 1193538 1271806 1869866 2446894 3350325 2634967 1288400 1461459 858698 689784
1734 689784 -894486 -3860372 -4380461 -2904465 -1250516 11803 1205903 1392559 1353937
1725 1353937 2403870 1595009 516512 977831 1742280 1821971 2282559 4111291 5780166
1716 5780166 4817217 2554906 853543 349827 716073 445218 -197435 -1671832 -2597994
$$ packed form
1783d26862j182759n43654M19227O42787O27563j36030L27951R08709Q95127O14977
1773B147036l10412j132880K7760K0285Q10834J580221m13740j185801p19069
1764H24234p95580j33779M34565L25786J191939j65303r05474m3974l10961l55009
1754F6444j41851L32193K49946Q30025O69991j444587j361308J95751p7402O73905
1744f893J200431P8268N98060N77028R03431p15358j346567J73059o02761j68914
1734F89784j584270k965886n20089J475996J653949J262319J194100J86656l8622
1725A353937J049933q08861j078497M61319P64449P9691M60588J828732J668875
1716E780166r62949k262311j701363n03716L66246k70855o42653j474397r26162
$$ plain form
1707 -2597994 -2410440 -2934693 -2633965 -1329290 392900 1508277 2072698 3445779 3919651
1698 3919651 3948458 2446444 171949 -2196599 -3837201 -3618726 -3298703 -2852771 -1009656
1689 -1009656 2094409 3279613 3128795 2408897 2558347 2494640 1470782 -66986 -1205276
1680 -1205276 -1776871 -1606486 -1254252 -962815 -135617 1172532 762970 665440 1383333 1434244
1670 1434244 422749 309464 -306039 -731684 137040 1339580 1772472 793349 221860
1661 221860 473383 365984 454210 1164186 502455 520498 2094336 2182577 689903 326751
1651 326751 -28310 -908925 -1473541 -1403452 -762246 1701328 2893637 3173965 3899104 3533852
1641 3533852 2647083 1602160 4274 -1125730 -958524 -1068583 650552 1075211 344219
$$ packed form
1707b597994J87554n24253L00728J304675J722190J115377N64421J373081M73872
1698C919651K8807j502014k274495k368548j640602K18475L20023M45932J843115
1689a009656L104065J185204j50818p19898J49450o3707j023858j537768j138290
1680a205276n71595J70385L52234K91437Q27198J308149m09562r7530P17893N0911
1670A434244j011495j13285o15503m25645Q68724J202540M32892r79123n71489
1661B21860K51523j07399Q8226P09976o61731J8043J573838Q8241j492674l63152
1651C26751l55061q80615n64616P0089O41206K463574J192309K80328P25139l65252
1641C533852q86769j044923j597886j130004J67206j10059J719135M24659p30992
$$ plain form
1632 344219 352750 -583530 -459278 744503 1839162 2595889 1278502 -1187435 -2172455
1623 -2172455 -330592 1741595 2733588 2197853 790398 -314774 -104749 1225260 1131148
1614 1131148 -179881 -1593294 -3930996 -5108630 -5242834 -4994786 -4596886 -3564669 -863672
1605 -863672 512154 240244 -270499 -1155533 -2652577 -3784012 -2813184 -1724832 -929090
1596 -929090 -468314 152723 928785 413229 572514 1496597 1603730 429269 -2075380
1587 -2075380 -4059545 -3782620 -3304511 -2954540 -2740475 -2322638 -1010370 -634576 -165396
1578 -165396 314281 -87 -591164 -1255828 -961577 1085810 2458746 1151492 181638
$$ packed form
1632C44219Q531r36280J24252J203781J094659P56727j317387k465937r85020
1623b172455J841863K072187R91993n35735j407455j105172K10025J330009r4112
1614A131148j311029j413413k337702j177634j34204K48048L97900J032217K700997
1605h63672J375826k71910n10743q85034j497044j131435R70828J088352P95742
1596i29090M60776O21037P76062n15556J59285R24083J07133j174461k504649
1587b075380j984165K76925M78109L49971K14065M17837J312268L75794M69180
1578a65396M79677l14368n91077o64664K94251K047387J372936j307254r69854
$$ [...]
##END NTUPLES=NMR SPECTRUM
##END=
