##TITLE=C13_IBEPA2709
 D2O,  2000 sc

 29.09.2021
##JCAMPDX= 6.0         $$ Bruker NMR JCAMP-DX V2.0
##DATA TYPE= NMR SPECTRUM
##DATA CLASS= NTUPLES
##ORIGIN= UXNMR, Bruker Analytische Messtechnik GmbH
##OWNER= root
$$ XWIN-NMR		Version 3.5
$$ Thu Sep 30 08:29:18 2021 Russian Standard Time (UT+4h)  she@DPX200
##.OBSERVE FREQUENCY= 50.327896
##.OBSERVE NUCLEUS= ^13C
##.ACQUISITION MODE= SIMULTANEOUS
##.ACQUISITION SCHEME= undefined
##.AVERAGES= 19500
##.DIGITISER RES= 17
##SPECTROMETER/DATA SYSTEM= spect
##.PULSE SEQUENCE= zgpg30
##.SOLVENT NAME= DMSO
##.SHIFT REFERENCE= (INTERNAL, DMSO, 0, 222.792)
##AUDIT TRAIL= $$ (NUMBER, WHEN, WHO, WHERE, WHAT)
$$ ##TITLE= Audit trail, XWIN-NMR		Version 3.5
$$ ##JCAMPDX= 5.01
$$ ##ORIGIN= Bruker BioSpin GmbH
$$ ##OWNER= she
$$ F:/spectra/data/she/nmr/c13/1/pdata/1/auditp.txt
$$ ##AUDIT TRAIL=  $$ (NUMBER, WHEN, WHO, WHERE, WHAT)
(   1,<2021-09-30 08:27:14.76 +0400>,<she>,<DPX200>,
      <created by zg, POWCHK disabled, PULCHK disabled
       terminated by command 'halt'
       configuration hash MD5:
       00 E9 B6 7A A2 85 ED C7 34 08 36 98 17 FE 4E 26
       data hash MD5: 32K
       0C 29 05 E7 24 00 ED 00 3D 1E F6 A4 58 A8 6A 5B>)
(   2,<2021-09-30 08:27:17.75 +0400>,<she>,<DPX200>,
      <Start of raw data processing
       efp BC_mod = 2 LB = 1 FT_mod = 6 PKNL = 1 PHC0 = -337.8748 PHC1 = 33.36238 SI = 32K 
       data hash MD5: 32K
       07 07 59 34 D9 FC D5 94 18 9D 6B 79 36 72 8F D0>)
(   3,<2021-09-30 08:27:49.98 +0400>,<she>,<DPX200>,
      <pk PHC0 = -8.528266 PHC1 = 0 
       data hash MD5: 32K
       50 66 5E DB 25 0C 95 6C 40 E2 C4 08 B8 B7 FF A9>)
(   4,<2021-09-30 08:27:53.07 +0400>,<she>,<DPX200>,
      <abs ABSG = 5 
       data hash MD5: 32K
       79 DD 3C AA 48 17 B5 46 02 AB 83 D7 CB 23 81 33>)
(   5,<2021-09-30 08:28:21.62 +0400>,<she>,<DPX200>,
      <abs ABSG = 5 
       data hash MD5: 32K
       A6 EB 2E F7 5B 43 54 CB D7 B7 DD 5A 72 BB 00 88>)
$$ ##END=
$$ 
$$ hash MD5
$$ 06 C3 33 0C D9 39 E1 E7 8C 41 48 FE DA 6B 40 BF
##$RELAX= 
##$RELAX= 
##$RELAX= 
##$RELAX= 
##$RELAX= 
##$RELAX= 
##$RELAX= 
##$RELAX= 
$$ Bruker specific parameters
$$ --------------------------
##$DU= <F:/spectra>
##$EXPNO= 1
##$NAME= <c13>
##$PROCNO= 1
##$TYPE= <nmr>
##$USER= <she>
##$AMP= (0..31)
100 100 100 100 100 100 100 100 100 100 100 100 100 100 100 100 100 100 
100 100 100 100 100 100 100 100 100 100 100 100 100 100 
##$AQSEQ= 0
##$AQ_mod= 1
##$AUNM= <au_zg>
##$AUTOPOS= <>
##$BF1= 50.322709
##$BF2= 200.13
##$BF3= 50.322709
##$BF4= 500.13
##$BF5= 500.13
##$BF6= 500.13
##$BF7= 500.13
##$BF8= 500.13
##$BYTORDA= 1
##$CFDGTYP= 0
##$CFRGTYP= 5
##$CHEMSTR= <none>
##$CNST= (0..31)
1 1 145 1 1 1 1 1 1 1 1 1 1 1 1 1 1 1 1 1 1 1 1 1 1 1 1 1 1 1 1 1 
##$CPDPRG= <waltz16>
##$CPDPRG1= <>
##$CPDPRG2= <waltz16>
##$CPDPRG3= <>
##$CPDPRG4= <mlev>
##$CPDPRG5= <mlev>
##$CPDPRG6= <mlev>
##$CPDPRG7= <mlev>
##$CPDPRG8= <mlev>
##$CPDPRGB= <>
##$CPDPRGT= <>
##$D= (0..31)
$$ [...]
##$SUBNAM4= <"">
##$SUBNAM5= <"">
##$SUBNAM6= <"">
##$SUBNAM7= <"">
##$SUBNAM8= <"">
##$SUBNAM9= <"">
##$SW= 239.972175391363
##$SWIBOX= (0..15)
0 1 3 0 0 0 0 0 0 0 0 0 0 0 0 0 
##$SW_h= 12077.2946859903
##$TD= 32768
##$TD0= 1
##$TE= 0
##$TE2= 300
##$TE3= 300
##$TEG= 300
##$TL= (0..7)
120 120 120 120 120 120 120 120 
##$TP= (0..7)
150 150 150 150 150 150 150 150 
##$TP07= 0
##$TPNAME0= <>
##$TPNAME1= <>
##$TPNAME2= <>
##$TPNAME3= <>
##$TPNAME4= <>
##$TPNAME5= <>
##$TPNAME6= <>
##$TPNAME7= <>
##$TPOAL= (0..7)
0.5 0.5 0.5 0.5 0.5 0.5 0.5 0.5 
##$TPOFFS= (0..7)
0 0 0 0 0 0 0 0 
##$TUNHIN= 0
##$TUNHOUT= 0
##$TUNXOUT= 0
##$USERA1= <user>
##$USERA2= <user>
##$USERA3= <user>
##$USERA4= <user>
##$USERA5= <user>
##$V9= 5
##$VALIST= <valist>
##$VCLIST= <CCCCCCCCCCCCCCC>
##$VD= 0
##$VDLIST= <DDDDDDDDDDDDDDD>
##$VPLIST= <PPPPPPPPPPPPPPP>
##$VTLIST= <TTTTTTTTTTTTTTT>
##$WBST= 1024
##$WBSW= 4
##$XGAIN= (0..3)
0 0 0 0 
##$XL= 0
##$YL= 0
##$YMAX_a= 110237589
##$YMIN_a= -74168955
##$ZGOPTNS= <>
##$ZL1= 120
##$ZL2= 120
##$ZL3= 120
##$ZL4= 120
##$ABSF1= 222.7925
##$ABSF2= -17.20435
##$ABSG= 5
##$ABSL= 3
##$ALPHA= 0
##$AQORDER= 0
##$ASSFAC= 0
##$ASSFACI= 0
##$ASSFACX= 0
##$ASSWID= 0
##$AUNMP= <proc_1d>
##$AZFE= 0.1
##$AZFW= 0.5
##$BCFW= 0
##$BC_mod= 2
##$BYTORDP= 0
##$COROFFS= 0
##$CY= -3
##$DATMOD= 1
##$DC= 0
##$DFILT= <>
##$DTYPP= 0
##$F1P= 0
##$F2P= 0
##$FCOR= 0.5
##$FTSIZE= 32768
##$FT_mod= 6
##$GAMMA= 0
##$GB= 0
##$INTBC= 1
##$INTSCL= 4.134877e-10
##$ISEN= 128
##$LB= 1
##$LEV0= 0
##$LPBIN= 0
##$MAXI= 10000
##$MC2= 0
##$MEAN= 0
##$ME_mod= 0
##$MI= 0.1934396
##$NCOEF= 0
##$NC_proc= 0
##$NLEV= 6
##$NOISF1= 120.0001
##$NOISF2= 80.00006
##$NSP= 0
##$NTH_PI= 0
##$NZP= 0
##$OFFSET= 222.7925
##$PC= 1.4
##$PHC0= -346.403
##$PHC1= 33.36238
##$PH_mod= 1
##$PKNL= yes
##$PPARMOD= 0
##$PSCAL= 0
##$PSIGN= 0
##$REVERSE= no
##$SF= 50.3227231246708
##$SI= 32768
##$SIGF1= 140
##$SIGF2= 120
##$SINO= 11.81781
##$SIOLD= 32768
##$SREGLST= <13C.CDCl3>
##$SSB= 0
##$STSI= 32768
##$STSR= 0
##$SW_p= 12077.2946859903
##$SYMM= 0
##$S_DEV= 0
##$TDeff= 32768
##$TDoff= 0
##$TI= <>
##$TILT= no
##$TM1= 0
##$TM2= 0
##$TOPLEV= 0
##$USERP1= <user>
##$USERP2= <user>
##$USERP3= <user>
##$USERP4= <user>
##$USERP5= <user>
##$WDW= 1
##$XDIM= 32768
##$YMAX_p= 380842257
##$YMIN_p= -8472978
$$ End of Bruker specific parameters
$$ ---------------------------------
##NTUPLES= NMR SPECTRUM
##VAR_NAME=  FREQUENCY,     SPECTRUM/REAL,   SPECTRUM/IMAG
##SYMBOL=    X,             R,               I
##VAR_TYPE=  INDEPENDENT,   DEPENDENT,       DEPENDENT
##VAR_FORM=  AFFN,          ASDF,            ASDF
##VAR_DIM=   32768,         32768,           32768
##UNITS=     HZ,            ARBITRARY UNITS, ARBITRARY UNITS
##FACTOR=    0.368581032318806, 1,           1
##FIRST=     11211.5250767513, 0,            0
##LAST=      -865.769609238951, 0,           0
##MIN=       -865.769609238951, -8472978,    0
##MAX=       11211.5250767513, 380842257,    0
$$ Real data points
##PAGE= N=1
##DATA TABLE= (X++(R..R)), XYDATA
$$ [...]
6940E060521j46058r64635k020645j086323O83568J789389j221248j655586r91329
6931e52346j425143K52591m66265j143162R68833K295528K331299r55703j955039
6922f49407j039726N03731J473160J802332P23815J78301J20682n21051k192649
6913C99188j720474M67582O8519N32549l09215J58494J438942O6599q82678n21772
6903c02266o72037L6628J552388L72090l4954R33754N29640j602863j942251j707548
6893b837419l43468M9800J866551K297710J138380j251195k424656m35057r4700
6884b034054p60638m85945N39894J088246J201558J003041O98634j028515j662881
6875a440660j37477K88146J34212O18605K02507k73783n61314k020917K91295
$$ y = [5060521, 4914463, 3949828, 1929183, 842860, 1526428, 3315817, 2094569, 438983, -552346, -1977489, -1724898, -2191163, -3334325, -2365492, -69964, 2261335, 1305632, -649407, -1689133, -1185402, 287758, 2090090, 2813905, 2992206, 3112888, 2591837, 399188, -1321286, -853704, -785185, -252636, -561851, -403357, 1035585, 1102184, 219506, -302266, -974303, -937675, 614713, 986803, 951849, 1885603, 2415243, 812380, -1129871, -2837419, -3180887, -3131087, -1264536, 1033174, 2171554, 920359, -1504297, -1939354, -2034054, -2794692, -3280637, -2740743, -1652497, -450939, 552102, 1250736, 222221, -1440660, -1578137, -1289991, -1155779, -537174, -334667, -608450, -1169764, -3190681, -2899386]
6866b899386P03003j486881r32282O7056J035004O07209j32074K70361R81670
6857a786320K9518l36624Q63064J18615n24491R33550R68744M20240l04396J99443
6847E81343J72130p85144n54280j151175j971228m78032P21850J320245O48814
6838a495477n39858l69723J51403J62834q40839j89515R84355j289748j184989
6829d611557J040564J639088J914302Q34864J263003o421o33727n43417k15730
6820F80969Q89832J106821o47406j800561J786052K258752o61951j192307m91967
6811A928234j535631q26287J185016J194682l73917j133303q56276p40669j301242
6802b459393j537282J27376J451549J986486N19172r86463r2462j000964J58573
$$ y = [-2899386, -2196383, -3683264, -4615546, -4548490, -3513486, -2906277, -3038351, -2767990, -1786320, -1756802, -2093426, -1230362, -1111747, -1636238, -702688, 266056, 686296, 381900, 581343, 753473, -31671, -585951, -1737126, -3708354, -4186386, -3464536, -2144291, -1495477, -2035335, -2405058, -2253655, -2090821, -2931660, -3121175, -2136820, -3426568, -4611557, -3570993, -1931905, -17603, 817261, 2080264, 2073843, 1440116, 896699, 680969, 1570801, 2677622, 2030216, 229655, 2015707, 4274459, 3612508, 2420201, 1928234, 392603, -433684, 751332, 1946014, 1572097, 438794, -417482, -1158151, -2459393, -3996675, -3869299, -2417750, -431264, 87908, -898555, -991017, -1991981, -1833408]
6793a833408K325645J025757j182092o26000j36133M49886M1945L92729J12773
6784E71102l41983M37326O43801j865240j444144l88343J185461J513329Q8535
6775C99844n93931q78772N0189Q79489M06056J898843K343014j10985j20236J307344
6765E580855q68299j043016n05645j705226q76729m28019n99081P74394N76632
6756I05866j102207j049436N21461K294347K310830j266461l242516k002714j179172
6747c810002P40103J485762P26866k548m96739n29322J907983K405184Q42315
6738C269602j090126j091274K34908j092748r06327m37550j5045o6455m2751Q15950
6728d21816N65788r84739j165638J70535J006428J626588j48588j531580j551606
$$ y = [-1833408, 492237, 1517994, 335902, -290098, -426231, 23655, 65600, 458329, 571102, 229119, 666445, 1310246, -554994, -1999138, -2387481, -1202020, 311309, 399844, -194087, -1072859, -1022670, -143181, 262875, 2161718, 4504732, 4393747, 4273511, 5580855, 4712556, 3669540, 3163895, 1458669, 581940, 153921, -445160, 329234, 905866, -196341, -1245777, -724316, 1570031, 3880861, 2614400, -628116, -2630830, -3810002, -3069899, -1584137, -857271, -859819, -1356558, -1885880, 22103, 2427287, 3269602, 2179476, 1088202, 1323110, 230362, -675965, -1113515, -1128560, -1195015, -1237766, -421816, 143972, -840767, -2006405, -1835870, -829442, 797146, 648558, -883022, -2434628]
6719b434628l89551P06878M80339q34173k88106O25613J489086J807995q19526
6710C43927j627096l59824P69809N46119l36524O23258O52690N1255p00460M20721
6700C83875L56823K83740J14937j939939j218793M39364O21458O29062k19830
6691e49303J60162P18869M67775P3800Q31601J529328J072981n61812j979202
6682A764199j910147j439794m06343o29170p23069j016144m77936J209981J799068
6673a829355P05079L44290N15944k88616M19551L42765m0030L30571J459309k20302
6663A739206j273069l44115M52568q25723K3117O81342j3410o10523j128809o40106
6653a939522j20996O55572J344612N51044K7592q3063j280778n11177k78989j146542
$$ y = [-2434628, -2824179, -2117301, -1636962, -2471135, -2759241, -2133628, -644542, 1163453, 343927, -1283169, -1642993, -873184, -327065, -663589, -40331, 612359, 663614, -36846, 383875, 740698, 1024438, 1139375, -800564, -2019357, -1579993, -958535, -329473, -549303, -389141, 329728, 797503, 871303, 1702904, 3232232, 4305213, 3743401, 1764199, -145948, -1585742, -1992085, -2621255, -3344324, -4360468, -4838404, -3628423, -1829355, -1124276, -779986, -264042, -552658, -133107, 209658, 169628, 500199, 1959508, 1739206, 466137, 122022, 574590, -251133, -228016, 453326, 439916, -170607, -1299416, -1939522, -2060518, -1404946, -60334, 490710, 518302, 435239, -845539, -1356716, -1635705, -2782247]
6643b782247j294615O30046N28902N93178J450672J136746k9465k57950Q65096
6634H40363O56437P31611j058467j656953k64712p23799j41809J044578J16112
6625d56639m64886J690945K257022j54952m46947j14918j048504j178846J087895
6616A170170K097456k78591j588497o46837J84111j524027j013376O25891K01200
6607g72500j75528j007776J1541J604916J738735K85535j10164N5747j516906
6598A13600j060286J570246J194843m45950o87381j72234l8227J334107K90871
6589B099589n53765P96699N12068l91741k342095k563638j712708J83551J405875
6580b566165O54672n9637Q63939J706506K475915j40063k183871j764565k012265
$$ y = [-2782247, -4076862, -3446816, -2917914, -2324736, -874064, 262682, 233217, -24733, 840363, 1496800, 2228411, 1169944, -487009, -751721, -1475520, -1617329, -572751, -456639, -921525, 769420, 3026442, 2871490, 2424543, 2309625, 1261121, 82275, 1170170, 3267626, 2989035, 1400538, 753701, 937812, -586215, -1599591, -973700, -772500, -948028, -1955804, -1944263, -339347, 1399388, 1684923, 1574759, 1630506, 113600, -946686, 623560, 1818403, 1372453, 685072, 512838, 474611, 1808718, 2099589, 1545824, 2342523, 2854591, 2462850, 120755, -2442883, -4155591, -3972040, -2566165, -1911493, -1971130, -1107191, 599315, 3075230, 2935167, 751296, -1013269, -3025534]
6571c025534j463578R3463O6700R13280K597641J874185O68852l7226l15100r87963
6561C84720o49276N0268o1390M71730K51347N02809m74718j318881k84795O40167
6551d88019M82820R92564J613048J425362k55721k518903k623974p6118J075587
6542c73354o41164j240870R9587L53944J673772J356565p64677m63667q57538
6533h57402J71699J854704M81126j212453j93875k20087p6069p89098k821402
6524c662857j148279J550016K956404J988354p92862k168219j163504O3141L84458
6515a993348K05883q05641j162415M36712J91395L34672K200694N05291n65318
6506f52075j054388k240780j097208O58293R1560p21969p41718J620636K290651
$$ y = [-3025534, -4489112, -4395649, -4328949, -3415669, -818028, 1056157, 1725009, 1687783, 1372683, 384720, -264556, -214288, -275678, 196052, 447399, 950208, 475490, -843391, -1128186, -488019, -5199, 987365, 2600413, 4025775, 3770054, 1251151, -1372823, -1448941, -373354, -1014518, -2255388, -2155801, -1801857, -128085, 1228480, 463803, 136, -857402, -685703, 1169001, 1650127, 437674, 243799, 23712, -52357, -841455, -3662857, -4811136, -3261120, -304716, 1683638, 890776, -1277443, -2440947, -2377806, -1993348, -1787465, -2593106, -3755521, -3318809, -3127414, -2792742, -592048, -86757, -652075, -1706463, -3947243, -5044451, -4386158, -4294598, -5016567, -5758285, -4137649, -1846998]
6497a846998R48784N01871p2857p57323j007359K28721J236344J217089J529923
6488A978195P00044j987523j688607L53635R05233R16121K08739j783259r10620
6479a308042J047643O73265n66720j15877Q50337R90558Q31152j490281m23486
6470D88549q5328j249052K19194o19290q45946M87430K178314J674679N13007
6461B761557q8341j320480r97060q63254j830389j321535K80917J236579J736477
6452d05529j28802r52499J683047K173222m64494r73271J29839j006575k39113
6443a84175M15155o79020O35288J127704r62642k239380m53154J195850R56626
6434a87748N71714Q40538J287226O76073q77541p40625j62342p83123o73623m60290
$$ y = [-1846998, -898214, -396343, -469200, -1226523, -2233882, -2005161, -768817, 448272, 1978195, 2678239, 690716, -997891, -644256, 260977, 1177098, 1385837, -397422, -1308042, -260399, 412866, -153854, -269731, 580606, 1571164, 2402316, 912035, 488549, 403221, -845831, -626637, -1245927, -2091873, -1604443, 573871, 2248550, 2761557, 2673216, 1352736, 355676, -507578, -2337967, -3659502, -3378585, -2142006, -405529, -534331, -1486830, 196217, 2369439, 1904945, 931674, 1061513, 54938, -184175, 230980, -448040, 187248, 1314952, 352310, -1887070, -2340224, -1144374, -187748, 383966, 1224504, 2511730, 3187803, 2310262, 1569637, 1407295, 624172, -49451, -509741]
6424e09741K134074K124130J05275m33155n64146p92852j335021J27753Q71905
6415A728222j24005p45151l78452J1525n11317p02809P66299J078386J856224
6406B978922P29204J53675j457501q96641N60928N98176q91746n81069J79412
6397A373360J496744J748365j064035j116189k90054k28190l37894k79549o37043
6388F65515k435058j376464Q88831K00816k079753j219812P14207J760199K757045
6379a24474J495908P21238M79340l71357l65792J48023j905045j209843Q9145
6370a042857r56370l12682k51746m93617K44182J81375L74837J723835J956477
6361A423434O47680M78864P24600K91406m12716M2341L82753j449724r59067q67169
$$ y = [-509741, 1624333, 3748463, 3853738, 3420583, 2856437, 2063585, 728564, 856317, 1728222, 1604217, 859066, 480614, 492139, -19178, -721987, 44312, 1122698, 2978922, 3708126, 3861801, 2404300, 1507659, 2068587, 2666763, 1775017, 1193948, 1373360, 2870104, 4618469, 3554434, 2438245, 2148191, 1920001, 1582107, 1302558, 665515, -1769543, -3146007, -2257176, -2056360, -4136113, -5355925, -4641718, -2881519, -124474, 1371434, 2092672, 2572012, 2200655, 1834863, 1982886, 77841, -1132002, -1042857, -1999227, -2311909, -2563655, -3057272, -2813090, -2631715, -2256878, -533043, 1423434, 2071114, 2549978, 3274578, 3565984, 3153268, 3195609, 3578362, 2128638, 1169571, 302402]
6351C02402r97288r31135j038165L23536J247950J0306m16768J235312m63096
6342g26946j211989q81533O25028R37694j01944l9767q31014q60133M58421M96596
6332b135587J131385J535530j12326n10184j00365o99274m14209K204509K173108
6323C072587j278832k082814J179952M32867M16709Q67013q10700r36818J53365
6314A013329L11890p05738R77738M37202o21694r69278o94568n84357l47452L53063
6304h29865J312831N57091K93572l4321M93946N72233j366439r78517R42609J107856
6294B070996o31730N4879J138827o13354j080474m8585q56960j428837j54499
6285a549737O77900o14994m78373k59329r46722J040083J939833L66849p20813
$$ y = [302402, -694886, -1626021, -2664186, -2340650, -1092700, -1082394, -1499162, -263850, -726946, -1938935, -2820468, -2195440, -1257746, -1359690, -1399457, -2230471, -3090604, -2632183, -2135587, -1004202, 531328, 419002, -91182, -191547, -890821, -1305030, 899479, 3072587, 1793755, -289059, 890893, 1323760, 1740469, 2607482, 1796782, 859964, 1013329, 1325219, 619481, 1597219, 2034421, 1412727, 443449, -251119, -835476, -1182928, -829865, 482966, 1040057, 1333629, 1299308, 1793254, 2365487, 999048, 20531, 963140, 2070996, 1439266, 1494145, 2632972, 2019618, 939144, 890559, 33599, -1395238, -1549737, -871837, -1486831, -1965204, -2224533, -3171255, -2131172, -191339, 175510, -545303]
6276e45303M58667J117893p46380j181294K35284Q75721M24787j70963n68869
6267a00457k65889J009476J379833J046639p24236M87708J365764J45488k8917
6258D315409r45852j626821o54093M37142n36547k69443n11327j319862L69186
6249g42208P21253J444566Q39872j229j29520J096769J012267j056382j743425
6240A441963j316941k185930j353457n36579Q2957N96346L59938J705390K148326
6231I42013J164686l37305k188237n97389P4120J034338P04738m05072q19124
6222d27232n7401J709814K949282J055668j411644L79051L90223m03253j244769
6213B939739q61015k13936j506888K51043P33882J01925J072271L44926M39038
$$ y = [-545303, -86636, 1031257, 284877, -896417, -661133, 214588, 639375, 468412, -100457, -366346, 643130, 2022963, 3069602, 2345366, 2833074, 4198838, 4344326, 4315409, 3369557, 1742736, 1088643, 1525785, 989238, 719795, 208468, -1111394, -742208, -20955, 1423611, 2263483, 2262254, 2132734, 3229503, 4241770, 3185388, 1441963, 125022, -2060908, -3414365, -3950944, -3867987, -3271641, -2911703, -1206313, 942013, 2106699, 1769394, -418843, -1016232, -942112, 92226, 796964, 391892, -427232, -484633, 1225181, 4174463, 5230131, 3818487, 4197538, 4587761, 4184508, 2939739, 2078724, 1864788, 357900, 608943, 1342825, 1444750, 2517021, 2861947, 3300985]
6204C300985J043355R99426J043898K88160p66015L68845j36082r91599j36465
6195E014508j09354j788842J08155K150823J207327m13144M39497O58054J001469
6186H268493Q50716K60399o78824k9921J867996K580884O32374m4247k6347p78211
6176A2903312r85078k63557J104260J542163P47230k01619Q21409l13542q11813
6167A4542765r79929r97278M30507j02147p46418q31987J177441K309506Q52531
6158A5654991N59456J687334L66165M45395J236332J927034K911486M40588m71480
6149B4757301R44800J468632J205808J622942K518560L021080M389880N566865
6141D5495868L814637K693560M568349O504193P479462Q640685J0700470J0567619
$$ y = [3300985, 4344340, 5343766, 6387664, 6675824, 5909809, 6278654, 6142572, 5150973, 5014508, 4905154, 3116312, 3224467, 5375290, 6582617, 6169473, 6608970, 7267024, 8268493, 9119209, 9379608, 8700784, 8670863, 10538859, 13119743, 13752117, 13707870, 13681523, 12903312, 11918234, 11654677, 12758937, 14301100, 15048330, 14846711, 15668120, 15354578, 14542765, 13562836, 12565558, 12996065, 12893918, 12147500, 11315513, 12492954, 14802460, 15654991, 16214447, 17901781, 18267946, 18713341, 19949673, 21876707, 24788193, 25228781, 24757301, 25702101, 27170733, 28376541, 29999483, 32518043, 35539123, 39929003, 45495868, 49310505, 52004065, 56572414, 63076607, 70556069, 79196754, 89897224, 100464843]
6133A00464843J2551380J6317657J8973179K4957982L2473350L8149514M2898421
6126B86786326M1474544K9841052J7550259N190076j1285451k8244677m0595740
6119C00716389m1891326l6358339k9196955k5129200k1281373j6411053j1416167
6112A19031976q703384r005593q276328n641653n188637o238657o960803o079308
6104F2937613m961860l414698j340165j651744k654842l657013j863624q53407
6096D2540260j079350k731231l117692l241991k850539k972792k738743j587287
6088B2220635l24217P01876p5158k004639j620656n50728J022398R01355k74821
6079A9996045J18608n35860k302945j647075l14429q2572n73345n87652j141602
$$ y = [100464843, 113016223, 129333880, 148307059, 173265041, 205738391, 243887905, 286786326, 328260870, 358101922, 375652181, 380842257, 369556806, 341312129, 300716389, 258825063, 222466724, 193269769, 168140569, 146859196, 130448143, 119031976, 110328592, 101322999, 93046671, 87405018, 82216381, 75977724, 69016921, 62937613, 57975753, 54561055, 53220890, 51569146, 48914304, 45257291, 43393667, 42540260, 41460910, 38729679, 35611987, 32369996, 29519457, 26546665, 23807922, 22220635, 21896418, 22598294, 22523136, 20518497, 18897841, 18347113, 19369511, 20270866, 19996045, 20114653, 19578793, 17275848, 15628773, 15314344, 15231772, 14658427, 14070775, 12929173]
6070A2929173j680166j863797q44470o437j115370j53595J361400J147340p22427
6061I051651k52191L46076J72117l56470R39021P63276j004540j323150k265892
6052F069898l1784Q16006J288518P91124j639617k297394k025778j11535l83956
6043B475482q38761J20653J335818j48050j262564M10237M22460L16722j61035
6034B670962m55741q98556j00178J416626n3172p67642K13483J045967K20897
6025C292646j027127q39499k6843m96831p98465M21153R4277L164J928107K225212
6015D775794P34356n38863r73003q52369m74301L86880L58932m01605j205280
6006A810541j161482P24737J117710j070125o24822N25806o31940J020201K398030
$$ y = [12929173, 11249007, 9385210, 8540740, 8534303, 7418933, 7265338, 8626738, 9774078, 9051651, 8799460, 9145536, 9317653, 8961183, 9900204, 10663480, 9658940, 8335790, 6069898, 6038114, 6854120, 8142638, 8933762, 7294145, 4996751, 2970973, 2859438, 2475482, 1636721, 1757374, 3093192, 2945142, 1682578, 2092815, 2515275, 2831997, 2670962, 2215221, 1316665, 1216487, 2633113, 2579941, 1812299, 2025782, 3071749, 3292646, 2265519, 1426020, 1399177, 902346, 103881, 525034, 619311, 622475, 2550582, 4775794, 5510150, 4971287, 3998284, 3145915, 2671614, 3058494, 3417426, 3015821, 1810541, 649059, 1373796, 2491506, 1421381, 796559, 1322365, 690425, 1710626, 4108656]
5997D108656Q64190J54766O7118j712991q28054M04377J204397k26576j607162
5988B428721j681923j521882j090653n76550J149841K725998K19359j054447j356853
5979g58389j706617k46053M78003J151602K20497R30088L077175K563914J9211
5970E729431j736866j80743r23167l393440j748980l70787N6711L42736M40609
5961a784496K01968m23132R89427J279017Q6591l1030o8820n13473Q80413J365606
5951A982071P73035n37184P6031R8296R33372J060599J01548j224411l456084
5942a92727l670405q25708Q70408K851840K803937m052O17590K150054J233950
5933E834887r63163k245484l76085M2714n86290R16958K37670r30791m12791R8327
$$ y = [4108656, 4972846, 5127612, 5194730, 3481739, 2653685, 3058062, 4262459, 4035883, 2428721, 746798, -775084, -1865737, -2442287, -1292446, 1433552, 1652911, 598464, -758389, -2465006, -2711059, -2233056, -1081454, -860957, 69131, 3146306, 5710220, 5729431, 3992565, 3811822, 2888655, -504785, -2253765, -2624552, -2567841, -2225105, -1784496, -1582528, -2005660, -1016233, 262784, 349375, 318345, 249525, -263948, 616465, 1982071, 2755106, 2217922, 2293953, 2392249, 3325621, 4386220, 4487768, 3263357, -192727, -3863132, -4688840, -3818432, -966592, 1837345, 1833293, 2450883, 4600937, 5834887, 4871724, 2626240, 2250155, 2292869, 1706579, 2623537, 2861207, 1930416, 1517625, 1615952]
5923A615952k68673j214138j343576N36088J262964J366491M17853j373697j065962
5914f6698n81924R00807J745915J01580p19131l05979R08102J311530P84592j324220
5904B754574j038914r02682q81626J137434R64977r7302O28499q76926J47634
5895A835668J617425R3556j207881j109201r46544m72156J273962K357339J837939
5886E280107J142212j049503j925592j444693K83010j3915j567462q36894L07480
5877A74750J7251M6268o45590n78310p70135j21586j9058K478606K007157o80781
5867A908572j172638J3910K47190M29699N45091P75998l77004k224696j384766
5858a238644O2780L31866J119803N42291q57829j77530R48641J956153J562071
$$ y = [1615952, 1347279, 133141, -1210435, -674347, 588617, 1955108, 2372961, 999264, -66698, -648622, 252185, 1998100, 2099680, 1380549, 1074570, 1982672, 3294202, 4078794, 2754574, 1715660, 812978, -68648, 1068786, 2033763, 1936461, 2564960, 1688034, 1835668, 3453093, 3546649, 2338768, 1229567, 283023, -189133, 1084829, 3442168, 5280107, 6422319, 5372816, 3447224, 2002531, 2285541, 2271626, 704164, -132730, 174750, 192001, 238269, -407321, -985631, -1755766, -1877352, -1896410, 582196, 2589353, 1908572, 735934, 749844, 997034, 1426733, 1971824, 2747822, 2370818, 146122, -1238644, -1175864, -843998, 275805, 818096, -39733, -217263, 731378, 2687531, 4249602]
5849D249602Q37318q64508k086639j087507o62838j91771J411124m36879k136788
5840i68886o2441P67454K503125K349742L73215l44026J18716o20007j769022
5831B347870N25455K518624K533096j57708j048221J30430p28293j336704j614822
5822C169727O09539j0016k113268k429540r02132k59881N92080J741020K309101
5813B706630K690017L61805j535525k208216j300981m83882L11757J286810J363694
5804C192109N13012L83733m26778k386086k738072j297770K25576R13908j6141
5795a636509J157736K642614R09473n39240p57876p64905N16508J82397m67336
5786A242862q60511j54952J000041O98048J202032M17696J64510P16324j426316
$$ y = [4249602, 5086920, 4222412, 2135773, 1048266, 385428, 193657, 1604781, 1167902, -968886, -1031327, -263873, 2239252, 4588994, 4962209, 4618183, 4736899, 4116892, 2347870, 2873325, 5391949, 7925045, 7767337, 6719116, 6849546, 6121253, 4784549, 3169727, 3779266, 3769250, 1655982, -773558, -1675690, -1935571, -1343491, 397529, 2706630, 5396647, 5758452, 4222927, 2014711, 713730, 229848, 541605, 1828415, 3192109, 3705121, 4088854, 3662076, 1275990, -1462082, -2759852, -2534276, -1620368, -1636509, -478773, 2163841, 3073314, 2534074, 1776198, 1011293, 1527801, 1710198, 1242862, 382351, 227399, 1227440, 1925488, 3127520, 3545216, 3709726, 4426050, 2999734]
5777B999734K65804J657707O51537K92759o95858j868006l30225o89631N9066
5768B342887K053469J229989R8042J170584K529783J779061j15803o48011n19355
5759I920646j396810m52762J561455J047896l03940J833280K713003K539339K530299
5750A9992406K764009M687140M944477N938229O051904N592400N603292N797651
5742F1371508M700266M219790L574604J526927L32642q82785k938616m801174
5734F7103162m761087n295573m272366l410261m950858k934802j946429k628729
5726C6903057j424424l062652m518171l472525l012626k419575k139083j490961
5718A5363040k123508k010987m52721o31920j52814L36113o8105o34839J71259
$$ y = [2999734, 3265538, 4923245, 5574782, 5867541, 5171683, 3303677, 2973452, 2283821, 2342887, 4396356, 5626345, 5724387, 6894971, 9424754, 11203815, 11088012, 10440001, 9920646, 8523836, 8071074, 9632529, 10680425, 10376485, 12209765, 14922768, 17462107, 19992406, 22756415, 27443555, 32388032, 38326261, 44378165, 49970565, 55573857, 61371508, 66071774, 70291564, 73866168, 75393095, 75725737, 74842952, 71904336, 67103162, 62342075, 57046502, 52774136, 49363875, 44413017, 41478215, 39531786, 36903057, 35478633, 32415981, 27897810, 24425285, 21412659, 18993084, 16854001, 15363040, 13239532, 11228545, 10775824, 10143904, 9991090, 10327203, 10259098, 9624259, 9795518]
5709I795518L96181P99080j89044j215893p03696j026627j315745m20727j312342
5700D806705j543833J464767J355310n24607j677906p82312k41674j459707N44621
5691A941364J051505n92222m58067J141596L77399j047024K09689j05419q79187
5682A639634m13493J66969P82001J685923L93870j002637l48229q38820q7078
5673A978140j340882k302440k03151J20824M9991m54591j25071J064306J059017
5664a53857N40413P85409l75488n81606p24273k265359M36963K822574J606702
5655B091478J142357J366668J96045m59376n13564l230291k432083m178J741726
5646a01218J842824n76445j547592p19396K70559J564933K072160j18122q24915
$$ y = [9795518, 10191699, 10990779, 10801735, 9585842, 8882146, 7855519, 6539774, 6119047, 4806705, 3262872, 4727639, 6082949, 5558342, 3880436, 3098124, 2856450, 1396743, 1941364, 2992869, 2400647, 1942580, 3084176, 3461575, 2414551, 2624240, 2518821, 1639634, 1226141, 1393110, 2175111, 3861034, 4254904, 3252267, 2904038, 2065218, 1978140, 637258, -1665182, -1868333, -1747509, -1697518, -2152109, -2277180, -1212874, -153857, 386556, 1171965, 796477, 214871, -509402, -2774761, -2337798, 484776, 2091478, 3233835, 4600503, 4796548, 4337172, 3823608, 593317, -1838766, -1842944, -101218, 1741606, 1165161, -382431, -1101827, -831268, 733665, 2805825, 2687703, 1862788]
5637A862788p57858r45849p27663N98739P29543M84930R54063K04124L66116J58917
5627B927850J457514J655023p22871r25645j293608j220925j067495K69725J389735
5618B469303N32082P89399l96272j016231j78772l73644j102066j64787J521915
5609B080927J007616J97652j534387k290409j310062k61504Q28346J125363J403150
5600A246692n73974j338519N47093O40084J479739J793380R90798O06302Q3449
5591E475044j320798j283075j446585k29240R23161l96442n5994k34563P09057
5582B140565m9358K01696J365303J647284K63295k0018o83005r14376O71824O94809
5572E318019J239854N14892l0499J92056j945631j383088p69331p16342J385191
$$ y = [1862788, 1104930, 159081, -568582, 30157, 759700, 1244630, 2198693, 2402817, 2768933, 2927850, 4385364, 6040387, 5317516, 4391871, 3098263, 1877338, 809843, 1079568, 2469303, 3001385, 3790784, 3394512, 2378281, 2199509, 1825865, 723799, 559012, 2080927, 3088543, 3286195, 1751808, -538601, -1848663, -2110167, -1281821, -156458, 1246692, 672718, -665801, -118708, 521376, 2001115, 3794495, 4785293, 5391595, 5475044, 4154246, 2871171, 1424586, 1195346, 2118507, 1722065, 1666071, 1431508, 2140565, 2091207, 2292903, 3658206, 5305490, 5568785, 5548767, 4865762, 3951386, 4623210, 5318019, 6557873, 7072765, 7042266, 7234322, 5288691, 3905603, 3136272, 2419930, 3805121]
5563C805121J892931p11051j317519j140794q84839k13160J204318K210738K377171
5554G222916J272551r51026m56440K80967j288159k472723k008652k38427J07985
5545A468992k25364m63074R34798J204034q22598k46461p22437j219174J054488
5536I63204J178323J712078J132927j433745m25187Q42464J186161J009809R96858
5527G162892J12753j313568p80096q58436o72853Q81750J009423l65949p77423
5518D398493j218655J131323L076396K319236J125377l66446j066081J4503J011814
5509A0425960Q92229J507660J343915L70771l89375Q92793L006037J311620J486628
5500B0848238M333467O512899N269955N214075M940305M420582M953765N909191
$$ y = [3805121, 5698052, 4987001, 3669482, 2528688, 1643849, 1430689, 2635007, 4845745, 7222916, 8495467, 7544441, 7088001, 7368968, 6080809, 3608086, 1599434, 1361007, 1468992, 1243628, 780554, 1715352, 2919386, 2096788, 1850327, 1127890, -91284, 963204, 2141527, 3853605, 4986532, 3552787, 3127600, 3970064, 5156225, 6166034, 7162892, 7275645, 5962077, 5181981, 4323545, 3650692, 4532442, 5541865, 5175916, 4398493, 3179838, 4311161, 7387557, 9706793, 10832170, 10465724, 9399643, 9414146, 10425960, 11318189, 12825849, 14169764, 14540535, 14151160, 15043953, 18049990, 19361610, 20848238, 25181705, 31694604, 36964559, 42178634, 47118939, 51539521, 56493286, 62402477]
5492F2402477P513373N566980J195437J8361J008219k225670m533084n836089
5484F5110004o100557n824293l791186k864341k429993k936243k348852p75652
5476C8038887j062769k760607k639900k029328k962314m011896l605330k491671
5468A6475072k633774j536664j865420k798147p87809J20457p14302j378720r94851
5459C885842q64037O10747r8589k878187k147742J520316J189556R3986P53120
5450B065012j164684j733546O01737Q92103R80926J325700l8360N31056J789522
5441E249466J059445O07382j548007j694342j180305k153199j418229J636847
5433E59058K289043n4686n47539n31055j042617n89197r91570j012896p96759
$$ y = [62402477, 69915850, 75482830, 76678267, 76696628, 77704847, 75479177, 70946093, 65110004, 59009447, 53185154, 49393968, 46529627, 44099634, 41163391, 38814539, 38038887, 36976118, 34215511, 31575611, 29546283, 26583969, 22572073, 18966743, 16475072, 13841298, 12304634, 10439214, 7641067, 6853258, 6973715, 6259413, 4880693, 3885842, 3021805, 3632552, 3533963, 655776, -1491966, 28350, 1217906, 1311892, 2065012, 900328, -833218, -231481, 660622, 1641548, 2967248, 2928888, 3459944, 5249466, 6308911, 6916293, 5368286, 3673944, 2493639, 340440, -1077789, 559058, 2848101, 2793415, 2245876, 1714821, 672204, 83007, -908563, -1921459, -2718218]
5424b718218R2600J124594Q51481J553366K535099R36395l24004j071829m17772
5415B561712k81676j025914q74488J079789J077208N06762q32347j705728j026639
5406e21321P06684J094382l85511j229807j07620N85669N72360O31087j459855
5397a13932k027218O60058K375103J288587M36816Q8043j186409j644526l82925
5388e06403O71305N07875N79778j120043l20722O0756p5489K40081R8431O76778
5378H12347q02336n19127K71557M06709j24972j618661j298368N23559K233869
5369a15423J556990M16764p89026j719677q78179k63401J9501R96842J076968
5360C01359Q013k66909p15784n91655N15601N31269M08712R24933N09899J384578
$$ y = [-2718218, -2625618, -1501024, -649543, 903823, 3438922, 4375317, 4051313, 2979484, 2561712, 2280036, 1254122, 379634, 1459423, 2536631, 3043393, 2211046, 505318, -521321, 185363, 1279745, 894234, -335573, -443193, 142476, 714836, 1345923, -113932, -2141150, -1481092, 894011, 2182598, 2619414, 2707457, 1521048, -123478, -506403, 164902, 672777, 1252555, 132512, -188210, -127454, -202943, 37138, 135569, 812347, 10011, -509116, -237559, 169150, 44178, -1574483, -2872851, -2349292, -115423, 1441567, 1858331, 1069305, -650372, -1528551, -1791952, -1772451, -775609, 301359, 309372, 42463, -673321, -1264976, -749375, -218106, 190606, 1115539, 1625438, 3010016]
5350C010016K401223J367058r3722j087007J16866K037700q0393j687314k632492
5341C351935l443553k599808j249673J133680K191043J548362M08066j052766
5333B87286k51240L205l87660J032409J605130k94526r99262j61191R37566R01921
5323B673638O00445M03079j219338k048947j946224k406250j021528L67304R79258
5314c618563Q03036l87217J60253J792787K337409J273531j682650p20899N62980
5305E20667N87394l08062q96432K53869J28403j095536Q92305K365785J302052
5296C750445j43534N73920P265q35316j626824k57417k94911l411679j557073
5287c795124k69027N32619K076434J721324o41566j243415O68716J066331R04409
$$ y = [3010016, 5411239, 6778297, 6684575, 5597568, 5714434, 7752134, 7671741, 5984427, 3351935, -91618, -2691426, -3941099, -2807419, -616376, 931986, 1340052, 287286, 36046, 39251, -348409, 684000, 2289130, 1994604, 995342, 834151, 1771717, 2673638, 3274083, 3677162, 2457824, 408877, -1537347, -3943597, -4965125, -4597821, -3618563, -2815527, -3202744, -3042491, -1249704, 1087705, 2361236, 678586, -42313, 520667, 1108061, 799999, -96433, 157436, 285839, -809697, 82608, 2448393, 3750445, 3606911, 4180831, 4188096, 3352780, 1725956, 1468539, 1173628, -2238051, -3795124, -4064151, -3531532, -1455098, 266226, -375340, -1618755, -950039, 116292, 1020701]
5278A020701J011787R97035j234493k404543k000668j810739k68505O67349J516036
5269b506040J538948M99899O15063n6218j061257K98611q14478j010916M22129
5260b074259N11878J468735M99914j963341j466279P26854L42653J16945N44778
5251a292122Q55803P83396J545623n9042N673P70867q58379k88086K70726q72696
5241H61763J306080J216287j125469j142719j074311j467023j106780L53057J063552
5232a115563J076759m5079j428247m39343R06580j552535k312496j163807J56056
5223e917675K573719L791706J338192N45738J78017m45530l201246k989342o4854
5214d191275J670542P42817L46784Q84401K010844J647086k35821K11551O30817
$$ y = [1020701, 2032488, 3029523, 1795030, -609513, -2610181, -4420920, -4689425, -4022076, -2506040, -967092, -467193, 147870, 91652, -969605, -670994, -1485472, -2496388, -2074259, -1562381, -93646, 406268, -1557073, -3023352, -2296498, -1953845, -1836900, -1292122, -436319, 347077, 1892700, 1833658, 1839331, 2610198, 1751819, 1463733, 1734459, 861763, 2167843, 3384130, 2258661, 1115942, 41631, -1425392, -2532172, -2179115, -1115563, -38804, -83883, -1512130, -1951473, -1044893, -2597428, -4909924, -6073731, -5917675, -3343956, 447750, 1785942, 2331680, 2509697, 2064167, -1137079, -4126421, -4191275, -2520733, -1777916, -1431132, -546731, 1464113, 3111199, 2875378, 3086929, 3717746]
5205C717746J123457L55925j9487M83411j084931n73636Q57179P92500P54759
5196F406923o63545j896366j926527k48229P24445J809177P07801J13049j70212
5187D856516K71414P29902R53233K32659l66303k1714J315174J521046J815462
5178A1307389K726201J713500P70529J931857L288990K962926J989789M982481
5170C1673662R426799J1936175J5436829J9710967K2927742K0541391J0908054
5163A42561619k450034j2271325j6082513j6031751j2569023q261269o686971
5156F8208733o087376l377342l50029P29662K226085K774187Q14398q16862r99097
5147F3122359q73431R53903N723307R054580J0556256J4686269J8199252J7845913
$$ y = [3717746, 4841203, 5197128, 5177641, 5661052, 4576121, 4002485, 4859664, 5652164, 6406923, 5743378, 3847012, 1920485, 1672256, 2396701, 4205878, 4913679, 5026728, 4856516, 5127930, 5857832, 6811065, 7043724, 6677421, 6655707, 7970881, 9491927, 11307389, 14033590, 15747090, 16517619, 18449476, 21738466, 24701392, 26691181, 31673662, 41100461, 53036636, 68473465, 88184432, 111112174, 131653565, 142561619, 140111585, 127840260, 111757747, 95725996, 83156973, 74895704, 68208733, 62121357, 58744015, 58393986, 59123648, 61349733, 64123920, 64938318, 64121456, 63122359, 62248928, 63202831, 68926138, 77980718, 88536974, 103223243, 121422495, 139268408]
5139A39268408J2187720q55720j2566180j8853906j8798257j7080518j4042309
5132F9259238j0744380p212788m755288m266271k388903N75837J570944j782236
5124D0256153k752431k798892m535823l228024k745051l024833k879914l296584
5116A4994601l785689k231262J058193q1675j762376j008547M33234L15730j818229
5107F113980j556503P29142N52203j651642j913134Q59719P50397l88572l21788
5098C173802Q87242J549717J045217N19094p14643j425651n34436l9754m98169
5089C962419r79354j402052j046482K51002o71947l28950r840j101629n89756
5080a916589R69757J273247O02548J057467J788373N82367j422149j788402l04585
$$ y = [139268408, 151456128, 150600408, 138034228, 119180322, 100382065, 83301547, 69259238, 58514858, 51302070, 46546782, 42280511, 39891608, 40467445, 42038389, 40256153, 37503722, 34704830, 30169007, 26940983, 24195932, 21171099, 18291185, 14994601, 11208912, 8977650, 10035843, 9954168, 8191792, 7183245, 7616479, 7932209, 6113980, 4557477, 5286619, 5838822, 4187180, 2274046, 3133765, 3884162, 3495590, 3173802, 4061044, 5610761, 6655978, 7175072, 6460429, 5034778, 4500342, 4460588, 3962419, 2983065, 1581013, 534531, 785533, 113586, -215364, -225204, -1326833, -1916589, -946832, 326415, 928963, 1986430, 3774803, 4357170, 2935021, 1146619, 842034]
5071H42034L06109J519381P82074j247658j532924j948840j168407r48763l545
5062c400539J594946L74434k30745k66756Q9970N5316m42344M59586L77432j63107
5052a551807L89326j22720j13205N32913R65119J245093L34405j146509j058388
5043e25773j375687j01574J269113j03238j081625q56134m32354o78311r42544
5034d828127l97472j168888o91611J222296J860000J237880J328743J582094P04666
5025H49581O59550J807513J362396p2754k76707k151580k298042j583502m19493
5016b123038Q34808L04074k01312l87032J843698P71824j751209k131499m07125
5007c246811J98045k6298J048387O55091R79272n89091j251108k14312j391983
$$ y = [842034, 1148143, 2667524, 3449598, 2201940, 669016, -1279824, -2448231, -3396994, -3400539, -1805593, -1431159, -1661904, -1928660, -1838690, -1783374, -2225718, -1766132, -1388700, -1551807, -1162481, -1285201, -1398406, -865493, 99626, 1344719, 1679124, 532615, -525773, -1901460, -2003034, -733921, -837159, -1918784, -2774918, -3207272, -3885583, -4828127, -5225599, -6394487, -7086098, -5863802, -4003802, -2765922, -1437179, 144915, 849581, 1509131, 3316644, 4679040, 4606286, 4329579, 2177999, -120043, -1703545, -2123038, -1288230, -984156, -1185468, -1572500, 271198, 1043022, -708187, -2839686, -3246811, -3048766, -3075064, -2026677, -1371586, -392314, -981405, -2232513, -2446825, -3838808]
4998c838808j415544Q3463J056959J216877L61797M13587q51944l7852J121276
4989a890189P96182k23355k549038n61622J445213N2390j029940L66268J120564
4980b473527M98738n62660J002678J734679J144590j85045j969640k531850n86185
4971c928222J222723j02016m2576L66322R73080R73855J109833Q07840O51504
4962B032343J70893N52570L23849k301604j304633N76524R54443J381495P70126
4953C156006j598874j376491o38402l73555J980331K471150P38835j956722k98787
4944B103491O04998N79120p10382k153076n96981M86011j022795p9245J114341
4935C25482J739936K45342j375291j648673q68555j064447N43104K48939M37649
$$ y = [-3838808, -5254352, -5170889, -4113930, -2897053, -2535256, -2121669, -2973613, -3011465, -1890189, -1094007, -1317362, -3866400, -4428022, -2982809, -2930419, -3960359, -3594091, -2473527, -1974789, -2537449, -1534771, 199908, 1344498, 1159453, -810187, -3342037, -3928222, -2705499, -2807515, -2850091, -2483769, -1510689, -536834, 572999, 1380839, 2032343, 2203236, 2755806, 3079655, 778051, -526582, 49942, 1004385, 2385880, 3156006, 1557132, 180641, -457761, -831316, 1149015, 3620165, 4359000, 2402278, 2103491, 2708489, 3287609, 2577227, 424151, -172830, 313181, -709614, -788859, 325482, 2065418, 2310760, 935469, -713204, -1581759, -2646206, -2103102, -1854163, -1416514]
4926a416514J187152l57806L9739O02679q84849o59686j308128j045430J331307
4917b511536J844779J110361J307420J888499Q29201r5629q09717k73335r05836
4908B384207m84584j938969j718509R2526M27452j99264p55296j445319o53021
4899d290777J437973L97574n14442l14757p19851j65653J363120J307493M73463
4890a025857q52746j367279M09543M1388Q24978J681358p76963o42212K068311
4881C60521K114313k41219j417745r82423q08165o50319k0124o13312j008841
4872c267314J080985J674170O72505J18519Q49314l69330j320118n37989J452351
4863C53093K020133J112432j379161l649926k465612j37161J454497J457092O19426
$$ y = [-1416514, -229362, -587168, -547429, 55250, -829599, -1489285, -2797413, -3842843, -2511536, -666757, 443604, 1751024, 3639523, 4468724, 4373095, 3563378, 3290043, 2384207, 1899623, -39346, -1757855, -1665329, -1237877, -1437141, -2192437, -3637756, -4290777, -2852804, -2455230, -2969672, -3284429, -4004280, -4169933, -2806813, -1499320, -1025857, -1878603, -3245882, -2836339, -2794951, -1969973, -288615, -1065578, -1707790, 360521, 2474834, 2233615, 815870, -166553, -974718, -1625037, -1645161, -2258473, -3267314, -2186329, -512159, 160346, 278865, 1128179, 758849, -561269, -1099258, 353093, 2373226, 3485658, 2106497, -1543429, -4009041, -4146202, -2691705, -1234613, -615187]
4854f15187M92857R15763r8748o95153j34307K47467M30300J019659J514268J830516
4844D907435O60826L19207K82961r02080k362183j546406q52299p857P60832Q48728
4834B109164P08542j436500j940500j638079j071848M76810k84786n93875M08355
4825c262717K082682J376767q59653p1476R13710R64174r43645j501951n94925
4816a897034L62790m43486O29066M74183L60206M0053k71560k56733J049200Q66219
4806I12904J89464m12655j841355j293000J327446O66097m30013j027541P28620
4797a180033K114083P06965P11934P30948j742860j276145J61517K11349K21949
4788F59707j128667p73895J24666J718478J086834j11282q95139j80290J353943
$$ y = [-615187, -122330, 793433, 694685, -468, -134775, 112692, 542992, 1562651, 3076919, 4907435, 5568261, 5887468, 6170429, 5268349, 2906166, 1359760, 507461, 499604, 1260436, 2109164, 2817706, 1381206, -559294, -2197373, -3269221, -2792411, -3077197, -3671072, -3262717, -1180035, 196732, -662921, -734397, 179313, 1143487, 199842, -1302109, -1897034, -1534244, -1977730, -1348664, -874481, -514275, -474222, -745782, -1002515, 46685, 912904, 1102368, 689713, -1151642, -2444642, -1117196, -451099, -881112, -1908653, -1180033, 934050, 1641015, 2352949, 3083897, 1341037, 64892, 226409, 437758, 659707, -468960, -1242855, -1118189, 600289, 1687123, 1575841, 680702, 500412, 1854355]
4779A854355P0246j68587J56755l68456J045987K15574J27366M09428O51530J631639
4769E625837L88473m65927J644334K283481J396003J957119L002522L800046N554832
4760B5186720O012452O666892R164048J1629372J6332318K2569239K7018125K8123728
4752A52702894K1255287O695792n948238r025207p378493m089578R82802N911442
4744A61106701J1132434J2402398R261184j374134j5121939k3455457k3652211
4737A30298976j9121725j5264273j3904967j2667759j0131852r619191r831165
4730C9758044o878133k147714k216116m222915m001009m704033m924184l243030
4722G420910j363572J29935k40117r64260J030485M11986p84127k15366k13622
$$ y = [1854355, 1924601, 1756014, 1912769, 1544313, 2590300, 2805874, 2933240, 3342668, 3994198, 5625837, 6014310, 5548383, 7192717, 9476198, 10872201, 12829320, 15831842, 19631888, 25186720, 31199172, 37866064, 47030112, 58659484, 74991802, 97561041, 124579166, 152702894, 173958181, 180653973, 174705735, 165680528, 158302035, 154212457, 155195259, 161106701, 172239135, 184641533, 193902717, 192528583, 177406644, 153951187, 130298976, 111177251, 95912978, 82008011, 69340252, 59208400, 49589209, 39758044, 32879911, 30732197, 28516081, 24293166, 20292157, 15588124, 10663940, 7420910, 6057338, 6187273, 5947156, 4982896, 6013381, 6425367, 5641240, 5425874, 5212252]
4713E212252j010211N64945J010537q56622P15933J720628l19526j672426j499114
4704C866396j10896m74214j694488n12806Q62459J784541J723884J440289j40402
4695F744763k146628k111010r07433p26001J32277J129454O05699n11266j397890
4686H11965j375105n64607p27940o20401L71343J345945J249410J313316M84175
4677B288101P34912L20492j12079M24276l89885n10279M31357L18521J83235j040471
4667B648180j898752o96459M96943J776915J466096J088572N75042j22218P43861
4658F078180K84317j81570L73650j100379k440613r51273J11202K49923K69904
4649B693341j14524j061915q58966j106231L8335l73951r75129j746002p51983
$$ y = [5212252, 4202041, 4766986, 5777523, 4920901, 5636834, 7357462, 7037936, 5365510, 3866396, 3755500, 3281286, 1586798, 1073992, 1936451, 3720992, 5444876, 6885165, 6744763, 4598135, 2487125, 1579692, 853691, 985968, 2115422, 2721121, 2209855, 811965, -563140, -1127747, -1855687, -2476088, -2104745, -758800, 490610, 1803926, 2288101, 3023013, 3343505, 3231426, 3655702, 3265817, 2755538, 3186895, 3505416, 3688651, 2648180, 749428, 52969, 549912, 2326827, 3792923, 4881495, 5456537, 5334319, 6078180, 6362497, 6180927, 6554577, 5454198, 3013585, 2062312, 2173514, 2423437, 2693341, 2578817, 1516902, 657936, -448295, -409960, -783911, -1759040, -3505042, -4257025]
4640d257025R73287K866422J351850q26264k08470p8533j413977o46763q1983
4631b321456O7359Q96518k71302K85726N60743n77550j836678r81034J610169
4622b567505K845050K577691J150310q66707M0861M38209j923507j926951l17837
4613e50386m45255p47931n91122J24038J284013J105357m84174l28302N1983J248441
4603F66662K032333Q20337p52032k83020R45147J02772R2820N78001o18684m09783
4593C174553m46253k043584j758207j096567Q88428J410416R06297m18836p30288
4584a14041q12268j257492k31305J166711P75929l45464K43243J37215m71203
4575i08675j893565j634863J298037J120400q14660j01883J929543K438330J617394
$$ y = [-4257025, -3283738, -417316, 934534, 108270, -100200, -178733, -1592710, -2239473, -2321456, -2254097, -1357579, -1628881, -1343155, -782412, -1359962, -3196640, -4177674, -2567505, 277545, 2855236, 4005546, 3138839, 3179700, 3617909, 1694402, -232549, -550386, -995641, -1743572, -2334694, -2210656, -926643, 178714, -305460, -633762, -581779, 666662, 2698995, 3519332, 2767300, 2484280, 3429427, 3532199, 3625019, 4203020, 3584336, 3174553, 2728300, 684716, -1073491, -2170058, -1281630, 128786, 1035083, 616247, -114041, -926309, -2183801, -2415106, -1248395, -472466, -817930, -574687, -437472, -908675, -2802240, -4437103, -3139066, -2018666, -2833326, -2935209, -1005666, 1432664, 3050058]
4566C050058R61521N70375P40951k42566q42213j220748j31158k16119p83781
4557A886320j651650k767189p66982K211756K723022p47606j048797p15113j539846
4548b416085k6776O47917k00060J49475k23608l26226n56518J096364J193649
4539f61868K75961J310272J49403N38115M07909M67646M997j349753p64774P92524
4529A170432J252626n29483j150847l2306J029058R5784k975868j360144J353878
4520a146870L36766j759832j352236j475181L58976K304356J812195M63581o9518
4511e27763r401q41088J45145j08883j140348R07752K185188J403089j85156m81625
4501A346910N56502k01724o71800k298875k981619p63913N93002p97059j414872
$$ y = [3050058, 4011579, 4581954, 5322905, 5080339, 4238126, 3017378, 2886220, 2670101, 1886320, 234670, -2532519, -3299501, -1087745, 1635277, 887671, -161126, -876239, -2416085, -2442861, -1794944, -1995004, -1845529, -2069137, -2395363, -2951881, -1855517, -661868, -385907, 924365, 1073768, 1611883, 2019792, 2487438, 2492435, 1142682, 377908, 1170432, 2423058, 1893575, 742728, 710422, 1739480, 1835264, -1140604, -2500748, -1146870, -810104, -2569936, -3922172, -5397353, -5038377, -2734021, -921826, -458245, -527763, -537164, -1378252, -1233107, -1341990, -2482338, -1574586, 610602, 2013691, 1828535, 1346910, 1903412, 1701688, 1029888, -1268987, -4250606, -5014519, -4421517, -5218576, -6633448]
4492f633448R42140K609563J787006n78705P73156M80738j023181R75798N76474
4483i0459j428651r82409K53058J15884j762590j031999J027606o6280O70470
4474c295370J492703K300188J202798k029922l020455j094058J543780J901930
4466i98406k21435j102413R13410p0299j782664j436994J9591O40258R21799J375154
4456a741999N79557q12284j650771r29058J701299J729123J03233l2795R75785
4447g7910J444165M41730j96217j040573j003389J14425j29340J71163m27980
4438g03926j270085J554962J880328o7879k59737r52952j762104q52815M78725
4429a955483N91123J06418m60224m16228k18997l50564J814102J695323J475257
$$ y = [-6633448, -5691308, -3081745, -1294739, -1873444, -1100288, -619550, -1642731, -666933, -90459, -1519110, -2501519, -2248461, -2132577, -3895167, -4927166, -3899560, -3965840, -3295370, -1802667, 497521, 1700319, -329603, -3350058, -4444116, -2900336, -998406, -1219841, -2322254, -1408844, -1479143, -3261807, -4698801, -4679210, -4038952, -3117153, -1741999, -1162442, -1974726, -3625497, -4554555, -2853256, -1124133, -1020900, -1053695, -77910, 1366255, 1807985, 1611768, 571195, -432194, -317769, -447109, -275946, -703926, -1974011, -419049, 1461279, 1393400, 1133663, 180711, -1581393, -2434208, -1955483, -1364360, -1257942, -1718166, -2134394, -2353391, -2703955, -889853, 805470, 2280727]
4420B280727K74654K55693l79110j882541j264740P02674J685336J287274J34064
4411C094031p83902J32168J080502k7906k709697k732565k446708n37683J193826
4402c737934K574843J497744m35494j014852l49324J92728N28845P82088J062462
4393A101106P48049L95082L57759J63382P45427J05590m60182j367231j835460
4384d6478j392518l12189J539671M00752n90604j720490j411056R67874J459100
4375a105938l58695p99674l59403J336553M78631l47895o8154J417164J011130
4366A203719J086649R86704N64974m06796p85908m80151r77398n81190j126715
4357e16112L64747M06296o72342J43931L60407M48349N45724M12486l77084O99721
$$ y = [2280727, 2555381, 2811074, 2431964, 549423, -715317, -12643, 1672693, 2959967, 3094031, 2310129, 2442297, 3522799, 3494893, 785196, -1947369, -4394077, -4931760, -3737934, -1163091, 334653, -100841, -1115693, -1465017, -1272289, -743444, 38644, 1101106, 1849155, 2244237, 2601996, 2765378, 3510805, 3616395, 3156213, 1788982, -46478, -1438996, -1751185, -211514, 189238, -401366, -2121856, -3532912, -2565038, -1105938, -1464633, -2264307, -2623710, -1287157, -808526, -1156421, -1224575, 192589, 1203719, 2290368, 3277072, 3842046, 3435250, 2649342, 2169191, 1191793, 610603, -516112, -151365, 254931, -417411, -273480, 86927, 535276, 1081000, 1493486, 1116402, 1816123]
4347A816123P39384o62611j12357Q87432p3461j441531k818989j194283m7220
4338b907513o85292P30776J593625j88994j021198N29666P00073n01952M37178
4329a313631k65310j052958o32374R39440J716048J388552R33467j827027j443704
4320a557497N87530P31846R4742Q22976j230129j947825j21196J716292j94371
4311a097632n91664p3743R35767K322099P30129k148380j274768J550201J923391
4302B275400K508005K214303J78424j696123j791329j390249j083921j061036
4294A53474n08359k40740K98032N24081K69448J000099P08304O3506j05140j416535
4284G46170j968704J448424K390592J386125K434105J647192n68799N18512l11457
$$ y = [1816123, 2555507, 1892896, 1780539, 2667971, 2594510, 1152979, -1666010, -2860293, -2907513, -3592805, -2862029, -1268404, -1457398, -2478596, -1948930, -1248857, -1750809, -1313631, -1578941, -2631899, -3264273, -2324833, -608785, 779767, 1713234, -113793, -1557497, -969967, -238121, -143379, 679597, -550532, -2498357, -2619553, -903261, -1097632, -1689296, -1763039, -827272, 1494827, 2224956, 76576, -1198192, 352009, 2275400, 4783405, 6997708, 7176132, 5480009, 3688680, 2298431, 1214510, 153474, -354885, -595625, -297593, 226488, 495936, 1496035, 2204339, 2267845, 2162705, 746170, -1222534, 225890, 2616482, 4002607, 6436712, 8083904, 7515105, 8033617, 7722160]
4275G722160j065879j16687p85037R51492J366628m80718J128483L106554L740207
4266A5567203K81489l34119N45505K322274O737350O562876N218322Q334782J0188386
4257E5424068J3534126K0088403K6692585L5095381M7012039O3100783P2545873
4250C33493258M3634559k7040487p2100537o6533322m7404051l4238905k5870145
4243A03940370j8273461j2570116r466380n785776l426216k190921j689571J205892
4235E1743821L561011M487682M140262O7545m834737q200242r052783q964654
4227C2947905o338473n158678k802482j350054k280606j923716m83204o10241
4219A2000451k031198k042838j495145l20316J462877l25476p00014j002414j939291
$$ y = [7722160, 6656281, 6539594, 5754557, 6706049, 8072677, 7591959, 8720442, 11826996, 15567203, 15848692, 15514573, 16060078, 18382352, 25119702, 31682578, 36900900, 45235682, 55424068, 68958194, 89046597, 115739182, 150834563, 197846602, 260947385, 333493258, 377127817, 350087330, 277986793, 211453471, 164049420, 129810515, 103940370, 85666909, 73096793, 63630413, 57844637, 54418421, 52227500, 50537929, 51743821, 55304832, 59792514, 63932776, 64000321, 59165584, 50965342, 41912559, 32947905, 26609432, 21450754, 18648272, 17298218, 15017612, 13093896, 12610692, 12000451, 9969253, 7926415, 6431270, 6110954, 7573831, 7248355, 6548341, 5545927, 3606636]
4210C606636j916717j060803N06658o07687n14794L51343J248740R03305k55843
4201B260838n97219j150263M69209J916753K024223j138124k123753j049250k31044
4192C81370J053502J606024J384378j54193m19515p0887J453627J861220l94665
4183F700861m28088J327933J034543j31673l04711J792239M888964O604923O005718
4174B7490709R66684m139318n685643o796096l798026J28298j002192k654239
4166D510177k153712n90836m28083m75646j033806j008010J76010j240864j332783
4157c577553J749917L328803J748487j546074j252635J162474N47314J97459p2941
4148B285251p31741o38117j025487q17273j161023M61617K366716K182373R5378
$$ y = [3606636, 1689919, 629116, 1135774, 528087, 13293, 364636, 1613376, 2516681, 2260838, 1663619, 513356, 982565, 2899318, 4923541, 3785417, 1661664, 612414, 381370, 1434872, 3040896, 4425274, 4271081, 3851566, 3780679, 5234306, 7095526, 6700861, 6272773, 7600706, 8635249, 8503576, 8198865, 9991104, 14880068, 21484991, 27490709, 28457393, 24318075, 18632432, 11836336, 8038310, 8166608, 7164416, 4510177, 2356465, 1765629, 1337546, 861900, -171906, -1179916, -1003906, -2244770, -3577553, -1827636, 1501167, 3249654, 1703580, 450945, 1613419, 2160733, 2358192, 2285251, 1553510, 915393, -110094, -927367, -2088390, -1626773, 739943, 2922316, 3017694]
4139C017694j538705n53915J593617J217173j718918k000534k39257J267202J673128
4130B717485o34158j401181m3992N34736m99030l10150q33163n97732M22989Q24064
4120A79868K74553L9076J919338M45654j105097j91124J309904K148366L92950
4111E413488j234568l9541k0215o74344m90316n63268L14700J352974k73627k572055
4101A213228k078797N45036J903880J761092O66862j2508j733562k106452k265178
4092b106399j586388j150944o88528J023236J941906J710014K208718R76578M5907
4083B374100p70604m00566Q10269j285708p11213k79138P972n77741K27784m49650
4073a054495k204873j004391L24663J395281L47921n04510Q85269J080820p85514
$$ y = [3017694, 1478989, 925074, 2518691, 3735864, 2016946, 16412, -222845, 1044357, 2717485, 2083327, 682146, 638154, 1172890, 673860, 363710, -469453, -1067185, -644196, 179868, 454421, 493497, 2412835, 2858489, 1753392, 1562268, 2872172, 5020538, 5413488, 4178920, 4139379, 4119164, 3444820, 2954504, 2391236, 2705936, 4058910, 3785283, 1213228, -865569, -320533, 1583347, 3344439, 4011301, 3998793, 2265231, 158779, -2106399, -3692787, -4843731, -5532259, -4509023, -2567117, -857103, 1351615, 2328193, 2374100, 1603496, 1202930, 2013199, 727491, 16278, -262860, -254888, -832629, -604845, -1054495, -3259368, -4263759, -3939096, -2543815, -2195894, -2700404, -1815135, -734315, -1519829]
4064a519829j93688P83697J085925l18768l45556P87545J043080q07569k316501
4055a801664j836219r42627P41357J541761J012916Q5628o76216k73624J310883
4046h37805J664074J167924J348726k41291j625821k283704j483704l97970j073031
4037c762602m52776J949631J295093K15261J448065R80413j32289O854j255193
4028B92457k987362q96615O12953k43133N18450J068232J97572J847629P79351
4019A189534m7344r81629j616560K13771R43888R4182K00253p93817j317723k35408
4009b350853j56539R89773O35624p09343p73334J703489J048657l1629m56939
4000a01094j54095O95559l07713L6057Q79437J247314k87583j204867l64164j660534
$$ y = [-1519829, -1713517, -929820, 156105, -162663, -508219, 279326, 1322406, 514837, -1801664, -3637883, -4580510, -3839153, -2297392, -1284476, -1198848, -1875064, -2148688, -837805, 826269, 1994193, 3342919, 3101628, 1475807, -807897, -2291601, -2689571, -3762602, -4215378, -2265747, -970654, -755393, 692672, 1673085, 1540796, 1547650, 292457, -2694905, -3591520, -2978567, -3221700, -2703250, -1635018, -1437446, 410183, 1189534, 1142190, 160561, -1455999, -1242228, -298340, -204158, -3905, -797722, -2115445, -2350853, -2507392, -1517619, -881995, -1591338, -2364672, -661183, 387474, 355845, -101094, -255189, 440370, 132657, 168714, 1048151, 2295465, 2007882, 803015, 438851, -1221683]
3990a221683j342914K04786J203008R37994n45077n20471J892623q4308j650301
3981a126343N05534K627659N27659j399304l80764J107849J210287l88705m68118
3972B215754j342523m11312n41200k8036J97715r22745j034361N43123J277760
3963d5825J199166j475679k584494p70691M42588J575796J890269P32456N73035
3954A536621P68356J085348O89357K32022J85143N12877O41962r61306j441848
3945C248532j133583Q9526q91003o90460j245922j675758l11817M97815J245134
3936h67536J174683J242051J48065N93776L23868n8976J295464N13509j414566
3927B950338j478813r01272j261845j180402r52966L4295n047O36475K560186
$$ y = [-1221683, -2564597, -2359811, -1156803, -218809, -763886, -1284357, 608266, 523958, -1126343, -620809, 2006850, 2534509, 1135205, 754441, 1862290, 3072577, 2683872, 2215754, 873231, 461919, -79281, -107317, 90398, -832347, -1866708, -1323585, -45825, 1153341, -322338, -2906832, -3677523, -3234935, -1659139, 231130, 963586, 1536621, 2304977, 3390325, 4079682, 4311704, 4496847, 5009724, 5651686, 4690380, 3248532, 2114949, 2204475, 1313472, 623012, -622910, -2298668, -2610485, -2112670, -867536, 307147, 1549198, 1697263, 2291039, 2614907, 2555931, 3851395, 4364904, 2950338, 1471525, 570253, -691592, -1871994, -2824960, -2790665, -2795712, -2159237, 400949]
3918D00949J537602k5932P2618Q02985m44269j919968r23827j188889j555504
3909c244235k77272R95686J51225M78104Q58523J001911Q13103n42694p71458
3900e37107p74598N55453J522778J49009j8090m44233r7193J273730M29517N505
3890B064771j477864k215480l68933N96364N39936P53164L99595j324402Q181
3881a024668Q35649Q9602j498895j101166J066533J524157P20154P45303k54074
3872A102595j013856n335M13736n96766M64801L08469j217334j002044k17216
3863a762950J582547P87408j096574l35708o68483j364662j21476P37690k69668
3854b511876N8433J205325J481581m04612m88353P66046R91800l04014k87130
$$ y = [400949, 1938551, 1912619, 1985237, 2788222, 2343953, 423985, -499842, -1688731, -3244235, -3521507, -2525821, -2374596, -1896492, -1037969, -36058, 777045, 234351, -537107, -1311705, -756252, 766526, 915535, 897445, 453212, 356019, 1629749, 2059266, 2064771, 586907, -1628573, -1997506, -1401142, -861206, -108042, 291553, -1032849, -1024668, -189019, -99417, -1598312, -2699478, -1632945, -108788, 611366, 1356669, 1102595, 88739, 83404, 497140, -99626, 365175, 673644, -543690, -1545734, -1762950, -180403, 607005, -489569, -825277, -1493760, -2858422, -2979898, -2242208, -2511876, -2453443, -1248118, 233463, -171149, -659502, 106544, 1098344, 794330, 507200]
3845E07200J184010N9769p07489J00353K9335O0313m3774O73735J327396M53717
3835C644565l08378q08186m72396n1161j162660j519548j052618P3686R33406
3826g23290p2797O37632R93392m08757n11069O83324o76682q45539M82065J771525
3816A329804O29258J33965O33502m93164r27470j408541k583512J48224J342520
3807a195414J165208L42467n74788o9727R36708L5834k85662J099991M51841o76186
3797A230272j009642j566387k64929J79467J302095J633504K207644J545827r34709
3788D323142l454135m050913j748065M37674J285507K730978J615377j142777
3780c212m45763k730n20345q1290J299030J279416O8112l74267j741464n57527
$$ y = [507200, 1691210, 1750979, 1043490, 1143843, 1173178, 1233491, 1189717, 1863452, 3190848, 3644565, 3336187, 2528001, 2055605, 2004444, 841784, -677764, -1730382, -1656696, -723290, -796087, -158455, 834937, 426180, -84889, 598435, -78247, -923786, -441721, 1329804, 1959062, 2093027, 2726529, 2233365, 1305895, -102646, -2686158, -2537934, -1195414, -30206, 312261, -262527, -332254, 604454, 640288, 354626, 1454617, 1906458, 1230272, 220630, -1345757, -1610686, -1431219, -129124, 1504380, 3712024, 5257851, 4323142, 869007, -3181906, -4929971, -4492297, -3206790, -475812, 1139565, -3212, -448975, -451705, -972050, -1053340, 245690, 1525106, 1593218, 1218951, -522513, -1080040]
3770a080040O63886m0172L88432R46K17288j46819L83469P86107q33665j362323
3760a022891K06163J349754K86173j158449j767372p85337O74600J030662J779917
3751E93220J829514j266121l129424r84932k35621o15966J31418J599452R22986
3742a155474J348265L187481K084098N26594o72543j479505j225406j431178j098552
3733H3780l24173j138082j304560R7993M12942k12938P30533J949718K99222k198243
3723a603808j569339J16088J443974Q39853P22900L69733r91385k08898J82378
3714f98504k20899J79300j203919k64903n72455j257759R02639m33875m47849
3705d018224J533019P21389j88149M17540P03378P39306Q85271O34369n04865
$$ y = [-1080040, -416154, -456326, -67894, -66948, 150340, 3521, 386990, 1173097, 339432, -1022891, -816728, 533026, 819199, -339250, -2106622, -2891959, -2217359, -1186697, 593220, 2422734, 1156613, -1972811, -2957743, -3193364, -3809330, -3677912, -2078460, -1155474, 192791, 3380272, 5464370, 5990964, 5318421, 3838916, 2613510, 1182332, 83780, -240393, -1378475, -2683035, -2585042, -2172100, -2385038, -1654505, 295213, 594435, -1603808, -3173147, -3057059, -1613085, -773232, -50332, 319401, -671984, -880882, -698504, -919403, -740103, -1944022, -2208925, -2781380, -4039139, -3136500, -3570375, -4018224, -2485205, -1763816, -1951965, -1534425, -831047, -91741, 793530, 1427899, 923034]
3696I23034J71012K120688P6141l076568j972999n675P18474J556882J498650
3687B009639P68287O18083j408642j482848p93842j008732q36426l16822o23259
3678c074562o02302J448755L15925j838138R7529K273657J017484o702q30752
3669a199106R38010K006745J505963r6803k080468j455456q36402j621460M34432
3660b404545R15916J346197J729607q07603j233802Q97447J416568o46525k460990
3651a247730j738685r4437j013603Q89730K091314J435395M19184k03040j302650
3642g64522j427732M10324J498028J006016l28391j45649J194474p36947j462549
3633g56948j92800K99615P8624k88754j01118L08707N56943k9824j248391k116029
$$ y = [923034, 1094046, 3214734, 3290875, 214307, -1758692, -1764367, -1045893, 510989, 2009639, 2777926, 3396009, 1987367, 504519, -289323, -1298055, -2134481, -2451303, -3074562, -3676864, -2228109, -1912184, -3750322, -3652793, -1379136, -361652, -368354, -1199106, -261096, 1745649, 3251612, 3154809, 1074341, -381115, -1217517, -2838977, -2404545, -1488629, -142432, 1587175, 779572, -454230, 443217, 1859785, 1213260, -1247730, -2986415, -3080852, -4094455, -3204725, -1113411, 321984, 741168, 538128, -764522, -2192254, -1781930, -283902, 722114, 393723, 248074, 1442548, 705601, -756948, -949748, -650133, -571509, -860263, -961381, -652674, -95731, -125555, -1373946, -3489975]
3623c489975p21391l25572Q33149K497754K551083N61610j854018j490210P9620
3614a357950K925559K924356r83108j962546M87627J207867J261740n42077j247397
3605B714071k166506l221586j547890R34041O85472P03513L69958j459003O52828
3596b335102J007221M35914K42458m91577o6595N40659j539151j558987J617845
3587b147315J818920l03102j285264n9774J281833M18805L40758p49094l37469
3578a021702Q09917P59058N23789J227199m27651j10247R38792J63110o76766
3569B185499l030722j981603n937J500793K113011M17823o9408R75362J185040
3560C289858M51006q69548j770977j819236k50012Q04587R90665m43682N20088
$$ y = [-3489975, -4211366, -4536938, -3703789, -1206035, 1345048, 1906658, 52640, -1437570, -1357950, 1567609, 4491965, 3508857, 1546311, 2033938, 3241805, 4503545, 3961468, 2714071, 547565, -2674021, -4221911, -3287870, -2602398, -1898885, -1528927, -2987930, -2335102, -1327881, -891967, -649509, -1141086, -1207681, -667022, -2206173, -3765160, -2147315, -328395, -631497, -1916761, -1976535, -694702, -275897, 64861, -684233, -1021702, -211785, 547273, 1071062, 2298261, 1870610, 1760363, 2699155, 2862265, 2185499, -845223, -2826826, -2832763, -1331970, 781041, 1198864, 1129456, 2104818, 3289858, 3740864, 2871316, 1100339, -718897, -968909, -164322, 826343, 382661, 902749]
3551I02749L2370p16652k93004J004388l15626j173389p60441N9785J079500L38838
3541A58518n58914k97703J428727O29776j292346j76849r321j249786P47314m94834
3531a115418j802258J160790J824680J485452J282714l8580k183079k045724j057022
3522b488445L69767K040013Q18395j377923j82595J286555j33559m76708P82911
3513F38411k48084r69198O91170J558421K3906K78919O68978q13017r22068J54366
3503A061804j611765j870642j087491j289029K04343J394643O72679p46780k58535
3494c530773Q99918O26105P24085J361726L93582N04453P07343P71685J95448
3485B653572j502483m38548J33619k988624l402587l26665L70128R79122J384856
$$ y = [902749, 935119, 218467, -74537, 929851, 614225, -559164, -1319605, -1259820, -180320, 158518, -400396, -698099, 730628, 1360404, 68058, -108791, -118112, -1367898, -620584, -1115418, -2917676, -1756886, 67794, 1553246, 2835960, 2797380, 614301, -1431423, -2488445, -2118678, -78665, 739730, -638193, -820788, 465767, 332208, -144500, 638411, 390327, -578871, 112299, 1670720, 1694626, 1973545, 2642523, 1829506, 907438, 1061804, -549961, -2420603, -3508094, -4797123, -4592780, -3198137, -2525458, -3272238, -3530773, -2630855, -2004750, -1280665, 81061, 474643, 979096, 1686439, 2458124, 2653572, 1151089, 712541, 846160, -2142464, -5545051, -5871716, -5501588, -4522466, -3137610]
3476c137610J757564R14709P57937J368957O66919L70075l04966j38452K15122
3467B470255Q9197p40285p34150J4797J451181N48671R5668O40510J119461Q7359
3457E042664K84804M13927n76097k236208j603405o73260j209500n01688N51418
3448e07345j480245j457475p7498K57030N19487J185128J167916R14934P31292
3439A253224J302510m42373O04710J967976J008452K33720J53009p32407k169953
3430C178868j800050l79870k53049l89888N54655q19322k393561j463310N79609
3421c185918Q00368p81268o21148J021738J125038j49031o11218L14465k76336
3412b363310j03865J175296L62054N8517k68632j003343j18383J058034J830334
$$ y = [-3137610, -1380046, -465337, 292600, 1661557, 2328476, 2698551, 2393585, 2255133, 2470255, 2559452, 1819167, 1085017, 1099814, 2550995, 3099666, 3195334, 3835844, 4955305, 5042664, 5327468, 5741395, 5165298, 2929090, 1325685, 652425, -557075, -1058763, -507345, -1987590, -3445065, -3522563, -3265533, -2746046, -1560918, -393002, 521932, 1253224, 2555734, 2113361, 2718071, 4686047, 5694499, 5928219, 6081228, 5348821, 3178868, 1378818, 998948, 745899, 356011, 910666, 91344, -2302217, -3765527, -3185918, -2385550, -3166818, -3787966, -2766228, -1641190, -1790221, -2401439, -2086974, -2363310, -2467175, -1291879, -929825, -871308, -1139940, -2143283, -2261666, -1203632, 626702]
3403F26702J039587j065871k069685n94531N59496M78143J08680Q7912j705315
3394b534882j246645L31138J092006p98142j758439n04398K024613R15962J72553
3385b306234M43407O14322J098950J700350J110889k77640j2880L39853K40298
3376B951315r89146o32704P40856J109006j116308k036568L21980j7455j187298
3367h56322m43143r6312M65337R75160O94334J377740l04573j008769j138381
3358c34929j004269k65781L33272J051643K65777K9446j85656j334204o23207
3349b067908J071838J459991R32016L5747j697059j513023J12958Q71209L88657
3340d05574p6904o61903m84470j026713p13446M31308l3327j11270J09597J316515
$$ y = [626702, 1666289, 600418, -1469267, -2063798, -1504302, -1026159, -917479, -829567, -2534882, -3781527, -3450389, -2358383, -3156525, -4914964, -5419362, -3394749, -2478787, -2306234, -1862827, -1248505, -149555, 1550795, 2661684, 2384044, 2371164, 2711017, 2951315, 1962169, 1329465, 2070321, 3179327, 2063019, 26451, 348431, 330976, -856322, -1299465, -1395777, -930440, 44720, 739054, 2116794, 1812221, 803452, -334929, -1339198, -1604979, -1271707, -220064, 45713, 75159, -110497, -1444701, -2067908, -996070, 463921, 1395937, 1431684, -265375, -1778398, -1665440, -794231, -405574, -482478, -1144381, -1628851, -2655564, -3369010, -2937702, -2971029, -3082299, -2972702, -1656187]
3330a656187J095227R35712m80584j413615j306538L03765K74924J060143o96202
3321a883355j210014Q5672J399639K075094J933103O54363k89546k28155o35139
3312A901662J59341J809842J031910m9633n29957j035549M52222q23489j858306
3303A058043j168825n33274K18871K317992R49859o44425p80751k011574k270886
3294b864970k06638K678174J867127o17671M28998J38549k0054j397196j141255
3285a134936j42089P35532R91292J115290j45523R8661N60212P5510j201132j941880
3275i89063l20554M83086n89135j715079L28834J636347J586428J145807M28949
3266A995620R10773q8319j096808p00220O8118O4249m16322j296378r63130J197196
$$ y = [-1656187, -560960, 374752, -105832, -1519447, -2825985, -2522220, -2247296, -1187153, -1883355, -3093369, -3007697, -1608058, 467036, 2400139, 3054502, 2764956, 2536801, 1901662, 2061003, 3870845, 4902755, 4853122, 4323165, 3287616, 3739838, 2916349, 1058043, -110782, -644056, -425185, 1892807, 2842666, 2198241, 1417490, -594084, -2864970, -3071608, -393434, 1473693, 856022, 1285020, 1423569, 1403515, 6319, -1134936, -1277025, -541493, 449799, 1565089, 1419566, 1518227, 2078439, 2153949, 952817, -989063, -1309617, -826531, -1415666, -3130745, -2801911, -1165564, 420864, 1566671, 1995620, 2906393, 2818074, 1721266, 1021046, 1089164, 1153413, 737091, -559287, -1522417, -325221]
3256c25221P04664K1466j020188L33874Q27742P57416j603214k424735Q3611J072513
3246a572072j517649j402031r24565j499172Q18613K549617J805829P47490j1230
3237a005170J09494J36293J234183Q79857j348330m22112R50274Q30433K31277
3228A596199j52357n29065j465353q45443L73588J562900q94055k245533P96068
3219a803051N04249m91445M14702O55303r8191j99191j250418k30634J203839
3210a294837Q44635P14225Q24401L26295k25388M8715O20010M84278O6186j174875
3200A233645j874161l72728J598936O06078r71204P03273P80637J36595j551460
3191B89611j720933j87206j43000n01149k70372Q6085J04148K63946k68394j41898
$$ y = [-325221, 379443, 400909, -619279, -285405, 542337, 1299753, -303461, -2728196, -2644585, -1572072, -3089721, -4491752, -5416317, -6915489, -6096876, -3547259, -1741430, -993940, -1005170, -895676, -759383, 474800, 1354657, 6327, -415785, 534489, 1364922, 1596199, 1443842, 914777, -550576, -1396019, -1022431, 540469, -353586, -2599119, -1803051, -1298802, -1790247, -1375545, -720242, -818433, -1017624, -2268042, -2498676, -1294837, -450202, 264023, 1088424, 1414719, 1189331, 1238046, 1858056, 2342334, 2408520, 1233645, -640516, -1013244, 585692, 1191770, 220566, 923839, 1704476, 1841071, 289611, -1431322, -1618528, -1761528, -2262677, -2533049, -2446964, -2342816, -2078870, -2347264, -2489162]
3181b489162M42063l27830p42048j64178Q89695J390959R12695L35379P42451
3172I90024R68066O30305o43195J49224P70916q32618p67794m13384n69627J042927
3162A324844R62938K02131m49579l49278k24641J80119K42071j008860j567892
3153f88147q96825Q18726m77052o3151R57410M12908j60855j012773q757J727132
3143F08616P90667Q46386j38600k323889j117084j659800o93461J418892J464658
3134h03615J151022j48772p34428L21149M7850N0024L04321r07753j607477J64850
3124b162829L109082K096680j580586l103030k098351q04405N61295K009517J640908
3115c31719J36269j481949r73380J302027K940950J715110j72266M47047r19183
$$ y = [-2489162, -2047099, -2374929, -3116977, -3281155, -2391460, -1000501, -87806, 247573, 990024, 1958090, 2588395, 1945200, 2094424, 2865340, 2032722, 1264928, 851544, 281917, 1324844, 2287782, 2489913, 2040334, 1691056, 1466415, 1646534, 1888605, 879745, -688147, -1584972, -766246, -1243298, -1306449, -349039, 63869, -96986, -1109759, -1118516, 608616, 1399283, 2245669, 2107069, -216820, -1333904, -2993704, -3687165, -2268273, -803615, 347407, 198635, -535793, -214644, -166794, -116770, 187551, -720202, -2327679, -2162829, 946253, 3042933, 1462347, -1640683, -3739034, -4543439, -3982144, -1972627, -331719, -195450, -1677399, -2650779, -1348752, 1592198, 3307308, 3135042, 3582089, 2662906]
3106B662906j788890j385684m34219l55119j917751j283308j061410j272707K38573
3097f597609J697260J265851m66649N14631L311237J299967k297944o96772J451910
3088e18118J165478J081023J183627k09068j594985k262696M25214J719955n77908
3079D12522m44661P14808N12942j03493j98238o41099k27442k62488Q63092J087003
3069A712946J05661l29918q56649j90325O72443J000851M93891J137397j59650
3060C586647n16343l38566n09453j73867J27806n04042j640326q05310P67205
3051f249N9777n80614r79125l08474m40022k94864J017871J587451L2915j189571
3041a100905K94567J053960j223963j795756j305569J74720J941535Q92413j311674
$$ y = [2662906, 874016, -511668, -945887, -1301006, -3218757, -4502065, -5563475, -6836182, -6597609, -4900349, -3634498, -4101147, -3586516, -275279, 1024688, -1273256, -1970028, -518118, 647360, 1728383, 2912010, 2702942, 1107957, -1154739, -729525, 990430, 412522, -32139, 682669, 1195611, 1092118, 893880, 252781, 25339, -237149, 625943, 1712946, 1818607, 1488689, 632040, 441715, 1114158, 2115009, 2608900, 3746297, 3586647, 3070304, 2731738, 2222285, 2048418, 2176224, 1672182, 31856, -773454, -6249, 53528, -527086, -1506211, -1814685, -2254707, -2549571, -1531700, 55751, 88666, -1100905, -806338, 247622, -976341, -2772097, -4077666, -3902946, -1961411, -1068998, -2380672]
3032b380672n28617o26002l15115J425160J204515Q7271q54584j727383j972511
3023e687938N37214l04210n34141J633126J443344L32951o79705m63206L71232
3014c351333j80270O20633Q90265R91186r67051j175856L32840O47448J471576
3005g20562R51047q89390n88014K432159J257471r60613r97915L74895O8710k036596
2995a108808k018583K21897R89003l64170j26202O78546O39528J870176j71693
2986F09694k093111M48717J67065k94934N79151Q84177r69402j433031p54614
2977b856288J845410M15583q76461n85274M78186J962029l30344p66058L7526
2968f75691N21873p89395k14472J370572K331723O12204j018223K19395K79547
$$ y = [-2380672, -2909289, -3535291, -3850406, -2425246, -1220731, -1133460, -1988044, -3715427, -5687938, -5150724, -5454934, -5989075, -4355949, -2912605, -2579654, -3259359, -3722565, -3351333, -3531603, -2910970, -2020705, -1029519, -1996570, -3172426, -2839586, -2192138, -720562, 230485, -658905, -1246919, 1185240, 2442711, 1482098, 484183, 859078, 927788, -1108808, -3127391, -2905494, -1916491, -2280661, -2406863, -1728317, -1088789, 781387, 609694, -1483417, -1034700, -867635, -1162569, -583418, 300759, -668643, -2101674, -2856288, -1010878, -595295, -1471756, -2057030, -1578844, 383185, 52841, -713217, -675691, -153818, -943213, -1157685, 212887, 2544610, 3156814, 2138591, 2357986, 2637533]
2959B637533j105541j04962L18086P08070p76094l115207k416950j545564J658853
2950c741776K358196R77348Q53469o23597k174525j860360Q17926L66395K63756
2941b763168J611721J462409N21880J088747k7800n20019J743665l77437j545889
2932A194109j144936m33935r86947p66297J827891J705774O99451n85400j300655
2923B09055J97085p16300j566284m09553N74574m95897k74172J298847L44749
2914h37896l06040P81447O90583q27364n77323J55495L90929Q35399j01493p20152
2904e16415o21266N03728L37934J531095P99653j435601k572671l57245K481900
2895A51112o6383p19526l41188K07846n40086o41478l39207j053697j800360k21648
$$ y = [2637533, 1531992, 1427030, 1745116, 2453186, 1677092, -1438115, -3855065, -5400629, -3741776, -1383580, -406232, 447237, -176360, -2350885, -4211245, -3393319, -3026924, -2763168, -1151447, 310962, 832842, 1921589, 1893789, 1373770, 3117435, 2739998, 1194109, 49173, -384762, -1371709, -2138006, -310115, 1395659, 2095110, 1509710, 209055, 406140, -310160, -1876444, -2285997, -1711423, -2207320, -2481492, -1182645, -837896, -1143936, -362489, 328094, -499270, -1076593, -921098, -530169, 305230, 203737, -516415, -1137681, -633953, -296019, 1235076, 2034729, 599128, -1973543, -2330788, 151112, 84729, -634797, -975985, -768139, -1308225, -1949703, -2288910, -3342607, -5142967, -5364615]
2885e364615K50924j79750R48072J533254J513312n30128r51899K48228J877298
2876f55304J793852j470839j556348r5122j69047P04461J362012k37764j078655
2867a402754Q0801J61141j45259J021651J482594K47183L91173J529651J556566
2858D922747J595964P3232j208945q63448l29309k686639l283610m18796J476865
2849g21939J803416J265494n25923j387524j367136j09260J138968O13704N29820
2840A239620p20802q62177p05191M54246J192792m07311m36090l01424j429164
2831a975501m60751l67287L44029K155063K412457K94190j97911j045335k975359
2822a816405j618971J008250Q55866k53156p91365q76179n88355N92241J956691
$$ y = [-5364615, -5113691, -5293441, -4345369, -2812115, -1298803, -1828931, -2780830, -2532602, -655304, 1138548, -332291, -1888639, -1983761, -2152808, -1448347, -86335, -324099, -1402754, -1321953, -1160812, -1306071, -284420, 1198174, 1445357, 1836530, 3366181, 4922747, 6518711, 6591943, 5382998, 4519550, 4190241, 1503602, -1780008, -2198804, -721939, 1081477, 2346971, 1821048, 433524, -933612, -1042872, 96096, 709800, 1239620, 518818, -343359, -1048550, -594304, 598488, 191177, -244913, -546337, -1975501, -2436252, -2803539, -2459510, -304447, 2108010, 2402200, 2204289, 1158954, -1816405, -3435376, -2427126, -1571260, -1824416, -2615781, -3491960, -4080315, -3488074, -1531383]
2813a531383P70807j333564j170054q22434O20779Q7100q49816L15726J141517
2804b771322J199317Q16606n94104k586201j849410R88959K229974J055412j45496
2795a656265J09843j61265m49020l17368n56106q7546K42340J182623J192915
2786d99849J273572J331018k754096l002818J87980J90503k52834J004487K016813
2777e05224M44374L04374j001298j231455M94406N35921N12676q55156j219231
2768b520613L6913J187424K166972o04467r79756L12242k18811m15598K95049
2759g40645J597874P69480L8122j783082l98409K128634R50560O34264P89698
2750C986496M2648j165112j562289k417519k023956j323395M60577K018585l00058
$$ y = [-1531383, -760576, -2094140, -3264194, -4086628, -3465849, -3378749, -4228565, -3912839, -2771322, -1572005, -755399, -1349503, -3935704, -5785114, -4796155, -2566181, -1510769, -1656265, -1546422, -1707687, -2156707, -2474075, -3030181, -3117727, -2875387, -1692764, -499849, 773723, 2104741, -649355, -3652173, -3464193, -3273690, -3526524, -2522037, -505224, -60850, 243524, -757774, -1989229, -1494823, -958902, -446226, -1301382, -2520613, -2483700, -1296276, 870696, 266229, -713527, -401285, -620096, -1035694, -740645, 857229, 1626709, 1664831, -118251, -516660, 1611974, 2562534, 3196798, 3986496, 4029144, 2864032, 1301743, -1115776, -3139732, -4463127, -4002550, -1983965, -2284023]
2741b284023j542368K51036J405222K315361O63835j478354p83696K0503n01444
2732a933928r2215K59233l18931M40934J146805j543417p21467L70587N16293
2723a876106R47337K38714j14815J96222J424129o58622j576012m57008n26475
2714b402636J047225J952394J29992l08926m3225K47510M8852q68025l39402J081058
2704E44817J107256J228775n72817j630683q37125n05278o12243N5563J871746
2695F50011J239583N82790J57705q4066L78243J379534R31130q67988j004784
2686C362158R11814R02025o97025j361948j860913j816543j46860M17799j782502
2677b071995k41088q3048l41846r69577q23636R57523J965473J534307R29534
$$ y = [-2284023, -3826391, -3575355, -2170133, 145228, 809063, -669291, -1452987, -1432484, -1933928, -2026143, -1766910, -2085841, -1644907, -498102, -2041519, -2762986, -2392399, -1876106, -928769, -690055, -804870, -608648, 815481, 156859, -1419153, -1876161, -2402636, -1355411, 596983, 726975, 418049, 374824, 622334, 671186, -196839, -536241, 544817, 1652073, 2880848, 2308031, 677348, -159777, -665055, -1277298, -1221735, 650011, 1889594, 2472384, 2630089, 2546023, 2924266, 4303800, 5234930, 4366942, 3362158, 4273972, 5175997, 4478972, 3117024, 1256111, -560432, -707292, -289493, -2071995, -2313083, -2396131, -2737977, -3707554, -4531190, -3573667, -1608194, -73887, 855647]
2668H55647J043297j729100j921318J525356Q78079j472274o49593J803198J784936
2659B118228j43476n12138N51381J809841J073050j178185k582108j681454k60680
2650h05541P98837m59444k018265j003334K555431K749908n28736j652359k089367
2641b452870j225557L66469J38196J472400K481579m79051q67238N3508L51701
2632a60863J046250j85739j662946L69676O94226o51071K11866J400786N70563
2623A632748j036504r57973m58878M66858J41645l40160P97292K027521J71326
2614B443875j359945P16114J005607j84656k223013q13120j89548M23763o39611
2605h20534q83809m66841O05995K036208J105175r38991j622053R86491R90057
$$ y = [855647, 1898944, 169844, -1751474, -226118, 651961, -820313, -1469906, 333292, 2118228, 1974752, 1462614, 2013995, 3823836, 4896886, 3718701, 1136593, -544861, -805541, -6704, -466148, -2484413, -3487747, -932316, 1817592, 1288856, -363503, -2452870, -3678427, -3311958, -3173762, -1701362, 780217, 301166, -566072, -512564, -160863, 885387, 699648, -963298, -593622, 100604, -550467, -338601, 1062185, 1632748, 596244, -361729, -820607, -353749, -212104, -552264, 245028, 2272549, 2443875, 1083930, 1800044, 2805651, 2620995, 397982, -415138, -604686, -180923, -820534, -1704343, -2171184, -1565189, 471019, 1576194, 637203, -984850, 1641, 991698]
2596I91698O32542P2081j001756l75205P61485L02863p77807J90463M74121j940080
2586f69595k800974j148169O50826j468036p50320J592262K310604J097861K78805
2577i06736j58249j45651j068299k908708O6417J741988L52536J84206N98823
2568b243673J300365k46551M68129J43107M84438R42373l93699k682911j675469
2559c903891J426849M53963m6536M96301k31736J33315N95988k34197j682486
2550b992430o13285p4766o39680j26682k43250K175594K090818N1574n11653n21272
2540a405032j107133J03525O84727o30J89586J689993K642423J687819K42888
2531D728166j442354j962138j732759p95389J79412J186638q21917k019647j764875
$$ y = [991698, 1624240, 1696321, 694565, 319360, 1080845, 1383708, 605901, 796364, 1270485, -669595, -3470569, -4618738, -3967912, -5435948, -6186268, -4594006, -2283402, -1185541, -906736, -1064985, -1210636, -2278935, -5187643, -5121226, -3379238, -3026702, -2842496, -2243673, -943308, -1189859, -721730, -578623, -94185, 848188, 454489, -2228422, -3903891, -2477042, -2023079, -2069615, -1573314, -1805050, -1671735, -1075747, -1309944, -2992430, -3605715, -3680481, -4320161, -4446843, -4690093, -2514499, -423681, -372107, -883760, -1405032, -2512165, -2408640, -1723913, -1724543, -1534957, 155036, 2797459, 4485278, 4728166, 3285812, 1323674, -409085, -1204474, -1025062, 161576, -660341, -2679988, -4444863]
2522d444863J067070K889453J650092J0625l05363j074523l42297J112750R80242
2513A543186M90555Q56710M27034j797414k858520l15560J332136k411q25968
2504a150252k526657j058060J279784P60975p22338Q33458J795029J409003Q43364
2495A464306N63983M96851o31526K23599J309706P20350K50717q92312m60599
2486C045075J124570n55669j867640r3483N56814p38962j366516j204259l40627
2477a440697P73515L72904J502826J680289M9214j390398m171848m618535l30194
2468g572924J034207N09625N03953J165458P09195p86049r42462j164901r56499
2459g500397J548709K110194K345297J422152m2824J27727M2395k28629L86281
$$ y = [-4444863, -3377793, -488340, 1161752, 1172377, 867014, -207509, -549806, 562944, 1543186, 2033741, 2890451, 3317485, 1520071, -1338449, -1654009, -321873, -324284, -1150252, -3676909, -4734969, -3455185, -2694210, -3416548, -2583090, -788061, 620942, 1464306, 2028289, 2525140, 1893614, 2117213, 3426919, 4147269, 4397986, 3505674, 3045075, 4169645, 3613976, 1746336, 1652853, 2209667, 1470705, 104189, -1100070, -1440697, -667182, -294278, 1208548, 2888837, 2938051, 1547653, -2624195, -7242730, -7572924, -6538717, -6029092, -5525139, -4359681, -3650486, -4436535, -5378997, -6543898, -7500397, -5951688, -3841494, -1496197, -74045, -116869, 10858, 53253, -175376, 210905]
2450B10905N23640p27587q89364o50963j353561k10357Q35235j39845l53094K67649
2440b487342J666332J151851L01136L80003J6887j517569o10384J181592J073602
2431A156108J34575j93200J026277o51361j427674o9566J124360R98088N30180
2422B627787q85988j841273n13898Q99683Q70622P33261J095127j89036L50552
2413C146837J79542r32500K61280L44208K36904P29551j265982l213163k649526
2404c162849q44650J555269K92147j092101j260946N7711J990985J730305O77864
2395e6265M8101N99536R43934M84027J292444m13148k480481j184969J400839
2386F34018L95223m79709O24051j157522j244233M43960K42655K77356J20226
$$ y = [210905, 734545, 6958, -882406, -1533369, -2886930, -3097287, -2262052, -2401897, -2754991, -2487342, -821010, 330841, 631977, 1011980, 1028867, -488702, -1099086, 82506, 1156108, 1290683, 1097483, 2123760, 1472399, 44725, -24841, 1099519, 2097607, 2627787, 1741799, -99474, -613372, 286311, 1156933, 1890194, 2985321, 2796285, 3146837, 3326379, 2393879, 2655159, 2999367, 3236271, 3965822, 2699840, -513323, -3162849, -4007499, -2452230, -2160083, -3252184, -4513130, -4455419, -2464434, -734129, -56265, -8164, 591372, 1535306, 2019333, 3311777, 2898629, 418148, -766821, 634018, 1029241, 549532, 1173583, 16061, -1228172, -784212, -541557, -264201, -143975]
2377a43975k665057j890726J76267J349004J110157N92063k68577Q96165M20025
2368d24654O19702P11914J007409L024442J215102M19144Q80618m51768J132058
2359H133967K271399N13492J138751J920849M408281J0194951J5136825K0217004
2351F3935519L1122801L8930478K3966421j2444740l2576895k8052856j6648651
2344F8232077q767904n641803m401554o574690q854657q533056n232542l870234
2336A6355637m734485m415890j811011o5763J002694o4971p06845o14995j096125
2327C848246k66592k15330m55188k44881j90108r82626j235018l69596M38625
2318C27532p1214k006040k59493J433918M22680P46262J355377R82161M59364
$$ y = [-143975, -2809032, -4699758, -4523491, -3174487, -2064330, -1472267, -1740844, -844679, -424654, 195048, 906962, 1914371, 4938813, 6153915, 6573059, 7453677, 7001909, 8133967, 10405366, 10918858, 12057609, 13978458, 18386739, 28581690, 43718515, 63935519, 95058320, 133988798, 157955219, 145510479, 112933584, 84880728, 68232077, 59464173, 53822370, 49420816, 42846126, 33991469, 25458413, 20225871, 16355637, 11621152, 7205262, 5394251, 5328488, 6331182, 6266211, 5559366, 4944371, 3848246, 3581654, 3366324, 2911136, 2666255, 2476147, 1493521, 258503, -111093, 327532, 256318, -1749722, -2009215, -575297, -152617, 593645, 1949022, 2931183, 3390547]
2309C390547k45283p37636j684438P8159o2534q51730j09903K5853j177809l20245
2299a695019J342350M77351Q6682m04974j111808p98267P93394K172961J382263
2290B244933o90881j027516j600381j197720K08900J11547J222537K744216J169035
2281C184670K5875k31558q4793l89092j51963q06339j100154N06589J176450n81273
2271A548412m47235K311031K36815j917553o82546L91440j087946j060166M22951
2262b84797o01178K41022J44130k792906l864221j315028J589566L594604K723435
2253e65373l42028m28074K013241K219995O29204j243263k684382l530J068561
2244F64351K17607J99143r95668j547983j044670j006989q6144R67150J500191
$$ y = [3390547, 3145264, 2407628, 723190, 801349, 738815, -112915, -222818, -196965, -1374774, -1695019, -352669, 124682, 211364, -193610, -1305418, -2103685, -1310291, 862670, 2244933, 1554052, 526536, -1073845, -2271565, -2062665, -1951118, -728581, 2015635, 3184670, 3210545, 2978987, 2894194, 2505102, 2353139, 1546800, 446646, 953235, 2129685, 1548412, 1101177, 3412208, 3649023, 1731470, 1048924, 1440364, 352418, -707748, -284797, -885975, -644953, -500823, -3293729, -7157950, -8472978, -6883412, -3288808, -565373, -907401, -1335475, 677766, 2897761, 3526965, 2283702, -400680, -404210, 664351, 881958, 1081101, 85433, -1462550, -2507220, -3514209, -3600353, -2633203, -1133012]
2235a133012K179133J146203m11596o79369r10976j532986k445968j833165J051044
2226d570692K426183J323176O2902r4109J61751J038384J253884J59422p47083
2217A013818M1921j9722k38971l04768O40376J284711K28804j239125j950286
2208e43242m41053k59501J148846J506648P71550j096297j641890O70910Q86787
2199A002758L14255n61374M16593L12017j920055k575913j128242M23770K303445
2190a412746J584087N18797j402383k316149o77535K09563j95916N31004M49215
2181b712063k051872p80410R13405J844573K848367J118970K70367j51029o58593
2172F41715o90189Q06411J975946K14406n70913p50343j479421r34537j95584
$$ y = [-1133012, 1046121, 2192324, 1780728, 1101359, 190383, -1342603, -3788571, -5621736, -4570692, -2144509, -821333, -758431, -852540, -690789, 347595, 1601479, 1760901, 1013818, 1055739, 1036017, 797046, 492278, 1132654, 2417365, 2646169, 1407044, -543242, -984295, -1243796, -94950, 1411698, 2183248, 1086951, -554939, 115971, 1002758, 1317013, 755639, 1172232, 1484249, -435806, -3011719, -4139961, -3716191, -1412746, 171341, 690138, -712245, -3028394, -3705929, -3496366, -3692282, -3161278, -2712063, -4763935, -5544345, -4630940, -2786367, 62000, 1180970, 1451337, 1300308, 641715, -48474, 757937, 2733883, 2948289, 2377376, 1627033, 147612, -786925, -982509]
2163i82509o02992j683219L45546J254034M5529J324050J695905K41082P59483
2154B396909J400001k57380j065740p04933o71633l71100l98420K08426J537794
2145B073924P42559l59008n7050Q03444P6944j649402q47232j98275P67715J321922
2135B675541q03110j302524n54012M63396P33025L80539M23139R79589m53492
2126B542091p73135j596329j271248P07396K689548J459729n42718j826660j569574
2117a80900l28923k80137j07177j075016k23110M21311J422140r03372k197041
2108c452225n73621l2793R28843K53996L39596J150995l55477j000347o00959
2099c341992q708J097051J038995M63973p14784j23881N27885o68166J263516
$$ y = [-982509, -1585501, -3268720, -2923174, -1669140, -1623611, -299561, 1396344, 1637426, 2396909, 3796910, 3539530, 2473790, 1768857, 1097224, 726124, 327704, 536130, 2073924, 2816483, 2457475, 2400425, 3203869, 3280813, 1631411, 784179, 585904, 1353619, 2675541, 1872431, 569907, 15895, 479291, 1212316, 1592855, 2015994, 2995583, 2542091, 1768956, 172627, -1098621, -391225, 2298323, 3758052, 3215334, 1388674, -180900, -509823, -789960, -897137, -1972153, -2195263, -1773952, -351812, -1255184, -3452225, -4025846, -4058639, -3129796, -2875800, -2536204, -1385209, -1740686, -2741033, -3341992, -3350700, -2253649, -1214654, -750681, -1465465, -1589346, -1061461, -1729627, -466111]
2090d66111J670614r94896j595926o98206K01190K74115K149272J947107O80672
2081C167831p91603o59646o41230k29922J44153J208792J354299k83735n19570
2072B749369k128090k736028j032724L41565M36178R29258J678445J95905m21951
2063A1927j852731j805345k20844l83646l64589L0089J823227J919003J474335
2054F31426L33480J75704j598711j025870L66762J222380J887402J132710o52329
2045B472954j097296P16114j041994k116936K08429K052404L21831p71605P86875
2036A530776R17011l1380n8521o54302j751008j379258j097401r65607p47075
2027d236765P48033J047970J411658J585751O7296j31189k3961j18864p77006
$$ y = [-466111, 1204503, 209607, -1386319, -2084525, -1883335, -1609220, 540052, 2487159, 3167831, 2376228, 1716582, 1075352, 845430, 989583, 2198375, 3552674, 3268939, 2749369, 621279, -2114749, -3147473, -2805908, -2369730, -1440472, 237973, 433878, 11927, -1840804, -3646149, -3866993, -4250639, -4615228, -4585139, -2761912, -842909, 631426, 964906, 1140610, -458101, -1483971, -1117209, 105171, 1992573, 3125283, 2472954, 1375658, 2091772, 1049778, -1067158, -858729, 1193675, 1515506, 743901, 1530776, 2447787, 2416407, 2357886, 1703584, -47424, -1426682, -2524083, -3489690, -4236765, -3488732, -2440762, -1029104, 556647, 623943, 492754, 468793, 349929, -427077]
2018d27077N07217J044611P1916n17893n58301k64848K18400N61556K56522l4894
2008H57209o73685l64437J006378L72324J341210J327571j3947P07396m84973
1999D075046r90980k384466k166066r44978j316415j053769k18919Q81326J635338
1990b483883R55802q14907j415030L23790R41425K04448J85491P06916j38158
1981a534106k114794K98646M057014K495366r27863j968496j901502N6460J890690
1972C51415J116598L57770k08263k63819K73068m55644p21024k167296k309024
1963d026219j0959K098906K940012J216983j199243o56896n67684l28256m87776
1954a021132j379114j525454l42298K483769K415541J68574j384787R6741J106075
$$ y = [-427077, 80140, 1124751, 1196667, 678774, 120473, -144375, 74025, 635581, 892103, 857209, 183524, -180913, 825465, 1197789, 2538999, 3866570, 3852623, 4560019, 4075046, 3084066, 699600, -1466466, -2411444, -3727859, -4781628, -5000547, -4119221, -2483883, -1528081, -2342988, -3758018, -3434228, -2492803, -2288355, -2102864, -1395948, -1534106, -3648900, -3350254, 706760, 3202126, 2274263, 305767, -1595735, -1539275, 351415, 1468013, 1825783, 1617520, 1353701, 1626769, 1171125, 450101, -1717195, -4026219, -4037178, -1938272, 1001740, 2218723, 1019480, 362584, -205100, -533356, -1021132, -2400246, -3925700, -4267998, -1784229, 631312, 799886, -584901, -488160, 617915]
1945F17915L24490j275811k659462k152818N38110J832086J108805L78292P30064
1936e58329N35507L66661R16627o44890j69795J870418N93880j462Q10839K14925
1926C934381j199483k287381k190048P2427N16275O64915L27299j598503k071310
1917c831428N47731J676673q5411j46691L42711Q57128J784195J195569n09233
1908A831244r93780j95024L76090n37108j319368j199505m88982r35083q19540
1899d281056J83926k06522J09762J496385J130054J67531m45242L58660R09626
1890e76876J036492m51512j896561m04142Q10516J275157K94783l18500J678549
1881A447906J957345Q05782L69348j338602l716536l089895p68448L89682P36697
$$ y = [617915, 942405, -333406, -2992868, -5145686, -4607576, -2775490, -1666685, -1288393, -558329, -22822, 343839, 1260466, 615576, 445781, 2316199, 2910079, 2908617, 3719456, 3934381, 2734898, 447517, -1742531, -1670104, -1153829, -488914, -161615, -1760118, -3831428, -3283697, -1607024, -1692435, -1839126, -1496415, -639287, 1144908, 2340477, 1831244, 837464, 642440, 1018530, 481422, -837946, -2037451, -2526433, -3461516, -4281056, -4097130, -4303652, -4193890, -2697505, -1567451, -1399920, -1845162, -1486502, -576876, 459616, 8104, -1888457, -2292599, -1482083, -206926, 87857, -230643, 1447906, 3405251, 4211033, 4580381, 3241779, -474757, -3564652, -4333100, -3943418, -3206721]
1872c206721O20559q3203M16313q2413k15097O20297K17421O78503L42226J82573
1862e09542L0733j86469m73836L55389J063124Q18129L3469k8241m02881n03599
1852A96276j129350k320569l52604P17248M1081m68297K57552J552692K064464
1843E58493K432305K54718J135271K02340j669073j662729k242579k55851J241761
1834e344J160742O26232r42458n23032O8781n38523L55471P54362m17890j71998
1824C66343M42199J070100q4851j32086M99425j596821j821423n25793N71093
1815a211814j508364j426159J010522J770384K224367R71420j12962k75299l85367
1806A056728r80230L997P59074L55000j112230j331544R87596L5570j172870J571737
$$ y = [-3206721, -2586162, -2669365, -2253052, -2335465, -2550562, -1930265, -1712844, -1034341, -692115, -509542, -478809, -665278, -1139114, -783725, 279399, 1097528, 1130997, 1102756, 699875, 196276, -933074, -3253643, -3606247, -2888999, -2847918, -3316215, -3058663, -1505971, 558493, 2990798, 3245516, 4380787, 4583127, 2914054, 1251325, -991254, -1247105, -5344, 1155398, 1781630, 839172, 316140, 384921, -153602, 201869, 956231, 538341, 366343, 808542, 1878642, 1793791, 1661705, 2161130, 564309, -1257114, -1782907, -1211814, -2720178, -4146337, -3135815, -1365431, 858936, 1830356, 1717394, 1442095, 1056728, 76498, 80495, 839569, 1194569, 82339, -1249205, -261609, -226039, -1398909, 172828]
1796A72828K685388L45542j241223k180694j056890J908867J094478j166066Q26262
1787A388492J240220J524350J180301j291279k267410j447527K50657J283276
1779A861080O92997p99919j375246q42111j033517p16348J131255J291869k51634
1770d1574M46157J318112R36692l17555j88580r9029j325509j915108j029713
1761b216107p01618r4230P37774K537177J636756q04094Q823J279832J018300
1752C402613Q24859j354153j971734J97138R98558J079869Q99839L33602r53409
1743C457182m08662n90698m49740o25071k111186m80610J40695k74272P34335
1734f08027J572854N62726N23535j577050r02712L25831p16477J49024J26681
$$ y = [172828, 2858216, 3203758, 1962535, -218159, -1275049, 633818, 1728296, 562230, 1388492, 2628712, 4153062, 5333363, 4042084, 1774674, 327147, 577804, 1861080, 2554077, 1754158, 378912, -463199, -1496716, -2213064, -1081809, 210060, -41574, 404583, 1722695, 2659387, 2341832, 2153252, 2054223, 728714, -1186394, -2216107, -2917725, -3011955, -2274181, 262996, 1899752, 1095658, 1104481, 2384313, 3402613, 4227472, 2873319, 901585, 1098723, 2097281, 3177150, 4076989, 4410591, 3457182, 3048520, 2457822, 2008082, 1383011, -728175, -1208785, -1068090, -1342362, -608027, 964827, 1527553, 2051088, 474038, -428674, -102843, -819320, -670296, -543615]
1725e43615p37676j530519j733121l68138J861557J666024M57986J1699J42337
1716g73466M94022J054345Q83609j316428j143283l40733j045865L22707L229676
1707A364584J650715O10641L52386j494012q23917o63876j98018l62437r53887
1698e17821k58409P89154M57117J936242J535346j270340j489030R4864J56355
1689A433478j121268m32058Q57231J165902P02851L03230j215363j200847M8863
1680E42019J537629J702805K63057k058670k441076N85394K452349J612242o73426
1671C522323J44305p02607m01328k19831p0517N73920p11981m00831p35760j92786
1661H04907K19477k235394k239622L85728K199047N96522m00811n03707k05655
$$ y = [-543615, -1281291, -2811810, -4544931, -4913069, -3051512, -1385488, -927502, -915803, -773466, -279444, 774901, 1658510, 342082, -801201, -1141934, -2187799, -1865092, 1364584, 3015299, 3625940, 3978326, 2484314, 1660397, 996521, 798503, 436066, -517821, -776230, 12924, 470041, 2406283, 3941629, 2671289, 1182259, 1277123, 1433478, 312210, -119848, 737383, 1903285, 2606136, 2909366, 1694003, 493156, 542019, 2079648, 3782453, 4045510, 1986840, -454236, 131158, 2583507, 4195749, 3522323, 3666628, 2964021, 2562693, 2342862, 2272345, 2846265, 2134284, 1733453, 997693, 804907, 1024384, -1211010, -3450632, -3064904, -865857, -269335, -670146, -1173853, -1379508]
1652a379508J020645k58691j542880r57951k20374J354768K043022O02004l42550
1643C18485n14859L79946J447272L54634j996884j517615m3831l57919O52994
1634a277777j75541l08816N78166M0641m19603n82249P46433J842538J283292
1625A727084M08036p79697j151139o51179n43709n74071q12567l37777O18388
1616b096631P94526N24446o01859n9154J690609L29584L5547J67828j068833n39494
1606h23431p65290q97259J216586J517443P08406Q91528P46510j008298p04130
1597H82065M4821j573426j194547N78486K079668R07259K3263j182944m21280
1588A43365M06513O83427R22710j449298j435073J256419J282592L04439O6532
$$ y = [-1379508, -358863, -617554, -2160434, -3118385, -3338759, -1983991, 59031, 661035, 318485, -196374, 183572, 1630844, 1985478, -11406, -1529021, -1572852, -1930771, -1277777, -1453318, -1762134, -1183968, -1143327, -1562930, -2145179, -1398746, 443792, 1727084, 2135120, 1355423, 204284, -446895, -990604, -1564675, -2377242, -2715019, -2096631, -1302105, -777659, -1379518, -1438672, 251937, 581521, 617068, 784896, -283937, -823431, -1588721, -2485980, -1269394, 248049, 956455, 1847983, 2594493, 1586195, 882065, 926886, -646540, -1841087, -1262601, 817067, 1724326, 1747589, 564645, 143365, 549878, 1233305, 2156015, 706717, -728356, 528063, 1810655, 2115094, 2181626]
1579B181626J468256R74843L84710J486256K96641j385628m09804J599643m83223
1570F113320j998846j037962j119031p75284o0604k50390N6954K6110m82627k055592
1560a583952m90277J024976K206559P86255N35292O7237j435202N48494J428813
1551C088195j62148j285910L17094J560304J633893R2759p27168l081303l349194
1542a913478r44691m62715K57966R45134O84571Q53615r73117l338429k240452
1533g131596P55687J101697O29390m63922p95754L16482J450471K400464K76083
1524a460998q50531m43370R17551J668745Q62964r62855j957054K99245J027661
1515h98642q02827m92643J144020J452755N25698N36371J70185j894064j611216
$$ y = [2181626, 3649882, 4624725, 5009435, 6495691, 6792332, 5406704, 4996900, 6596543, 6113320, 4114474, 3076512, 1957481, 1182197, 1121593, 871203, 928157, 954267, 471640, -1583952, -2074229, -1049253, 1157306, 1943561, 2478853, 2546090, 1110888, 1659382, 3088195, 2926047, 1640137, 1957231, 3517535, 5151428, 5244187, 4517019, 1435716, -1913478, -2858169, -3320884, -3062918, -2117784, -1433213, -579598, -1552715, -4891144, -7131596, -6375909, -5274212, -4644822, -5108744, -5904498, -5588016, -4137545, -1737081, -1460998, -2311529, -2754899, -1837348, -168603, 694361, -268494, -2225548, -1926303, -898642, -1701469, -2194112, -1050092, 402663, 928361, 1464732, 1634917, -259147, -1870363]
$$ [...]
##END NTUPLES=NMR SPECTRUM
##END=
