##TITLE=C13_IBBC-2H
 CDCl3, 1200 sc

 7.3.2024
##JCAMPDX= 6.0         $$ Bruker NMR JCAMP-DX V2.0
##DATA TYPE= NMR SPECTRUM
##DATA CLASS= NTUPLES
##ORIGIN= UXNMR, Bruker Analytische Messtechnik GmbH
##OWNER= root
$$ XWIN-NMR		Version 3.5
$$ Thu Mar  7 15:27:07 2024 Russian Standard Time (UT+4h)  she@DPX200
##.OBSERVE FREQUENCY= 50.327896
##.OBSERVE NUCLEUS= ^13C
##.ACQUISITION MODE= SIMULTANEOUS
##.ACQUISITION SCHEME= undefined
##.AVERAGES= 1201
##.DIGITISER RES= 17
##SPECTROMETER/DATA SYSTEM= spect
##.PULSE SEQUENCE= zgpg30
##.SOLVENT NAME= CDCl3
##.SHIFT REFERENCE= (INTERNAL, CDCl3, 0, 222.646)
##AUDIT TRAIL= $$ (NUMBER, WHEN, WHO, WHERE, WHAT)
$$ ##TITLE= Audit trail, XWIN-NMR		Version 3.5
$$ ##JCAMPDX= 5.01
$$ ##ORIGIN= Bruker BioSpin GmbH
$$ ##OWNER= she
$$ F:/spectra/data/she/nmr/c13/1/pdata/1/auditp.txt
$$ ##AUDIT TRAIL=  $$ (NUMBER, WHEN, WHO, WHERE, WHAT)
(   1,<2024-03-07 15:26:26.90 +0400>,<she>,<DPX200>,
      <created by zg, POWCHK disabled, PULCHK disabled
       terminated by command 'halt'
       configuration hash MD5:
       00 E9 B6 7A A2 85 ED C7 34 08 36 98 17 FE 4E 26
       data hash MD5: 32K
       CA 18 5E CE 14 88 2D E3 59 AB BD A7 68 21 37 FA>)
(   2,<2024-03-07 15:26:29.09 +0400>,<she>,<DPX200>,
      <Start of raw data processing
       efp BC_mod = 2 LB = 2 FT_mod = 6 PKNL = 1 PHC0 = -373.3315 PHC1 = 16.9201 SI = 32K 
       data hash MD5: 32K
       12 4B AD E9 80 8A B7 1E 49 D5 4F 36 1F 4E 25 FA>)
(   3,<2024-03-07 15:26:32.00 +0400>,<she>,<DPX200>,
      <abs ABSG = 5 
       data hash MD5: 32K
       80 04 B4 BC CF 63 A7 05 A9 E0 3A 77 89 F5 DF 97>)
$$ ##END=
$$ 
$$ hash MD5
$$ AE DF F2 09 21 FF 02 06 99 B1 6C C8 26 D7 1B 87
##$RELAX= 
##$RELAX= 
##$RELAX= 
##$RELAX= 
##$RELAX= 
##$RELAX= 
##$RELAX= 
##$RELAX= 
$$ Bruker specific parameters
$$ --------------------------
##$DU= <F:/spectra>
##$EXPNO= 1
##$NAME= <c13>
##$PROCNO= 1
##$TYPE= <nmr>
##$USER= <she>
##$AMP= (0..31)
100 100 100 100 100 100 100 100 100 100 100 100 100 100 100 100 100 100 
100 100 100 100 100 100 100 100 100 100 100 100 100 100 
##$AQSEQ= 0
##$AQ_mod= 1
##$AUNM= <au_zg>
##$AUTOPOS= <>
##$BF1= 50.322709
##$BF2= 200.13
##$BF3= 50.322709
##$BF4= 500.13
##$BF5= 500.13
##$BF6= 500.13
##$BF7= 500.13
##$BF8= 500.13
##$BYTORDA= 1
##$CFDGTYP= 0
##$CFRGTYP= 5
##$CHEMSTR= <none>
##$CNST= (0..31)
1 1 145 1 1 1 1 1 1 1 1 1 1 1 1 1 1 1 1 1 1 1 1 1 1 1 1 1 1 1 1 1 
##$CPDPRG= <waltz16>
##$CPDPRG1= <>
##$CPDPRG2= <waltz16>
##$CPDPRG3= <>
##$CPDPRG4= <mlev>
##$CPDPRG5= <mlev>
##$CPDPRG6= <mlev>
##$CPDPRG7= <mlev>
##$CPDPRG8= <mlev>
##$CPDPRGB= <>
##$CPDPRGT= <>
##$D= (0..31)
0 2 0.00345 0 0 0 0 0 0 0 0 0.03 2e-05 3e-06 0 0 0 0 0 0 0 0 0 0 0 0 0 
0 0 0 0 0 
##$DATE= 1709806751
##$DBL= (0..7)
120 120 120 120 120 120 120 120 
##$DBP= (0..7)
150 150 150 150 150 150 150 150 
##$DBP07= 0
##$DBPNAM0= <>
##$DBPNAM1= <>
##$DBPNAM2= <>
##$DBPNAM3= <>
##$DBPNAM4= <>
##$DBPNAM5= <>
##$DBPNAM6= <>
##$DBPNAM7= <>
##$DBPOAL= (0..7)
0.5 0.5 0.5 0.5 0.5 0.5 0.5 0.5 
$$ [...]
##$SUBNAM4= <"">
##$SUBNAM5= <"">
##$SUBNAM6= <"">
##$SUBNAM7= <"">
##$SUBNAM8= <"">
##$SUBNAM9= <"">
##$SW= 239.972175391363
##$SWIBOX= (0..15)
0 1 3 0 0 0 0 0 0 0 0 0 0 0 0 0 
##$SW_h= 12077.2946859903
##$TD= 32768
##$TD0= 1
##$TE= 0
##$TE2= 300
##$TE3= 300
##$TEG= 300
##$TL= (0..7)
120 120 120 120 120 120 120 120 
##$TP= (0..7)
150 150 150 150 150 150 150 150 
##$TP07= 0
##$TPNAME0= <>
##$TPNAME1= <>
##$TPNAME2= <>
##$TPNAME3= <>
##$TPNAME4= <>
##$TPNAME5= <>
##$TPNAME6= <>
##$TPNAME7= <>
##$TPOAL= (0..7)
0.5 0.5 0.5 0.5 0.5 0.5 0.5 0.5 
##$TPOFFS= (0..7)
0 0 0 0 0 0 0 0 
##$TUNHIN= 0
##$TUNHOUT= 0
##$TUNXOUT= 0
##$USERA1= <user>
##$USERA2= <user>
##$USERA3= <user>
##$USERA4= <user>
##$USERA5= <user>
##$V9= 5
##$VALIST= <valist>
##$VCLIST= <CCCCCCCCCCCCCCC>
##$VD= 0
##$VDLIST= <DDDDDDDDDDDDDDD>
##$VPLIST= <PPPPPPPPPPPPPPP>
##$VTLIST= <TTTTTTTTTTTTTTT>
##$WBST= 1024
##$WBSW= 4
##$XGAIN= (0..3)
0 0 0 0 
##$XL= 0
##$YL= 0
##$YMAX_a= 6314582
##$YMIN_a= -6612321
##$ZGOPTNS= <>
##$ZL1= 120
##$ZL2= 120
##$ZL3= 120
##$ZL4= 120
##$ABSF1= 222.646
##$ABSF2= -17.35081
##$ABSG= 5
##$ABSL= 3
##$ALPHA= 0
##$AQORDER= 0
##$ASSFAC= 0
##$ASSFACI= 0
##$ASSFACX= 0
##$ASSWID= 0
##$AUNMP= <proc_1d>
##$AZFE= 0.1
##$AZFW= 0.5
##$BCFW= 0
##$BC_mod= 2
##$BYTORDP= 0
##$COROFFS= 0
##$CY= -3
##$DATMOD= 1
##$DC= 0
##$DFILT= <>
##$DTYPP= 0
##$F1P= 0
##$F2P= 0
##$FCOR= 0.5
##$FTSIZE= 32768
##$FT_mod= 6
##$GAMMA= 0
##$GB= 0
##$INTBC= 1
##$INTSCL= 4.134877e-10
##$ISEN= 128
##$LB= 2
##$LEV0= 0
##$LPBIN= 0
##$MAXI= 10000
##$MC2= 0
##$MEAN= 0
##$ME_mod= 0
##$MI= 0.1934396
##$NCOEF= 0
##$NC_proc= -2
##$NLEV= 6
##$NOISF1= 120.0001
##$NOISF2= 80.00006
##$NSP= 0
##$NTH_PI= 0
##$NZP= 0
##$OFFSET= 222.646
##$PC= 1.4
##$PHC0= -373.3315
##$PHC1= 16.9201
##$PH_mod= 1
##$PKNL= yes
##$PPARMOD= 0
##$PSCAL= 0
##$PSIGN= 0
##$REVERSE= no
##$SF= 50.3227304925793
##$SI= 32768
##$SIGF1= 140
##$SIGF2= 120
##$SINO= 11.81781
##$SIOLD= 32768
##$SREGLST= <13C.CDCl3>
##$SSB= 0
##$STSI= 32768
##$STSR= 0
##$SW_p= 12077.2946859903
##$SYMM= 0
##$S_DEV= 0
##$TDeff= 32768
##$TDoff= 0
##$TI= <>
##$TILT= no
##$TM1= 0
##$TM2= 0
##$TOPLEV= 0
##$USERP1= <user>
##$USERP2= <user>
##$USERP3= <user>
##$USERP4= <user>
##$USERP5= <user>
##$WDW= 1
##$XDIM= 32768
##$YMAX_p= 373408807
##$YMIN_p= -6721093
$$ End of Bruker specific parameters
$$ ---------------------------------
##NTUPLES= NMR SPECTRUM
##VAR_NAME=  FREQUENCY,     SPECTRUM/REAL,   SPECTRUM/IMAG
##SYMBOL=    X,             R,               I
##VAR_TYPE=  INDEPENDENT,   DEPENDENT,       DEPENDENT
##VAR_FORM=  AFFN,          ASDF,            ASDF
##VAR_DIM=   32768,         32768,           32768
##UNITS=     HZ,            ARBITRARY UNITS, ARBITRARY UNITS
##FACTOR=    0.368581032318806, 1,           1
##FIRST=     11204.1544566776, 0,            0
##LAST=      -873.140229312654, 0,           0
##MIN=       -873.140229312654, -6721093,    0
##MAX=       11204.1544566776, 373408807,    0
$$ Real data points
##PAGE= N=1
##DATA TABLE= (X++(R..R)), XYDATA
$$ [...]
$$ plain form
9106 -1092377 -1078737 -1061016 -790360 -91622 616210 960702 1206402 1611973 2055151 2108681
9096 2108681 1579542 799307 246075 93210 143735 35751 -395524 -914853 -1134691 -870536
9086 -870536 -343451 127043 458503 789424 1248828 1702649 1994253 2145756 2081638 1855209
9076 1855209 1739726 1697179 1389981 758798 117655 -389967 -761354 -746392 -220580 523292
9066 523292 1194072 1771471 2337868 2702945 2619438 2183727 1629625 1047108 645197 698034
9056 698034 1104072 1668710 2124682 2029882 1355489 740741 662031 900708 1002410 881204
9046 881204 754010 764645 794306 649055 369073 53026 -443239 -1284170 -2056467 -2234149
9036 -2234149 -1897406 -1534384 -1265683 -887966 -558500 -512004 -762857 -1191529 -1519750 -1580456
$$ packed form
9106a092377J3640J7721K70656O98738P07832L44492K45700M05571M43178N3530
9096B108681n29139p80235n53232j52865N0525j07984m31275n19329k19838K64155
9086h70536N27085M70494L31460L30921M59404M53821K91604J51503o4118k26429
9076A855209j15483m2547l07198o31183o41143n07622l71387J4962N25812P43872
9066E23292O70780N77399N66397L65077q3507m35711n54102n82517m01911N2837
9056F98034M06038N64638M55972r4800o74393o14748p8710K38677J01702j21206
9046H81204j27194J0635K9661j45251k79982l16047m96265q40931p72297j77682
9036b234149L36743L63022K68701L77717L29466M6496k50853m28672l28221o0706
$$ plain form
9026 -1580456 -1337564 -908133 -567898 -366577 -426470 -943791 -1674299 -2193721 -2270407 -1919837
9016 -1919837 -1310465 -768346 -550082 -639788 -705919 -539892 -274325 111026 553538 922953
9006 922953 1235496 1378195 1339716 1260839 1150556 987953 1001231 1259303 1465187 1387759
8996 1387759 1110989 664889 -120058 -1198392 -2276759 -3122167 -3496230 -3208548 -2548585
8987 -2548585 -1861278 -1168388 -559726 -165930 66550 177856 128021 13624 -116511 -441138
8977 -441138 -812664 -1035558 -1230168 -1493237 -1790111 -2104402 -2324504 -2531940 -2899839 -3450307
8967 -3450307 -4007177 -4368431 -4435902 -4252772 -4027910 -3857530 -3656657 -3357847 -3298108 -3790841
8957 -3790841 -4502511 -4899498 -4895495 -4563353 -4027151 -3561835 -3435245 -3722061 -4127377 -4364765
$$ packed form
9026a580456K42892M29431L40235K01321n9893n17321p30508n19422p6686L50570
9016a919837O09372N42119K18264q9706o6131J66027K65567L85351M42512L69415
9006I22953L12543J42699l8479p8877j10283j62603J3278K58072K05884p7428
8996A387759k76770m46100p84947j078334j078367q45408l74063K87682O59963
8987b548585O87307O92890O08662L93796K32480J11306m9835j14397j30135l24627
8977d41138l71526k22894j94610k63069k96874l14291k20102k07436l67899n50468
8967c450307n56870l61254o7471J83130K24862J70380K00873K98810N9739m92733
8957c790841p11670l96987M003L32142N36202M65316J26590k86816m05316k37388
$$ plain form
8947 -4364765 -4389493 -4301969 -4197649 -4120593 -4006811 -3763725 -3503192 -3388664 -3368334 -3093599
8937 -3093599 -2348346 -1476012 -994188 -877457 -792214 -657799 -695394 -1140927 -1792405 -2206494
8927 -2206494 -2208360 -2148669 -2423162 -2950119 -3252720 -3028351 -2331570 -1663331 -1454915 -1566864
8917 -1566864 -1743977 -1716575 -1562608 -1588128 -1797895 -2064303 -2262610 -2220074 -2041418 -2062884
8907 -2062884 -2496636 -3019926 -3100414 -2683432 -2039934 -1501326 -1237986 -1022495 -816970 -937489
8897 -937489 -1260605 -1381723 -1171485 -901527 -723430 -667539 -940058 -1507464 -2009148 -2183016
8887 -2183016 -2062743 -1853295 -1527042 -952820 -383976 -117270 34666 362734 635171 441927
8877 441927 -127882 -615431 -693381 -447509 -103914 243232 483527 552278 568078 620320
$$ packed form
8947d364765k4728Q7524J04320P7056J13782K43086K60533J14528K0330K74735
8937c093599P45253Q72334M81824J16731Q5243J34415l7595m45533o51478m14089
8927b206494j866N9691k74493n26957l02601K24369O96781O68239K08416j11949
8917a566864j77113K7402J53967k5520k09767k66408j98307M2536J78656k1466
8907b062884m33752n23290q0488M16982O43498N38608K63340K15491K05525j20519
8897i37489l23116j21118K10238K69958J78097N5891k72519n67406n01684j73868
8887b183016J20273K09448L26253N74222N68844K66706J51936L28068K72437j93244
8877D41927n69809m87549p7950K45872L43595L47146K40295O8751J5800N2242
$$ plain form
8867 620320 563751 307049 69844 -149258 -518141 -882043 -1025450 -1061085 -1210000 -1498705
8857 -1498705 -1915022 -2425457 -2755477 -2505607 -1712003 -852943 -382740 -410625 -753202 -1115208
8847 -1115208 -1431812 -1881470 -2359356 -2433467 -1901176 -860923 463778 1647545 2209185
8838 2209185 2223724 2111040 2040667 1820125 1256231 640984 321755 255078 296606 284540
8828 284540 210506 272922 366471 233519 -81219 -421272 -668273 -638627 -181778 626409
8818 626409 1472513 2047965 2137258 1840690 1463718 1133206 822175 514356 204396 -119850
8808 -119850 -450573 -668445 -695014 -576218 -503325 -563870 -680619 -803807 -804799 -823453 -1053219
8797 -1053219 -1414761 -1694003 -1723035 -1590014 -1399595 -1233658 -1187230 -1373652 -1806070 -2070446
$$ packed form
8867F20320n6569k56702k37205k19102l68883l63902j43407l5635j48915k88705
8857a498705m16317n10435l30020K49870P93604Q59060M70203k7885l42577l62006
8847a115208l16604m49658m77886p4111N32291J040253J324701J183767N61640
8838B209185J4539j12684p0373k20542n63894o15247l19229o6677M1528j2066
8828B84540p4034O2416R3549j32952l14738l40053k47001K9646M56849Q08187
8818F26409Q46104N75452Q9293k96568l76972l30512l11031l07819l09960l24246
8808a19850l30723k17872k6569J18796P2893o0545j16749j23188r92j8654k29766
8797a053219l61542k79242k9032J33021J90419J65937M6428j86422m32418k64376
$$ plain form
8787 -2070446 -1934476 -1575083 -1383526 -1480389 -1566757 -1465094 -1204898 -974490 -938578 -867688
8777 -867688 -391610 570447 1730059 2741757 3364735 3481440 3249842 2856954 2417213
8768 2417213 2076676 1898806 1878551 2030257 2356039 2855088 3358353 3548653 3351555 2929854
8758 2929854 2377339 1627010 606047 -327523 -732576 -731455 -602080 -550349 -639988 -683043
8748 -683043 -476842 -122362 146325 245810 124090 -85815 -235790 -374398 -558267 -753440
8738 -753440 -987540 -1285963 -1501203 -1530889 -1468209 -1619633 -2105845 -2692129 -3043256 -2967408
8728 -2967408 -2576056 -2099020 -1719721 -1598168 -1573894 -1310079 -797859 -270874 190753 677562
8718 677562 965528 789760 225369 -404628 -736991 -674737 -422449 -237466 -201940 -283504
$$ packed form
8787b070446J35970L59393J91557r6863q6368J01663K60196K30408L5912P0890
8777h67688M76078R62057J159612J011698O22978J16705k31598l92888m39741
8768B417213l40537j77870k0255J51706L25782M99049N03265J90300j97098m21701
8758B929854n52515p50329j020963r33570m05053J121J29375N1731q9639m3055
8748f83043K06201L54480K68687R9485j21720k09905j49975j38608j83869j95173
8738g53440k34100k98423k15240k9686O2680j51424m86212n86284l51127P5848
8728b967408L91352M77036L79299J21553K4274K63815N12220N26985M61627M86809
8718F77562K87966j75768n64391o29997l32363O2254K52288J84983L5526q1564
$$ plain form
8708 -283504 -439328 -697907 -845824 -792061 -710597 -655220 -664720 -662626 -555782 -391650 -377764
8697 -377764 -729588 -1277390 -1638278 -1758374 -1940609 -2324872 -2664576 -2635195 -2160268 -1406761
8687 -1406761 -555618 156125 426844 372033 261889 -59201 -663025 -1230901 -1458272 -1329203
8677 -1329203 -1059310 -1052626 -1394111 -1681370 -1646086 -1372974 -1194233 -1246558 -1117985 -648278
8667 -648278 -274286 -273275 -495111 -776105 -1002425 -1071040 -898581 -483463 -32227 221564
8657 221564 151591 -180092 -555564 -661075 -375535 58215 275267 154766 -123431 -228121
8647 -228121 -82971 17149 -52172 -190190 -363549 -576690 -651719 -563090 -651185 -1012710
8637 -1012710 -1387876 -1572724 -1352063 -775150 -392244 -284202 -59747 274370 528424 800296
$$ packed form
8708b83504j55824k58579j47917N3763Q1464N5377r500K094J06844J64132J3886
8697c77764l51824n47802l60888j20096j82235l84263l39704K9381M74927P53507
8687a406761Q51143P11743K70719n4811j10144l21090o03824n67876k27371J29069
8677a329203K69893O684l41485k87259L5284K73112J78741n2325J28573M69707
8667f48278L73992J011k21836k80994k26320o8615J72459M15118M51236K53791
8657B21564o9973l31683l75472j05511K85540M33750K17052j20501k78197j04690
8647b28121J45150J00120o9321j38018j73359k13141p5029Q8629q8095l61525
8637a012710l75166j84848K20661N76913L82906J08042K24455L34117K54054K71872
$$ plain form
8627 800296 1261477 1799026 2177586 2157544 1645089 965130 513605 430662 609629 907519
8617 907519 1208782 1406192 1370252 976028 395648 -53168 -242683 -353425 -470749 -402116
8607 -402116 -112696 185114 248440 -10904 -332192 -522489 -547957 -459629 -239457 61930
8597 61930 272934 255207 124194 100401 286761 654548 1057924 1268199 1146612 883878
8587 883878 610077 294053 98133 126603 185322 252834 418551 580050 598160 360273
8577 360273 -86716 -602375 -1014282 -1386360 -1817884 -2161904 -2266789 -2110341 -1882761 -1748014
8567 -1748014 -1648858 -1407642 -827062 4852 740047 1159330 1374475 1458203 1261422 934163
8557 934163 722693 587829 569135 708991 936559 1170152 1242069 1225031 1537044 2228799
$$ packed form
8627H00296M61181N37549L78560k0042n12455o79959m51525q2943J78967K97890
8617I07519L01263J97410l5940l94224n80380m48816j89515j10742j17324O8633
8607d02116K89420K97810O3326k59344l21288j90297k5468Q8328K20172L01387
8597F1930K11004j7727j31013k3793J86360L67787M03376K10275j21587k62734
8587H83878k73801l16024j95920K8470N8719O7512J65717J61499J8110k37887
8577C60273m46989n15659m11907l72078m31524l44020j04885J56448K27580J34747
8567a748014R9156K41216N80580Q31914P35195M19283K15145Q3728j96781l27259
8557I34163k11470j34864j8694J39856K27568K33593P1917j7038L12013O91755
$$ plain form
8547 2228799 2935794 3472519 3733425 3585566 3203150 2961895 2826481 2492950 2081576 1955413
8537 1955413 2081002 2231863 2291161 2193628 1942789 1737814 1725836 1741020 1655223 1423161
8527 1423161 1129704 1082742 1413164 2033689 2637170 3019768 3129915 2890869 2335777 1660123
8517 1660123 1095865 788855 596114 334066 -107678 -549665 -722375 -682989 -546870 -254954
8507 -254954 251618 776333 1071710 1266683 1626522 1993407 1982718 1576786 1114699 804583
8497 804583 571279 400199 325300 295878 170963 -87958 -369483 -634804 -911818 -1141208
8487 -1141208 -1285230 -1255872 -1082879 -1154532 -1563744 -1915205 -1902062 -1828906 -2021766 -2336828
8477 -2336828 -2473583 -2433832 -2463818 -2673028 -2793995 -2551872 -2265285 -2220766 -2263560 -2221028
$$ packed form
8547B228799P06995N36725K60906j47859l82416k41255j35414l33531m11374j26163
8537A955413J25589J50861N9298r7533k50839k04975j1978J5184q5797k32062
8527A423161k93457m6962L30422O20525O03481L82598J10147k39046n55092o75654
8517A660123n64258l07010j92741k62048m41744m41987j72710L9386J36119K91916
8507b54954N06572N24715K95377J94973L59839L66885j0689m05932m62087l10116
8497H04583k33304j71080p4899k9422j24915k58921k81525k65321k77014k29390
8487a141208j44022K9358J72993p1653m09212l51461J3143P3156j92860l15062
8477b336828j36755L9751k9986k09210j20967K42123K86587M4519m2794M2532
$$ plain form
8467 -2221028 -2017127 -1706563 -1460680 -1126191 -449286 317008 614387 293643 -361515 -1005431
8457 -1005431 -1392931 -1319018 -910431 -562740 -241595 200286 577780 539487 93924 -271644
8447 -271644 -275736 9424 461309 839905 1052740 1175548 1241336 1262113 1111956 506802
8437 506802 -433645 -1252556 -1823931 -2185106 -2406540 -2708589 -2923986 -2839401 -2686488 -2427354
8427 -2427354 -1965838 -1615461 -1497141 -1210993 -570801 213896 1011669 1564789 1680407 1596413
8417 1596413 1543108 1621582 1808994 2009463 2041522 1839867 1439730 767708 -155278 -1003156
8407 -1003156 -1325063 -1094595 -685964 -357804 -84801 172039 262744 217179 255218 422107
8397 422107 563166 618538 679216 757388 972085 1308308 1366524 1108520 786184 397523
$$ packed form
8467b221028K03901L10564K45883L34489O76905P66294K97379l20744o55158o43916
8457a005431l87500P3913M08587L47691L21145M41881L77494l8293m45563l65568
8447b71644m092K85160M51885L78596K12835J22808O5788K0777j50157o05154
8437E06802r40447q18911n71375l61175k21434l02049k15397Q4585J52913K59134
8427b427354M61516L50377J18320K86148O40192P84697P97773N53120J15618q3994
8417A596413n3305P8474J87412K00469L2059k01655m00137o72022r22986q47878
8407a003156l21907K30468M08631L28160K73003K56840R0705m5565L8039J66889
8397D22107J41059N5372O0678P8172K14697L36223N8216k58004l22336l88661
$$ plain form
8387 397523 -59252 -423366 -643647 -905147 -1271255 -1588516 -1752583 -1796723 -1660336 -1268336
8377 -1268336 -664686 -107940 63555 -147208 -602679 -1266716 -2004436 -2769646 -3398679 -3620316
8367 -3620316 -3299983 -2554420 -1830010 -1504081 -1566989 -1792255 -1946758 -1817528 -1371794 -776121
8357 -776121 -209109 208605 452190 567009 617452 746419 924648 1006538 887422 704471
8347 704471 547063 321378 57062 -163429 -287753 -402114 -486777 -553955 -710775 -874054
8337 -874054 -876620 -836400 -834535 -750782 -632128 -672032 -735392 -442585 261455 1059568 1715523
8326 1715523 2226511 2489256 2268900 1757808 1366064 1089307 927661 981238 1127897 1220724
8316 1220724 1327723 1285502 947109 498277 46068 -399567 -685271 -430535 404495 1356356
$$ packed form
8387C97523m56775l64114k20281k61500l66108l17261j64067m4140J36387L92000
8377a268336O03650N56746J71495k10763m55471o64037p37720p65210o29033k21637
8367c620316L20333P45563P24410L25929o2908k25266j54503J29230M45734N95673
8357g76121N67012M17714K43585J14819N0443J28967J78229Q1890j19116j82951
8347G04471j57408k25685k64316k20491j24324j14361q4663o7178j56820j63279
8337h74054k566M0220J865Q3753J18654l9904o3360K92807P04040P98113O55955
8326A715523N10988K62745k20356n11092l91744k76757j61646N3577J46659R2827
8316A220724J06999m2221l38393m48832m52209m45635k85704K54736Q35030R51861
$$ plain form
8306 1356356 2013319 2190179 1794011 852956 -241877 -1188264 -1889398 -2226923 -2393056
8297 -2393056 -2767821 -3322687 -3839342 -4310310 -4805427 -5204454 -5032033 -4126418 -2968813
8288 -2968813 -2022199 -1303458 -585267 90910 391997 189309 -197541 -458772 -686383 -1020628
8278 -1020628 -1485097 -1954128 -2211749 -2358345 -2417758 -2200284 -1819382 -1661843 -1844382 -2032018
8268 -2032018 -2046327 -1851863 -1377028 -743648 -60930 632728 1087840 1215716 1163054 1116250
8258 1116250 1251871 1566174 1939940 2248838 2422397 2349314 1907876 1242921 659205 106822
8248 106822 -380993 -585418 -608794 -646518 -810612 -1006447 -981922 -630978 -143472 307294
8238 307294 836900 1427547 1939722 2249358 2213500 1874814 1331560 739723 466739 781509
$$ packed form
8306A356356O56963J76860l96168r41055j094833r46387p01134l37525j66133
8297b393056l74765n54866n16655m70968m95117l99027J72421R05615J157605
8288b968813R46614P18741P18191O76177L01087k02688l86850k61231k27611l34245
8278a020628m64469m69031k57621j46596n9413K17474L80902J57539j82539j87636
8268b032018j4309J94464M74835O33380O82718O93658M55112J27876n2662m6804
8258A116250J35621L14303L73766L08898J73559p3083m41438o64955n83716n52383
8248A06822m87815k04425k3376l7724j64094j95835K4525L50944M87506M50766
8238C07294N29606N90647N12175L09636l5858l38686n43254n91837k72984L14770
$$ plain form
8228 781509 1554260 2499495 3112345 3053157 2563594 2112735 1989628 2179543 2371647 2169865
8218 2169865 1597260 1146015 1149002 1559878 2221979 2979771 3530500 3669993 3449855 3060850
8208 3060850 2672408 2389603 2217029 2006335 1539913 784201 87817 -82809 -4134 -202511
8198 -202511 -664065 -1163013 -1578393 -1685941 -1284163 -476372 484190 1196011 1356935 1035494
8188 1035494 388101 -455754 -1283393 -1928510 -2359676 -2373183 -1825720 -1064427 -501495 -149820
8178 -149820 37345 124175 422717 952853 1372367 1472952 1360174 1089935 813763 765700
8168 765700 867362 936231 1022280 1158624 1412880 1868977 2296572 2479380 2455835 2392004
8158 2392004 2289988 2054237 1834470 1744167 1772665 1957653 2226515 2353403 2300187 2205026
$$ packed form
8228G81509P72751R45235O12850n9188m89563m50859j23107J89915J92104k01782
8218B169865n72605m51245K987M10876O62101P57792N50729J39493k20138l89005
8208C060850l88442k82805j72574k10694m66422p55712o96384j70626P8675j98377
8198b02511m61554m98948m15380j07548M01778Q07791R60562P11821J60924l21441
8188A035494o47393q43855q27639o45117m31166j3507N47463P61293N62932L51675
8178a49820J87165Q6830K98542N30136M19514J00585j12778k70239k76172m8063
8168G65700J01662O8869Q6049J36344K54256M56097M27595J82808k3545o3831
8158B392004j02016k35751k19767r0303K8498J84988K68862J26888n3216r5161
$$ plain form
8148 2205026 2254535 2369120 2248040 1832984 1477924 1477186 1703496 1797806 1649394 1454534
8138 1454534 1436436 1695887 2094568 2440922 2653051 2757726 2578379 2070286 1797189 1967053
8128 1967053 2066030 1751245 1178918 691960 540959 700639 1049868 1394802 1456371 1107560
8118 1107560 515547 -203663 -972031 -1664228 -2073606 -1957376 -1433442 -883931 -518717 -403174
8108 -403174 -545173 -765356 -945945 -1047448 -950216 -572473 71272 801471 1334295 1505119
8098 1505119 1439178 1389047 1409956 1372591 1153975 725973 113259 -543879 -970609 -1074717
8088 -1074717 -1007113 -886105 -694139 -638996 -953362 -1378060 -1639476 -1630021 -1458613 -1424016
8078 -1424016 -1436590 -1114800 -578740 -69219 412470 836886 1028355 865010 500493 186233
$$ packed form
8148B205026M9509J14585j21080m15056l55060p38K26310R4310j48412j94860
8138A454534j8098K59451L98681L46354K12129J04675j79347n08093k73097J69864
8128A967053R8977l14785n72327m86958j51001J59680L49229L44934O1569l48811
8118A107560n92013p19210p68368o92197m09378J16230N23934N49511L65214J15543
8108d03174j41999k20183j80589j01503R7232L77743O43745P30199N32824J70824
8098A505119o5941n0131K0909l7365k18616m28002o12714o57138m26730j04108
8088a074717O7604J21008J91966N5143l14366m24698k61416R455J71408L4597
8078a424016j2574L21790N36060N09521M81689M24416J91469j63345l64517l14260
$$ plain form
8068 186233 14808 219151 900578 1653318 2083344 1903906 1156198 58358 -1322298
8059 -1322298 -2713282 -3751420 -4136528 -3728075 -2838190 -1804149 -849503 -161726 296718
8050 296718 659201 921059 976018 858265 848406 1121086 1395278 1388152 1005682 316755 -404823
8039 -404823 -1105716 -1919579 -2626589 -2928722 -2715235 -1982071 -1162570 -654952 -387357 -230565
8029 -230565 -256216 -491281 -917219 -1422235 -1788317 -1920661 -1739851 -1118966 -257879 498405
8019 498405 890657 811545 223259 -778500 -1907024 -2902198 -3657292 -3977888 -3647504 -2889718
8009 -2889718 -2100087 -1474271 -843415 -112036 521348 906968 1117377 1125313 578564 -530542
7999 -530542 -1613974 -2175859 -2279468 -2164549 -2007500 -1832840 -1444307 -948109 -764225 -1034781
$$ packed form
8068A86233j71425K04343O81427P52740M30026j79438p47708j097840j380656
8059a322298j390984j038138l85108M08453Q89885J034041R54646O87777M58444
8050B96718L62483K61858N4959j17753r859K72680K74192p126l82470o88927p21578
8039d04823p00893q13863p07010l02133K13487P33164Q19501N07618K67595J56792
8029b30565k5651k35065m25938n05016l66082j32344J80810O20885Q61087P56284
8019D98405L92252p9112n88286j001759j128524r95174p55094l20596L30384P57786
8009b889718P89631O25816O30856P31379O33384L85620K10409P936n46749j109106
7999e30542j083432n61885j03609J14919J57049J74660L88533M96198J83884k70556
$$ plain form
7989 -1034781 -1565454 -2166333 -2602685 -2828621 -2919754 -2788753 -2539817 -2465179 -2821349 -3565026
7979 -3565026 -4325091 -4769344 -4844109 -4589240 -4072536 -3415845 -2643871 -1637668 -559709
7970 -559709 91368 203316 106221 131508 348260 792818 1305987 1641521 1866884 2025808
7960 2025808 2218855 2585947 2970349 2938788 2259820 1332764 715880 481564 517137 779476
7950 779476 979216 940971 675358 252980 -147249 -621192 -1309989 -2018178 -2496802 -2573916
7940 -2573916 -2351250 -2080083 -1965926 -1988349 -1996809 -1929074 -1779432 -1557530 -1318988 -1144145
7930 -1144145 -1089091 -1229793 -1519649 -1855556 -2094824 -2224601 -2396293 -2639545 -2918962 -3211519
7920 -3211519 -3487752 -3676165 -3764784 -3852847 -3977928 -4103682 -4134349 -3942394 -3373081 -2311676
$$ packed form
7989a034781n30673o00879m36352k25936r1133J31001K48936P4638l56170p43677
7979c565026p60065m44253p4765K54869N16704O56691P71974J006203J077959
7970e59709O51077J11948r7095K5287K16752M44558N13169L35534K25363J58924
7960B025808J93047L67092L84402l1561o78968r27056o16884k34316L5573K62339
7950G79476J99740l8245k65613m22378m00229m73943o88797p08189m78624p7114
7940b573916K22666K71167J14157k2423q460O7735J49642K21902K38542J74843
7930a144145N5054j40702k89856l35907k39268j29777j71692k43252k79417k92557
7920c211519k76233j88413q8619q8063j25081j25754l0667J91955N69313J061405
$$ plain form
7910 -2311676 -995319 162591 875196 1032169 745842 217463 -132370 -80843 236426
7901 236426 715171 1021401 907849 345659 -452841 -965825 -985608 -798566 -639315 -624481
7891 -624481 -808357 -1065913 -1218956 -1252683 -1297602 -1476358 -1719820 -1737786 -1481062 -1338499
7881 -1338499 -1588049 -1878869 -1887940 -1589531 -937913 -180735 373428 884248 1555611 2196629
7871 2196629 2622684 2900832 3146209 3416878 3687367 3761088 3359319 2582803 1869664 1486339
7861 1486339 1373395 1259942 1002292 740802 677930 841873 1109497 1335904 1429355 1344261
7851 1344261 1234005 1183288 1079077 854226 512811 186957 134461 358548 546173 598914
7841 598914 601709 470471 -64242 -879286 -1500014 -1692357 -1495149 -1274850 -1286130 -1468564
$$ packed form
7910b311676J316357J157910P12605J56973k86327n28379l49833N1527L17269
7901B36426M78745L06230j13552n62190p98500n12984j9783J87042J59251J4834
7891f24481j83876k57556j53043l3727m4919j78756k43462j7966K56724J42563
7881a338499k49550k90820r071K98409O51618P57178N54163N10820O71363O41018
7871B196629M26055K78148K45377K70669K70489P3721m01769p76516p13139l83325
7861A486339j12944j13453k57650k61490o2872J63943K67624K26407R3451q5094
7851A344261j10256n0717j04211k24851l41415l25854n2496K24087J87625N2741
7841E98914K795j31238n34713q15044o20728j92343J97208K20299j1280j82434
$$ plain form
7831 -1468564 -1677422 -1855423 -2020756 -2094112 -2031859 -1809051 -1537376 -1326345 -1380886 -1714305
7821 -1714305 -2093737 -2414040 -2785416 -3174777 -3224691 -2782370 -2138231 -1417694 -577994 273984
7811 273984 877795 1089740 1159322 1436409 1936386 2326043 2546247 2797899 2985468 2891427
7801 2891427 2550036 2027445 1398973 723929 30236 -620296 -854110 -451842 164754 533070
7791 533070 519550 159230 -366996 -854789 -1177439 -1278282 -1274853 -1280208 -1171826 -690948 114194
7780 114194 634679 604312 246282 -309272 -889703 -1256571 -1224373 -955773 -815271 -845124
7770 -845124 -858343 -911876 -1211768 -1645409 -1798861 -1525613 -951221 -385246 -125269 -169272
7760 -169272 -410955 -860053 -1417999 -1809276 -1876340 -1625279 -1245251 -993262 -923924 -893520
$$ packed form
7831a468564k08858j78001j65333p3356O2253K22808K71675K11031n4541l33419
7821a714305l79432l20303l71376l89361m9914M42321O44139P20537Q39700Q51978
7811B73984O03811K11945O9582K77087M99977L89657K20204K51652J87569r4041
7801B891427l41391n22591o28472o75044o93693o50532k33814M02268O16596L68316
7791E33070j3520l60320n26226m87793l22650j00843L429n355J08382M80878Q05142
7780A14194N20485l0367l58030n55554n80431l66868L2198K68600J40502k9853
7770h45124j3219n3533k99892m33641j53452K73248N74392N65975K59977m4003
7760a69272k41683m49098n57946l91277o7064K51061L80028K51989O9338L0404
$$ plain form
7750 -893520 -835449 -788335 -780171 -905063 -1244895 -1457967 -1309940 -1006098 -701648 -346675
7740 -346675 47294 482761 995723 1398741 1507319 1315210 1007809 711360 309568 -315822
7730 -315822 -948570 -1510307 -2033833 -2285471 -2159272 -1786201 -1290134 -902251 -783781 -889355
7720 -889355 -1175150 -1421931 -1349104 -944525 -260638 694262 1562334 1953215 1888341 1716864
7710 1716864 1692850 1752168 1738852 1632112 1582017 1562022 1434192 1224007 1128972 1249000 1421171
7699 1421171 1389154 988889 417054 197418 256913 49006 -513413 -1081841 -1314042 -1146631
7689 -1146631 -854073 -732641 -988192 -1840424 -2927968 -3740971 -4096275 -3970916 -3551565
7680 -3551565 -3097933 -2691605 -2335625 -1913106 -1413108 -986853 -644939 -196768 476378 1248088
$$ packed form
7750h93520N8071M7114Q164j24892l39832k13072J48027L03842L04450L54973
7740c46675L93969M35467N12962M03018J08578j92109l07401k96449m01792o25390
7730c15822o32748n61737n23526k51638J26199L73071M96067L87883J18470j05574
7720h89355k85795k46781P2827M04579O83887R54900Q68072L90881o4874j71477
7710A716864k4014N9318j3316j06740n0095j9995j27830k10185r5035J20028J72171
7699A421171l2017m00265n71835k19636N9495k07907n62419n68428k32201J67411
7689a146631K92558J21432k55551q52232j087544q13003l55304J25359M19351
7680c551565M53632M06328L55980M22519M99998M26255L41914M48171O73146P71710
$$ plain form
7670 1248088 1911680 2228989 2174991 1912549 1585426 1272813 1181911 1275492 1314005 1428559
7660 1428559 1663483 1767075 1672025 1387297 793134 -41459 -629640 -702862 -362162 235080
7650 235080 786256 1133487 1299305 1247545 885890 322137 -122488 -305181 -389375 -629025
7640 -629025 -1033904 -1301189 -1233216 -960947 -736707 -520607 -412611 -613359 -939110 -1054277
7630 -1054277 -763688 -405625 -282437 -262481 -358769 -578505 -695671 -569297 -461377 -709682
7620 -709682 -1177970 -1545564 -1672094 -1525128 -1135546 -538707 242602 1056130 1658604 1957213
7610 1957213 1918912 1671915 1502742 1482191 1460387 1305197 1076793 809191 400383 -189058
7600 -189058 -644796 -670304 -398901 -143784 -113534 -294668 -395158 -343409 -337274 -565991 -969628
$$ packed form
7670A248088O63592L17309n3998k62442l27123l12613r0902R3581L8513J14554
7660A428559K34924J03592r5050k84728n94163q34593n88181p3222L40700N97242
7650B35080N51176L47231J65818n1760l61655n63753m44625j82693q4194k39650
7640f29025m04879k67285O7973K72269K24240K16100J07996k00748l25751j15167
7630a054277K90589L58063J23188J9956r6288k19736j17166J26374J07920k48305
7620g09682m68288l67594j26530J46966L89582N96839P81309Q13528O02474K98609
7610A957213l8301k46997j69173k0551k1804j55190k28404k67602m08808n89441
7600a89058m55738k5508K71403K55117L0250j81134j00490N1749O135k28717m03637
$$ plain form
7589 -969628 -1242821 -1321589 -1298987 -1093412 -604810 -90927 192650 232796 166859 147865 277900
7578 277900 477855 580597 652141 808390 824660 600884 333122 -43072 -766202 -1619619
7568 -1619619 -2131647 -2291989 -2249636 -1954728 -1422912 -908557 -562231 -264457 91811 483833
7558 483833 758611 845628 749088 559400 461369 340855 104745 -76160 -40757 217760
7548 217760 694725 1144243 1327160 1426643 1617658 1809022 1897203 1711470 1297604 1009225
7538 1009225 1058912 1302793 1576050 1867456 1947085 1546378 780047 77521 -477603 -1067775
7528 -1067775 -1710235 -2252422 -2707798 -3178482 -3486049 -3570581 -3663941 -3748737 -3507343 -2973376
7518 -2973376 -2509510 -2309922 -2275011 -2257931 -2095547 -1641423 -1123267 -746851 -323678 321581
$$ packed form
7589i69628k73193p8768K2602K05575M88602N13883K83577M0146o5937j8994J30035
7578B77900J99955J02742P1544J56249J6270k23776k67762l76194p23130q53417
7568a619619n12028j60342M2353K94908N31816N14355L46326K97774L56268L92022
7558D83833K74778Q7017r6540j89688r8031j20514k36110j80905L5403K58517
7548B17760M76965M49518J82917R9483J91015J91364Q8181j85733m13866k88379
7538A009225M9687K43881K73257K91406P9629m00707p66331p02526n55124n90172
7528a067775o42460n42187m55376m70684l07567q4532r3360q4796K41394N33967
7518b973376M63866J99588L4911J7080J62384M54124N18156L76416M23173O45259
$$ plain form
7508 321581 944119 1216242 1229396 1224102 1318750 1620453 1964609 2044206 1742429 1178872 627103
7497 627103 365789 494306 879753 1259407 1449309 1421891 1249566 1079373 871869 510923
7487 510923 -1008 -509194 -759442 -788173 -759484 -777843 -699304 -459018 -196613 153465
7477 153465 569106 822462 757460 404853 -52896 -385322 -561574 -574609 -429079 -191282
7467 -191282 54912 123391 -12798 -154529 -311656 -598478 -997401 -1381682 -1494337 -1203971
7457 -1203971 -613003 177724 1049538 1647760 1549001 1110754 988828 1058540 836550 420410
7447 420410 183320 221073 510199 923626 1206507 1114821 672817 206772 -178498 -423191
7437 -423191 -230631 190639 263227 1986 -65629 420879 1174346 1695176 1928949 2123228
$$ packed form
7508C21581O22538K72123J3154n294R4648L01703L44156P9597l01777n63557n51769
7497F27103k61314J28517L85447L79654J89902k7418j72325j70193k07504l60946
7487E10923n11931n08186k50248k8731K8689j8359P8539K40286K62405L50078
7477A53465M15641K53356o5002l52607m57749l32426j76252j3035J45530K37797
7467a91282K46194O8479j36189j41731j57127k86822l98923l84281j12655K90366
7457a203971N90968P90727Q71814N98222r8759m38247j21926O9712k21990m16140
7447D20410k37090L7753K89126M13427K82881r1686m42004m66045l85270k44693
7437d23191J92560M21270P2588k61241o7615M86508P53467N20830K33773J94279
$$ plain form
7427 2123228 2484219 2907459 3041407 2893698 2646537 2324492 1838640 1054757 36116
7418 36116 -904317 -1588583 -2045480 -2266438 -2061704 -1311569 -203192 983014 1739123 1683060
7408 1683060 999790 56058 -795599 -1296982 -1541948 -1690570 -1727418 -1550814 -1162231 -694597
7398 -694597 -179638 366381 920149 1393881 1680206 1650280 1277167 735039 -32621 -1144555
7388 -1144555 -2332653 -3162536 -3527059 -3475731 -3018852 -2221904 -1287529 -586555 -317093 -349574
7378 -349574 -480411 -578719 -558964 -539255 -712699 -998468 -1212748 -1266252 -1370939 -1524936
7368 -1524936 -1370879 -994631 -745113 -691735 -694490 -686544 -723633 -826540 -984706 -1110078 -1098468
7357 -1098468 -821378 -299832 402721 1238182 2063743 2832123 3528508 3889345 3805376 3513342
$$ packed form
7427B123228L60991M23240J33948j47709k47161l22045m85852p83883j018641
7418C6116r40433o84266m56897k20958K04734P50135J108377J186206P56109n6063
7408A683060o83270r43732q51657n01383k44966j48622l6848J76604L88583M67634
7398f94597N14959N46019N53768M73732K86325k9926l73113n42128p67660j111934
7388a144555j188098q29883l64523N1328M56879P96948R34375P00974K69462l2481
7378c49574j30837r8308J9755J9709j73444k85769k14280n3504j04687j53997
7368a524936J54057L76248K49518N3378k755P946l7089j02907j58166j25372J1610
7357a098468K77090N21546P02553Q35461Q25561P68380O96385L60837q3969k92034
$$ plain form
7347 3513342 3173963 2781898 2255034 1467961 217670 -1490421 -3172262 -4277030 -4765640
7338 -4765640 -4885489 -4692199 -4140465 -3374239 -2688377 -2058328 -1207917 -159072 723094
7329 723094 1139604 916326 66748 -1016758 -1664519 -1695716 -1603396 -1697430 -1822270 -1831857
7319 -1831857 -1618279 -1108484 -456957 -27866 -96014 -542448 -941183 -993962 -683005 -66803
7309 -66803 828664 1769111 2219081 1882794 1049848 192311 -403998 -619922 -539440 -600525
7299 -600525 -941955 -1178586 -1200073 -1163655 -1185231 -1487257 -2026677 -2571514 -3025682 -3271596
7289 -3271596 -3287847 -3141637 -2790567 -2331469 -1935453 -1750101 -1884803 -2275238 -2686423 -2952010
7279 -2952010 -2980099 -2846100 -2766157 -2700420 -2445608 -1892927 -1110345 -389450 -96706 -164865
$$ packed form
7347C513342l39379l92065n26864p87073j250291j708091j681841j104768m88610
7338d765640j19849J93290N51734P66226O85862O30049Q50411J048845Q82166
7329G23094M16510k23278q49578j083506o47761l1197R2320r4034j24840r587
7319a831857K13578N09795O51527M29091o8148m46434l98735n2779L10957O16202
7309f6803Q95467R40447M49970l36287q32946q57537n96309k15924Q0482o1085
7299f00525l41430k36631k1487L6418k1576l02026n39420n44837m54168k45914
7289c271596j6251J46210L51070M59098L96016J85352j34702l90435m11185k65587
7279b952010k8089J33999P9943O5737K54812N52681P82582P20895K92744o8159
$$ plain form
7269 -164865 -297939 -255330 1680 247993 453867 1022879 1857788 2380413 2412932 2183216
7259 2183216 1807493 1281718 699189 357173 396583 731751 1305281 1926203 2402652 2720365
7249 2720365 2880967 2736505 2208930 1611977 1350083 1483922 1789067 2035322 1922501 1449577
7239 1449577 812209 80540 -649937 -1215870 -1483056 -1529914 -1601933 -1881033 -2216420 -2110889
7229 -2110889 -1472037 -866270 -692682 -789769 -914725 -1022568 -1000168 -713070 -290300 -94075
7219 -94075 -275161 -654499 -1078345 -1494338 -1693826 -1477851 -911018 -129259 777303 1585934
7209 1585934 2117277 2444853 2535253 2396864 2067507 1667822 1505626 1749445 2096515 2016711
7199 2016711 1630235 1422012 1554838 1939597 2372293 2594967 2697972 2719150 2393272 1845683
$$ packed form
7269a64865j33074M2609K57010K46313K05874N69012Q34909N22625L2519k29716
7259B183216l75723n25775n82529l42016L9410L35168N73530O20922M76449L17713
7249B720365J60602j44462n27575n96953k61894J33839L05145K46255j12821m72924
7239A449577o37368p31669p30477n65933k67186m6858p2019k79100l35387J05531
7229b110889O38852O05767J73588r7087j24956j07843K2400K87098M22770J96225
7219i4075j81086l79338m23846m15993j99488K15975N66833P81759R06562Q08631
7209A585934N31343L27576R0400j38389l29357l99685j62196K43819L47070p9804
7199B016711l86476k08223J32826L84759M32696K22674J03005K1178l25878n47589
$$ plain form
7189 1845683 1588114 1635709 1668846 1543465 1427861 1518942 1540434 1136050 405945 -429642
7179 -429642 -1254618 -1863090 -2198518 -2187814 -1784122 -1339775 -1191843 -1362653 -1683103 -1902815
7169 -1902815 -1912713 -1996067 -2420618 -2874097 -2852544 -2303095 -1609932 -1206977 -1177599 -1248104 -1209721
7158 -1209721 -1055331 -917444 -895512 -898368 -858116 -846233 -942810 -1031501 -980680 -721491 -178727
7147 -178727 468927 1000402 1464745 1940265 2331693 2549739 2584400 2270863 1619146 981332
7137 981332 511345 219949 197078 386323 474900 242506 -245924 -651160 -790108 -896256
7127 -896256 -1135038 -1307229 -1180408 -668457 -34024 357700 437601 211902 -277334 -834140
7117 -834140 -1171628 -1325551 -1483998 -1646795 -1678089 -1531494 -1354634 -1249570 -1142460 -904027
$$ packed form
7189A845683k57569M7595L3137j25381j15604R1081K1492m04384p30105q35587
7179d29642q24976o08472l35428J0704M03692M44347J47932j70810l20450k19712
7169a902815r898q3354m24551m53479K1553N49449O93163M02955K9378p0505L8383
7158a209721J54390J37887K1932k856M0252J1883r6577q8691N0821K59189N42764
7147a78727O47654N31475M64343M75520L91428K18046L4661l13537o51717o37814
7137I81332m69987k91396k2871J89245Q8577k32394m88430m05236j38948j06148
7127h96256k38782j72191J26821N11951O34433L91724P9901k25699m89236n56806
7117h34140l37488j53923j58447j62797l1294J46595J76860J05064J07110K38433
$$ plain form
7107 -904027 -645885 -588595 -824407 -1134274 -1112062 -779195 -442340 -193377 11191 358009
7097 358009 909718 1380351 1473597 1338989 1309549 1392877 1369888 1150901 816250 597480
7087 597480 673394 873680 946790 937897 1049678 1327439 1621117 1648906 1382492 1038914 635529
7076 635529 199736 -69024 -130539 6420 303815 644596 943327 1148758 1223103 990129
7066 990129 479212 51859 -101692 -221258 -405836 -551822 -545271 -269998 270992 932310
7056 932310 1543250 1980768 2170591 2160837 2042074 1739030 1213486 698479 368246 151441
7046 151441 -31482 -96444 -44064 -29585 -112757 -255137 -181667 357703 1182638 1991384 2617920
7035 2617920 3066946 3405591 3580255 3349896 2656058 2004941 1839337 1843528 1569170 1109046
$$ packed form
7107i04027K58142N7290k35812l09867K2212L32867L36855K48963K04568L46818
7097C58009N51709M70633R3246j34608k9440Q3328k2989k18987l34651k18770
7087E97480P5914K00286P3110q893J11781K77761K93678K7789k66414l43578m03385
7076F35529m35793k68760o1515J36959K97395L40781K98731K05431P4345k32974
7066I90129n10917m27353j53551j19566j84578j45986O551K75273N40990O61318
7056I32310O10940M37518J89823r754j18763l03044n25544n15007l30233k16805
7046A51441j82923o4962N2380J4479q3172j42380P3470N39370Q24935Q08746O26536
7035B617920M49026L38645J74664k30359o93838o51117j65604M191k74358m60124
$$ plain form
7025 1109046 883002 1112502 1577262 1753495 1417931 865156 442549 343053 590279 953766
7015 953766 1292068 1481963 1391848 1346118 1615213 1993108 2079609 1767155 1255639 702626
7005 702626 276052 144509 255952 427994 610370 945947 1323475 1367960 1022786 581672
6995 581672 209083 -229447 -697975 -948780 -776966 -293899 281156 748874 840035 329229
6985 329229 -500494 -1052314 -999724 -389907 540366 1416386 2056486 2466634 2540344 2212061
6975 2212061 1755565 1410532 1022502 573446 383975 604274 1047509 1436948 1686713 1765988
6965 1765988 1541755 1248943 1271251 1462897 1614380 1832934 2128551 2312523 2325253 2277524
6955 2277524 2172204 2037367 1967095 2031107 2260273 2880639 3907790 4912476 5411634 5134697
$$ packed form
7025A109046k26044K29500M64760J76233l35564n52775m22607r9496K47226L63487
7015I53766L38302J89895r0115m5730K69095L77895Q6501l12454n11516n53013
7005G02626m26574j31543J11443J72042J82376L35577L77528M4485l45174m41114
6995E81672l72589m38530m68528k50805J71814M83067N75055M67718R1161n10806
6985C29229q29723n51820N2590O09817R30273Q76020O40100M10148P3710l28283
6975B212061m56496l45033l88030m49056j89471K20299M43235L89439K49765P9275
6965A765988k24233k92812K2308J91646J51483K18554K95617J83972J2730m7729
6955B277524j05320j34837p0272O4012K29166O20366J027151J004686M99158k76937
$$ plain form
6945 5134697 4287662 3226337 2158643 1357657 997571 1045576 1428707 1798274 1895324 1856302
6935 1856302 1787818 1776668 1698616 1399207 958041 647405 548737 551486 589298 653792 771850
6924 771850 840460 786286 657310 589564 625726 824833 1265067 1730412 1960455 1963039 1962992
6913 1962992 2175485 2509430 2708108 2709640 2627217 2556967 2580268 2774520 3072812 3336986
6903 3336986 3415232 3228395 2747916 2025872 1238670 423657 -220409 -377767 -142660 117734
6893 117734 193399 203947 180730 53706 -104352 -246110 -368739 -385624 -120326 390539
6883 390539 1010145 1628490 2186637 2629229 2875953 2850105 2492453 1812047 830734 -194234
6873 -194234 -872704 -1128046 -1171675 -1026067 -561352 95687 674186 1003359 1267326 1531473
$$ packed form
6945E134697q47035j061325j067694q00986l60086M8005L83131L69567R7050l9022
6935A856302o8484j1150p8052k99409m41166l10636r8668K749L7812O4494J18058
6924G71850O8610n4174j28976o7746L6162J99107M40234M65345K30043K584m7
6913A962992K12493L33945J98678J532q2423p0250K3301J94252K98292K64174
6903C336986P8246j86837m80479p22044p87202q15013o44066j57358K35107K60394
6893A17734P5665J0548k3217j27024j58058j41758j22629j6885K65298N10865
6883C90539O19606O18345N58147M42592K46724k5848l57652o80406r81313j024968
6873a94234o78470k55342m3629J45608M64715O57039N78499L29173K63967K64147
$$ plain form
6863 1531473 1449286 880053 154462 -148886 167801 585496 693753 566863 304211 102199
6853 102199 176250 436880 670716 659450 445398 209218 38714 12360 192268 578517
6843 578517 1238555 2240270 3372283 4207403 4555221 4688200 4783407 4804294 4761507 4697892
6833 4697892 4534247 4268097 4034305 3865964 3829922 3911274 4013399 4062695 4009425 3872487
6823 3872487 3813903 3864352 3841251 3789264 3722522 3436154 2776697 1812944 848917 43345
6813 43345 -721000 -1565181 -2221297 -2247073 -1819692 -1488094 -1398080 -1376565 -1123462 -582387
6803 -582387 61654 609491 903217 923629 821348 964699 1412091 1780098 1889467 1841927
6793 1841927 1697962 1501077 1398046 1534335 1950228 2650252 3449249 4060732 4569503 5128427
$$ packed form
6863A531473q2187n69233p25591l03348L16687M17695J08257j26890k62652k02012
6853A02199P4051K60630K33836j1266k14052k36180j70504k6354J79908L86249
6843E78517O60038J001715J132013Q35120L47818J32979R5207K0887m2787o3615
6833D697892j63645k66150k33792j68341l6042Q1352J02125M9296n3270j36938
6823C872487n8584N0449k3101n1987o6742k86368o59457r63753r64027q05572
6813D3345p64345q44181o56116k5776M27381L31598R0014K1515K53103N41075
6803e82387O44041N47837K93726K0412j02281J43351M47392L68007J09369m7540
6793A841927j43965j96885j03031J36289M15893P00024P98997O11483N08771N58924
$$ plain form
6783 5128427 5672485 6154594 6498210 6735042 7067895 7607303 8142658 8432373 8319527 7926916
6773 7926916 7599968 7292763 6756720 6098109 5611848 5513446 5776997 6164470 6505533 6883377
6763 6883377 7376177 7760056 7918503 8133117 8364515 8323345 8145678 8092400 8140115 8234437
6753 8234437 8393261 8634568 8925806 9229440 9493062 9582938 9373017 8967353 8568505 8349949
6743 8349949 8425503 8713456 9043138 9313963 9661763 10062683 10204162 10066727 9881835 9606906
6733 9606906 9058274 8215291 7172091 6067332 5150147 4512941 4111044 3870409 3660739
6724 3660739 3496846 3537998 3834881 4337150 4868401 5034731 4658201 4038496 3485834 2917634
6714 2917634 2226488 1666526 1564905 1967874 2516471 2674417 2450257 2226025 2314910 2790906
$$ packed form
6783E128427N44058M82109L43616K36832L32853N39408N35355K89715j12846l92611
6773G926916l26948l07205n36043o58611m86261r8402K63551L87473L41063L77844
6763F883377M92800L83879J58447K14614K31398m1170j77667n3278M7715R4322
6753H234437J58824K41307K91238L03634K63622Q9876k09921m05664l98848k18556
6743H349949P5554K87953L29682K70825L47800M00920J41479j37435j84892k74929
6733I606906n48632q42983j043200j104759r17185o37206m01897k40635k09670
6724C660739j63893M1152K96883N02269N31251J66330l76530o19705n52662n68200
6714B917634o91146n59962j01621M02969N48597J57946k24160k24232Q8885M75996
$$ plain form
6704 2790906 3426159 3821046 3469494 2282809 901262 -15936 -240922 -123154 -143887
6695 -143887 -311592 -341599 -229505 -196545 -324414 -637551 -1048279 -1350122 -1520817 -1624542
6685 -1624542 -1531948 -1127751 -529948 65642 456591 615477 758434 982250 1014601 624743
6675 624743 148945 -35830 58122 271571 505132 799591 1265519 1813838 2143747 1976869
6665 1976869 1435820 809487 345817 340503 582484 701614 683725 488922 74301 -396065
6655 -396065 -749501 -1006097 -1385021 -1929516 -2467195 -2689889 -2461862 -1958154 -1397759 -869724
6645 -869724 -434383 -144393 167512 669438 1307348 1885830 2138938 1817284 1154985 433634
6635 433634 -152613 -434738 -323663 181094 806445 1268898 1460305 1384520 1120504 824748
$$ packed form
6704B790906O35253L94887l51552j186685j381547r17198k24986J17768k0733
6695a43887j67705l0007J12094L2960j27869l13137m10728l01843j70695j03725
6685a624542R2594M04197N97803N95590L90949J58886J42957K23816L2351l89858
6675F24743m75798j84775R3952K13449K33561K94459M65928N48319L29909j66878
6665A976869n41049o26333m63670n314K41981J19130j7889j94803m14621m70366
6655c96065l53436k56596l78924n44495n37679k22694K28027N03708N60395N28035
6645h69724M35341K89990L11905N01926O37910N78482K53108l21654o62299p21351
6635D33634n86247k82125J11075N04757O25351M62453J91407p5785k64016k95756
$$ plain form
6625 824748 622386 452932 128358 -385597 -712766 -674343 -655955 -773841 -790541 -620999
6615 -620999 -547088 -784772 -1213746 -1501176 -1369547 -874197 -347101 -2543 150170 189122
6605 189122 405521 765873 999278 1029605 832213 484518 84148 -281722 -496902 -541989
6595 -541989 -455168 -346185 -181520 171859 435970 222431 -393916 -1013795 -1235135 -1180960
6585 -1180960 -1143825 -1030749 -670132 -238791 117729 398638 567897 676680 757286 701804
6575 701804 444311 8529 -520387 -911506 -1056201 -905739 -390912 317915 739022 642842
6565 642842 80479 -767939 -1520423 -1924028 -2033780 -2050850 -2061425 -2112239 -2113672 -1911684 -1601177
6554 -1601177 -1421580 -1328198 -1219315 -1075651 -887932 -536753 121807 737058 880975 761829
$$ packed form
6625H24748k02362j69454l24574n13955l27169L8423J8388j17886j6700J69542
6615f20999P3911k37684m28974k87430J31629M95350N27096L44558J52713L8952
6605A89122K16399L60352K33405L0327j97392l47695m00370l65870k15180m5087
6595e41989Q6821J08983J64665L53379K64111k13539o16347o19879k21340N4175
6585a180960L7135J13076L60617M31341L56520K80909J69259J08783Q0606n5482
6575G01804k57493m35782n28916l91119j44695J50462N14827P08827M21107r6180
6565F42842n62363q48418p52484m03605j09752j7070j0575n0814j433K01988L10507
6554a601177J79597R3382J08883J43664J87719L51179O58560O15251J43917j19146
$$ plain form
6544 761829 806090 990012 1299480 1793498 2245513 2512222 2562839 2400516 2260581 2202158
6534 2202158 1981575 1560166 1052859 553797 191765 121856 323938 586063 771221 760443
6524 760443 377041 -247404 -654296 -742968 -898092 -1277599 -1692730 -2106097 -2377042 -2476366
6514 -2476366 -2455712 -2206327 -1827492 -1489985 -1058270 -420983 225479 663941 868695 809661
6504 809661 468773 -6478 -386276 -601397 -623196 -375218 -13894 84800 -170709 -529614
6494 -529614 -899046 -1181269 -1217998 -1191416 -1095453 -662545 18330 502092 443560 5917
6484 5917 -499496 -854690 -775223 -155293 755353 1561735 2015874 2108462 1936127 1658427
6474 1658427 1444128 1467728 1709646 1792245 1509014 1141917 827384 427873 -146634 -689071
$$ packed form
6544G61829M4261J83922L09468M94018M52015K66709N0617j62323j39935n8423
6534B202158k20583m21409n07307m99062l62032o9909K02082K62125J85158j0778
6524G60443l83402o24445m06892q8672j55124l79507m15131m13367k70945r9324
6514b476366K0654K49385L78835L37507M31715O37287O46462M38462K04754n9034
6504H09661l40888m75251l79798k15121k1799K47978L61324R8694k55509l58905
6494e29614l69432k82223l6729K6582R5963M32908O80875M83762n8532m37643
6484E917n05413l55194P9467O19930R10646Q06382M54139R2588j72335k77700
6474A658427k14299K3600K41918Q2599k83231l67097l14533l99511n74507n42437
$$ plain form
6464 -689071 -884254 -948668 -1242873 -1676478 -2049489 -2287621 -2412464 -2530355 -2779546 -3212082
6454 -3212082 -3627895 -3822824 -3729037 -3318677 -2787386 -2404655 -2260979 -2204342 -2263792 -2704285
6444 -2704285 -3293603 -3593824 -3574867 -3314251 -3066083 -3071356 -3155292 -3056793 -2790167 -2562498
6434 -2562498 -2542552 -2893309 -3484338 -3903378 -3993328 -3690972 -3041846 -2418517 -2135402 -2048577
6424 -2048577 -1885813 -1521374 -915012 -341515 -108917 -155113 -85796 288513 830600 1493400
6414 1493400 2126773 2570285 2784787 2652998 2340526 2309791 2672732 3062403 2994044 2197024
6404 2197024 876483 -266752 -701155 -402569 258891 789982 1080619 1212684 1099426
6395 1099426 750601 335449 48529 7699 159602 395996 688590 1055394 1346055 1344127
$$ packed form
6464f89071j95183o4414k94205m33605l73011k38132j24843j17891k49191m32536
6454c212082m15813j94929R3787M10360N31291L82731J43676N6637n9450m40493
6444b704285n89318l00221J8957K60616K48168n273q3936R8499K66626K27669
6434b562498J9946l50757n91029m19040q9950L02356O49126O23329K83115Q6825
6424b048577J62764L64439O06362N73497K32598m6196O9317L74309N42087O62800
6414A493400O33373M43512K14502j31789l12472l0735L62941L89671o8359p97020
6404B197024j320541j143235m34403K98586O61460N31091K90637J32065j13258
6395A099426l48825m15152k86920m0830J51903K36394K92594L66804K90661j928
$$ plain form
6385 1344127 1103307 970139 960158 694141 105283 -719657 -1575117 -2020698 -1898607 -1531463
6375 -1531463 -1227614 -1007101 -726959 -305616 147902 373301 328361 234369 70938 -80851
6365 -80851 -74510 -23563 7675 24474 -113923 -408374 -607087 -424377 154279 790426 1203729
6354 1203729 1300937 1362943 1911110 2961269 3957295 4366793 4274203 3978973 3501904 2953876
6344 2953876 2536554 2353261 2592481 3111277 3367649 3283899 3290387 3430589 3303861 2855967
6334 2855967 2408190 2127682 1976061 1844412 1531608 946878 335376 -16120 -36593 292571
6324 292571 908931 1480981 1541811 970590 229902 -210621 -302349 -107045 331654 880577
6314 880577 1301196 1561045 1671223 1538323 1224664 947499 787334 724395 858424 1165598
$$ packed form
6385A344127k40820j33168r981k66017n88858q24940q55460m45581J22091L67144
6375a531463L03849K20513K80142M21343M53518K25399m4940r3992j63431j51789
6365h0851O341N0947L1238J6799j38397k94451j98713J82710N78656O36147M13303
6354A203729R7208O2006N48167J050159R96026M09498r2590k95230m77069n48028
6344B953876m17322j83293K39220N18796K56372q3750O488J40202j26728m47894
6334B855967m47777k80508j51621j31649l12804n84730o11502l51496k0473L29164
6324B92571O16360N72050O0830n71221p40688m40523r1728J95304M38699N48923
6314H80577M20619K59849J10178j32900l13659k77165j60165o2939J34029L07174
$$ plain form
6304 1165598 1291723 1012487 532104 203293 294403 792724 1342991 1661745 1687953 1557755
6294 1557755 1465006 1410955 1336531 1309875 1476683 1885885 2467413 3019620 3221511 3043206
6284 3043206 2873635 3002975 3386505 3998620 4820766 5619740 6172726 6463210 6616051 6863995
6274 6863995 7174757 7180745 6626603 5775348 5282778 5517474 6171019 6845780 7539266 8493445
6264 8493445 9752779 11171566 12578555 13950209 15401016 16978229 18716357 20717082
6256 20717082 23120627 26055507 29530928 33626486 38679366 45038058 52937795 62457515
6248 62457515 73571640 86738104 103007432 123411538 148975536 181154580 221658277
6241 221658277 270953778 324254587 365851138 373408807 340456214 285319224 229329588
$$ packed form
6304A165598J26125k79236m80383l28811R1110M98321N50267L18754K6208j30198
6294A557755r2749n4051p4424k6656J66808M09202N81528N52207K01891j78305
6284C043206j69571J29340L83530O12115Q22146P98974N52986K90484J52841K47944
6274F863995L10762N988n54142q51255m92570K34696O53545O74761O93486R54179
6264H493445J259334J418787J406989J371654J450807J577213J738128K000725
6256B0717082K403545K934880L475421M095558N052880O358692P899737R519720
6248F2457515J1114125J3166464J6269328K0404106K5563998L2179044M0503697
6241B21658277M9295501N3300809M1596551P557669l2952593n5136990n5989636
$$ plain form
6234 229329588 182217223 145315469 117106399 95556874 78740036 65360952 54653987
6227 54653987 45922674 38878106 33454316 29287383 25958995 23228641 20822515 18529816
6219 18529816 16441401 14603058 13074489 11973322 11348540 11011103 10459401 9619613 8877924
6210 8877924 8374055 8106077 7935193 7516025 6773961 5858360 4906154 4200302 3844540 3738793
6200 3738793 3758772 3616006 3031524 2133204 1417025 1141485 1329802 1844765 2419958 2988816
6190 2988816 3577372 4278253 5085067 5710600 5812140 5440393 4927445 4472299 3965327 3392905
6180 3392905 2841583 2209699 1399495 458884 -296848 -600817 -592594 -656049 -963976 -1188570
6170 -1188570 -743362 457013 1764914 2628477 3049008 3301777 3502497 3523663 3256800
$$ packed form
6234B29329588m7112365l6901754k8209070k1549525j6816838j3379084j0706965
6227E4653987q731313p044568n423790m166933l328388k730354k406126k292699
6219A8529816k088415j838343j528569j101167o24782l37437n51702q39788p41689
6210H877924n03869k67978j70884m19168p42064r15601r52206p05852l55762j05747
6200C738793J9979j42766n84482q98320p16179k75540J88317N14963N75193N68858
6190B988816N88556P00881Q06814O25533J01540l71747n12948m55146n06972n72422
6180C392905n51322o31884q10204r40611p55732l03969Q223o3455l07927k24594
6170a188570M45208J200375J307901Q63563M20531K52769K00720K1166k66863
$$ plain form
6161 3256800 2760621 2222449 1610307 859270 237068 78096 284151 600654 837957 834074
6151 834074 757921 786695 853748 781539 535380 319161 313392 544189 847464 1070948 1245575
6140 1245575 1363045 1091242 162751 -1076737 -2049575 -2546830 -2713455 -2584695 -2175841
6131 -2175841 -1723910 -1435108 -1394833 -1413899 -1375660 -1542007 -1920853 -2097338 -1918474 -1729221
6121 -1729221 -1732445 -1725737 -1697873 -1688587 -1573821 -1532752 -1824466 -2256743 -2354212 -2081347 -1694683
6110 -1694683 -1430553 -1369589 -1374106 -1286621 -1082454 -820148 -492672 -146997 130608 322640
6100 322640 411906 446632 553028 797300 1192258 1571093 1836407 1892634 1427612 516335
6090 516335 -530452 -1481448 -2031581 -2018229 -1586204 -987257 -561665 -474885 -499649 -272631
$$ packed form
6161C256800m96179n38172o12142p51037o22202j58972K06055L16503K37303l883
6151H34074p6153K8774O7053p2209k46159k16219n769K30797L03275K23484J74627
6140A245575J17470k71803r28491j239488r72838m97255j66625J28760M08854
6131b175841M51931K88802M0275j9066L8239j66347l78846j76485J78864J89253
6121a729221l224O708K7864R286J14766M1069k91714m32277r7469K72865L86664
6110a694683K64130O0964m517Q7485K04167K62306L27476L45675K77605J92032
6100C22640Q9266L4726J06396K44272L94958L78835K65314N6227m65022r11277
6090E16335j046787r50996n50133J3352M32025N98947M25592Q6780k4764K27018
$$ plain form
6080 -272631 306873 1106768 1926887 2613732 2892375 2591234 1825070 802245 -294434
6071 -294434 -1228656 -1790475 -2088635 -2330494 -2509109 -2721062 -3093705 -3616649 -4050343 -4197103
6061 -4197103 -4116608 -3707870 -2986976 -2287574 -1823485 -1530200 -1419004 -1662737 -2069554 -2305034
6051 -2305034 -2229750 -1918354 -1596770 -1395578 -1232786 -940546 -555089 -273253 -97455 207841
6041 207841 697695 1005615 764629 147868 -387855 -496446 -261139 -58313 -95541 -269670
6031 -269670 -560883 -1044098 -1352700 -1266809 -895833 -184365 868739 1904573 2466926 2531471
6021 2531471 2484566 2678036 3094310 3479901 3751003 3961548 3900005 3472020 3024847 2943197
6011 2943197 3276608 3707891 3731939 3281821 2673002 2026809 1316359 589797 -143378 -789353
$$ packed form
6080b72631N79504P99895Q20119O86845K78643l01141p66164j022825j096679
6071b94434r34222n61819k98160k41859j78615k11953l72643n22944m33694j46760
6061d197103Q0495M08738P20894O99402M64089K93285J11196k43733m06817k35480
6051b305034P5284L11396L21584K01192J62792K92240L85457K81836J75798L05296
6041B07841M89854L07920k40986o16761n35723j08591K35307K02826l7228j74129
6031b69670k91213m83215l08602Q5891L70976P11468J053104J035834N62353O4545
6021B531471m6905J93470M16274L85591K71102K10545o1543m27985m47173q1650
6011B943197L33411M31283K4048m50118o08819o46193p10450p26562p33175o45975
$$ plain form
6001 -789353 -1138517 -1036169 -526547 120109 457449 230900 -267335 -637894 -683527 -432638
5991 -432638 -54241 136498 -86095 -589100 -1069794 -1233584 -982896 -583613 -315527 -83208
5981 -83208 329192 956264 1404031 1195444 304495 -840475 -1716369 -2067392 -1955191 -1749572
5971 -1749572 -1761976 -1751221 -1443859 -918284 -208656 559257 881010 494135 -172637 -588717
5961 -588717 -611558 -589802 -750956 -981653 -1087968 -935528 -498262 -35001 198150 272800
5951 272800 232502 70516 -63589 -132616 -351816 -824902 -1355087 -1787878 -2102277 -2133028
5941 -2133028 -1913033 -1767138 -1736224 -1559304 -1173882 -804943 -623241 -713202 -837010 -757570
5931 -757570 -629593 -430726 -77646 356622 612235 498309 257984 205395 134104 -86423
$$ packed form
6001g89353l49164J02348N09622O46656L37340k26549m98235l70559m5633K50889
5991d32638L78397J90739k22593n03005m80694j63790K50688L99283K68086K32319
5981h3208M12400O27072M47767k08587q90949j144970q75894l51023J12201K05619
5971a749572j2404J0755L07362N25575P09628P67913L21753l86875o66772m16080
5961e88717k2841K1756j61154k30697j06315J52440M37266M63261K33151P4650
5951B72800m0298j61986j34105o9027k19200m73086n30185m32791l14399l0751
5941b133028K19995J45895L0914J76920L85422L68939J81702q9961j23808P9440
5931g57570J27977J98867L53080M34268K55613j13926k40325n2589p1291k20527
$$ plain form
5921 -86423 -125183 -21253 15934 165426 485259 627567 698044 1011790 1296620 1176884
5911 1176884 749730 400145 173386 -82861 -216376 -116058 15654 1861 -38700 106514
5901 106514 369710 448458 381517 359895 366875 561341 1101162 1772665 2119483 1955226 1402616
5890 1402616 526696 -501997 -1281099 -1395978 -807557 59480 878097 1654530 2208530
5881 2208530 2195761 1598973 831253 331953 174551 284212 474380 486493 275853 308862
5871 308862 876897 1694609 2476871 3160979 3661703 3780745 3416674 2726862 2138615 1767121
5861 1767121 1402825 1203831 1592603 2434913 2991688 2863244 2351757 1809323 1376016 1002986
5851 1002986 585102 85723 -506594 -1061026 -1346638 -1499355 -1999257 -2932598 -3800293 -4073466
$$ packed form
5921h6423l8760J03930L7187J49492L19833J42308P0477L13746K84830j19736
5911A176884m27154l49585k26759k56247j33515J00318J31712j3793m0561J45214
5901A06514K63196P8748o6941k1622O980J94466N39821O71503L46818j64257n52610
5890A402616q75920j028693p79102j14879N88421Q67037Q18617P76433N54000
5881B208530j2769n96788p67720m99300j57402J09661J90168J2113k10640L3009
5871C08862N68035Q17712P82262O84108N00724J19042l64071o89812n88247l71494
5861A767121l64296j98994L88772Q42310N56775j28444n11487n42434m33307l73030
5851A002986m17884m99379n92317n54432k85612j52717m99902r33341q67695k73173
$$ plain form
5841 -4073466 -3594427 -2811133 -2329625 -2055657 -1618835 -1148788 -919480 -912272 -949723 -908768
5831 -908768 -667902 -380815 -402341 -620484 -704523 -590084 -554334 -791284 -1082326 -936132
5821 -936132 -186767 780789 1496061 1826407 1864559 1674228 1322838 1022070 634438 13498
5811 13498 -589435 -977714 -1020969 -735282 -420545 -282156 -232258 -248327 -462663 -755696
5801 -755696 -919978 -873709 -574055 -41591 501964 808625 844662 599058 -8411 -630991
5791 -630991 -795484 -668562 -416428 21613 640695 1342143 1893781 2122298 1917720 1254463
5781 1254463 309036 -612997 -1178932 -1276058 -1167009 -1157653 -1195778 -1135568 -1084143 -1113305 -1116882
5770 -1116882 -811947 -145008 671310 1284962 1416999 1259962 1098430 901575 665232 517996
$$ packed form
5841d073466M79039P83294M81508K73968M36822M70047K29308P208l7451M0955
5831i08768K40866K87087k1526k18143q4039J14439L5750k36950k91042J46194
5821i36132P49365R67556P15272L30346L8152j90331l51390l00768l87632o20940
5811A3498o02933l88279m3255K85687L14737J38389M9898j6069k14336k93033
5801g55696j64282M6269K99654N32464N43555L06661L6037k45604o07469o22580
5791f30991j64493J26922K52134M38041O19082P01448N51638K28517k04578o63257
5781A254463r45427r22033n65935r7126J09049R356l8125O0210N1425k9162l577
5770a116882L04935O66939Q16318O13652J32037j57037j61532j96855k36343j47236
$$ plain form
5760 517996 588606 962018 1668743 2506682 3209120 3573571 3392330 2751013 1857551 802608
5750 802608 -354475 -1488535 -2325734 -2643767 -2488378 -2016759 -1385359 -629442 153388
5741 153388 617699 641124 494566 327532 241208 304439 404026 348606 191865 165014 250903
5730 250903 94366 -360550 -764977 -976024 -1203755 -1481672 -1723488 -2043284 -2395720 -2539493
5720 -2539493 -2343160 -2038763 -1996313 -2109123 -2059348 -2033170 -2309018 -2702552 -2950344 -3102287
5710 -3102287 -3366459 -3737310 -3839183 -3405429 -2628322 -1773119 -953898 -182860 533087 956104
5700 956104 991809 658171 103221 -293780 -410115 -398756 -420976 -496499 -630296 -888556
5690 -888556 -1243164 -1451667 -1282797 -967130 -879000 -943746 -1006684 -1098220 -1352544 -1618085
$$ packed form
5760E17996P0610L73412P06725Q37939P02438L64451j81241o41317q93462j054943
5750H02608j157083j134060q37199l18033J55389M71619O31400P55917P82830
5741A53388M64311K3425j46558j67034q6324O3231R9587n5420j56741k6851Q5889
5730B50903j56537m54916m04427k11047k27731k77917k41816l19796l52436j43773
5720b539493J96333L04397M2450j12810M9775K6178k75848l93534k47792j51943
5710c102287k64172l70851j01873M33754P77107Q55203Q19221P71038P15947M23017
5700I56104L5705l33638n54950l97001j16335J1359k2220p5523j33797k58260
5690h88556l54608k08503J68870L15667Q8130o4746o2938r1536k54324k65541
$$ plain form
5680 -1618085 -1597932 -1411200 -1297857 -1245035 -1159930 -1164505 -1319846 -1542392 -1923873 -2493202
5670 -2493202 -3005802 -3159124 -3028553 -2846613 -2590977 -2145684 -1727851 -1671436 -1951906 -2373722
5660 -2373722 -2607563 -2529123 -2362385 -1943892 -1033163 61845 859504 1038978 626126 45821
5650 45821 -311595 -394649 -243798 -10988 65176 -168794 -612645 -1073531 -1420314 -1528414
5640 -1528414 -1354935 -901717 -403967 -130954 84070 412937 737151 877763 928095 1052300
5630 1052300 1158148 1115760 1007265 1042461 1298118 1749390 2222101 2480125 2336610 1982756
5620 1982756 1890936 2051446 2234445 2422146 2520681 2244989 1684735 1234894 936765 814186
5610 814186 945213 1061867 920356 554596 104933 -183843 -290491 -574825 -1274223 -2143850
$$ packed form
5680a618085K0153J86732J13343N2822Q5105m575j55341k22546l81481n69329
5670b493202n12600j53322J30571J81940K55636M45293M17833N6415k80470m21816
5660b373722k33841P8440J66738M18493R10729J095008P97659J79474m12852n80305
5650D5821l57416q3054J50851K32810P6164k33970m43851m60886l46783j08100
5640a528414J73479M53218M97750K73013K15024L28867L24214J40612N0332J24205
5630A052300J05848m2388j08495L5196K55657M51272M72711K58024j43515l53854
5620A982756r1820J60510J82999J87701R8535k75692n60254m49841k98129j22579
5610H14186J31027J16654j41511l65760m49663k88776j06648k84334o99398q69627
$$ plain form
5600 -2143850 -2828388 -3099015 -2934380 -2482568 -1800324 -1040603 -481880 -270731 -246215 -146788
5590 -146788 82536 304247 354631 149880 -171524 -327937 -363830 -593215 -991246 -1253420
5580 -1253420 -1315368 -1325916 -1269881 -1029096 -551174 -82344 -113812 -705832 -1268442 -1386888
5570 -1386888 -1150138 -744622 -317288 10090 88659 6798 -73068 -277859 -790254 -1293217
5560 -1293217 -1329418 -1023072 -685254 -422648 -191751 -10923 -23160 -102673 -65080 26312
5550 26312 -51047 -325015 -676154 -1074569 -1412349 -1414504 -886431 96725 1149764 1876131
5540 1876131 2100671 1981759 1957423 2265129 2669964 2950436 3196045 3457946 3657302 3768443
5530 3768443 3760238 3496327 2957885 2148643 1093074 83859 -610988 -919157 -853514 -557682
$$ packed form
5600b143850o84538k70627J64635M51812O82244P59721N58723K11149K4516R9427
5590a46788K29324K21711N0384k04751l21404j56413l5893k29385l98031k62174
5580a253420o1948j0548N6035K40785M77922M68830l1468n92020n62610j18446
5570a386888K36750M05516M27334L27378P8569q1861p9866k04791n12395n02963
5560a293217l6201L06346L37818K62606K30897J80828j2237p9513L7593R1392
5550B6312p7359k73968l51139l98415l37780k155N28073R83156J053039P26367
5540A876131K24540j18912k4336L07706M04835K80472K45609K61901J99356J11141
5530C768443q205k63911n38442q09242j055569j009215o94847l08169O5643K95832
$$ plain form
5520 -557682 -314708 -404405 -732172 -988839 -1172956 -1367938 -1430104 -1074408 -416650 111904
5510 111904 489252 1050143 1647405 1965232 2106711 2357436 2741681 3038143 3297369 3632730
5500 3632730 3996789 4334540 4559870 4462663 3930994 3281289 2957935 3080841 3283026 3165630
5490 3165630 2811628 2267299 1411966 401604 -431268 -902412 -1030919 -990650 -917596 -796329
5480 -796329 -754644 -866874 -982826 -1033027 -979732 -920125 -953862 -951146 -881385 -828431 -993215
5469 -993215 -1437534 -2056092 -2668901 -3121898 -3423411 -3490826 -3291186 -3154770 -3268013 -3387372
5459 -3387372 -3217081 -2740411 -2175302 -1796467 -1591903 -1333639 -1141648 -1163644 -1417314 -1779516
5449 -1779516 -2043873 -2180148 -2220494 -2104542 -1890694 -1686287 -1532956 -1304349 -1082303 -977481
$$ packed form
5520e57682K42974q9697l27767k56667j84117j94982o2166L55696O57758N28554
5510A11904L77348N60891N97262L17827J41479K50725L84245K96462K59226L35361
5500C632730L64059L37751K25330r7207n31669o49705l23354J22906K02185j17396
5490C165630l54002n44329q55333j010362q32872m71144j28507M0269P3054J21267
5480g96329M1685j12230j15952n0201N3295N9607l3737K716O9761N2954j64784
5469i93215m44319o18558o12809m52997l01513o7415J99640J36416j13243j19359
5459c387372J70291M76670N65109L78835K04564K58264J91991k1996k53670l62202
5449a779516k64357j36275m0346J15952K13848K04407J53331K28607K22046J04822
$$ plain form
5439 -977481 -762392 -326754 160067 621010 1112757 1534794 1731342 1802747 1811431 1725574
5429 1725574 1683954 1579759 1179776 491455 -161856 -296407 103345 663981 1069478 1310490
5419 1310490 1586416 1902057 2177296 2239125 2078509 1950631 1897766 1916995 1893406 1608478
5409 1608478 1065516 515699 294650 409090 479269 364796 196278 66464 6127 -13077
5399 -13077 -123098 -284738 -373499 -590604 -971405 -1325565 -1603041 -1842101 -2130886 -2569705
5389 -2569705 -2925323 -2934146 -2679060 -2295799 -1831744 -1340383 -970568 -759196 -641903 -705916
5379 -705916 -799150 -747835 -705154 -623363 -346145 71681 408682 432559 -15873 -787525 -1320268
5368 -1320268 -1243153 -936766 -904053 -1133583 -1390425 -1609398 -1773031 -1789869 -1590597 -1300447
$$ packed form
5439i77481K15089M35638M86821M60943M91747M22037J96548P1405Q684q5857
5429A725574m1620j04195l99983o88321o53311j34551L99752N60636M05497K41012
5419A310490K75926L15641K75239O1829j60616j27878n2865J9229k3589k84928
5409A608478n42962n49817k21049J14440P0179j14473j68518j29814o0337j9204
5399a3077j10021j61640q8761k17105l80801l54160k77476k39060k88785m38819
5389b569705l55618q823K55086L83261M64055M91361L69815K11372J17293o4013
5379g05916r3234N1315M2681Q1791K77218M17826L37001K3877m48432p71652n32743
5368a320268P7115L06387L2713k29530k56842k18973j63633j6838J99272K90150
$$ plain form
5358 -1300447 -1043190 -777155 -437856 -166753 -199956 -577612 -1127971 -1498003 -1460660 -992096
5348 -992096 -275469 366064 820562 1119745 1278143 1315999 1322662 1501784 1788527 1890538
5338 1890538 1858545 1921799 2134726 2411929 2614861 2608393 2334003 1885358 1513375 1407968
5328 1407968 1503846 1637856 1816967 2139715 2583288 2898985 2943193 2876864 2712110 2448409
5318 2448409 2143850 1871098 1620927 1337219 1190982 1233001 1300604 1345181 1452063 1796816
5308 1796816 2226943 2434518 2422618 2240622 2000398 1763172 1566647 1486991 1451171 1334550
5298 1334550 1200656 1082814 951788 785046 624139 522770 642937 995437 1343678 1591907
5288 1591907 1707741 1564387 1023888 155006 -702642 -1081108 -710959 58558 475786 217427
$$ packed form
5358a300447K57257K66035L39299K71103l3203l77656n50359l70032L7343M68564
5348i92096P16627O41533M54498K99183J58398L7856O663J79122K86743J02011
5338A890538l1993O3254K12927K77203K02932o468k74390m48645l71983j05407
5328A407968R5878J34010J79111L22748M43573L15697M4208o6329j64754k63701
5318B448409l04559k72752k50171k83708j46237M2019O7603M4577J06882L44753
5308A796816M30127K07575j1900j81996k40224k37226j96525p9656l5820j16621
5298A334550j33894j17842j31026j66742j60907j01369J20167L52500L48241K48229
5288A591907J15834j43354n40499q68882q57648l78466L70149P69517M17228k58359
$$ plain form
5278 217427 -347153 -897970 -1482351 -1920053 -1881781 -1310705 -617084 -224720 -101345 -168835
5268 -168835 -411046 -597106 -595074 -531131 -360379 -82221 48423 -49254 -352587 -593198
5258 -593198 -539399 -375914 -336592 -453588 -597939 -610317 -464789 -284684 -166265 -113819
5248 -113819 3781 162316 127723 -52666 -92365 -72323 -314080 -720872 -1028151 -1221502
5238 -1221502 -1283520 -1228885 -1124510 -967518 -824195 -639948 -315522 23488 191734 210932
5228 210932 288590 339944 199296 2503 -9539 256072 733552 1218803 1437171 1246884
5218 1246884 904973 645385 425289 213105 15077 -263310 -613582 -985639 -1364031 -1514013
5208 -1514013 -1299415 -994700 -902091 -965020 -1026640 -1087122 -1160918 -1149432 -1028597 -875136 -694733
$$ packed form
5278B17427n64580n50817n84381m37702L8272N71076O93621L92364J23375o7490
5268a68835k42211j86060K032O3943J70752K78158J30644r7677l03333k40611
5258e93198N3799J63485L9322j16996j44351j2378J45528J80105J18419N2446
5248a13819J17600J58535l4593j80389l9699K0042k41757m06792l07279j93351
5238a221502o2018N4635J04375J56992J43323J84247L24426L39010J68246J9198
5228B10932P7658N1354j40648j96793j2042K65611M77480M85251K18368j90287
5218A246884l41911k59588k20096k12184j98028k78387l50272l72057l78392j49982
5208a514013K14598L04715R2609o2929o1620o0482p3796J1486J20835J53461J80403
$$ plain form
5197 -694733 -544977 -580388 -772678 -1121325 -1573511 -1924298 -2115152 -2157310 -1940235 -1473631
5187 -1473631 -943747 -405065 98442 267134 -71591 -691342 -1279660 -1805296 -2218615 -2348018
5177 -2348018 -2316805 -2494211 -2858017 -3039016 -2768783 -2168916 -1650251 -1262562 -817066 -353895
5167 -353895 93078 445235 475819 168960 -284946 -794528 -1163910 -1182323 -934776 -555073
5157 -555073 -95757 337509 704091 847057 712493 456569 71385 -421092 -776085 -670592
5147 -670592 -141718 434592 828303 933607 825663 768978 869186 1134943 1466684 1410850
5137 1410850 723463 -299208 -1235293 -1821647 -1953629 -1823531 -1690846 -1601889 -1442697 -1044617
5127 -1044617 -421547 201119 545065 558940 327177 -52659 -349392 -476353 -328540 314129
$$ packed form
5197f94733J49756l5411j92290l48647m52186l50787j90854m2158K17075M66604
5187a473631N29884N38682N03507J68692l38725o19751n88318n25636m13319j29403
5177b348018L1213j77406l63806j80999K70233N99867N18665L87689M45496M63171
5167c53895M46973L52157L0584l06859m53906n09582l69382j8413K47547L79703
5157e55073M59316M33266L66582J42966j34564k55924l85184m92477l54993J05493
5147f70592N28874N76310L93711J05304j07944n6685J00208K65757L31741n5834
5137A410850o87387j022671r36085n86354j31982J30098J32685Q8957J59192L98080
5127a044617O23070O22666L43946J3875k31763l79836k96733j26961J47813O42669
$$ plain form
5117 314129 1181822 1748598 1862438 1638082 1299091 1162878 1446329 1827045 1788768 1299436
5107 1299436 587352 -103139 -516566 -568132 -532060 -619643 -843301 -952276 -699161 -139768
5097 -139768 607397 1340477 1851015 2073081 1964884 1555971 861903 24878 -721349 -1295869
5087 -1295869 -1754585 -2257140 -2800919 -3166331 -3183334 -2929525 -2604458 -2154902 -1375486 -246588
5077 -246588 956406 1928635 2440091 2412708 1927174 1083714 224577 -185430 -112378 18897
5067 18897 -47721 -275115 -569313 -696710 -424173 136337 739013 1194998 1404910 1220563
5057 1220563 583226 -446737 -1621496 -2478537 -2755121 -2639433 -2435986 -2187673 -1876196
5048 -1876196 -1620749 -1437210 -1150355 -771239 -427730 -205986 -103531 -70724 -33497 70424
$$ packed form
5117C14129Q67693N66776J13840k24356l38991j36213K83451L80716l8277m89332
5107A299436p12084o90491m13427n1566L6072q7583k23658j08975K53115N59393
5097a39768P47165P33080N10538K22066j08197m08913o94068q37025p46227n74520
5087a295869m58716n02555n43779l65412j7003K53809L25067M49556P79416J128898
5077b46588J202994R72229N11456k7383m85534q43460q59137m10007P3052J31275
5067A8897o6618k27394k94198j27397K72537N60510O02676M55985K09912j84347
5057A220563o37337j029963j174759q57041k76584J15688K03447K48313L11477
5048a876196K55447J83539K86855L79116L43509K21744J02455L2807L7227J03921
$$ plain form
5038 70424 178563 136462 -86795 -395222 -583234 -418422 47678 477663 705577 887212
5028 887212 1295174 1825190 2096215 2081623 1984683 1953045 2028844 2143416 2288212 2560890
5018 2560890 2942908 2953660 2288153 1284821 330351 -299246 -351972 117270 666731 799755
5008 799755 365846 -280450 -768137 -933178 -792925 -561925 -469584 -662460 -967884 -1135828
4998 -1135828 -1073327 -670182 -101227 278983 500761 933991 1606840 2306240 3026630 3804351
4988 3804351 4321930 4337526 4044139 3631088 3175595 2857239 2834137 3050660 3435062 3976519
4978 3976519 4342327 4262416 4055844 3893615 3721814 3688268 3787489 3952882 4232472 4494116
4968 4494116 4549773 4370319 3764909 2877154 2088430 1474135 969733 481625 55484 -117770
$$ packed form
5038G0424J08139m2101k23257l08427j88012J64812M66100M29985K27914J81635
5028H87212M07962N30016K71025j4592r6940l1638P5799J14572J44796K72678
5018B560890L82018J0752o65507j003332r54470o29597n2726M69242N49461J33024
5008G99755m33909o46296m87687j65041J40253K31000R2341j92876l05424j67944
4998a135828O2501M03145N68955L80210K21778M33230O72849O99400P20390P77721
4988C804351N17579J5596k93387m13051m55493l18356k3102K16523L84402N41457
4978C976519L65808p9911k06572j62229j71801l3546R9221J65393K79590K61644
4968D494116N5657j79454o05410q87755p88724o14295n04402m88108m26141j73254
$$ plain form
4958 -117770 -18958 256455 691500 1292496 1960446 2559776 3057875 3396819 3530761 3607570
4948 3607570 3948657 4704253 5636465 6424853 7063416 7721785 8439691 9072651 9605508 10045587
4938 10045587 10261534 10208537 10096471 10191028 10600821 11294040 12250156 13549666 15104856
4929 15104856 16537490 17520020 18149016 18809545 19698969 20895224 22378548 23723990 24710353
4920 24710353 25562204 26359624 27036077 27528597 27893106 28491813 29402799 30090433 30324200
4911 30324200 30281089 30077023 29656984 28997027 28323459 27846689 27359439 26704150 25893794 24903336
4901 24903336 23866339 22971357 22245198 21583978 20690759 19570551 18475428 17461201 16676233
4892 16676233 16210168 15762419 14976630 13980461 13051602 12318559 11675161 11009394 10363565
$$ packed form
4958a17770R8812K75413M35045O00996O67950N99330M98099L38944J33942P6809
4948C607570L41087P55596R32212P88388O38563O58369P17906O32960N32857M40079
4938A0045587K15947n2997j12066R4557M09793O93219R56116J299510J555190
4929A5104856J432634R82530O28996O60529Q89424J196255J483324J345442R86363
4920B4710353Q51851P97420O76453M92520L64509N98707R10986O87634K33767
4911C0324200m3111k04066m20039o59957o73568m76770m87250o55289q10356r90458
4901B4903336j036997q94982p26159o61220q93219j120208j095123j014227p84968
4892A6676233m66065m47749p85789r96169r28859p33043o43398o65767o45829
$$ plain form
4883 10363565 9828562 9527048 9505875 9531092 9419207 9291807 9002071 8225289 7029023 5883908
4873 5883908 5171725 4922563 4789872 4563195 4179211 3703398 3347743 3166970 3031038 2921644
4863 2921644 2857013 2632635 2212437 1979018 2160715 2558026 3018666 3476394 3804130 3822231
4853 3822231 3495131 2907469 2260578 1744336 1340627 1215901 1547991 2160304 2630257 2700970
4843 2700970 2729683 2857656 2919100 3164973 3589937 3534131 2742775 1737850 1047046 800200
4833 800200 787119 686558 246743 -476289 -1147669 -1579851 -1644637 -1403584 -1182736 -1089952
4823 -1089952 -957342 -726470 -587291 -528143 -411356 -343176 -570338 -985540 -1189765 -1038876
4813 -1038876 -788725 -779562 -902687 -719845 -96603 651526 1055340 1104115 1126508 1172043
$$ packed form
4883A0363565n35003l01514k1173K5217j11885j27400k89736p76782j196266j145115
4873E883908p12183k49162j32691k26677l83984m75813l55655j80773j35932j09394
4863B921644o4631k24378m20198k33419J81697L97311M60640M57728L27736J8101
4853C822231l27100n87662o46891n16242m03709j24726L32090O12313M69953P0713
4843B700970K8713J27973O1444K45873M24964n5806p91356j004925o90804k46846
4833H00200j3081j00561m39815p23032o71380m32182o4786K41053K20848R2784
4823a089952J32610K30872J39179N9148J16787O8180k27162m15202k04225J50889
4813a038876K50151R163j23125J82842O23242P48129M03814M8775K2393M5535
$$ plain form
4803 1172043 1013345 710993 652733 896394 1025267 696723 -42362 -970089 -1740945 -1990246
4793 -1990246 -1710065 -1047105 23136 1283731 2248130 2672387 2702099 2551234 2351024
4784 2351024 2135007 1968391 1887586 1762351 1390057 854147 352133 -75891 -497851 -954261
4774 -954261 -1284170 -1370905 -1359342 -1338711 -1194333 -865990 -589500 -527559 -623056 -718254 -810833
4763 -810833 -826167 -468763 325245 1138136 1495983 1442155 1376943 1388408 1163052 577316
4753 577316 -198290 -826095 -1079436 -1149995 -1233850 -1352842 -1509932 -1566446 -1590933 -1783136
4743 -1783136 -2048813 -2092520 -2095187 -2291793 -2354757 -2017443 -1489312 -1173076 -1141303 -1318342
4733 -1318342 -1569944 -1737854 -1905206 -2251267 -2831930 -3368070 -3569415 -3434869 -3226017 -2994526
$$ packed form
4803A172043j58698l02352n8260K43661J28873l28544p39085r27727p70856k49301
4793a990246K80181O62960J070241J260595R64399M24257K9712j50865k00210
4784B351024k16017j66616q0805j25235l72294n35910n02014m28024m21960m56410
4774i54261l29909q6735J1563K0631J44378L28343K76490O1941r5497r5198r2579
4763h10833j5334L57404P94008Q12891L57847n3828o5212J1465k25356n85736
4753E77316p75606o27805k53341p0559q3855j18992j57090n6514k4487j92203
4743a783136k65677m3707k667j96606o2964L37314N28131L16236L1773j77039
4733a318342k51602j67910j67352l46061n80663n36140k01345J34546K08852K31491
$$ plain form
4723 -2994526 -2717722 -2447172 -2089117 -1779304 -1618800 -1376527 -816656 -54221 458912 434645
4713 434645 -91113 -863329 -1385891 -1390240 -1186734 -1170283 -1236804 -1145572 -1106752 -1427888 -1936228
4702 -1936228 -2359254 -2822288 -3242586 -3346092 -3134867 -2771323 -2363981 -1997162 -1810903 -1743978
4692 -1743978 -1598213 -1497827 -1638451 -1868331 -1954115 -1837947 -1636298 -1429693 -1091392 -515803
4682 -515803 71157 272696 -58491 -863578 -1876371 -2419404 -2137478 -1379210 -734518 -593439
4672 -593439 -743960 -843295 -894490 -913276 -739510 -313586 91522 127799 -138329 -434201
4662 -434201 -565138 -468604 -284393 -40708 306147 774190 1140926 1216421 1224060 1387993
4652 1387993 1555991 1492179 1358981 1277412 914935 156850 -511100 -590218 -81517 484526
$$ packed form
4723b994526K76804K70550L58055L09813J60504K42273N59871P62435N13133k4267
4713D34645n25758p72216n22562m349K03506J6451o6521R1232L8820l21136n08340
4702a936228m23026m63034m20298j03506K11225L63544M07342L66819J86259O6925
4692a743978J45765J00386j40624k29880q5784J16168K01649K06605L38301N75589
4682e15803N86960K01539l31187q05087j012793n43033K81926P58268O44692J41079
4672e93439j50521r9335n1195j8786J73766M25924M05108L6277k66128k95872
4662d34201j30937R6534J84211K43685L46855M68043L66736P5495P639J63933
4652A387993J67998o3812j33198q1569l62477p58085o67950p9118N08701N66043
$$ plain form
4642 484526 647754 413834 56260 -191381 -277357 -288209 -178573 108082 213997 6607
4632 6607 -165665 -245545 -433830 -641725 -765433 -884809 -1087744 -1324002 -1401980 -1373009 -1301858
4621 -1301858 -1063646 -573899 57160 543230 663439 497605 322878 394838 858673 1400842
4611 1400842 1755573 2156617 2625885 2918048 2887176 2463409 1668949 481143 -927435
4602 -927435 -2111844 -2744434 -2950791 -2853075 -2597975 -2409428 -2272446 -2254270 -2425188 -2622145
4592 -2622145 -2568198 -2199850 -1841415 -1707238 -1651204 -1581455 -1418785 -947455 -276884 475472
4582 475472 1367149 2028530 2062312 1601980 1027486 624796 497579 436014 221591 143329
4572 143329 302237 322073 168202 92787 161189 175170 124979 405230 1067841 1710257 2122542
$$ packed form
4642D84526J63228k33920l57574k47641q5976j0852J09636K86655J05915k07390
4632F607j72272p9880j88285k07895j23708j19376k02935k36258p7978K8971P1151
4621a301858K38212M89747O31059M86070J20209j65834j74727P1960M63835N42169
4611A400842L54731M01044M69268K92163l0872m23767p94460j187806j408578
4602i27435j184409o32590k06357R7716K55100J88547J36982J8176j70918j96957
4592b622145N3947L68348L58435J34177N6034O9749J62670M71330O70571P52356
4582D75472Q91677O61381L3782m60332n74494m02690j27217o1565k14423p8262
4572A43329J58908J9836j53871p5415O8402J3981n0191K80251O62611O42416M12285
$$ plain form
4561 2122542 2227736 1909582 1385937 882509 458453 32062 -508900 -1092415 -1452996 -1333215
4551 -1333215 -754433 59272 862543 1328245 1374572 1202114 923925 473582 -71836 -410791
4541 -410791 -429362 -153556 202572 454305 548148 476987 232377 -245759 -972458 -1608418
4531 -1608418 -1820434 -1618213 -1184281 -649136 -181472 -100321 -484315 -1024009 -1495288 -1926381
4521 -1926381 -2310586 -2560496 -2633755 -2568544 -2493369 -2408668 -2169010 -1699088 -1122390 -738745
4511 -738745 -685625 -903450 -1298010 -1778843 -2049176 -1875733 -1512283 -1164946 -836143 -504293
4501 -504293 -198170 -164611 -451068 -824202 -1110090 -1343652 -1421633 -1208837 -771642 -203054
4491 -203054 284887 419705 165527 -104846 -281124 -679269 -1523258 -2470675 -2853574 -2452872
$$ packed form
4561B122542J05194l18154n23645n03428m24056m26391n40962n83515l60581J19781
4551a333215N78782Q13705Q03271M65702M6327j72458k78189m50343n45418l38955
4541d10791j8571K75806L56128K51733R3843p1161k44610m78136p26699o35960
4531a608418k12016K02221M33932N35145M67664Q1151l83994n39694m71279m31093
4521a926381l84205k49910p3259O5211P5175Q4701K39658M69922N76698L83645
4511g38745N3120k17825l94560m80833k70333J73443L63450L47337L28803L31850
4501e04293L06123L3559k86457l73134k85888k33562p7981K12796M37195N68588
4491b03054M87941J34818k54178k70373j76278l98145q43989r47417l82899M00702
$$ plain form
4481 -2452872 -1633680 -832076 -112274 622364 1173147 1236082 743584 -72000 -849275 -1445882
4471 -1445882 -1956402 -2534091 -3065992 -3196141 -2815681 -2101219 -1426560 -1173227 -1481800 -2104893
4461 -2104893 -2621909 -2935515 -3206572 -3372194 -3363369 -3328461 -3266164 -2990532 -2338029 -1493049
4451 -1493049 -848903 -572208 -587315 -786490 -1274566 -1999663 -2668975 -2907384 -2527615 -1742434
4441 -1742434 -939368 -440014 -397219 -599316 -706427 -611718 -535969 -620803 -633258 -383473
4431 -383473 198140 1060957 2033408 2849280 3239793 3232239 3239546 3592648 4053388 4116127 3569789
4420 3569789 2600233 1622258 922286 580740 492834 492792 473780 354226 36101 -614003 -1498297
4409 -1498297 -2203843 -2302917 -1746945 -923942 -287308 -17642 -8906 -183918 -549080 -1012625
$$ packed form
4481b452872Q19192Q01604P19802P34638N50783O2935m92498q15584p77275n96607
4471a445882n10520n77689n31901j30149L80460P14462O74659K53333l08573o23093
4461b104893n17016l13606k71057j65622Q825L4908O2297K75632O52503Q44980
4451a493049O44146K76695j5107j99175m88076p25097o69312k38409L79769P85181
4441a742434Q03066M99354M2795k02097j07111R4709P5749q4834j2455K49785
4431c83473N81613Q62817R72451Q15872L90513p554P307L53102M60740O2739n46338
4420C569789r69556r77975o99972l41546q7906m2j9012j19554l18125o50104q84294
4409a498297p05546r9074N55972Q23003O36634K69666Q736j75012l65162m63545
$$ plain form
4399 -1012625 -1572271 -2062576 -2313271 -2475555 -2643585 -2639578 -2458740 -2349029 -2334943 -2172898
4389 -2172898 -1808545 -1502602 -1242488 -882786 -635065 -887359 -1704804 -2634306 -3090590 -2845573
4379 -2845573 -2057030 -1119389 -448768 -161747 48021 368526 585507 571316 471133 533853
4369 533853 855482 1414487 2016763 2157411 1762994 1282819 838183 349931 -137856 -540068
4359 -540068 -857950 -1131500 -1279791 -1239289 -1010654 -608133 -121177 265066 504759 674946
4349 674946 706877 472662 394 -526351 -936833 -1163452 -1118480 -898432 -870203 -1186938
4339 -1186938 -1485042 -1284150 -690518 -218332 -146805 -548760 -1217914 -1699263 -1789611 -1492331
4329 -1492331 -881685 -307390 -98909 -359803 -820588 -1070112 -890627 -450399 -61407 88127
$$ packed form
4399a012625n59646m90305k50695j62284j68030M007J80838J09711J4086J62045
4389b172898L64353L05943K60114L59702K47721k52294q17445r29502m56284K45017
4379b845573P88543R37641O70621K87021K09768L20505K16981j4191j00183O2720
4369E33853L21629N59005O02276J40648l94417m80175m44636m88252m87787m02212
4359e40068l17882k73550j48291M0502K28635M02521M86956L86243K39693J70187
4349F74946L1931k34215m72268n26745m10482k26619M4972K20048K8229l16735
4339a186938k98104K00892N93632M72186P1527m01955o69154m81349r0348K97280
4329a492331O10646N74295K08481k60894m60785k49524J79485M40228L88992J49534
$$ plain form
4319 88127 51349 -49360 35736 497362 939848 918692 620715 491664 678627 948252
4309 948252 921460 507040 -76688 -285667 137340 731059 1053394 1053101 932901 922906 1027627
4298 1027627 1065310 900331 509470 55779 -52058 195038 448947 608815 664264 616082
4288 616082 397945 -116386 -735653 -987118 -770499 -395943 -54340 239749 388067 272358
4278 272358 23046 -28709 207036 347487 106310 -397466 -874096 -1140053 -1271431 -1496785
4268 -1496785 -1838110 -2001977 -1891268 -1772370 -1847202 -2170112 -2584747 -2885863 -2894380 -2691196
4258 -2691196 -2455492 -2147657 -1733671 -1269803 -750345 -201587 313102 708614 689376 103542
4248 103542 -841784 -1635071 -1907682 -1734317 -1307149 -660145 242053 1362873 2558285
$$ packed form
4319H8127l6778j00709Q5096M61626M42486k1156k97977j29051J86963K69625
4309I48252k6792m14420n83728k08979M23007N93719L22335k93j20200r995J04721
4298A027627L7683j64979l90861m53691j07837K47096K53909J59868N5449m8182
4288F16082k18137n14331o19267k51465K16619L74556L41603K94089J48318j15709
4278B72358k49312n1755K35745J40451k41177n03776m76630k65957j31378k25354
4268a496785l41325j63867J10709J18898p4832l22910m14635l01116q517K03184
4258b691196K35704L07835M13986M63868N19458N48758N14689L95512j9238n85834
4248A03542r45326p93287k72611J73365M27168O47004R02198J120820J195412
$$ plain form
4239 2558285 3575636 4050932 3778138 3203115 2686300 2164510 1649564 1159459 737284
4230 737284 429043 196910 136833 312186 652070 1041760 1088788 738977 373833 103751
4220 103751 -45219 -1701 96820 162360 231842 259125 143608 43297 290494 799730 1139172
4209 1139172 1171695 1201587 1484617 2008630 2643423 3082769 3082970 2706527 2096477 1358988
4199 1358988 684952 354909 406391 544365 485142 100632 -541691 -1175907 -1583633 -1747862
4189 -1747862 -1684110 -1463284 -1298801 -1308991 -1466728 -1521278 -1320131 -1192654 -1501804 -2157100
4179 -2157100 -2737026 -2978589 -2900894 -2432707 -1423009 -277814 414366 549975 399308
4170 399308 308067 337873 357040 342122 422756 456149 365716 408725 663245 880389 973355
$$ packed form
4239B558285J017351M75296k72794n75023n16815n21790n14946m90105m22175
4230G37284l08241k32133o0077J75353L39884L89690M7028l49811l65144k70082
4220A03751j48970M3518R8521O5540O9482K7283j15517j00311K47197N09236L39442
4209A139172L2523K9892K83030N24013O34793M39346K01l76443o10050p37489
4199A358988o74036l30043N1482J37974n9223l84510o42323o34216m07726j64229
4189a747862O3752K20826J64483j0190j57737n4550K01147J27477l09150o55296
4179b157100n79926k41563P7695M68187J009698J145195O92180J35609j50667
4170C99308r1241K9806J9167j4918Q0634L3393r0433M3009K54520K17144R2966
$$ plain form
4159 973355 1105421 1363735 1557971 1534797 1418033 1156665 687108 297391 191378 195283
4149 195283 126429 -32205 -240445 -454225 -600754 -572225 -302684 -3791 39994 -64495
4139 -64495 -24700 134689 256654 314074 356954 265359 90182 3155 -109972 -248793 -185384
4128 -185384 119400 483190 635670 495286 298912 309890 515096 746940 867075 828805
4118 828805 690691 710534 1121554 1859872 2422639 2261878 1398855 344644 -442788 -973468
4108 -973468 -1324861 -1335936 -1110771 -952385 -923225 -1041500 -1420332 -2095976 -2767741 -3107503
4098 -3107503 -2983336 -2352646 -1330900 -287793 621944 1340290 1670330 1670249 1595614 1551153
4088 1551153 1567486 1719903 1811104 1572309 1029938 372203 -228495 -519592 -318456 169081
$$ packed form
4159I73355J32066K58314J94236k3174j16764k61368m69557l89717j06013L905
4149A95283o8854j58634k08240k13780j46529K8529K69541K98893M3785j04489
4139f4495L9795J59389J21965N7420M2880r1595j75177q7027j13127j38821O3409
4128a85384L04784L63790J52480j40384j96374J0978K05206K31844J20135l8270
4118H28805j38114J9843M11020P38318N62767j60761q63023j054211p87432n30680
4108i73468l51393j1075K25165J58386K9160j18275l78832o75644o71765l39762
4098c107503J24167O30690J021746J043107R09737P18346L30040q1p4635m4461
4088A551153J6333J52417R1201k38795n42371o57735o00698k91097K01136M87537
$$ plain form
4078 169081 700229 1210422 1453042 1307810 930266 480882 63855 -222549 -246690 -129671
4068 -129671 -164394 -400639 -608456 -722552 -873871 -973001 -792769 -253595 570353 1302011
4058 1302011 1378012 724161 -64623 -372809 -193046 10493 -113158 -447562 -848895 -1343769
4048 -1343769 -1765538 -1838296 -1436920 -778830 -210143 235493 497882 595401 471181 -155531
4038 -155531 -1155651 -2056362 -2585693 -2799126 -2827563 -2711834 -2551585 -2460962 -2311167 -1876752
4028 -1876752 -1239527 -593764 -34253 272742 135932 -236274 -586873 -886645 -1133902 -1427486
4018 -1427486 -1595122 -1408773 -1037762 -722842 -449626 -57874 453810 911627 1193259 1213536
4008 1213536 979817 509961 -259197 -1229652 -1945161 -2172971 -1959480 -1366531 -593677 95955
$$ packed form
4078A69081N31148N10193K42620j45232l77544m49384m17027k86404k4141J17019
4068a29671l4723k36245k07817j14096j51319r9130J80232N39174Q23948P31658
4058A302011P6001o53851p88784l08186J79763K03539j23651l34404m01333m94874
4048a343769m21769p2758M01376O58090N68687M45636K62389R7519j24220o26712
4038a55531j000120r00711n29331k13433k8437J15729J60249R0623J49795M34415
4028a876752O37225O45763N59511L06995j36810l72206l50599k99772k47257k93584
4018a427486j67636J86349L71011L14920K73216L91752N11684M57817K81632K0277
4008A213536k33719m69856p69158r70455p15509k27810K13491N92949P72854O89632
$$ plain form
3998 95955 615003 1016689 1381911 1637887 1819254 1977733 2063875 1910585 1382456 808616
3988 808616 507955 363880 259178 -48301 -738722 -1555128 -2076682 -2105591 -1798838 -1542403
3978 -1542403 -1659910 -2037317 -2304616 -2064273 -1320889 -501275 171317 524612 511248 376385
3968 376385 241753 130094 -81894 -503985 -912308 -1090018 -1112583 -1039863 -869042 -754168
3958 -754168 -866326 -1195815 -1440645 -1451263 -1271257 -945889 -633114 -340695 80323 510822
3948 510822 846268 1168322 1612578 2261659 2858106 3067395 2858711 2487424 2146974 1783635
3938 1783635 1431956 1267739 1201134 836932 16345 -944419 -1586952 -1595068 -1056886 -378066
3928 -378066 192544 764198 1346340 1644282 1461425 988787 624609 392771 113249 -58465
$$ packed form
3998I5955N19048M01686L65222K55976J81367J58479Q6142j53290n28129n73840
3988H08616l00661j44075j04702l07479o90421q16406n21554k8909L06753K56435
3978a542403j17507l77407k67299K40343P43384Q19614O72592L53295j3364j34863
3968C76385j34632j11659k11988m22091m08323j77710k2565P2720J70821J14874
3958g54168j12158l29489k44830j0618J80006L25368L12775K92419M21018M30499
3948E10822L35446L22054M44256O49081N96447K09289k08684l71287l40450l63339
3938A783635l51679j64217o6605l64202q20587r60764o42533q116N38182O78820
3928c78066N70610N71654N82142K97942j82857m72638l64178k31838k79522j71714
$$ plain form
3918 -58465 67006 353737 598566 777937 944305 1169578 1573391 2209414 2811361 3127441
3908 3127441 3203077 3179455 3205066 3226727 2989986 2409667 1622331 786285 171823 -80240
3898 -80240 -165596 -308922 -600217 -1100910 -1723468 -2105079 -2106820 -2003756 -1990380 -1960606 -1624624
3887 -1624624 -924290 -1865 944369 1845451 2361680 2225787 1777777 1143168 253745 -706920
3877 -706920 -1389704 -1617078 -1475131 -1175293 -1109240 -1452221 -1884707 -2030374 -1776446 -1240242
3867 -1240242 -566198 63788 352626 72694 -625958 -1508670 -2181858 -2284555 -1918987 -1421475
3857 -1421475 -953038 -433887 157498 608478 750321 540546 213442 13187 -172838 -444739
3847 -444739 -578573 -392676 81460 552565 717818 583455 232617 -333203 -950599 -1376830
$$ packed form
3918e8465J25471K86731K44829J79371J66368K25273M03813O36023O01947L16080
3908C127441P5636k3622K5611K1661k36741n80319p87336q36046o14462k52063
3898h0240q5356j43326k91295n00693o22558l81611j741J03064J3376K9774L35982
3887a624624P00334R22425R46234R01082N16229j35893m48010o34609q89423r60665
3877g06920o82784k27374J41947K99838O6053l42981m32486j45667K53928N36204
3867a240242O74044O29986K88838k79932o98652q82712o73188j02697L65568M97512
3857a421475M68437N19151N91385M50980J41843k09775l27104k00255j86025k71901
3847d44739j33834J85897M74136M71105J65253j34363l50838n65820o17396m26231
$$ plain form
3837 -1376830 -1540477 -1551408 -1433100 -1158915 -884402 -704346 -579550 -345845 202565 891398
3827 891398 1359890 1520764 1405036 1135039 807075 591343 609253 568414 353283 103277
3817 103277 -240675 -914526 -1949969 -2914332 -3341378 -3116494 -2633121 -2343536 -2251441 -2414560
3807 -2414560 -2829199 -3386471 -4021505 -4524626 -4532039 -3871277 -2739759 -1463568 -156059
3798 -156059 1023503 1863030 2267691 2093743 1406756 637711 315593 472144 773049 1035758
3788 1035758 1129575 981629 744410 702885 837776 836967 590254 197139 -268890 -696162
3778 -696162 -1133596 -1639642 -1950793 -1746957 -1100499 -439321 -49389 248574 588004 723156
3768 723156 641557 507991 407812 355830 317735 230859 -33733 -559626 -1166881 -1383619
$$ packed form
3837a376830j63647j0931J18308K74185K74513J80056J24796K33705N48410O88833
3827H91398M68492J60874j15728k69997l27964k15732J7910m0839k15131k50006
3817A03277l43952o73851j035443r64363m27046K24884M83373K89585R2095j63119
3807b414560m14639n57272o35034n03121p413O60762J131518J276191J307509
3798a56059J179562Q39527M04661j73948o86987p69045l22118J56551L00905K62709
3788A035758R3817j47946k37219m1525J34891q09k46713l93115m66029m27272
3778f96162m37434n06046l11151K03836O46458O61178L89932K97963L39430J35152
3768G23156q1599j33566j00179n1982l8095q6876k64592n25893o07255k16738
$$ plain form
3758 -1383619 -992949 -276156 281359 466239 421099 444547 744260 1077567 1283997 1422435
3748 1422435 1506768 1590050 1858220 2263868 2667758 2914602 2772136 2346047 1893874 1483817
3738 1483817 1203781 1356979 1923240 2393298 2403277 2020194 1360527 467887 -383413 -930599
3728 -930599 -1289924 -1576637 -1760601 -1884405 -2037153 -2286593 -2528972 -2503432 -2142283 -1643276
3718 -1643276 -1229717 -855639 -338621 293600 817914 948903 646959 211076 46614 289431
3708 289431 705950 1111717 1468866 1634485 1732970 2074023 2577865 2916611 2979376 2904592
3698 2904592 2789754 2783379 3057891 3437813 3603312 3552577 3575559 3705812 3666932 3455014
3688 3455014 3379629 3555777 3761825 3386828 2345982 1251207 437264 -69356 -371652
$$ packed form
3758a383619L90670P16793N57515J84880m5140K3448K99713L33307K06430J38438
3748A422435Q4333Q3282K68170M05648M03890K46844j42466m26089m52173m10057
3738A483817k80036J53198N66261M70058R979l83083o59667q92640q51300n47186
3728i30599l59325k86713j83964j23804j52748k49440k42379K5540L61149M99007
3718a643276M13559L74078N17018O32221N24314J30989l01944m35883j64462K42817
3708B89431M16519M05767L57149J65619R8485L41053N03842L38746O2765p4784
3698B904592j14838o375K74512L79922J65499n0735K2982J30253l8880k11918
3688C455014p5385J76148K06048l74997j040846j094775q13943n06620l02296
$$ plain form
3679 -371652 -652303 -1086018 -1741214 -2431846 -2970664 -2980734 -2358157 -1673716 -1359919 -1470663
3669 -1470663 -1904094 -2391693 -2648114 -2469787 -1859982 -902660 164366 1044176 1477928
3660 1477928 1352005 944223 609109 431103 439600 703025 1143852 1569853 1800423 1583790
3650 1583790 931229 75584 -653803 -977985 -762027 -50635 920166 2061019 3106490
3641 3106490 3691746 3610568 3108189 2672460 2420386 2120782 1764980 1538192 1409564 1180835
3631 1180835 828496 602723 622060 900205 1294047 1294647 856336 591968 786952 1095986
3621 1095986 1151338 966613 765009 797899 985782 1013860 847660 645008 530174 624994
3611 624994 859789 1030209 1067038 832350 336198 -193258 -508268 -514425 -135495 720605
$$ packed form
3679c71652k80651m33715o55196o90632n38818j0070O22577O84441L13797j10744
3669a470663m33431m87599k56421J78327O09805R57322J067026Q79810M33752
3660A477928j25923m07782l35114j78006Q497K63425M40827M26001K30570k16633
3650A583790o52561q55645p29387l24182K15958P11392R70801J140853J045471
3641C106490N85256q1178n02379m35729k52074k99604l55802k26788j28628k28729
3631A180835l52339k25773J9337K78145L93842O00m38311k64368J94984L09034
3621A095986N5352j84725k01604L2890J87883K8078j66200k02652j14834R4820
3611F24994K34795J70420L6829k34688m96152n29456l15010o157L78930Q56100
$$ plain form
3601 720605 1655197 2076809 1942664 1526349 1059784 680794 449479 251051 121006 209310
3591 209310 421556 608155 575241 272670 -45137 -172537 -184586 -209209 -186703 49240
3581 49240 356961 423014 289575 230069 359339 433987 61252 -647376 -1218920 -1442636
3571 -1442636 -1397816 -1334233 -1482925 -1716566 -1806489 -1640114 -1199800 -726794 -522080 -704576
3561 -704576 -969367 -966862 -872436 -1105717 -1681955 -2141061 -2132000 -1699103 -958579 -20631 695828
3550 695828 776289 289063 -379668 -848226 -933209 -733458 -579796 -702821 -1012999 -1398035
3540 -1398035 -1776650 -2162112 -2574308 -2809103 -2614324 -2054194 -1564800 -1438055 -1477161 -1365066
3530 -1365066 -1101984 -745792 -386403 -58820 457860 1242149 2023241 2601581 2914701 2840651
$$ packed form
3601G20605R34592M21612j34145m16315m66565l78990k31315j98428j30045Q8304
3591B09310K12246J86599l2914l02571l17807j27400j2049k4623K2506K35943
3581D9240L07721O6053j33439n9506J29270P4648l72735p08628n71544k23716
3571a442636M4820O3583j48692k33641q9923J66375M40314M73006K04714j82496
3561g04576k64791K505R4426k33281n76238m59106R061M32897P40524R37948P16459
3550F95828Q0461m87226o68731m68558q4983J99751J53662j23025l10178l85036
3540a398035l78615l85462m12196k34795J94779N60130M89394J26745l9106J12095
3530a365066K63082L56192L59389L27583N16680P84289P81092N78340L13120p4050
$$ plain form
3520 2840651 2221569 1259820 457262 47239 -95511 -238633 -526305 -818102 -1006540 -1063561
3510 -1063561 -1090376 -1359610 -1878197 -2328573 -2553454 -2649769 -2661031 -2478629 -2190217 -1949550
3500 -1949550 -1755322 -1540948 -1365759 -1330745 -1402861 -1607776 -2032974 -2571724 -2917486 -2867428
3490 -2867428 -2485879 -2016436 -1683860 -1573525 -1491966 -1240213 -927875 -702849 -638146 -745192
3480 -745192 -993456 -1191799 -1277417 -1471167 -1810183 -2077626 -2289927 -2578062 -2813053 -2708316
3470 -2708316 -2339551 -2104602 -2110481 -2207590 -2328378 -2489611 -2514476 -2230171 -1702832 -1040427
3460 -1040427 -264897 626078 1444545 1828710 1636623 1060121 499971 73664 -345239 -855164
3450 -855164 -1465692 -1995896 -2235295 -2099002 -1733045 -1242448 -616188 -194073 -299460 -664702
$$ packed form
3520B840651o19082r61749q02558m10023j42750j43122k87672k91797j88438n7021
3510a063561k6815k69234n18587m50376k24881r6315j1262J82402K88412K40667
3500a949550J94228K14374J75189L5014p2116k04915m25198n38750l45762N0058
3490b867428L81549M69443L32576J10335Q1559K51753L12338K25026O4703j07046
3480g45192k48264j98343q5618j93750l39016k67443k12301k88135k34991J04737
3470b708316L68765K34949n879r7109j20788j61233k4865K84305N27339O62405
3460a040427P75530Q90975Q18467L84165j92087n76502n60150m26307m18903n09925
3450h55164o10528n30204k39399J36293L65957M90597O26260M22115j05387l65242
$$ plain form
3440 -664702 -1025020 -1372173 -1763889 -2185766 -2400207 -2055475 -1263101 -476928 169224 654738
3430 654738 1035973 1527210 2162649 2523870 2484230 2348062 2250270 2213843 2315033 2482531
3420 2482531 2574726 2535011 2347458 2034796 1608635 937062 -82341 -1325203 -2263168 -2468697
3410 -2468697 -2214571 -1973988 -1832451 -1495575 -928793 -425595 -194902 -357074 -743458 -1107394
3400 -1107394 -1332150 -1559795 -1889210 -2156543 -2343233 -2462318 -2379252 -2084120 -1700185 -1158196
3390 -1158196 -386924 284691 568086 570010 572117 806714 1244479 1674172 2074087 2498955
3380 2498955 2705556 2524344 2281489 2368347 2720042 2967055 3007170 3041683 3021216 2695477
3370 2695477 2305137 2089132 1945174 2056381 2654625 3497890 4021526 3943813 3345504 2536205
$$ packed form
3440f64702l60318l47153l91716m21877k14441L44732P92374P86173O46152M85514
3430F54738L81235M91237O35439L61221l9640j36168r7792l6427J01190J67498
3420B482531R2195l9715j87553l12662m26161o71573j019403j242862r37965k05529
3410b468697K54126K40583J41537L36876N66782N03198K30693j62172l86384l63936
3400a107394k24756k27645l29415k67333j86690j19085Q3066K95132L83935N41989
3390a158196P71272O71615K83395J924K107K34597M37765M29693L99915M24868
3380B498955K06601j81212k42855Q6858L51695K47013M0115L4513k0467l25739
3370B695477l90340k16005j43958J11207N98244Q43265N23636p7713n98309q09299
$$ plain form
3360 2536205 1980545 1822878 1770304 1455391 802804 264571 238662 475742 538685 555945
3350 555945 770015 1084359 1295031 1206309 762952 167591 -396665 -900127 -1174503 -1300243
$$ packed form
3360B536205n55660j57667n2574l14913o52587n38233k5909K37080O2943J7260
3350E55945K14070L14344K10672q8722m43357n95361n64256n03462k74376j25740
$$ [...]
##END NTUPLES=NMR SPECTRUM
##END=
