##TITLE=C13_IBA1203-3
 CDCl3, 22100 sc

 14.3.2024
##JCAMPDX= 6.0         $$ Bruker NMR JCAMP-DX V2.0
##DATA TYPE= NMR SPECTRUM
##DATA CLASS= NTUPLES
##ORIGIN= UXNMR, Bruker Analytische Messtechnik GmbH
##OWNER= root
$$ XWIN-NMR		Version 3.5
$$ Fri Mar 15 13:43:04 2024 Russian Standard Time (UT+4h)  she@DPX200
##.OBSERVE FREQUENCY= 50.327896
##.OBSERVE NUCLEUS= ^13C
##.ACQUISITION MODE= SIMULTANEOUS
##.ACQUISITION SCHEME= undefined
##.AVERAGES= 22401
##.DIGITISER RES= 17
##SPECTROMETER/DATA SYSTEM= spect
##.PULSE SEQUENCE= zgpg30
##.SOLVENT NAME= DMSO
##.SHIFT REFERENCE= (INTERNAL, DMSO, 0, 222.646)
##AUDIT TRAIL= $$ (NUMBER, WHEN, WHO, WHERE, WHAT)
$$ ##TITLE= Audit trail, XWIN-NMR		Version 3.5
$$ ##JCAMPDX= 5.01
$$ ##ORIGIN= Bruker BioSpin GmbH
$$ ##OWNER= she
$$ F:/spectra/data/she/nmr/c13/1/pdata/1/auditp.txt
$$ ##AUDIT TRAIL=  $$ (NUMBER, WHEN, WHO, WHERE, WHAT)
(   1,<2024-03-15 13:41:32.71 +0400>,<she>,<DPX200>,
      <created by zg, POWCHK disabled, PULCHK disabled
       terminated by command 'halt'
       configuration hash MD5:
       00 E9 B6 7A A2 85 ED C7 34 08 36 98 17 FE 4E 26
       data hash MD5: 32K
       3D EF 0C 3A 5F 60 6A EE 40 52 DE BF F2 DD 89 13>)
(   2,<2024-03-15 13:41:37.96 +0400>,<she>,<DPX200>,
      <Start of raw data processing
       efp BC_mod = 2 LB = 2 FT_mod = 6 PKNL = 1 PHC0 = -386.576 PHC1 = 27.9862 SI = 32K 
       data hash MD5: 32K
       24 99 91 C2 C5 4D 81 02 8D 34 A8 92 15 45 54 E4>)
(   3,<2024-03-15 13:41:40.39 +0400>,<she>,<DPX200>,
      <abs ABSG = 5 
       data hash MD5: 32K
       A0 C7 6D 52 CC 02 9F 74 84 12 4B 93 22 83 F5 4C>)
(   4,<2024-03-15 13:42:10.68 +0400>,<she>,<DPX200>,
      <pk PHC0 = -0.0008324977 PHC1 = 1.4 
       data hash MD5: 32K
       3F 91 43 7A 9D 18 B3 55 DE 34 12 52 7E 96 2A 0A>)
$$ ##END=
$$ 
$$ hash MD5
$$ DD 14 D6 AE A4 9D 64 00 57 E5 71 BA 85 65 47 5C
##$RELAX= 
##$RELAX= 
##$RELAX= 
##$RELAX= 
##$RELAX= 
##$RELAX= 
##$RELAX= 
##$RELAX= 
$$ Bruker specific parameters
$$ --------------------------
##$DU= <F:/spectra>
##$EXPNO= 1
##$NAME= <c13>
##$PROCNO= 1
##$TYPE= <nmr>
##$USER= <she>
##$AMP= (0..31)
100 100 100 100 100 100 100 100 100 100 100 100 100 100 100 100 100 100 
100 100 100 100 100 100 100 100 100 100 100 100 100 100 
##$AQSEQ= 0
##$AQ_mod= 1
##$AUNM= <au_zg>
##$AUTOPOS= <>
##$BF1= 50.322709
##$BF2= 200.13
##$BF3= 50.322709
##$BF4= 500.13
##$BF5= 500.13
##$BF6= 500.13
##$BF7= 500.13
##$BF8= 500.13
##$BYTORDA= 1
##$CFDGTYP= 0
##$CFRGTYP= 5
##$CHEMSTR= <none>
##$CNST= (0..31)
1 1 145 1 1 1 1 1 1 1 1 1 1 1 1 1 1 1 1 1 1 1 1 1 1 1 1 1 1 1 1 1 
##$CPDPRG= <waltz16>
##$CPDPRG1= <>
##$CPDPRG2= <waltz16>
##$CPDPRG3= <>
##$CPDPRG4= <mlev>
##$CPDPRG5= <mlev>
##$CPDPRG6= <mlev>
##$CPDPRG7= <mlev>
##$CPDPRG8= <mlev>
##$CPDPRGB= <>
##$CPDPRGT= <>
##$D= (0..31)
0 2 0.00345 0 0 0 0 0 0 0 0 0.03 2e-05 3e-06 0 0 0 0 0 0 0 0 0 0 0 0 0 
0 0 0 0 0 
##$DATE= 1710419163
##$DBL= (0..7)
120 120 120 120 120 120 120 120 
##$DBP= (0..7)
150 150 150 150 150 150 150 150 
$$ [...]
##$SUBNAM4= <"">
##$SUBNAM5= <"">
##$SUBNAM6= <"">
##$SUBNAM7= <"">
##$SUBNAM8= <"">
##$SUBNAM9= <"">
##$SW= 239.972175391363
##$SWIBOX= (0..15)
0 1 3 0 0 0 0 0 0 0 0 0 0 0 0 0 
##$SW_h= 12077.2946859903
##$TD= 32768
##$TD0= 1
##$TE= 0
##$TE2= 300
##$TE3= 300
##$TEG= 300
##$TL= (0..7)
120 120 120 120 120 120 120 120 
##$TP= (0..7)
150 150 150 150 150 150 150 150 
##$TP07= 0
##$TPNAME0= <>
##$TPNAME1= <>
##$TPNAME2= <>
##$TPNAME3= <>
##$TPNAME4= <>
##$TPNAME5= <>
##$TPNAME6= <>
##$TPNAME7= <>
##$TPOAL= (0..7)
0.5 0.5 0.5 0.5 0.5 0.5 0.5 0.5 
##$TPOFFS= (0..7)
0 0 0 0 0 0 0 0 
##$TUNHIN= 0
##$TUNHOUT= 0
##$TUNXOUT= 0
##$USERA1= <user>
##$USERA2= <user>
##$USERA3= <user>
##$USERA4= <user>
##$USERA5= <user>
##$V9= 5
##$VALIST= <valist>
##$VCLIST= <CCCCCCCCCCCCCCC>
##$VD= 0
##$VDLIST= <DDDDDDDDDDDDDDD>
##$VPLIST= <PPPPPPPPPPPPPPP>
##$VTLIST= <TTTTTTTTTTTTTTT>
##$WBST= 1024
##$WBSW= 4
##$XGAIN= (0..3)
0 0 0 0 
##$XL= 0
##$YL= 0
##$YMAX_a= 90050820
##$YMIN_a= -140957295
##$ZGOPTNS= <>
##$ZL1= 120
##$ZL2= 120
##$ZL3= 120
##$ZL4= 120
##$ABSF1= 222.646
##$ABSF2= -17.35081
##$ABSG= 5
##$ABSL= 3
##$ALPHA= 0
##$AQORDER= 0
##$ASSFAC= 0
##$ASSFACI= 0
##$ASSFACX= 0
##$ASSWID= 0
##$AUNMP= <proc_1d>
##$AZFE= 0.1
##$AZFW= 0.5
##$BCFW= 0
##$BC_mod= 2
##$BYTORDP= 0
##$COROFFS= 0
##$CY= -3
##$DATMOD= 1
##$DC= 0
##$DFILT= <>
##$DTYPP= 0
##$F1P= 0
##$F2P= 0
##$FCOR= 0.5
##$FTSIZE= 32768
##$FT_mod= 6
##$GAMMA= 0
##$GB= 0
##$INTBC= 1
##$INTSCL= 4.134877e-10
##$ISEN= 128
##$LB= 2
##$LEV0= 0
##$LPBIN= 0
##$MAXI= 10000
##$MC2= 0
##$MEAN= 0
##$ME_mod= 0
##$MI= 0.1934396
##$NCOEF= 0
##$NC_proc= 5
##$NLEV= 6
##$NOISF1= 120.0001
##$NOISF2= 80.00006
##$NSP= 0
##$NTH_PI= 0
##$NZP= 0
##$OFFSET= 222.646
##$PC= 1.4
##$PHC0= -386.5768
##$PHC1= 29.3862
##$PH_mod= 1
##$PKNL= yes
##$PPARMOD= 0
##$PSCAL= 0
##$PSIGN= 0
##$REVERSE= no
##$SF= 50.3227304925793
##$SI= 32768
##$SIGF1= 140
##$SIGF2= 120
##$SINO= 11.81781
##$SIOLD= 32768
##$SREGLST= <13C.CDCl3>
##$SSB= 0
##$STSI= 32768
##$STSR= 0
##$SW_p= 12077.2946859903
##$SYMM= 0
##$S_DEV= 0
##$TDeff= 32768
##$TDoff= 0
##$TI= <>
##$TILT= no
##$TM1= 0
##$TM2= 0
##$TOPLEV= 0
##$USERP1= <user>
##$USERP2= <user>
##$USERP3= <user>
##$USERP4= <user>
##$USERP5= <user>
##$WDW= 1
##$XDIM= 32768
##$YMAX_p= 428774250
##$YMIN_p= -637223
$$ End of Bruker specific parameters
$$ ---------------------------------
##NTUPLES= NMR SPECTRUM
##VAR_NAME=  FREQUENCY,     SPECTRUM/REAL,   SPECTRUM/IMAG
##SYMBOL=    X,             R,               I
##VAR_TYPE=  INDEPENDENT,   DEPENDENT,       DEPENDENT
##VAR_FORM=  AFFN,          ASDF,            ASDF
##VAR_DIM=   32768,         32768,           32768
##UNITS=     HZ,            ARBITRARY UNITS, ARBITRARY UNITS
##FACTOR=    0.368581032318806, 1,           1
##FIRST=     11204.1544566776, 0,            0
##LAST=      -873.140229312654, 0,           0
##MIN=       -873.140229312654, -637223,     0
##MAX=       11204.1544566776, 428774250,    0
$$ Real data points
##PAGE= N=1
##DATA TABLE= (X++(R..R)), XYDATA
$$ [...]
$$ plain form
7873 2314830 2189497 2125185 2071069 1956216 1765735 1553025 1360533 1196941 1066216 962630
7863 962630 875184 801568 738691 690009 662988 650695 637922 621273 604595 580921 550549 524802
7851 524802 507134 494559 492186 497805 501221 499950 488658 459333 415439 372553 343185 326912
7839 326912 318422 312759 311515 321170 331637 325831 308970 300264 302596 303338 296233 284160 270515 263796
7825 263796 265429 267486 265035 254564 235528 219547 211993 204658 197925 198600 203602 210057 215383 215485
7811 215485 207696 195861 189599 191877 190938 179876 163238 145817 126709 111687 112595 127633 141595
7798 141595 147374 155902 172730 181799 176662 172232 180879 195413 201482 199171 193805 179803 155408
7785 155408 130185 111591 99862 86606 70750 60013 58064 62558 64125 62048 63531 71323 82509
$$ packed form
7873B314830j25333o4312n4116j14853j90481k12710j92492j63592j30725j03586
7863I62630q7446p3616o2877m8682k7021j2293j2773j6649j6678k3674l0372k5747
7851E24802j7668j2575k373N619L416j271j1292k9325m3894m2886k9368j6273
7839C26912q490n663j244R655J0467n806j6861q706K332P42p105j2073j3645o719
7825B63796J633K057k451j0471j9036j5981p554p335o733O75N002O455N326J02
7811B15485p789j1835o262K278r39j1062j6638j7421j9108j5022R08J5038J3962
7798A41595N779Q528J6828R069n137m430Q647J4534O069k311n366j4002k4395
7785A55408k5223j8594j1729j3256j5856j0737j949M494J567k077J483P792J1186
$$ plain form
7772 82509 98801 121338 138882 145087 147808 151486 148142 133979 118789 109278 106343 105702 108278 116525
7758 116525 120967 111949 90541 62220 36106 21642 20317 29260 43486 56834 66046 69886 67584
7745 67584 65666 68168 63082 44308 24272 16647 20584 32621 48402 61028 66565 62978 51314
7732 51314 40084 35298 33514 31410 32735 39033 41096 32712 21907 18541 21141 19660 11522 2913
7718 2913 -3132 -5276 -1303 4541 6610 4629 1881 1846 9740 25627 46489 72458 94343 97414
7704 97414 84767 69446 56093 43543 30873 21400 18788 18704 19631 19993 15735 1006 -20411 -38352
7690 -38352 -50499 -58861 -66652 -74305 -78527 -76547 -64682 -50125 -46005 -51772 -60054 -66085 -67797 -66173
7676 -66173 -59045 -44581 -27531 -14948 -6556 4270 18700 25772 17450 -3041 -23781 -35134 -36523
$$ packed form
7772H2509J6292K2537J7544O205K721L678l344j4163j5190r511k935o41K576Q247
7758A16525M442r018k1408k8321k6114j4464j325Q943J4226J3348R212L840k302
7745F7584j918K502n086j8774k0036p625L937J2037J5781J2626N537l587j1664
7732E1314j1230m786j784k104J325O298K063q384j0805l366K600j481q138q609
7718B913o045k144L973N844K069j981k748l5P894J5887K0862K5969K1885L071
7704I7414j2647j5321j3353j2550j2670r473k612q4R27L62m258j4729k1417j7941
7690c8352j2147q362p791p653m222J980J1865J4557M120n767q282o031j712J624
7676f6173P128J4464J7050J2583Q392J0826J4430P072q322k0491k0740j1353j389
$$ plain form
7663 -36523 -26248 -3936 22934 43963 53350 52231 36713 5414 -31863 -60201 -69633 -61246 -39107
7650 -39107 -9058 21546 50307 67419 64264 48654 27743 4747 -11801 -18224 -20149 -16615 -9264
7637 -9264 -7546 -15784 -28021 -34254 -34377 -35258 -35027 -30515 -23965 -16380 -13435 -21382 -31820 -33602 -28757
7622 -28757 -25125 -20206 -12371 -6600 -4041 -2176 5843 25740 50791 69087 77162 77941 70777 49868
7608 49868 13231 -26767 -56721 -76059 -87305 -88364 -76627 -54643 -33805 -32217 -55640 -89564
7596 -89564 -112524 -113292 -89695 -30134 84967 231028 328814 330235 271266 210246 174894 163727
7584 163727 156645 138509 108580 72541 34159 -1237 -30551 -58747 -89888 -118944 -134131 -133117
7572 -133117 -124246 -111514 -93605 -67058 -30234 9608 37479 50032 55248 57515 58428 56450 45530
$$ packed form
7663c6523J0275K2312K6870K1029R387j119j5518l1299l7277k8338r432Q387K2139
7650c9107L0049L0604K8761J7112l155j5610k0911k2996j6548o423j925L534P351
7637i264J718q238j2237o233j23q81K31M512O550P585K945p947j0438j782M845
7622b8757L632M919P835N771K559J865Q019J9897K5051J8296Q075P79p164k0909
7608D9868l6637l9998k9954j9338j1246j059J1737K1984K0838J588k3423l3924
7596h9564k2960p68K3597N9561J15101J46061R7786J421n8969o1020l5352j1167
7584A63727p082j8136k9929l6039l8382l5396k9314k8196l1141k9056j5187J014
7572a33117Q871J2732J7909K6547L6824L9842K7871J2553N216K267R13j978j0920
$$ plain form
7559 45530 26057 3593 -17406 -36423 -53439 -67237 -73503 -63841 -41495 -21975 -10388 -25
7547 -25 12099 20966 21896 19351 18306 17802 12381 -489 -17430 -34209 -44128 -42985 -38406 -40533 -48287
7532 -48287 -51557 -46421 -35582 -23520 -17158 -17142 -17264 -18384 -26188 -38050 -46776 -46119 -32695 -13830
7518 -13830 -1499 381 -6861 -17008 -25937 -33975 -36392 -31158 -25314 -27658 -38447 -53854 -75634
7505 -75634 -104766 -129730 -134300 -123455 -115305 -119431 -131773 -146817 -163852 -179946 -190665 -197720 -204506
7492 -204506 -213484 -220385 -215254 -196722 -169583 -139396 -116552 -109397 -115331 -126982 -141076 -150950 -151896
7479 -151896 -148960 -150673 -158276 -162732 -155251 -137417 -115536 -94004 -79685 -78256 -81880 -72259 -50970
7466 -50970 -33551 -20826 -9792 -5571 -7133 -12356 -15792 -17205 -23966 -34949 -39077 -32416 -25129 -26633
$$ packed form
7559D5530j9473k2464k0999j9017j7016j3798o266R662K2346J9520J1587J0363
7547b5J2124Q867R30k545j045n04n421j2870j6941j6779r919J143M579k127p754
7532d8287l270N136J0839J2062O362J6j22j120p804j1862q726O57J3424J8865
7518a3830J2331J880p242j0147q929q038k417N234N844k344j0789j5407k1780
7505g5634k9132k4964m570J0845Q150m126j2342j5044j7035j6094j0719p055o786
7492b04506q978o901N131J8532K7139L0187K2844P155n934j1651j4094r874r46
7479a51896K936j713p603m456P481J7834K1881K1532J4319J429l624R621K1289
7466e0970J7419J2725J1034M221j562n223l436j413o761j0983m128O661P287j504
$$ plain form
7452 -26633 -43740 -74883 -100533 -98688 -69345 -33535 -11672 -12087 -28176 -46068 -59363 -66404 -67858
7439 -67858 -67599 -69669 -75191 -79665 -74654 -64903 -61423 -61201 -60998 -69214 -87515 -109893 -133581 -150152
7425 -150152 -149211 -133680 -113332 -94441 -78920 -72477 -77778 -87638 -96849 -108249 -119167 -126126 -125782
7412 -125782 -115649 -101496 -82809 -56262 -27358 -7977 -4375 -14246 -35827 -67568 -98759 -112752
7400 -112752 -109203 -103066 -98982 -97253 -104837 -119093 -127265 -123921 -111024 -95590 -90128 -96555 -104620 -109767
7386 -109767 -108234 -96785 -83217 -79376 -83491 -83080 -77352 -75968 -83408 -93828 -102862 -114072 -125321
7373 -125321 -127861 -118119 -103385 -90979 -79330 -63903 -44718 -34806 -46869 -76301 -102413 -106055
7361 -106055 -89408 -70393 -58372 -51910 -50951 -57557 -69977 -84451 -99612 -120096 -140092 -147001 -143310
$$ packed form
7452b6633j7107l1143k5650J845K9343L5810K1863m15j6089j7892j3295p041j454
7439f7858K59k070n522m474N011R751L480K22K03q216j8301k2378k3688j6571
7425a50152R41J5531K0348J8891J5521O443n301r860r211j1400j0918o959L44
7412a25782J0133J4153J8687K6547K8904J9381L602r871k1581l1741l1191j3993
7400a12752L549O137M084J729p584j4256q172L344J2897J5434N462o427q065n147
7386a09767J533J1449J3568L841m115M11N728J384p440j0420r034j1210j1249
7373a25321k540R742J4734J2406J1649J5427J9185R912j2063k9432k6112l642
7361a06055J6647J9015J2021O462R59o606j2420j4474j5161k0484j9996o909L691
$$ plain form
7348 -143310 -138583 -134673 -131041 -125781 -117217 -110535 -114076 -126590 -133501 -124064 -105841 -90869 -83343 -84823
7334 -84823 -92582 -95652 -85995 -71868 -68838 -76054 -83903 -87125 -81667 -71349 -66736 -72031 -82536 -91106
7320 -91106 -95651 -94666 -89879 -86650 -82688 -73530 -59501 -46374 -40430 -42808 -47330 -50358 -56719 -69066
7306 -69066 -82561 -91878 -91972 -73996 -38124 -2332 12876 6258 -6072 -15171 -25709 -35615 -34874 -22323
7292 -22323 -8097 1694 8353 12362 10716 3305 -9705 -23058 -24794 -11740 6228 15658 16146 17531
7278 17531 20832 19384 10519 665 1583 8337 6072 -3035 -5392 24 10653 29022 48504 63915
7264 63915 72424 68070 59048 59388 63081 60993 61122 64006 61737 58182 58617 60097 57666 47124 30606
7249 30606 14649 1054 -7933 -2767 24813 70682 118448 151213 164851 166153 156928 136897 107246
$$ packed form
7348a43310M727L910L632N260Q564O682l541j2514o911R437J8223J4972P526j480
7334h4823p759l070R657J4127L030p216p849l222N458J0318M613n295j0505q570
7320i1106m545R85M787L229L962R158J4029J3127N944k378m522l028o361j2347
7306f9066j3495r317r4J7976L5872L5792J5208o618j2330r099j0538r906P41J2551
7292b2323J4226R791O659M009j646p411j3010j3353j736J3054J7968R430M88J385
7278A7531L301j448q865r854R18O754k265r107k357N416J0629J8369J9482J5411
7264F3915Q509m354r022L40L693k088J29K884k269l555M35J480k431j0542j6518
7249C0606j5957j3595q987N166K7580M5869M7766L2765J3638J302r225k0031k9651
$$ plain form
7236 107246 73597 42082 16029 -4675 -18181 -23421 -22539 -17346 -14035 -23386 -44732 -67086 -85704
7223 -85704 -104775 -120407 -122911 -120938 -126284 -131344 -126583 -112650 -98065 -91360 -88054 -77260 -57438
7210 -57438 -35687 -21179 -16458 -16592 -19982 -32431 -52955 -69248 -77282 -87152 -100723 -104017 -92176
7197 -92176 -75761 -66617 -67602 -71298 -70141 -67516 -69335 -75012 -87061 -98099 -95394 -79503 -61509 -49707
7183 -49707 -42000 -35989 -35200 -43508 -55287 -66752 -80456 -96770 -107346 -109097 -102772 -94054 -89405 -85481
7169 -85481 -79120 -65674 -44332 -25804 -23296 -41443 -66342 -83633 -91159 -90217 -87925 -88732 -87683 -85366
7155 -85366 -88646 -96356 -101064 -95661 -83831 -76960 -76908 -74587 -63711 -50908 -43279 -36814 -33556 -39160
7141 -39160 -48008 -48578 -40960 -35596 -41694 -62166 -91023 -112074 -110367 -94376 -84501 -84696 -88477 -89596
$$ packed form
7236A07246l3649l1515k6053k0704j3506n240Q82N193L311r351k1346k2354j8618
7223h5704j9071j5632k504J973n346n060M761J3933J4585O705L306J0794J9822
7210e7438K1751J4508M721j34l390j2449k0524j6293q034r870j3571l294J1841
7197i2176J6415R144r85l696J157K625j819n677j2049j1038K705J5891J7994J1802
7183d9707P707O011P89q308j1779j1465j3704j6314j0576j751O325Q718M649L924
7169h5481O361J3446K1342J8528K508j8147k4899j7291p526R42K292q07J049K317
7155h5366l280p710m708N403J1830O871N2K321J0876J2803P629O465L258n604
7141c9160q848n70P618N364o098k0472k8857k1051J707J5991R875j95l781j119
$$ plain form
7127 -89596 -85654 -82553 -88519 -100117 -100752 -80184 -47123 -16533 4047 13042 10989 3345 -5145 -12101
7113 -12101 -14843 -11750 -13249 -27869 -49963 -77541 -103472 -111023 -95960 -76898 -72096 -76718 -74997
7100 -74997 -62976 -45470 -25926 -12879 -10894 -18698 -36513 -55658 -64354 -63678 -61756 -64313 -73257
7087 -73257 -84374 -92917 -97442 -95656 -88531 -78877 -69612 -65568 -63650 -54590 -35725 -13819 -1593 -2011
7073 -2011 -11578 -21726 -21866 -16767 -10328 838 9856 6832 -9194 -28862 -41713 -45893 -48752 -66821
7059 -66821 -103092 -140519 -162721 -171067 -172053 -168303 -163417 -155359 -136245 -112728 -100035 -100156 -101001 -91146
7045 -91146 -69761 -46947 -32402 -27963 -36718 -56095 -70833 -68286 -45961 -15675 9174 29634
7033 29634 47901 61411 68596 72292 71273 71616 85385 112924 142744 169147 198680 228436 249159
$$ packed form
7127h9596L942L101n966j1598o35K0568L3061L0590K0580Q995k053p644q490o956
7113a2101k742L093j499j4620k2094k7578k5931p551J5063J9062M802m622J721
7100g4997J2021J7506J9544J3047J985p804j7815j9145q696O76J922k557q944
7087g3257j1117q543m525J786P125R654R265M044J918R060J8865K1906J2226m18
7073b011r567j0148j40N099O439J1166R018l024j6026j9668j2851m180k859j8069
7059f6821l6271l7427k2202q346r86L750M886Q058J9114K3517J2693j21q45R855
7045i1146K1385K2814J4545M439q755j9377j4738K547K2325L0286K4849K0460
7033B9634J8267J3510P185L696j019L43J3769K7539K9820K6403K9533K9756K0723
$$ plain form
7020 249159 257501 254278 245767 245941 262528 293490 337211 387336 424126 432377 413509 381192 352087
7007 352087 329358 307161 287549 273166 264004 255765 244457 228832 206697 180012 158571 148005
6995 148005 148297 165599 197711 228311 253256 277709 307692 349675 398758 443345 471156 471116 449953
6982 449953 432065 425875 422339 415492 408182 406958 415086 435207 460828 478957 487031 489537 492274
6969 492274 506856 541500 586930 629515 665662 697934 735900 798420 900440 1038855 1199067
6958 1199067 1373622 1568829 1795265 2066066 2394643 2784879 3242130 3784274 4436774 5226061
6948 5226061 6188551 7372728 8843666 10699459 13067663 16108111 19935710 24309914
6940 24309914 28238386 30228674 29301416 25800390 21265612 17121603 13842715 11311738
$$ packed form
7020B49159Q342l223q511J74J6587L0962M3721N0125L6790Q251j8868l2317k9105
7007C52087k2729k2197j9612j4383r162q239j1308j5625k2135k6685k1441j0566
6995A48005K92J7302L2112L0600K4945K4453K9983M1983M9083M4587K7811m0k1163
6982D49953j7888o190l536o847p310j224Q128K0121K5621J8129Q074K506K737
6969D92274J4582L4644M5430M2585L6147L2272L7966O2520J02020J38415J60212
6958A199067J74555J95207K26436K70801L28577L90236M57251N42144O52500P89287
6948E226061R62490J184177J470938J855793K368204L040448L827599M374204
6940B4309914L928472J990288r27258l501026m534778m144009l278888k530977
$$ plain form
6932 11311738 9294665 7647979 6311997 5243211 4390207 3705995 3153951 2708213 2343900
6923 2343900 2039096 1782040 1569263 1399058 1266337 1155728 1052989 951508 858642 784377
6913 784377 727682 674723 615438 558324 511921 477723 456120 439881 420729 395743 369103 345422
6901 345422 332207 333918 346593 365693 386017 407195 435929 465972 476897 460429 426046 386190
6889 386190 347082 304728 256931 215057 187278 170412 159510 148835 137122 123837 116456 118903
6877 118903 121014 110936 89266 75947 79520 83972 75108 55160 41284 41234 41076 36535 41419 60341
6863 60341 88013 112293 124176 118585 98387 72798 49406 34745 30928 36315 47574 56667 55551
6850 55551 39659 15395 -2649 -8043 -11152 -16811 -15092 -5452 558 -7375 -20925 -24947 -17630 -6904
$$ packed form
6932A1311738k017073j646686j335982j068786q53004o84212n52044m45738l64313
6923B343900l04804k57056k12777j70205j32721j10609j02739j01481r2866p4265
6913G84377n6695n2959n9285n7114m6403l4198k1603j6239j9152k4986k6640k3681
6901C45422j3215J711J2675J9100K0324K1178K8734L0043J0925j6468l4383l9856
6889C86190l9108m2354m7797m1874k7779j6866j0902j0675j1713j3285p381K447
6877A18903K111j0078k1670j3319L573M452q864j9948j3876n0j58m541M884J8922
6863F0341K7672K4280J1883n591k0198k5589k3392j4661l817N387J1259R093j116
6850E5551j5892k4264j8044n394l109n659J719R640O010p933j3550m022P317J0726
$$ plain form
6836 -6904 -2906 -2898 8243 31506 57236 84993 115186 148344 185552 223036 261986 294153 293661
6823 293661 258262 211770 171263 141855 121812 102011 79767 62372 50737 46750 57295 75252
6811 75252 87154 88236 82913 79769 82268 83383 88116 106916 131985 150883 162694 171745 179331
6798 179331 183832 193276 222393 266738 311654 356957 411301 478081 546429 588056 576444 521890
6786 521890 461632 421388 402320 400360 414888 444815 491109 550424 617368 694124 775859 848992
6774 848992 911845 983459 1089021 1245833 1458033 1728828 2079911 2544502 3152431 3891050
6764 3891050 4605533 4931647 4601405 3825529 2996825 2304123 1771503 1375029 1087587 879095
6754 879095 719600 590448 482680 391477 316342 254238 202437 159945 127126 103014 87075
$$ packed form
6836f904L998QJ1141K3263K5730K7757L0193L3158L7208L7484L8950L2167m92
6823B93661l5399m6492m0507k9408k0043j9801k2244j7395j1635l987J0545J7957
6811G5252J1902J082n323l144K499J115M733J8800K5069J8898J1811R051P586
6798A79331M501R444K9117M4345M4916M5303N4344O6780O8348M1627j1612n4554
6786E21890o0258m0244j9068j960J4528K9927M6294N9315O6944P6756Q1735P3133
6774H48992O2853P1614J05562J56812K12200K70795L51083M64591O07929P38619
6764C891050P14483L26114l30242p75876q28704o92702n32620l96474k87442k08492
6754H79095j59495j29152j07768r1203p5135o2104n1801m2492l2819k4112j5939
$$ plain form
6743 87075 74969 59146 38210 14783 -2615 -8519 -8237 -6882 -3399 8133 30449 51117 54282
6730 54282 41939 28526 25069 38843 70273 117982 177479 233738 276523 296210 281148 240619
6718 240619 201369 179211 170496 161367 141403 108665 70042 39828 33502 50345 78103 106222
6706 106222 130450 151686 169063 181289 186883 185620 181424 180359 184883 189852 194076 208152 241405
6693 241405 290336 337694 361901 362283 360860 381283 433829 516296 608727 654448 617333 533301
6681 533301 444761 360317 277154 199661 134720 94021 78698 78650 85839 96388 101540 90954 67063
6668 67063 44891 28986 7248 -17501 -27110 -22621 -15747 -16990 -29560 -45208 -50320 -40930 -25217
6655 -25217 -10156 3941 16935 24735 21960 5593 -17778 -39072 -61171 -87857 -110226 -116847
$$ packed form
6743H7075j2106j5823k0936k3427j7398n904K82J355L483J1532K2316K0668L165
6730E4282j2343j3413l457J3774L1430M7709N9497N6259M2785J9687j5062m0529
6718B40619l9250k2158q715r129j9964l2738l8623l0214o326J6843K7758K8119
6706A06222K4228K1236J7377J2226N594j263m196j065M524M969M224J4076L3253
6693B41405M8931M7358K4207L82j423K0423N2546Q2467R2431M5721l7115q4032
6681E33301q8540q4444q3163p7493o4941m0699j5323m8P189J0549N152j0586k3891
6668F7063k2172j5905k1738k4749r609M489O874j243j2570j5648n112R390J5713
6655b5217J5061J4097J2994P800k775j6367k3371k1294k2099k6686k2369o621
$$ plain form
6643 -116847 -115217 -117106 -115982 -103461 -83476 -65325 -55871 -57615 -63047 -66568 -71058 -78915 -86823 -93854
6629 -93854 -106335 -122132 -135437 -148035 -161648 -170609 -171507 -163760 -148430 -132214 -121111 -115210 -112272
6616 -112272 -109690 -109548 -112473 -112844 -110791 -113947 -120114 -120652 -121577 -133927 -154024 -165481 -159884 -142265
6602 -142265 -119334 -89866 -53229 -22748 -14196 -31950 -61244 -85450 -98708 -99504 -93155 -88037 -85419
6589 -85419 -81172 -71513 -53803 -31259 -15937 -14092 -22965 -35675 -41111 -33768 -19751 -6948 2727
6576 2727 8869 8459 2746 -7384 -22887 -35695 -38349 -35267 -40495 -58623 -73495 -72070 -62010 -56218
6562 -56218 -57903 -65446 -72917 -76096 -75903 -79057 -86122 -86755 -76696 -57877 -33443 -8991 10244 20953
6548 20953 18704 6413 -12931 -35976 -49241 -45467 -30881 -9714 18261 45645 67860 92002
$$ packed form
6643a16847J630j889J124J2521J9985J8151R454j744n432l521m490p857p908p031
6629i3854j2481j5797j3305j2598j3613q961q98P747J5330J6216J1103N901K938
6616a12272K582J42k925l71K053l156o167n38r25j2350k0097j1457N597J7619
6602a42265K2931K9468L6637L0481Q552j7754k9294k4206j3258p96O349N118K618
6589h5419M247R659J7710K2544J5322J845q873j2710n436P343J4017J2803R675
6576B727O142m10n713j0130j5503j2808k654L082n228j8128j4872J425J0060N792
6562e6218j685p543p471l179J93l154p065o33J0059J8819K4434K4452J9235J0709
6548B0953k249j2291j9344k3045j3265L774J4586K1167K7975K7384K2215K4142
$$ plain form
6536 92002 124926 171062 234498 312430 397919 494799 618807 785797 1003263 1274476 1611211
6525 1611211 2021395 2480531 2884131 3037214 2821485 2352348 1841116 1407406 1075225 825928
6515 825928 628926 468971 348710 260344 186109 121403 70875 35044 15802 17861 34282
6504 34282 50029 57872 56935 48025 31896 8261 -17158 -34084 -42781 -48876 -54906 -64189 -77385
6491 -77385 -89498 -100026 -106315 -102906 -89871 -74997 -66408 -61944 -60254 -69503 -92937 -114674 -117685
6478 -117685 -102589 -81877 -65167 -53168 -48004 -49713 -53141 -54689 -56539 -57146 -50793 -35373 -14069
6465 -14069 8539 30069 46244 46364 25984 -3275 -21451 -21805 -19350 -28400 -45204 -50724 -31855
6452 -31855 -3639 8674 -2521 -28505 -58501 -88447 -111548 -120530 -123003 -131053 -143569 -153040 -156667
$$ packed form
6536I2002L2924M6136O3436P7932Q5489R6880J24008J66990K17466K71213L36735
6525A611211M10184M59136M03600J53083k15729m69137n11232m33710l32181k49297
6515H25928j97002j59955j20261q8366p4235o4706n0528l5831j9242K059J6421
6504C4282J5747P843r37q910j6129k3635k5419j6926q697o095o030r283j3196
6491g7385j2113j0528o289L409J3035J4874Q589M464J690r249k3434k1737l011
6478a17685J5096K0712J6710J1999N164j709l428j548j850o07O353J5420K1304
6465a4069K2608K1530J6175J20k0380k9259j8176l54K455r050j6804n520J8869
6452c1855K8216J2313j1195k5984k9996k9946k3101q982k473q050j2516r471l627
$$ plain form
6439 -156667 -155802 -151635 -150263 -155344 -157163 -146614 -129956 -119566 -117811 -119146 -120180 -126435 -135344 -137435
6425 -137435 -136138 -137153 -140679 -147707 -155288 -157523 -154755 -148848 -142060 -143852 -155236 -167849 -170689 -159235
6411 -159235 -136456 -108280 -80495 -54584 -31878 -17832 -16774 -24784 -39997 -59285 -70069 -72033
6399 -72033 -70090 -58043 -34595 -11906 -6511 -23230 -45881 -60097 -69350 -79672 -91669 -98588 -90582
6386 -90582 -71814 -57899 -60918 -80707 -99848 -100982 -86948 -74294 -74714 -88831 -111515 -131899 -142385
6373 -142385 -139367 -128323 -118996 -109874 -103478 -102419 -105590 -113645 -123010 -125820 -120693 -113863 -107296 -99838
6359 -99838 -90839 -82735 -80263 -87570 -105283 -127549 -146738 -161784 -173257 -177618 -173972 -163237 -143489
6346 -143489 -117371 -96563 -86798 -83989 -88005 -100609 -121021 -146862 -176254 -201422 -206264 -191013
$$ packed form
6439a56667Q65M167J372n081j819J0549J6658J0390J755j335j034o255q909k091
6425a37435J297j015l526p028p581k235K768N907O788j792j1384j2613k840J1454
6411a59235K2779K8176K7785K5911K2706J4046J058q010j5213j9288j0784j964
6399g2033J943J2047K3448K2689N395j6719k2651j4216r253j0322j1997o919Q006
6386i0582J8768J3915l019j9789j9141j134J4034J2654m20j4117k2684k0384j0486
6373a42385L018J1044R327R122O396J059l171q055r365k810N127O830O567P458
6359i9838Q999Q104K472p307j7713k2266j9189j5046j1473m361L646J0735J9748
6346a43489K6118K0808R765K809m016j2604k0412k5841k9392k5168m842J5251
$$ plain form
6334 -191013 -175228 -172938 -182530 -191247 -189616 -185176 -187668 -196315 -206406 -212961 -208236 -194560 -179761
6321 -179761 -156503 -122214 -90032 -69276 -60237 -60998 -57522 -41277 -27532 -31648 -52173 -75569 -85694
6308 -85694 -81981 -77972 -76378 -70918 -61806 -55709 -54290 -57372 -71243 -100878 -141050 -175717 -193127
6295 -193127 -189345 -171907 -151192 -127243 -96875 -64211 -39186 -24313 -22256 -33712 -48047 -56888
6283 -56888 -59786 -60928 -68157 -81789 -87979 -82016 -73855 -71664 -82840 -110052 -139348 -149086 -135599
6270 -135599 -113349 -98698 -97196 -101502 -102587 -100189 -102327 -106490 -102022 -91433 -82574 -76355 -73410 -73537
6256 -73537 -70225 -56445 -36619 -23198 -18961 -20850 -35649 -71266 -109497 -121036 -103787 -71457
6244 -71457 -33680 2831 36177 66734 86002 87137 81760 81818 84636 68230 19285 -35155 -64023
$$ packed form
6334a91013J5785K290r592q717J631M440k492q647j0091o555M725J3676J4799
6321a79761K3258L4289L2182K0756R039p61L476J6245J3745m116k0525k3396j0125
6308h5694L713M009J594N460R112O097J419l082j3871k9635m0172l4667j7410
6295a93127L782J7438K0715K3949L0368L2664K5025J4873K057j1456j4335q841
6283e6888k898j142p229j3632o190N963Q161K191j1176k7212k9296r738J3487
6270a35599K2250J4651J502m306j085K398k138m163M468J0589Q859O219K945j27
6256g3537L312J3780J9826J3421M237j889j4799l5617l8231j1539J7249L2330
6244g1457L7777L6511L3346L0557J9268J135n377N8K818j6406m8945n4440k8868
$$ plain form
6231 -64023 -67388 -59909 -53613 -58055 -79435 -112541 -141663 -158914 -169642 -179811 -195433 -215937 -226126
6218 -226126 -215514 -190615 -161320 -128075 -89749 -57757 -43778 -42748 -51540 -68791 -89588 -106903
6206 -106903 -114094 -116723 -120760 -129072 -135765 -132024 -122898 -118129 -121740 -131120 -137699 -140349 -144743 -157222
6192 -157222 -176386 -194018 -206011 -212422 -203602 -176490 -149218 -129840 -118412 -117404 -127848 -148471
6180 -148471 -175402 -200455 -210036 -198236 -173872 -145331 -116118 -89269 -64428 -46500 -39742 -37868
6168 -37868 -41303 -57675 -84097 -107048 -117540 -114401 -99499 -83199 -68869 -50585 -26716 -4623
6156 -4623 10098 22345 33182 36471 34442 33246 29300 18350 3479 -5956 -5988 -5486 -9593 -11590
6142 -11590 -6167 -1944 -8839 -23872 -35978 -39867 -35551 -25100 -17036 -18135 -22621 -17984 -1800 19161
$$ packed form
6231f4023l365P479O296m442k1380l3106k9122j7251j0728j0169j5622k0504j0189
6218b26126J0612K4899K9295L3245L8326L1992J3979J030q792j7251k0797j7315
6206a06903p191k629m037q312o693L741R126M769l611r380o579k650m394j2479
6192a57222j9164j7632j1993o411Q820K7112K7272J9378J1428J008j0444k0623
6180a48471k6931k5053r581J1800K4364K8541K9213K6849K4841J7928O758J874
6168c7868l435j6372k6422k2951j0492L139J4902J6300J4330J8284K3869K2093
6156d623J4721J2247J0837L289k029j196l946j0950j4871r435l2N02m107j997
6142a1590N423M223o895j5033j2106l889M316J0451Q064j099m486M637J6184K0961
$$ plain form
6128 19161 39126 51225 51119 43858 41019 47455 57072 63835 64733 56134 41412 28284 20692 21572
6114 21572 27725 29397 27479 26128 24978 28083 36014 40948 36795 25788 17651 21467 38750 60683
6100 60683 73672 67292 43539 15640 -9405 -36052 -64214 -82397 -85422 -80292 -75473 -70321 -61336
6087 -61336 -45338 -24560 -5080 7706 15370 25986 38335 40198 29320 15186 5207 1190 -3741
6074 -3741 -10242 -4243 24570 64982 86866 66131 15450 -37841 -78003 -98615 -103920 -102132 -94888
6061 -94888 -78797 -50932 -16486 6868 11530 7229 4296 3901 2068 3010 8941 16135 22396 23553
6047 23553 21270 26893 41493 52842 51817 44416 36198 18405 -7678 -31174 -49871 -65968 -83814
6034 -83814 -105027 -123085 -133927 -140076 -137558 -116847 -78310 -36969 -11940 -4813 -6754 -18551 -42136
$$ packed form
6128A9161J9965J2099j06p261k839O436R617O763Q98q599j4722j3128p592Q80
6114B1572O153J672j918j351j150L105P931M934m153j1007q137L816J7283K1933
6100F0683J2989o380k3753k7899k5045k6647k8162j8183l025N130M819N152Q985
6087f1336J5998K0778J9480J2786P664J0616J2349J863j0878j4134r979m017m931
6074c741o501N999K8813M0412K1884k0735n0681n3291m0162k0612n305J788P244
6061i4888J6091K7865L4446K3354M662m301k933l95j833R42N931P194O261J157
6047B3553k283N623J4600J1349j025p401q218j7793k6083k3496j8697j6097j7846
6034h3814k1213j8058j0842o149K518K0711L8537M1341K5029P127j941j1797k3585
$$ plain form
6021 -42136 -67521 -82992 -89796 -97587 -113040 -132458 -149211 -160826 -163591 -160215 -155365 -152519 -157579
6008 -157579 -167482 -173124 -174993 -176419 -175795 -168961 -154444 -139082 -130505 -129254 -130848 -130745 -130400 -129465 -119144
5993 -119144 -95981 -68305 -51029 -49990 -55637 -52262 -37595 -18510 10110 60177 127682 188403
5981 188403 218245 208459 169491 117448 62198 7276 -42159 -81737 -111827 -131217 -132922 -111557
5969 -111557 -74236 -35307 -8853 1191 -755 -8862 -15687 -19279 -28580 -43789 -52343 -54132 -56370
5956 -56370 -63295 -73913 -86027 -97751 -94355 -66431 -29224 -8661 -11232 -22316 -30421 -29053 -9030
5943 -9030 22207 44745 47596 35085 16203 -3827 -24115 -46391 -64310 -75111 -87487 -101509
5931 -101509 -105374 -95101 -79052 -64024 -57558 -63839 -77967 -92883 -101536 -104472 -105936 -106722 -107715 -111823
$$ packed form
6021d2136k5385j5471o804p791j5453j9418j6753j1615k765L376M850K846n060
6008a57579r903n642j869j426O24O834J4517J5362Q577J251j594J03L45R35J0321
5993a19144K3163K7676J7276J039n647L375J4667J9085K8620N0067O7505O0721
5981A88403K9842r786l8968n2043n5250n4922m9435l9578l0090j9390j705K1365
5969a11557L7321L8929K6454J0044j946q107o825l592r301j5209q554j789k238
5956e6370o925j0618j2114j1724L396K7924L7207K0563k571j1084q105J368K0023
5943i030L1237K2538K851j2511j8882k0030k0288k2276j7919j0801j2376j4022
5931a01509l865J0273J6049J5028O466o281j4128j4916q653k936j464p86r93m108
$$ plain form
5917 -111823 -119895 -121851 -116249 -114050 -118968 -128557 -136847 -136889 -125675 -110224 -102873 -106388 -106665 -91443
5903 -91443 -61403 -27839 -292 16148 11369 -13742 -34876 -34811 -25111 -21334 -18879 -11383 -9257 -21792
5889 -21792 -38551 -48704 -54161 -59836 -62926 -62860 -62086 -55859 -48537 -50759 -64595 -86548 -106561 -116971
5875 -116971 -119988 -124472 -134683 -141480 -138523 -130109 -121366 -112809 -97334 -77644 -65977 -58785 -46453
5862 -46453 -36034 -34638 -39098 -38216 -23164 -4143 2949 -7002 -28530 -51050 -66560 -75532 -86039
5849 -86039 -100232 -110078 -106475 -84235 -54025 -35275 -32389 -35125 -37240 -44019 -56093 -67262 -76432
5836 -76432 -88040 -101049 -107482 -110980 -116957 -115106 -101821 -91078 -90388 -97045 -113632 -135676 -150772
5823 -150772 -149877 -134886 -116833 -100981 -86862 -73926 -63927 -58831 -54626 -50989 -52141 -57793 -63878
$$ packed form
5917a11823q072j956N602K199m918r589q290m2J1214J5451P351l515k77J5222
5903i1443L0040L3564K7547J6440m779k5111k1134O5R700L777K455P496K126j2535
5889b1792j6759j0153n457n675l090O6P74O227P322k222j3836k1953k0013j0410
5875a16971l017m484j0211o797K957Q414Q743Q557J5475J9690J1667P192J2332
5862d6453J0419J396m460Q82J5052J9021P092r951k1528k2520j5510q972j0507
5849h6039j4193r846L603K2240L0210J8750K886k736k115o779j2074j1169r170
5836g6432j1608j3009o433l498n977J851J3285J0743O90o657j6587k2044j5096
5823a50772Q95J4991J8053J5852J4119J2936R999N096M205L637j152n652o085
$$ plain form
5810 -63878 -64829 -57102 -47799 -48984 -61052 -72450 -76688 -76072 -69945 -54256 -28329 198 28199 57767
5796 57767 66464 39980 6267 -10426 -12551 -9974 -2668 14868 43109 75403 101659 99655 22743
5783 22743 -171774 -427985 -584182 -570231 -470163 -373627 -312655 -283704 -271675 -266045 -263228
5772 -263228 -256626 -239540 -209241 -176047 -153894 -139954 -120040 -88290 -53626 -27613 -19505 -30877
5760 -30877 -51467 -64592 -64328 -56344 -38416 3924 66069 124749 164451 185328 204299 236632
5748 236632 275341 288379 252660 182062 103853 31250 -28142 -69223 -101134 -134229 -164279 -183112
5736 -183112 -195126 -208508 -224454 -236673 -237761 -227042 -213211 -202352 -189839 -170598 -151833 -141949
5724 -141949 -136564 -135822 -145261 -158369 -166975 -170926 -171326 -172315 -174846 -173882 -163142 -148050 -136942 -131464
$$ packed form
5810f3878r51P727R303j185j2068j1398m238O16O127J5689K5927K8527K8001K9568
5796E7767Q697k6484l3713j6693k125K577P306J7536K8241L2294K6256k004p6912
5783B2743j94517k56211j56197J3951J00068R6536O0972K8951J2029N630K817
5772b63228O602J7086L0299L3194K2153J3940J9914L1750L4664K6013Q108j1372
5760c0877k0590j3125K64P984J7928M2340O2145N8680L9702K0877J8971L2333
5748B36632L8709J3038l5719p0598p8209p2603n9392m1081l1911l3095l0050j8833
5736a83112j2014j3382j5946j2219j088J0719J3831J0859J2513J9241J8765R884
5724a41949N385P42r439j3108q606l951m00r89k531R64J0740J5092J1108N478
$$ plain form
5710 -131464 -134574 -142783 -150637 -160271 -166917 -164532 -159549 -156646 -151177 -146592 -148525 -151250 -144295 -127155
5696 -127155 -106420 -81936 -55742 -38702 -36010 -38485 -29793 -10550 -2201 -15480 -38942 -59560
5684 -59560 -75319 -89251 -103773 -122170 -140464 -145327 -134312 -121317 -119138 -122816 -122051 -118866 -117133
5671 -117133 -113056 -106594 -100421 -97947 -97890 -93191 -83637 -87705 -118633 -157687 -182040 -188211 -179749 -158550
5657 -158550 -133349 -117200 -113426 -114813 -121290 -129674 -131248 -126319 -120304 -118242 -116870 -112454 -110377 -115266
5643 -115266 -123795 -133541 -140232 -139265 -132049 -124321 -123616 -126185 -121932 -110429 -92888 -78037 -79042 -90121
5629 -90121 -97040 -94546 -84998 -78270 -81147 -93015 -110894 -125467 -131117 -129580 -122524 -115363 -114730 -118697
5615 -118697 -121187 -113590 -100249 -96018 -103367 -117317 -133624 -151593 -165586 -167286 -154803 -132068 -110762
$$ packed form
5710a31464l110q209p854r634o646K385M983K903N469M585j933k725O955J7140
5696a27155K0735K4484K6194J7040K692k475Q692J9243Q349j3279k3462k0618
5684e9560j5759j3932j4522j8397j8294m863J1015J2995K179l678P65L185J733
5671a17133M077O462O173K474N7M699R554m068l0928l9054k4353o171Q462K1199
5657a58550K5201J6149L774j387o477q384j574M929O015K062J372M416K077m889
5643a15266q529r746o691R67P216P728P05k569M253J1503J7541J4851j005j1079
5629i0121o919K494R548O728k877j1868j7879j4573n650J537P056P161O33l967
5615a18697k490P597J3341M231p349j3950j6307j7969j3993j700J2483K2735K1306
$$ plain form
5602 -110762 -98920 -96009 -99896 -105303 -109644 -114629 -112516 -100832 -92246 -96144 -107177 -118282 -128673
5589 -128673 -136071 -136597 -126744 -107322 -89954 -82868 -81682 -88359 -107493 -128120 -130795 -114262 -91600
5576 -91600 -67338 -47118 -40725 -48559 -62853 -78005 -96021 -116226 -125543 -118587 -106392 -103522 -112981
5563 -112981 -128910 -141837 -145837 -140912 -125822 -105413 -91647 -90261 -97459 -106070 -110137 -109116 -110339
5550 -110339 -114580 -117784 -116841 -110405 -104085 -97261 -80800 -57056 -38645 -30380 -29808 -30287 -30676 -33917 -41256
5535 -41256 -45221 -40520 -29933 -17785 -4660 4972 3136 -7543 -22724 -40432 -57135 -73409 -91186
5522 -91186 -108145 -115739 -106192 -82788 -56751 -41389 -40240 -48400 -62774 -83034 -107844 -130007 -146375
5509 -146375 -160435 -170195 -171213 -168480 -169922 -175759 -180831 -179483 -174010 -172367 -174345 -173042 -170766 -170586
$$ packed form
5602a10762J1842K911l887n407m341m985K113J1684Q586l898j1033j1105j0391
5589a28673p398n26R853J9422J7368P086J186o677j9134k0627k675J6533K2662
5576i1600K4262K0220O393p834j4294j5152j8016k0205r317O956J2195K870r459
5563a12981j5929j2927m000M925J5090K0409J3766J386p198q611m067J021j223
5550a10339m241l204R43O436O320O824J6461K3744J8411Q265N72m79l89l241p339
5535d1256l965M701J0587J2148J3125R632j836j0679j5181j7708j6703j6274j7777
5522i1186j6959p594R547K3404K6037J5362J149q160j4374k0260k4810k2163j6368
5509a46375j4060r760j018K733j442n837n072J348N473J643j978J303K276J80
$$ plain form
5495 -170586 -171031 -172352 -172828 -163119 -134615 -94817 -60521 -38853 -28313 -26783 -31169 -38959 -49935
5482 -49935 -62320 -70489 -67642 -54722 -40364 -39932 -60357 -86148 -99566 -104772 -112948 -120866 -121529 -116650
5468 -116650 -112700 -109412 -101600 -90514 -84886 -86752 -87790 -82885 -71125 -57059 -40556 -20593 -1984
5455 -1984 10055 13678 12008 6033 -3469 -14914 -23161 -22139 -14624 -8283 -2501 6851 15547 13161
5441 13161 -2196 -29558 -61083 -79588 -80089 -66331 -45652 -29230 -21673 -19649 -18851 -22085 -27770
5428 -27770 -30953 -28203 -22189 -19656 -25032 -40590 -59770 -72698 -77443 -76456 -71435 -58928 -39044 -18336
5414 -18336 1012 16502 22654 17054 4054 -12585 -28250 -37739 -43920 -48258 -47375 -40550 -33582 -28112
5400 -28112 -20759 -12880 -2552 15242 35066 53379 74983 100314 122078 135955 135545 111957 75868
$$ packed form
5495a70586m45j321m76R709K8504L9798L4296K1668J0540J530m386p790j0976
5482d9935j2385q169K847J2920J4358M32k0425k5791j3418n206q176p918o63M879
5468a16650L950L288P812J1086N628j866j038M905J1760J4066J6503J9963J8609
5455a984J2039L623j670n975r502j1445q247J022P515O341N782R352Q696k386
5441A3161j5357k7362l1525j8505n01J3758K0679J6422P557K024P98l234n685
5428b7770l183K750O014K533n376j5558j9180j2928m745R87N021J2507J9884K0708
5414a8336J9348J5490O152n600j3000j6639j5665r489o181m338Q83O825O968N470
5400b8112P353P879J0328J7794J9824J8313K1604K5331K1764J3877m10k3588l6089
$$ plain form
5387 75868 41743 9866 -20494 -45736 -62603 -68293 -62765 -49553 -38612 -39518 -49645 -58488 -53114
5374 -53114 -33516 -17310 -15583 -23548 -30535 -35607 -43087 -47717 -40466 -21272 1735 18677 21303
5361 21303 11163 51 -1707 4140 6943 -1806 -19628 -43206 -71023 -95176 -109096 -103349 -75438
5348 -75438 -39685 -10201 9829 16224 7119 -801 9582 31832 48667 52692 50653 50830 51498 53290
5334 53290 77779 161465 341084 609959 834912 840529 646416 420403 258697 162223 104725
5323 104725 67428 43802 27681 21999 34775 55906 72761 83176 86555 90171 110931 158943
5311 158943 224977 298289 380552 473035 568165 665735 776068 904453 1057705 1250176 1502754
5300 1502754 1836426 2267910 2820719 3527262 4384900 5243283 5734753 5530811 4741192 3777913
$$ packed form
5387G5868l4125l1877l0360k5242j6867n690N528J3212J0941r06j0127q843N374
5374e3114J9598J6206J727p965o987n072p480m630P251J9194K3007J6942K626
5361B1303j0140j1112j758N847K803q749j7822k3578k7817k4153j3920N747K7911
5348g5438L5753K9484K0030O395r105p920J0383K2250J6835M025k039J77O68J792
5334E3290K4489Q3686J79619K68875K24953N617j94113k26013j61706r6474n7498
5323A04725l7297k3626j6121n682J2776K1131J6855J0415L379L616K0760M8012
5311A58943O6034P3312Q2263R2483R5130R7570J10333J28385J53252J92471K52578
5300A502754L33672M31484N52809P06543Q57638Q58383M91470k03942p89619r63279
$$ plain form
5290 3777913 2930691 2281026 1815340 1495276 1275068 1118108 998474 893330 786596 674578
5280 674578 567502 482121 426095 393905 373170 355999 338747 317348 291860 264631 234391
5269 234391 201382 176761 167810 167150 166792 167534 172115 176392 175883 164602 133834 86606 37154 285
5255 285 -19097 -23654 -18383 -10080 -2655 7497 22396 31451 24150 3694 -21094 -43505 -58751
5242 -58751 -60256 -42896 -14176 15476 42503 62734 77822 97188 122051 144539 158027 162279
5230 162279 154747 133716 106634 80681 56092 27563 -3654 -27586 -41080 -46531 -47228 -50218 -57837
5217 -57837 -65493 -73260 -80736 -83181 -85803 -90626 -93023 -94609 -101585 -116936 -135058 -145211 -140139 -125455
5203 -125455 -111443 -99921 -87676 -74092 -63138 -58465 -53234 -43594 -37220 -37680 -42219 -47119 -48826
$$ packed form
5290C777913q47222o49665m65686l20064k20208j56960j19634j05144j06734j12018
5280F74578j07076q5381n6026l2190k0735j7171j7252k1399k5488k7229l0240
5269B34391l3009k4621q951o60l58P42M581M277n09j1281l0768m7228m9452l6869
5255B85j9382m557N271Q303P425J0152J4899R055p301k0456k4788k2411j5246
5242e8751j505J7360K8720K9652K7027K0231J5088J9366K4863K2488J3488M252
5230A62279p532k1031k7082k5953k4589k8529l1217k3932j3494n451o97k990p619
5217e7837p656p767p476k445k622m823k397j586o976j5351j8122j0153N072J4684
5203a25455J4012J1522J2245J3584J0954M673N231R640O374m60m539m900j707
$$ plain form
5190 -48826 -47455 -44301 -35060 -13023 11916 23552 20530 6896 -10572 -23437 -29842 -34862 -40518
5177 -40518 -36736 -16785 12287 39498 53845 51528 41855 29233 10053 -7869 -15699 -17574 -18200
5164 -18200 -16390 -12915 -12603 -10545 -2046 7366 11108 10974 17429 33603 50734 66205 85911 107452
5150 107452 125627 138437 143492 137036 117316 90712 62637 40556 25814 12099 3314 9226
5138 9226 29418 50892 61750 70843 91841 116957 133564 143289 153162 166876 189866 225673 269632
5125 269632 315648 365753 422623 484078 554048 645698 770989 932026 1114709 1274178 1354655
5114 1354655 1334320 1230478 1070565 885493 709451 566647 458771 374635 309318 260508
5104 260508 223353 193852 177678 180165 191327 192066 178553 164057 161838 168008 167561 151733 126691
$$ packed form
5190d8826J371L154R241K2037K4939J1636l022j3634j7468j2865o405n020n656
5177d0518L782J9951K9072K7211J4347k317r673j2622j9180j7922p830j875o26
5164a8200J810L475L12K058Q499R412L742j34O455J6174J7131J5471J9706K1541
5150A07452J8175J2810N055o456j9720k6604k8075k2081j4742j3715q785N912
5138I226K0192K1474J0858R093K0998K5116J6607R725R873J3714K2990L5807M3959
5125B69632M6016N0105N6870O1455O9970R1650J25291J61037J82683J59469Q0477
5114A354655k0335j03842j59913j85072j76042j42804j07876q4136o5317m8810
5104B60508l7155k9501j6174K487J1162P39j3513j4496k219O170m47j5828k5042
$$ plain form
5091 126691 105536 94147 93524 98592 102402 102849 100957 101406 112214 127534 133723 132650 133006 130915
5077 130915 120614 107657 102227 107511 122647 145140 160612 158093 148878 144863 145708 144133 134195
5064 134195 123843 123610 126381 117134 96901 81381 83079 100443 113722 107865 90764 76419 63379
5051 63379 47949 41364 53260 71085 77327 67818 52861 42301 43471 57096 77505 103689 137303
5038 137303 169478 186324 186043 178011 174647 174538 165695 144742 117069 91522 69892 49120 34154
5025 34154 33213 46168 66832 89142 108103 115908 113355 105869 96113 86894 77009 64260 54378 55937
5011 55937 70868 85771 87071 77505 66120 62073 61558 59729 61783 65466 67476 73293 86767 101745
4997 101745 112171 118365 120663 113822 96027 78063 69446 66290 63016 60803 66233 83740 107829
$$ packed form
5091A26691k1155j1389o23N068L810M47j892M49J0808J5320O189j073L56k091
5077A30915j0301j2957n430N284J5136K2493J5472k519r215m015Q45j575r938
5064A34195j0352k33K771r247k0233j5520J698J7364J3279n857j7101j4345j3040
5051F3379j5430o585J1896J7825O242r509j4957j0560J170J3625K0409K6184L3614
5038A37303L2175J6846k81q032l364j09q843k0953k7673k5547k1630k0772j4966
5025C4154r41J2955K0664K2310J8961P805k553p486r756r219r885j2749r882J559
5011E5937J4931J4903J300r566j1385m047n15j829K054L683K010N817J3474J4978
4997A01745J0426O194K298o841j7795j7964q617l156l274k213N430J7507K4089
$$ plain form
4984 107829 131598 153890 172464 189206 207256 227949 251208 272478 283857 285252 284482 286293
4972 286293 295252 313197 331195 337221 328538 310774 288210 272816 276226 298478 332129 367147
4960 367147 392210 401259 402266 405553 410632 411946 409234 409005 415123 424391 430864 433498 435776 436262 434618
4945 434618 437568 450621 475263 513099 568482 637196 712428 791195 868061 922922 933514 913715
4933 913715 897431 900221 915466 931923 943624 949563 955813 974955 1015659 1075033 1144804 1224424
4921 1224424 1323454 1449725 1603099 1780933 1979056 2196256 2437838 2710434 3023792 3391288
4911 3391288 3824734 4337816 4940479 5643635 6465851 7440271 8606678 10010046 11700144
4902 11700144 13747013 16254499 19370503 23271910 28145711 34191519 41636661 50688675
$$ packed form
4984A07829K3769K2292J8574J6742J8050K0693K3259K1270J1379J395p70J811
4972B86293Q959J7945J7998O026q683j7764k2564j5394L410K2252L3651L5018
4960C67147K5063R049J007L287N079J314k712k29O118R268O473K634K278M86j644
4945D34618K950J3053K4642L7836N5383O8714P5232P8767P6866N4861J0592j9799
4933I13715j6284K790J5245J6457J1701N939O250J9142M0704N9374O9771P9620
4921A224424R9030J26271J53374J77834J98123K17200K41582K72596L13358L67496
4911C391288M33446N13082O02663P03156Q22216R74420J166407J403368J690098
4902A1700144K046869K507486L116004L901407M873801O045808P445142R052014
$$ plain form
4894 50688675 61107095 70865700 75217055 70448947 59105635 46714609 36319014 28416667
4886 28416667 22564731 18223014 14960855 12473742 10550997 9057022 7889106 6955398
4878 6955398 6147150 5395614 4722429 4174821 3743506 3395234 3103610 2859620 2651895 2466343
4868 2466343 2295678 2133943 1967687 1798786 1641124 1505439 1393315 1307366 1243171 1188830
4858 1188830 1136797 1090593 1055476 1032116 1010612 989151 971433 958267 946259 935020 929094 935638
4846 935638 948248 956159 954663 933271 884390 824034 762686 699676 641789 600032 575231 558760
4834 558760 538475 513541 487628 462258 435222 409943 393601 386541 386640 395671 411158 428755 446582
4821 446582 468120 494670 523863 554368 580982 588740 571761 532764 484923 447432 426254 410739
$$ packed form
4894E0688675J0418420R758605M351355m768108j1343312j2391026j0395595p902347
4886B8416667n851936m341717l262159k487113j922745j493975j167916r33708
4878F955398q08248p51536o73185n47608m31315l48272k91624k43990k07725j85552
4868B466343j70665j61735j66256j68901j57662j35685j12124q5949o4195n4341
4858A188830n2033m6204l5117k3360k1504k1461j7718j3166j2008j1239n926O544
4846I35638J2610P911j496k1392m8881o0356o1348o3010n7887m1757k4801j6471
4834E58760k0285k4934k5913k5370k7036k5279j6342p060R9R031J5487J7597J7827
4821D46582K1538K6550K9193L0505K6614P758j6979l8997m7841l7491k1178j5515
$$ plain form
4809 410739 389316 365633 349088 338514 329883 318163 304731 293679 284715 275114 267984 269514 284018
4796 284018 303000 313543 310375 298938 288602 286137 287473 281887 268163 253359 239257 229410 225026
4783 225026 223686 226727 236054 249260 262693 270682 274617 277498 274751 264997 259065 261474 267127 270203
4769 270203 268781 261162 251577 248968 258341 279722 306046 330200 350034 356659 343387 319840 300844
4756 300844 289240 286027 289749 302077 317979 327682 325787 318530 315161 314454 307580 293247 284059 289809
4742 289809 309724 332443 345871 350851 350765 353923 370535 395789 418984 436895 450971 468295 492539
4729 492539 524175 567590 625676 694438 775295 876332 991099 1085880 1130324 1132118 1115727
4718 1115727 1094692 1086179 1101699 1128058 1143987 1133346 1106881 1101149 1121351 1135772 1106810 1031321
$$ packed form
4809D10739k1423k3683j6545j0574q631j1720j3432j1052q964r601p130J530J4504
4796B84018J8982J0543l168j1437j0336k465J336n586j3724j4804j4102r847m384
4783B25026j340L041R327J3206J3433P989L935K881k747r754n932K409N653L076
4769B70203j422p619r585k609R373K1381K6324K4154J9834O625j3272k3547j8996
4756C00844j1604l213L722J2328J5902R703j895p257l369p07o874j4333r188N750
4742B89809J9915K2719J3428M980q6L158J6612K5254K3195J7911J4076J7324K4244
4729D92539L1636M3415N8086O8762Q0857J01037J14767R4781M4444J794j6391
4718A115727k1035q513J5520K6359J5929j0641k6465n732K0202J4421k8962p5489
$$ plain form
4706 1031321 935417 831599 726931 634602 564066 517376 493596 492560 507115 525078 539682
4695 539682 555244 569270 571742 565057 558043 550515 541766 529612 510810 491184 478674 474453 481276
4682 481276 494914 504866 508222 508646 511789 525719 550281 579534 610814 632846 633098 617423 597977
4669 597977 582514 574378 571780 572543 578480 594573 621752 646522 651160 635241 615737 607690 611424
4656 611424 620802 633306 649825 671345 695331 716289 731731 744357 754966 761788 768677 778948
4644 778948 793137 812982 840891 875860 912335 937699 942350 928272 905385 885276 872018 867318
4632 867318 872654 888559 915132 954334 1003723 1053087 1091816 1114938 1134773 1164891 1206070 1249040
4620 1249040 1283735 1316609 1368587 1450694 1558265 1677245 1800046 1918743 2023580 2122711
$$ packed form
4706A031321r5904j03818j04668r2329p0536m6690k3780j036J4555J7963J4604
4695E39682J5562J4026K472o685p014p528q749j2154j8802j9626j2510m221O823
4682D81276J3638R952L356M24L143J3930K4562K9253L1280K2032K52j5675j9446
4669E97977j5463q136k598P63N937J6093K7179K4770M638j5919j9504q047L734
4656F11424R378J2504J6519K1520K3986K0958J5442J2626J0609O822O889J0271
4644G78948J4189J9845K7909L4969L6475K5364M651j4078k2887k0109j3258m700
4632H67318N336J5905K6573L9202M9389M9364L8729K3122J9835L0118M1179M2970
4620A249040L4695L2874N1978Q2107J07571J18980J22801J18697J04837R9131
$$ plain form
4610 2122711 2227795 2346093 2483036 2641635 2830185 3065796 3375103 3789922 4339963 5054089
4600 5054089 5974025 7153303 8575701 9971559 10719331 10305156 8961111 7365570 5977188
4591 5977188 4915490 4135999 3552072 3088415 2712659 2424648 2223134 2088660 1975808
4582 1975808 1840408 1681818 1531870 1416331 1345820 1312393 1293888 1261202 1195526 1105565 1011524
4571 1011524 924726 855042 805927 768219 727147 677400 620718 566969 528175 509766 514136 531737
4559 531737 546252 550791 545794 538062 529584 516802 501992 489610 478283 470760 477838 502898 531433
4546 531433 551542 562521 572006 585735 599321 608827 614246 612643 604226 591036 577287 564651 554072
4533 554072 546972 546810 556116 565595 566029 562517 562787 573300 593059 611850 625250 641530 665569 691367
$$ packed form
4610B122711J05084J18298J36943J58599J88550K35611L09307M14819N50041P14126
4600E054089R19936J179278J422398J395858P47772m14175j344045j595541j388382
4591E977188j061698p79491n83927m63657l75756k88011k01514j34474j12852
4582A975808j35400j58590j49948j15539p0511l3427j8505l2686o5676q9961r4041
4571A011524q6798o9684m9115l7708m1072m9747n6682n3749l8794j8409M370J7601
4559E31737J4515M539m997p732q478j2782j4810j2382j1327p523P078K5060K8535
4546E31433K0109J0979R485J3729J3586R506N419j603q417j3190j3749j2636j0579
4533E54072p100j62R306R479M34l512K70J0513J9759J8791J3400J6280K4039K5798
$$ plain form
4519 691367 710571 724131 731319 729996 725980 729419 745362 765775 779056 785065 793392 811162 827282
4506 827282 833225 837766 852740 874211 900748 934721 973488 1012662 1054194 1095113 1132012 1167935
4494 1167935 1207648 1253198 1304767 1362077 1428285 1499836 1570417 1640946 1715372 1785988 1859179
4483 1859179 1951106 2061136 2180737 2313586 2470292 2662972 2896622 3172099 3492119 3872870
4473 3872870 4324739 4791789 5119282 5169870 4980850 4717764 4506866 4393693 4367724 4406560
4463 4406560 4501011 4650341 4849166 5098647 5403667 5756138 6136551 6540960 6988418 7507132
4453 7507132 8113307 8825850 9665718 10647464 11784154 13107011 14651593 16456540 18573361
4444 18573361 21087801 24096189 27706758 32023920 37134652 43119850 50124444 58400889
$$ packed form
4519F91367J9204J3560P188j323m016L439J5943K0413J3281O009Q327J7770J6120
4506H27282N943M541J4974K1471K6537L3973L8767L9174M1532M0919L6899L5923
4494A167935L9713M5550N1569N7310O6208P1551P0581P0529P4426P0616P3191
4483A859179R1927J10030J19601J32849J56706J92680K33650K75477L20020L80751
4473C872870M51869M67050L27493N0588j89020k63086k10898j13173k5969L8836
4463D406560R4451J49330J98825K49481L05020L52471L80413M04409M47458N18714
4453G507132O06175P12543Q39868R81746J136690J322857J544582J804947K116821
4444A8573361K514440L008388L610569M317162N110732N985198P004594Q276445
$$ plain form
4436 58400889 68345328 80512948 95647896 114660650 138622157 168885701 207452633
4429 207452633 256888000 318011407 383083063 428774250 427307646 376975348 305426176
4422 305426176 238633633 185804522 146291541 117009838 95112778 78482718 65654703
4415 65654703 55613463 47625937 41169922 35882647 31503478 27832891 24728788 22092102
4407 22092102 19856950 17964481 16348768 14951209 13726621 12631571 11638792 10737148
4399 10737148 9922586 9198792 8573472 8038352 7571530 7153766 6772334 6414714 6083118
4390 6083118 5791758 5539072 5308812 5095052 4904010 4747338 4635774 4571386 4556023 4600162
4380 4600162 4713471 4893996 5091996 5177402 5017876 4632129 4170261 3754110 3415945 3136977
$$ packed form
4436E8400889R944439J2167620J5134948J9012754K3961507L0263544L8566932
4429B07452633M9435367O1123407O5071656M5691187j466604n0332298p1549172
4422C05426176o6792543n2829111l9512981k9281703k1897060j6630060j2828015
4415F5654703j0041240p987526o456015n287275m379169l670587l104103k636686
4407B2092102k235152j892469j615713j397559j224588j095050r92779r01644
4399A0737148q14562p23794o25320n35120m66822m17764l81432l57620l31596
4390F083118k91360k52686k30260k13760j91042j56672j11564o4388j5363M4139
4380D600162J13309J80525J98000Q5406j59526l85747m61868m16151l38165k78968
$$ plain form
4370 3136977 2896873 2685798 2500999 2344158 2214984 2111511 2031486 1971410 1923175 1876378
4360 1876378 1822303 1759340 1689995 1613130 1535417 1468217 1412874 1367701 1333877 1310375 1296001
4349 1296001 1283728 1266216 1245528 1229625 1220735 1214769 1208289 1199141 1182703 1158737 1135534 1118713
4337 1118713 1108582 1103320 1094586 1073099 1041528 1010044 983433 961733 949118 950743 958629 962128
4325 962128 956655 942109 920031 897248 886846 889610 895768 902446 900159 882009 862628 853720 850062
4312 850062 846123 842082 840367 839543 832682 813722 789709 779266 789295 801588 797369 774987 742754
4299 742754 703641 661686 627882 609833 608731 618915 632426 643121 646914 649689 653356 652263 645411
4286 645411 632750 610765 587911 570126 544845 509352 478197 455073 434523 417890 405054 394186
$$ packed form
4370C136977k40104k11075j84799j56841j29174j03473q0025o0076m8235m6797
4360A876378n4075o2963o9345p6865p7713o7200n5343m5173l3824k3502j4374
4349A296001j2273j7512k0688j5903q890n966o480r148j6438k3966k3203j6821
4337A118713j0131n262q734k1487l1571l1484k6611k1700j2615J625P886L499
4325I62128n473j4546k2078k2783j0402K764O158O678k287j8150j9381q908l658
4312H50062l939m041j715q24o861j8960k4013j0443J0029J2293m219k2382l2233
4299G42754l9113m1955l3804j8049j102J0184J3511J0695L793K775L667j093o852
4286F45411j2661k1985k2854j7785k5281l5493l1155k3124k0550j6633j2836j0868
$$ plain form
4274 394186 384900 377853 370761 361663 353638 344871 330269 313814 304324 303963 307295 314573 324484 336043
4260 336043 348625 351855 344492 338911 344892 350761 342233 323309 305289 291555 283526 284001 287368 287031
4246 287031 281195 270164 260211 260820 269996 276714 270276 252303 231404 208142 186930 171419 160405
4233 160405 155555 161545 175447 190350 202480 208720 209008 206229 196956 181811 165463 147518 128620
4220 128620 107384 86977 80033 91833 120015 150747 166864 165886 158522 154192 154311 157336 165160
4207 165160 178321 193542 208791 222645 230041 231420 231955 234206 237479 237183 229332 222863 229077 245089
4193 245089 256918 263505 274392 291325 310515 321779 315055 293104 261694 227395 195880 172845
4181 172845 159152 152543 145872 140747 143370 148040 144728 133614 120804 109562 99717 90914 80107
$$ packed form
4274C94186r286p047p092r098q025q767j4602j6455r490l61L332P278R911J1559
4260C36043J2582L230p363n581N981N869q528j8924j8020j3734q029M75L367l37
4246B87031n836j1031r953O09R176O718o438j7973k0899k3262k1212j5511j1014
4233A60405m850N990J3902J4903J2130O240K88k779r273j5145j6348j7945j8898
4220A28620k1236k0407o944J1800K8182L0732J6117r78p364m330J19L025P824
4207A65160J3161J5221J5249J3854P396J379N35K251L273k96p851o469O214J6012
4193B45089J1829O587J0887J6933J9190J1264o724k1951l1410l4299l1515k3035
4181A72845j3693o609o671n125K623M670l312j1114j2810j1242r845q803j0807
$$ plain form
4168 80107 67095 55394 49030 49032 53996 58979 61087 62287 60442 55323 55117 68478 94894 124580
4154 124580 147822 162807 171543 172493 164453 152535 136703 115035 96618 98576 127985 160895 168246
4141 168246 153268 135753 119586 95292 66330 51596 55955 66460 69924 67441 74546 94198
4129 94198 108360 105330 87649 62916 43994 40382 51382 68427 88886 108761 118643 118182 106164
4116 106164 83169 63180 61722 77089 98509 121350 143813 159549 162985 156330 148186 135025
4104 135025 110281 87090 77644 79736 82454 78642 76418 88483 112550 133631 138070 127309 111869
4091 111869 98720 89163 80009 73937 77261 88951 100985 105493 99135 87343 76229 65386 55635
4078 55635 55286 67241 72203 58379 40751 36174 46171 61854 72147 72691 70159 71045 73444 71127
$$ packed form
4168H0107j3012j1701o364KM964M983K108J200j845n119k06J3361K6416K9686
4154A24580K3242J4985Q736R50q040j1918j5832k1668j8417J958K9409L2910P351
4141A68246j4978j7515j6167k4294k8962j4734M359J0505L464k483P105J9652
4129I4198J4162l030j7681k4733j8922l612J1000J7045K0459J9875R882m61j2018
4116A06164k2995j9989j458J5367K1420K2841K2463J5736L436o655q144j3161
4104A35025k4744k3191r446K092K718l812k224J2065K4067K1081M439j0761j5440
4091A11869j3149r557r154o072L324J1690J2034M508o358j1792j1114j0843r751
4078E5635l49J1955M962j3824j7628m577R997J5683J0293N44k532Q86K399k317
$$ plain form
4064 71127 68395 72076 77068 77010 75294 78220 82446 80675 73846 67437 66106 71914 81105 86002 84002
4049 84002 80342 78736 73968 59684 39249 27435 30647 38778 46072 56436 68512 77175 84170
4036 84170 91944 94321 81421 58145 37373 25335 25857 40582 62025 70998 66046 60437 58844
4023 58844 66406 85219 109868 129634 136080 133697 131987 128804 117509 97016 71039 46315 28549
4010 28549 21524 20373 18864 18865 18501 17537 22313 38217 63846 91210 110370 111085 94364 73571 56949
3995 56949 50113 52637 56640 63195 82265 117503 160330 187038 168266 111519 54449 15426 -11019
3982 -11019 -30851 -39560 -37429 -30958 -21920 -10791 11374 75832 187832 280618 294224 254608
3970 254608 215187 189310 166197 143283 123477 100959 75678 54732 44366 53487 80860 112146
$$ packed form
4064G1127k732L681M992n8j716K926M226j771o829o409j331N808R191M897k000
4049H4002l660j606m768j4284k0435j1814L212Q131P294J0364J2076Q663O995
4036H4170P774K377j2900k3276k0772j2038N22J4725K1443Q973m952n609j593
4023E8844P562J8813K4649J9766O446k383j710l183j1295k0493k5977k4724j7766
4010B8549p025j151j509Jl64r64M776J5904K5629K7364J9160P15j6721k0793j6622
3995E6949o836K524M003O555J9070L5238M2827K6708j8772n6747n7070l9023k6445
3982a1019j9832q709K131O471R038J1129K2165O4458J12000R2786J3606l9616
3970B54608l9421k5877k3113k2914j9806k2518k5281k0946j0366R121K7373L1286
$$ plain form
3958 112146 133470 146712 160422 169971 166623 153245 140575 135629 136006 134933 131492 131678 140005 150072
3944 150072 155701 161041 171871 179488 173069 157672 142911 130296 116218 100538 88835 89833 104793
3931 104793 125196 134984 126731 106803 83054 63953 56688 61658 74786 88658 94289 94198 97210
3918 97210 100493 97451 91950 92973 102606 113919 118573 119872 120514 117972 117553 124573 135460 139600 130389
3903 130389 109414 85731 65242 45483 21012 -5446 -24094 -32586 -34743 -30944 -19457 -4133
3891 -4133 13475 30727 37868 38016 43872 48729 36458 8071 -20501 -43168 -60521 -72311 -82243
3878 -82243 -94658 -111482 -134732 -161002 -186937 -207369 -210249 -190575 -162214 -138633 -113003 -74872
3866 -74872 -33291 -3256 10432 9129 -3287 -17050 -25137 -27283 -19700 -6421 5601 7539 -904
$$ packed form
3958A12146K1324J3242J3710R549l348j3378j2670m946L77j073l441J86Q327J0067
3944A50072N629N340J0830P617o419j5397j4761j2615j4078j5680j1703R98J4960
3931A04793K0403R788q253j9928k3749j9101p265M970J3128J3872N631r1L012
3918I7210L283l042n501J023R633J1313M654J299O42k542m19P020J0887M140r211
3903A30389k0975k3683k0489j9759k4471k6458j8648q492k157L799J1487J5324
3891d133J7608J7252P141J48N856M857j2271k8387k8572k2667j7353j1790r932
3878h2243j2415j6824k3250k6270k5935k0432k880J9674K8361K3581K5630L8131
3866g4872M1581L0035J3688j303j2416j3763q087k146P583J3279J2022J938q443
$$ plain form
3853 -904 -1071 10991 20435 15457 -5152 -28964 -42762 -45920 -46771 -46076 -38514 -33336 -35952 -42478 -46167
3838 -46167 -44993 -38671 -25327 -16537 -23881 -42405 -65017 -88985 -100805 -96010 -87205 -82568 -82662 -81379
3824 -81379 -76474 -75152 -84605 -100593 -112433 -114505 -112018 -115123 -130051 -153151 -174465 -179077 -163501
3811 -163501 -146730 -141197 -141891 -144135 -139263 -123357 -103917 -84743 -67040 -51856 -42766 -41251 -39615
3798 -39615 -35336 -30750 -24928 -24124 -32826 -46832 -64333 -83276 -95486 -92239 -81835 -75875 -78384 -89454
3784 -89454 -103104 -114490 -119579 -115006 -103020 -91327 -86688 -90285 -96270 -100525 -102405 -101684 -101698 -109228
3770 -109228 -126184 -146921 -165024 -173995 -166641 -143754 -113662 -81848 -52110 -25742 -6422 -4983
3758 -4983 -26579 -59588 -83659 -88858 -82584 -73377 -67434 -73638 -96138 -122047 -138984 -147878 -150465
$$ packed form
3853i04j67J2062R444m978k0609k3812j3798l158q51O95P562N178k616o526l689
3838d6167J174O322J3344Q790p344j8524k2612k3968j1820M795Q805M637r4J283
3824h1379M905J322r453j5988j1840k072K487l105j4928k3100k1314m612J5576
3811a63501J6771N533o94k244M872J5906J9440J9174J7703J5184R090J515J636
3798c9615M279M586N822Q04q702j4006j7501j8943j2210L247J0404N960k509j1070
3784h9454j3650j1386n089M573J1986J1693M639l597n985m255j880P21j4p530
3770a09228j6956k0737j8103q971P354K2887L0092L1814K9738K6368J9320J439
3758d983k1596l3009k4071n199O274R207N943o204k2500k5909j6937q894k587
$$ plain form
3745 -150465 -150327 -150567 -150477 -147430 -140467 -128029 -109218 -84924 -62217 -51162 -49070 -47707 -46272 -48015
3731 -48015 -49280 -48237 -46358 -41796 -36297 -33629 -36204 -45647 -56963 -63715 -64767 -60221 -60017 -72373
3717 -72373 -90093 -105723 -117219 -124181 -125750 -122945 -124204 -135854 -153640 -167083 -168146 -162610 -161127
3704 -161127 -168160 -177072 -171710 -149717 -124389 -105099 -84237 -56351 -32531 -23124 -22330 -17695 -5734
3691 -5734 1582 -7988 -32940 -59368 -78636 -95858 -115345 -134020 -148146 -153934 -148939 -134364 -116916
3678 -116916 -105391 -98383 -85129 -64307 -53125 -57501 -63794 -66066 -60948 -46257 -30410 -27628 -38449
3665 -38449 -49125 -59484 -73676 -85247 -91124 -91260 -91734 -98934 -112209 -118187 -104232 -79576 -60570
3652 -60570 -53423 -59016 -74444 -91312 -105228 -119285 -137430 -163480 -191909 -206855 -203036 -188343
$$ packed form
3745a50465J38k40R0L047O963J2438J8811K4294K2707J1055K092J363J435j743
3731d8015j265J043J879M562N499K668k575r443j1316o752j052M546K04j2356
3717g2373j7720j5630j1496o962j569K805j259j1650j7786j3443j063N536J483
3704a61127p033q912N362K1993K5328J9290K0862K7886K3820R407P94M635J1961
3691e734P316r570k4952k6428j9268j7222j9487j8675j4126n788M995J4575J7448
3678a16916J1525P008J3254K0822J1182m376o293k272N118J4691J5847K782j0821
3665c8449j0676j0359j4192j1571n877j36m74p200j3275n978J3955K4656J9006
3652f0570P147n593j5428j6868j3916j4057j8145k6050k8429j4946L819J4693
$$ plain form
3640 -188343 -174766 -170231 -172717 -171702 -160044 -137260 -111839 -98065 -101779 -110174 -108069 -93575 -73219
3627 -73219 -59335 -57698 -63132 -67997 -67075 -60481 -53608 -49441 -46810 -44251 -41257 -45152 -60258 -73999
3613 -73999 -79072 -78307 -79500 -87667 -101874 -120493 -139732 -154394 -162656 -166247 -165786 -157975 -140126 -116201
3599 -116201 -98110 -86253 -66686 -35402 -9794 -5885 -19066 -31501 -36990 -42178 -51069 -59993 -61378
3586 -61378 -52518 -41618 -36595 -38297 -45849 -61641 -90528 -120720 -135904 -140935 -143045 -138911 -129682
3573 -129682 -123516 -118968 -112845 -106619 -99516 -92926 -92478 -96416 -96165 -89432 -77273 -63435 -53844 -47499
3559 -47499 -45941 -52361 -61690 -67663 -70109 -75415 -90131 -115615 -141733 -160788 -177861 -198808 -220821
3546 -220821 -238158 -249709 -257396 -261983 -261356 -254982 -251755 -253821 -248599 -223583 -169248 -85844 -196
$$ packed form
3640a88343J3577M535k486J015J1658K2784K5421J3774l714q395K105J4494K0356
3627g3219J3884J637n434m865R22O594O873M167K631K559K994l895j5106j3741
3613g3999n073P65j193q167j4207j8619j9239j4662q262l591M61P811J7849K3925
3599a16201J8091J1857J9567L1284K5608L909j3181j2435n489n188q891q924j385
3586f1378Q860J0900N023j702p552j5792k8887l0192j5184n031k110M134R229
3573a29682O166M548O123O226P103O590M48l938K51O733J2159J3838R591O345
3559d7499J558o420r329n973k446n306j4716k5484k6118j9055j7073k0947k2013
3546b20821j7337j1551p687m587O27O374L227k066N222K5016N4335Q3404Q5648
$$ plain form
3533 -196 59406 81244 64949 29008 -2435 -11436 17079 88928 207139 385349 624164 833549
3521 833549 841577 604981 294728 67288 -57877 -118862 -149427 -163836 -170403 -178450 -188573
3510 -188573 -195071 -196613 -192752 -186231 -182830 -184562 -186564 -183220 -176919 -173129 -171760 -163479 -144187 -123040
3496 -123040 -110576 -109698 -113354 -113357 -111417 -112083 -116652 -122251 -125433 -125040 -117816 -106816 -101854 -106502 -111372
3481 -111372 -107635 -97721 -87842 -77087 -61596 -43438 -31609 -33729 -56155 -90734 -121107 -141491
3469 -141491 -152417 -155154 -151810 -139667 -120332 -103892 -95230 -98214 -109677 -116933 -116111 -111714 -108525
3456 -108525 -113714 -133233 -162739 -186234 -192376 -181164 -161820 -150379 -151403 -157429 -164327 -171055 -177434
3443 -177434 -183496 -185161 -177143 -161587 -145344 -135132 -129068 -123348 -116595 -104631 -85092 -63872 -51620
$$ packed form
3533a96N9602K1838j6295l5941l1443r001K8515P1849J18211J78210K38815K09385
3521H33549Q028k36596l10253k27440j25165o0985l0565j4409o567q047j0123
3510a88573o498j542L861O521L401j732k002L344O301L790J369Q281J9292K1147
3496a23040J2464Q78l656lJ940o66m569n599l182L93P224J1000M962m648m870
3481a11372L737R914R879J0755J5491J8158J1829k120k2426l4579l0373k0384
3469a41491j0926k737L344J2143J9335J6440Q662k984j1463p256Q22M397L189
3456a08525n189j9519k9506k3495o142J1212J9344J1441j024o026o898o728o379
3443a77434o062j665Q018J5556J6243J0212O064N720O753J1964J9539K1220J2252
$$ plain form
3430 -51620 -47784 -41371 -31393 -23052 -17648 -11855 -4562 1463 2941 1428 3319 6214 2132 -9346
3416 -9346 -21573 -25153 -19206 -14748 -19758 -31752 -45531 -58299 -69879 -80397 -87970 -98244 -120503
3403 -120503 -142197 -148609 -143384 -133634 -123780 -112254 -92298 -66401 -48458 -45299 -50274 -52978 -51991
3390 -51991 -52654 -57206 -68451 -84648 -98427 -106324 -108841 -109197 -108224 -106431 -103476 -98705 -91199 -80098
3376 -80098 -69314 -59960 -53868 -56614 -67585 -77668 -78851 -70931 -57454 -42861 -36693 -43104 -50014
3363 -50014 -53077 -58784 -62388 -59325 -55909 -56135 -62583 -73834 -79919 -74988 -69090 -76748 -93592 -102452
3349 -102452 -96117 -80536 -63749 -58935 -75858 -112950 -153075 -175513 -181575 -184015 -182946 -177344 -175223
3336 -175223 -178186 -176307 -163754 -148738 -145141 -147810 -143602 -142576 -153209 -162263 -163247 -163815 -170169 -180865
$$ packed form
3430e1620L836O413R978Q341N404N793P293O025J478j513J891K895m082j1478
3416i346j2227l580N947M458n010j1994j3779j2768j1580j0518p573j0274k2259
3403a20503k1694o412N225R750R854J1526J9956K5897J7943L159m975k704R87
3390e1991o63m552j1245j6197j3779p897k517l56R73J793K955M771P506J1101
3376h0098J0784R354O092k746j0971j0083j183P920J3477J4593O168o411o910
3363e0014l063n707l604L063L416k26o448j1251o085M931N898p658j6844q860
3349a02452O335J5581J6787M814j6923l7092m0125k2438o062k440J069N602K121
3336a75223k963J879J2553J5016L597k669M208J026j0633r054r84n68o354j0696
$$ plain form
3322 -180865 -188246 -185817 -179331 -175717 -172083 -168100 -169459 -173277 -170643 -163246 -152263 -134772 -114392 -96323
3308 -96323 -87316 -91338 -104144 -122053 -133287 -130893 -125371 -123925 -123114 -116460 -102743 -82995 -61588
3295 -61588 -40529 -22317 -8125 6039 20222 28169 26625 19807 13740 12685 9494 -2387 -18565
3282 -18565 -35219 -48555 -55168 -58684 -65094 -72525 -80046 -88728 -93576 -88530 -76528 -68871 -73259 -89429
3268 -89429 -109844 -118294 -107245 -95490 -107049 -140256 -171648 -181074 -166400 -133731 -88532 -35668
3256 -35668 18330 57497 71634 68969 53733 21116 -20480 -53424 -72605 -82263 -80818 -69864
3244 -69864 -57479 -47419 -40712 -33560 -16407 8198 29244 41289 44492 34548 10457 -18158 -39420
3231 -39420 -48178 -49829 -48622 -46880 -40542 -23128 23 19478 28425 20632 1456 -15924 -32950
$$ packed form
3322a80865p381K429O486L614L634L983j359l818K634P397J0983J7491K0380J8069
3308i6323R007m022j2806j7909j1234K394N522J446Q11O654J3717J9748K1407
3295f1588K1059J8212J4192J4164J4183P947j544o818o067j055l191j1881j6178
3282a8565j6654j3336o613l516o410p431p521q682m848N046J2002P657m388j6170
3268h9429k0415q450J1049J1755j1559l3207l1392r426J4674L2669M5199N2864
3256c5668N3998L9167J4137k665j5236l2617m1596l2944j9181r658J445J0954
3244f9864J2385J0060O707P152J7153K4605K1046J2045L203r944k4091k8615k1262
3231c9420q758j651J207J742O338J7414K3151J9455Q947p793j9176j7380j7026
$$ plain form
3218 -32950 -55766 -74052 -80008 -75521 -61719 -49161 -45059 -39183 -30061 -30910 -40985 -48761 -51357 -53831
3204 -53831 -54589 -51585 -48380 -48205 -50116 -52513 -56265 -62769 -64479 -57315 -53125 -56127 -58567 -55744 -51936
3189 -51936 -52556 -55426 -59267 -66295 -70862 -66974 -52353 -30411 -11494 -4243 -7817 -17525 -32075 -47807
3175 -47807 -63367 -77196 -78310 -61491 -40598 -28797 -27339 -32546 -43159 -61383 -85240 -103899
3163 -103899 -109748 -104565 -93023 -82107 -74445 -70284 -71067 -71619 -66954 -57457 -51209 -56321 -69579 -83432
3149 -83432 -96441 -110819 -120772 -113507 -88128 -57919 -31834 -8284 9130 12851 4241 -7533 -21434
3136 -21434 -39502 -55008 -65498 -70577 -69514 -64799 -62919 -66503 -75432 -87732 -100338 -110193 -113912
3123 -113912 -106771 -82412 -47339 -18011 -6581 -7480 -13443 -21161 -25051 -23731 -16947 -8035 -3355 -2922
$$ packed form
3218c2950k2816j8286n956M487J3802J2558M102N876R122q49j0075p776k596k474
3204e3831p58L004L205J75j911k397l752o504j710P164M190l002k440K823L808
3189e1936o20k870l841p028m567L888J4621K1942J8917P251l574r708j4550j5732
3175d7807j5560j3829j114J6819K0893J1801J458n207j0613j8224k3857j8659
3163a03899n849N183J1542J0916P662M161p83n52M665R497O248n112j3258j3853
3149h3432j3009j4378r953P265K5379L0209K6085K3550J7414L721q610j1774j3901
3136b1434j8068j5506j0490n079J063M715J880l584q929j2300j2606r855l719
3123a13912P141K4359L5073K9328J1430q99n963p718l890J320O784Q912M680M33
$$ plain form
3109 -2922 -4524 -4675 -4069 -3336 6160 23274 33239 28780 16896 2613 -13483 -22406 -14708 3034
3095 3034 12955 2129 -25619 -58227 -83102 -91015 -86303 -82108 -86886 -96215 -102794 -110755 -125764 -144833
3081 -144833 -168414 -197568 -223991 -242100 -256571 -275979 -305098 -356335 -438337 -542129 -634306
3070 -634306 -637223 -475151 -197150 42281 162650 189162 170963 136389 96542 63229 44192
3059 44192 34822 23143 125 -30007 -52774 -65507 -77345 -92010 -105405 -112777 -114468 -109830 -91573
3046 -91573 -67596 -53281 -47560 -40857 -30681 -21022 -13916 -16257 -27378 -36366 -38195 -38237 -40401 -37900
3032 -37900 -29136 -20974 -17507 -19973 -29863 -46328 -59918 -59482 -49360 -40178 -37500 -45703 -59952 -66540
3018 -66540 -64266 -61421 -62249 -65903 -71765 -87206 -110037 -128561 -142196 -146455 -133047 -106214 -74074
$$ packed form
3109b922j602j51O06P33R496J7114R965m459j1884j4283j6096q923P698J7742
3095C034R921j0826k7748l2608k4875p913M712M195m778r329o579p961j5009j9069
3081a44833k3581k9154k6423j8109j4471j9408k9119n1237q2002j03792r2177
3070f34306k917J62072K78001K39431J20369K6512j8199l4574l9847l3313j9037
3059D4192r370j1679k3018l0132k2767j2733j1838j4665j3395p372j691M638J8257
3046i1573K3977J4315N721O703J0176R659P106k341j1121q988j829m2k164K501
3032c7900Q764Q162L467k466r890j6465j3590M36J0122R182K678q203j4249o588
3018f6540K274K845q28l654n862j5441k2831j8524j3635m259J3408K6833L2140
$$ plain form
3005 -74074 -49045 -42058 -44161 -42214 -36884 -34012 -34156 -29128 -19980 -19868 -33171 -54947 -80977 -108153
2991 -108153 -133115 -149092 -157005 -165121 -171504 -172321 -166896 -154583 -139936 -128264 -115427 -96461 -76247
2978 -76247 -62011 -57391 -59299 -60845 -54495 -48565 -51932 -60721 -72632 -85396 -92006 -86873 -73143 -57399
2964 -57399 -42731 -26599 -9503 7041 22472 33819 35209 25199 16848 21429 31141 38786 48200
2951 48200 64486 87562 107228 108277 90616 68014 46905 26429 9726 1418 1336 5134 4638
2938 4638 -4926 -23709 -47349 -68758 -80095 -80398 -76069 -70089 -63374 -63071 -71090 -76641 -74206 -63943
2924 -63943 -48648 -37074 -30224 -24167 -24075 -29837 -37825 -47612 -56636 -63958 -68153 -67443 -65248 -60819 -51363
2909 -51363 -40169 -31277 -24968 -24648 -27586 -30579 -37654 -44003 -48450 -55447 -64622 -73400 -82565 -96048
$$ packed form
3005g4074K5029O987k103J947N330K872j44N028R148J12j3303k1776k6030k7176
2991a08153k4962j5977p913q116o383q17N425J2313J4647J1672J2837J8966K0214
2978g6247J4236M620j908j546O350N930l367q789j1911j2764o610N133J3730J5744
2964e7399J4668J6132J7096J6544J5431J1347J390j0010q351M581R712P645R414
2951D8200J6286K3076J9666J049j7661k2602k1109k0476j6703q308q2L798m96
2938D638r564j8783k3640k1409j1337l03M329N980O715L03q019n551K435J0263
2924f3943J5295J1574O850O057R2n762p988r787r024p322m195P10K195M429R456
2909e1363J1194Q892O309L20k938k993p075o349m447o997r175q778r165j3483
$$ plain form
2895 -96048 -108182 -115286 -118523 -113869 -100646 -87633 -84440 -90845 -93280 -79183 -51118 -23527 -10505
2882 -10505 -5359 3451 9225 5250 -7388 -22589 -31002 -31655 -29803 -24984 -16693 -12601 -15956 -24584
2868 -24584 -31354 -29281 -25832 -29990 -43916 -65101 -83810 -96608 -106588 -115035 -111308 -84046 -42739
2855 -42739 -5713 8579 -2905 -18616 -26246 -30443 -34868 -41817 -50764 -63115 -81796 -96299 -102347
2842 -102347 -110140 -125236 -142079 -151359 -148936 -135575 -117649 -99750 -76442 -48134 -22375 -1774
2830 -1774 9559 2684 -19105 -44803 -70914 -90792 -92182 -77151 -57995 -41845 -33817 -36228 -47766
2817 -47766 -62665 -77015 -95025 -114157 -124785 -121813 -111250 -104861 -104465 -104139 -101818 -100293 -94603 -81602
2803 -81602 -66724 -56362 -50045 -39483 -19895 -815 8376 11130 13530 16339 12961 -2627 -24658
$$ packed form
2895i6048j2134p104l237M654J3223J3013L193o405k435J4097K8065K7591J3022
2882a0505N146Q810N774l975j2638j5201q413o53J852M819Q291M092l355q628
2868b4584o770K073L449m158j3926k1185j8709j2798r980q447L727K7262M1307
2855d2739L7026J4292j1484j5711p630m197m425o949q947j2351j8681j4503o048
2842a02347p793j5096j6843r280K423J3361J7926J7899K3308K8308K5759K0601
2830a774J1333o875k1789k5698k6111j9878j390J5031J9156J6150Q028k411j1538
2817d7766j4899j4350j8010j9132j0628K972J0563O389L96L26K321J525N690J3001
2803h1602J4878J0362O317J0562J9588J9080R191K754K400K809l378j5588k2031
$$ plain form
2790 -24658 -43046 -50523 -54486 -62015 -71928 -81888 -88724 -88439 -81819 -75037 -69709 -62158 -50393 -36957
2776 -36957 -28903 -27067 -22336 -10821 2566 13491 12806 -4414 -21633 -26237 -24913 -24671 -25560 -25245
2762 -25245 -26454 -29303 -30665 -34255 -38274 -39072 -33112 -22353 -16091 -12242 543 18866 30956 37517
2748 37517 42370 50988 68708 83955 78678 56004 31901 8520 -19427 -39307 -40902 -35000 -28775
2735 -28775 -18168 -4724 -305 -2902 2635 15121 22663 21948 16673 9385 146 -7400 -8278 -3666
2721 -3666 4303 11742 18787 26285 32124 34143 34310 40105 55015 72191 85695 94326 96340 90593
2707 90593 73923 43148 9809 -5751 388 13715 21863 23652 23424 27463 36370 42292 40886 34957
2693 34957 25855 9301 -11815 -18077 -2581 18606 31703 32702 21003 1787 -18269 -29214 -29712
$$ packed form
2790b4658j8388p477l963p529r913r960o836K85O620O782N328P551J1765J3436
2776c6957Q054J836M731J1515J3387J0925o85j7220j7219m604J324K42q89L15
2762b5245j209k849j362l590m019p98N960J0759O262L849J2785J8323J2090O561
2748C7517M853Q618J7720J5247n277k2674k4103k3381k7947j9880j595N902O225
2735b8775J0607J3444M419k597N537J2486P542p15n275p288r239p546q78M612
2721c666P969P439P045P498N839K019J67N795J4910J7176J3504Q631K014n747
2707I0593j6670l0775l3339j5560O139J3327Q148J789k28M039Q907N922j406n929
2693C4957r102j6554k1116o262J5496K1187J3097R99j1699j9216k0056j0945m98
$$ plain form
2680 -29712 -29681 -29617 -26938 -31786 -47654 -69378 -97242 -125431 -144181 -149207 -140437 -126290 -119769 -118653
2666 -118653 -115578 -108335 -95401 -76261 -53622 -35993 -26971 -25603 -31327 -39313 -46342 -54682 -69627
2653 -69627 -94566 -118551 -131714 -130331 -116180 -99697 -85542 -62232 -23054 15954 37951 48979
2641 48979 58077 59247 41263 2505 -40659 -68434 -77533 -82371 -94372 -115906 -144695 -166886 -171889
2628 -171889 -165439 -158381 -154738 -153441 -152325 -145273 -129209 -107752 -85689 -62313 -30138 12699 43271
2615 43271 38010 6457 -28615 -54356 -70790 -84455 -93991 -96431 -93135 -85063 -75526 -68412 -63189
2602 -63189 -55846 -48044 -42874 -42438 -49991 -64465 -74275 -73286 -69306 -75946 -104697 -150092 -190341 -207159
2588 -207159 -205401 -197803 -187971 -174764 -159425 -146469 -140952 -143739 -145503 -136263 -122870 -121577 -133411
$$ packed form
2680b9712L1O4K679m848j5868k1724k7864k8189j8750n026Q770J4147O521J116
2666a18653L075P243J2934J9140K2639J7629R022J368n724p986p029q340j4945
2653f9627k4939k3985j3163J383J4151J6483J4155K3310L9178L9008K1997J1028
2641D8979R098J170j7984l8758m3164k7775r099m838j2001k1534k8789k2191n003
2628a71889O450P058L643J297J116P052J6064K1457K2063K3376L2175M2837L0572
2615D3271n261l1553l5072k5741j6434j3665r536k440L296Q072R537P114N223
2602f3189P343P802N170M36p553j4474r810R89L980o640k8751m5395m0249j6818
2588b07159J758P598R832J3207J5339J2956N517k787j764R240J3393J293j1834
$$ plain form
2575 -133411 -144019 -140337 -125035 -106784 -85517 -60371 -38696 -24128 -9888 6400 19380 28479
2563 28479 37846 44030 41079 30456 13746 -10183 -33162 -42121 -36860 -30898 -33435 -35745 -29297 -16070
2549 -16070 -381 13095 18271 9042 -15905 -46140 -71795 -94564 -117493 -132318 -137393 -141875 -145307
2536 -145307 -138054 -118015 -94731 -78896 -75947 -89856 -120047 -155577 -185500 -203012 -203751 -190861
2524 -190861 -173062 -158716 -150426 -140160 -121179 -101004 -85892 -72795 -62695 -60967 -59951 -54709
2512 -54709 -53454 -52429 -44215 -36460 -38358 -48657 -58703 -67640 -78019 -91656 -113974 -139437 -151748
2499 -151748 -142410 -119510 -96500 -78428 -64942 -49373 -22294 1169 3510 -8913 -26326 -48963
2487 -48963 -73029 -84001 -72789 -46332 -25971 -23204 -26523 -28065 -30593 -32038 -27690 -22747 -23862
$$ packed form
2575a33411j0608L682J5302J8251K1267K5146K1675J4568J4240J6288J2980R099
2563B8479R367O184k951j0623j6710k3929k2979q959N261N962k537k310O448J3227
2549a6070J5689J3476N176r229k4947l0235k5655k2769k2929j4825n075m482l432
2536a45307P253K0039K3284J5835K949j3909l0191l5530k9923j7512p39J2890
2524a90861J7799J4346Q290J0266J8981K0175J5112J3097J0100J728J016N242
2512e4709J255J025Q214P755j898j0299j0046q937j0379j3637k2318k5463j2311
2499a51748R338K2900K3010J8072J3486J5569K7079K3463K341j2423j7413k2637
2487d8963k4066j0972J1212K6457K0361K767l319j542k528j445M348M943j115
$$ plain form
2474 -23862 -25365 -22952 -23591 -28463 -34044 -40330 -45188 -41659 -26873 -13431 -10423 -10844 -12694 -17713 -24899
2459 -24899 -30865 -33655 -31403 -22027 -10653 -5501 -6346 -5148 -1517 -2836 -11859 -18427 -11793 6388
2445 6388 27240 39211 39375 32236 24189 15271 1125 -12268 -21982 -35879 -50693 -61575 -75841
2432 -75841 -100168 -129300 -154529 -168050 -167712 -163994 -158598 -139726 -104918 -64640 -29911 -3808 14747
2419 14747 27673 32901 22102 -10313 -45222 -59586 -57562 -55823 -64587 -78447 -85680 -86650 -87150 -88964
2405 -88964 -98413 -117069 -138625 -152555 -155210 -152417 -147506 -141521 -136180 -130549 -122565 -111615 -107323 -115331
2391 -115331 -127463 -131104 -123523 -115352 -113949 -117005 -127167 -142734 -153310 -154580 -150037 -144501 -137954
2378 -137954 -131726 -128696 -131700 -137085 -137403 -136773 -142614 -156519 -171559 -175795 -169702 -164267 -158474 -146452
$$ packed form
2474b3862j503K413o39m872n581o286m858L529J4786J3442L008m21j850n019p186
2459b4899n966k790K252R376J1374N152q45J198L631j319r023o568O634J8181
2445F388K0852J1971J64p139q047q918j4146j3393r714j3897j4814j0882j4266
2432g5841k4327k9132k5229j3521L38L718N396J8872L4808M0278L4729K6103J8555
2419A4747J2926N228j0799l2415l4909j4364K024J739q764j3860p233r70n00j814
2405h8964r449j8656k1556j3930k655K793M911N985N341N631P984J0950M292q008
2391a15331j2132l641P581Q171J403l056j0162j5567j0576j270M543N536O547
2378a37954O228L030l004n385l18O30n841j3905j5040m236O093N435N793J2022
$$ plain form
2364 -146452 -130405 -118095 -116837 -123584 -128712 -128048 -124000 -121811 -122216 -121951 -120606 -121977 -121335 -110845 -91466
2349 -91466 -75084 -73247 -81936 -85471 -79417 -70740 -65197 -67940 -77523 -80604 -65453 -39424 -17900 -9442
2335 -9442 -11184 -16314 -15466 -8355 -5661 -9040 -5642 9127 30499 52944 65731 67062 68458 78581
2321 78581 96359 116539 139559 163431 193470 235490 266926 255767 203192 132384 59618 1222
2309 1222 -35495 -55256 -62141 -60648 -50446 -32282 -18184 -16821 -22978 -28935 -35360 -42810 -41138 -27877
2295 -27877 -10604 5317 11750 2998 -8769 -4491 19164 48615 70123 76054 65261 42143 15742
2282 15742 -3558 -12920 -20136 -27678 -31600 -28204 -17627 -5014 6504 15296 24318 34238 41785 45996
2268 45996 47211 43445 29506 8545 -7629 -14719 -11213 598 11169 16392 16692 15437 19302 21995
$$ packed form
2364a46452J6047J2310J258o747n128O64M048K189m05K65J345j371O42J0490J9379
2349i1466J6382J837q689l535O054Q677N543k743r583l081J5151K6029K1524Q458
2335i442j742n130Q48P111K694l379L398J4769K1372K2445J2787J331J396J0123
2321G8581J7778K0180K3020K3872L0039M2020L1436j1159n2575p0808p2766n8396
2309A222l6717j9761o885J493J0202J8164J4098J363o157n957o425p450J672J3261
2295b7877J7273J5921O433q752j1767M278K3655K9451K1508N931j0793k3118k6401
2282A5742j9300r362p216p542l922L396J0577J2613J1518Q792R022R920P547M211
2268D5996J215l766j3939k0961j6174p090L506J1811J0571N223L00j255L865K693
$$ plain form
2254 21995 14725 4861 2469 5819 6873 2433 -1994 -1788 2475 6789 11566 20082 24373 15869 -454
2239 -454 -15864 -28134 -34102 -32316 -27710 -30475 -43026 -59145 -75834 -90602 -99619 -106336 -115425 -120943
2225 -120943 -113628 -94734 -75397 -66592 -75506 -97117 -114346 -118497 -116457 -113336 -104504 -89693 -76293
2212 -76293 -74104 -84779 -100954 -121548 -143488 -160525 -169148 -166566 -149965 -123826 -98988 -81381
2200 -81381 -62253 -32828 -223 26662 43880 48380 40115 25558 13140 5162 -91 -26 6157
2187 6157 5649 -10119 -26166 -28425 -22733 -26752 -41566 -52170 -54928 -52221 -38456 -11266 19165
2174 19165 48428 81174 109446 121828 125409 131075 135051 128553 113820 93960 65140 38556 29896
2161 29896 38448 49119 52999 53925 49511 35023 12937 -9331 -24339 -29738 -25215 -16011 -11551 -16551
$$ packed form
2254B1995p270r864k392L350J054m440m427K06M263M314M777Q516M291q504j6323
2239d54j5410j2270n968J786M606k765j2551j6119j6689j4768r017o717r089n518
2225a20943P315J8894J9337Q805q914k1611j7229m151K040L121Q832J4811J3400
2212g6293K189j0675j6175k0594k1940j7037q623K582J6601K6139K4838J7607
2200h1381J9128K9425L2605K6885J7218M500q265j4557j2418p978n253O5O183
2187F157n08j5768j6047k259N692m019j4814j0604k758K707J3765K7190L0431
2174A9165K9263L2746K8272J2382L581N666L976o498j4733j9860k8820k6584q660
2161B9896Q552J0671L880R26m414j4488k2086k2268j5008n399M523R204M460n000
$$ plain form
2147 -16551 -30918 -46832 -55348 -51708 -34621 -15466 -9374 -22443 -50048 -72944 -77090 -65577 -46699
2134 -46699 -26300 -8468 5608 10252 5245 -5186 -21685 -40252 -53121 -63597 -79805 -99111
2122 -99111 -114618 -124300 -127482 -128240 -132093 -136674 -133223 -118247 -98669 -80496 -70223 -80074 -104743
2109 -104743 -119438 -118901 -114932 -110300 -103594 -92219 -79110 -72678 -73805 -78667 -82767 -89100 -103595 -121375
2095 -121375 -132665 -137472 -141303 -141786 -134075 -127375 -126227 -121143 -108151 -90854 -75225 -60261 -41725
2082 -41725 -21750 -12626 -18533 -26367 -26645 -19908 -16493 -22615 -27501 -29414 -38542 -53394 -64638 -66037
2068 -66037 -61723 -66014 -82390 -98978 -104779 -99775 -95987 -100165 -106316 -108172 -104262 -96455 -88004 -80345
2054 -80345 -74617 -72356 -75276 -81660 -83576 -80585 -78318 -75567 -71877 -70056 -70550 -72227 -69675 -56274 -39460
$$ packed form
2147a6551j4367j5914q516L640J7087J9155O092j3069k7605k2896m146J1513J8878
2134d6699K0399J7832J4076M644n007j0431j6499j8567j2869j0476j6208j9306
2122i9111j5507r682l182p58l853m581L451J4976J9578J8173J0273r851k4669
2109a04743j4695N37L969M632O706J1375J3109O432j127m862m100o333j4495j7780
2095a21375j1290m807l831m83P711O700J148N084J2992J7297J5629J4964J8536
2082d1725J9975R124n907p834k78O737L415o122m886j913r128j4852j1244j399
2068f6037M314m291j6376j6588n801N004L788m178o151j856L910P807Q451P659
2054h0345N728K261k920o384j916K991K267K751L690J821m94j677K552J3401J6814
$$ plain form
2039 -39460 -30174 -27502 -19315 -4716 9344 20127 19041 4943 -10406 -16160 -15485 -12152 -5755 -4932
2025 -4932 -14556 -28340 -37356 -45080 -60610 -75650 -73083 -49132 -16311 10000 27670 35786 24352
2012 24352 -4524 -32256 -44246 -46716 -54335 -71586 -96237 -121267 -136490 -136049 -120763 -96015 -66253
1999 -66253 -36438 -14450 -8534 -23667 -57301 -90554 -106545 -105060 -90636 -68810 -50515 -44419
1987 -44419 -52823 -67093 -77968 -83959 -88437 -97316 -105415 -105726 -99344 -92628 -91685 -95170 -96316 -92260 -82653
1972 -82653 -64138 -37164 -10287 2735 -3931 -21189 -41714 -61238 -73340 -72782 -60791 -46123
1960 -46123 -35657 -34989 -44835 -61484 -77784 -87436 -91050 -89382 -77516 -55770 -40631 -49405 -74840
1947 -74840 -94720 -100708 -98968 -97475 -99761 -101545 -98619 -94801 -95128 -98452 -102265 -112109 -122048 -117297 -99023
$$ packed form
2039c9460R286K672Q187J4599J4060J0783j086j4098j5349n754O75L333O397Q23
2025d932r624j3784r016p724j5530j5040K567K3951L2821K6311J7670Q116j1434
2012B4352k8876k7732j1990k470p619j7251k4651k5030j5223M41J5286K4748K9762
1999f6253K9815K1988N916j5133l3634l3253j5991J485J4424K1826J8295O096
1987d4419q404j4270j0875n991m478q879q099l11O382O716R43l485j146M056R607
1972h2653J8515K6974K6877J3022o666j7258k0525j9524j2102N58J1991J4668
1960d6123J0466O68r846j6649j6300r652l614J668J1866K1746J5139q774k5435
1947g4840j9880n988J740J493k286j784K926L818l27l324l813r844r939M751J8274
$$ plain form
1932 -99023 -86207 -91513 -106640 -119583 -123851 -122391 -119332 -108667 -93082 -78762 -66277 -54395 -40506
1919 -40506 -27454 -18793 -14467 -9912 -2189 4129 4741 -1341 -12725 -26964 -41002 -44988 -32595 -13150
1905 -13150 -1773 302 -1122 -4237 -10561 -25766 -46498 -63660 -77318 -88251 -92781 -88314 -84052
1892 -84052 -90613 -101376 -104255 -102687 -104432 -110958 -118883 -119619 -109205 -95803 -87263 -86181 -84077 -66387
1878 -66387 -33265 2903 29488 41314 39492 31970 26108 18361 2110 -22271 -52121 -80811 -96380
1865 -96380 -95267 -83073 -73172 -72776 -72141 -65230 -61298 -63803 -67418 -73586 -83633 -92288 -98390 -105924 -119310
1850 -119310 -142434 -170526 -191033 -195654 -187518 -174660 -153096 -116536 -74995 -50206 -50266 -65678 -86489
1837 -86489 -102697 -107242 -98519 -83896 -72746 -69813 -76560 -86317 -90785 -93321 -99000 -103235 -97939 -87796
$$ packed form
1932i9023J2816n306j5127j2943m268J460L059J0665J5585J4320J2485J1882J3889
1919d0506J3052Q661M326M555P723O318O12o082j1384j4239j4038l986J2393J9445
1905a3150J1377K075j424l115o324j5205k0732j7162j3658j0933m530M467M262
1892h4052o561j0763k879J568j745o526p925p36J0414J3402Q540J082K104J7690
1878f6387L3122L6168K6585J1826j822p522n862p747j6251k4381k9850k8690j5569
1865i6380J113J2194R901L96O35O911L932k505l615o168j0047q655o102p534j3386
1850a19310k3124k8092k0507m621Q136J2858K1564L6560M1541K4789o0j5412k0811
1837h6489j6208m545Q723J4623J1150K933o747r757m468k536n679m235N296J0143
$$ plain form
1823 -87796 -82934 -78483 -64964 -48080 -38157 -39891 -51635 -66931 -84805 -101621 -107561 -101554 -88493
1810 -88493 -69336 -40211 -2390 31921 52024 61243 66912 69887 60837 39878 17846 -4642 -26662
1797 -26662 -45873 -65824 -83981 -96738 -102523 -100783 -94889 -89355 -87302 -91474 -101636 -115150 -129071
1784 -129071 -134960 -128118 -113166 -95923 -82370 -79217 -82985 -87695 -88812 -87971 -88042 -85345 -79182 -77589
1770 -77589 -91911 -107586 -102444 -81958 -66259 -63066 -66894 -68202 -62110 -49562 -25759 9218 40040
1757 40040 51440 44543 29635 9740 -12679 -31585 -44346 -49539 -54921 -65480 -70246 -59310 -38083
1744 -38083 -19201 -2411 15867 30616 35283 32560 29923 32025 38592 43425 39360 29366 17884
1731 17884 7686 -696 -12531 -26955 -46825 -74651 -97958 -109927 -112578 -106919 -100063 -98040 -93579
$$ packed form
1823h7796M862M451J3519J6884R923j734j1744j5296j7874j6816n940O007J3061
1810h8493J9157K9125L7821L4311K0103R219N669K975r050k0959k2032k2488k2020
1797b6662j9211j9951j8157j2757n785J740N894N534K053m172j0162j3514j3921
1784a29071n889O842J4952J7243J3553L153l768m710j117Q41p1K697O163J593
1770g7589j4322j5675N142K0486J5699L193l828j308O092J2548K3803L4977L0822
1757D0040J1400o897j4908j9895k2419j8906j2761n193n382j0559m766J0936K1227
1744c8083J8882J6790J8278J4749M667k723k637K102O567M833m065r994j1482
1731A7884j0198q382j1835j4424j9870k7826k3307j1969k651N659O856K023M461
$$ plain form
1718 -93579 -82492 -72312 -63004 -50469 -41637 -48973 -74777 -108685 -131780 -129365 -106424 -79135 -59633
1705 -59633 -48361 -37654 -27456 -23852 -29196 -38105 -40607 -37275 -36572 -41120 -47960 -53800 -56845 -58433
1691 -58433 -64561 -73954 -79786 -82452 -88827 -98206 -104531 -102927 -94958 -91108 -93007 -90550 -75229 -47755
1677 -47755 -18227 -1926 -9148 -34466 -59167 -70741 -67617 -52319 -32478 -17638 -13944 -17570 -20687
1664 -20687 -21126 -20232 -24388 -36362 -51427 -57022 -44584 -26011 -16710 -13373 -3277 7509 3743 -18482
1650 -18482 -52069 -83937 -106128 -118338 -119924 -111231 -98157 -81202 -59557 -43341 -41630 -47700 -46892
1637 -46892 -36625 -25417 -21073 -25339 -38676 -54485 -64389 -68674 -65426 -52818 -38135 -30264 -28088
1624 -28088 -27852 -29487 -31359 -30515 -26553 -15775 371 13312 19010 17193 16411 24716 40819 60039
$$ packed form
1718i3579J1087J0180R308J2535Q832p336k5804l3908k3095K415K2941K7289J9502
1705e9633J1272J0707J0198L604n344q909k502L332P03m548o840n840l045j588
1691e8433o128r393n832k666o375r379o325J604P969L850j899K457J5321K7474
1677d7755K9528J6301p222k5318k4701j1574L124J5298J9841J4840L694l626l117
1664b0687m39Q94m156j1974j5065n595J2438J8573R301L337J0096J0786l766k2225
1650a8482l3587l1868k2191j2210j586Q693J3074J6955K1645J6216J711o070Q08
1637d6892J0267J1208M344m266j3337j5809r904m285L248J2608J4683P871K176
1624b8088K36j635j872Q44L962J0778J6146J2941N698j817p82Q305J6103J9220
$$ plain form
1610 60039 72216 69094 54952 39637 28337 22515 22528 30764 48408 66671 79504 83759 79931
1597 79931 67402 45616 22058 3379 -9315 -24521 -41490 -48773 -46430 -41255 -35537 -30358 -29294
1584 -29294 -31915 -32189 -27135 -8971 24891 60409 86114 99725 101411 93810 81197 69932 65094
1571 65094 59924 44598 19398 -5156 -27205 -50271 -69096 -77249 -75025 -70733 -76128 -91218 -105933
1558 -105933 -119292 -135231 -153848 -165132 -159576 -139326 -113584 -92853 -85694 -93134 -108234 -120133
1546 -120133 -117491 -98696 -72361 -49480 -36380 -36549 -52623 -79566 -103052 -117139 -127065 -136462 -136936
1533 -136936 -122269 -99411 -85463 -89631 -103223 -120500 -141886 -160617 -159431 -135104 -101907 -70731
1521 -70731 -44394 -23370 -14175 -19283 -33711 -50079 -65239 -78881 -86900 -86650 -77420 -65279 -59528
$$ packed form
1610F0039J2177l122j4142j5315j1300n822J3Q236J7644J8263J2833M255l828
1597G9931j2529k1786k3558j8679j2694j5206j6969p283K343N175N718N179J064
1584b9294k621k74N054J8164L3862L5518K5705J3611J686p601j2613j1265m838
1571F5094n170j5326k5200k4554k2049k3066j8825q153K224M292n395j5090j4715
1558a05933j3359j5939j8617j1284N556K0250K5742K0731P159p440j5100j1899
1546a20133K642J8795K6335K2881J3100j69j6074k6943k3486j4087r926r397m74
1533a36936J4667K2858J3948m168j3592j7277k1386j8731J186K4327L3197L1176
1521g0731K6337K1024R195n108j4428j6368j5160j3642q019K50R230J2141N751
$$ plain form
1508 -59528 -58956 -56726 -50468 -45469 -49176 -61874 -70530 -64448 -53526 -50614 -56087 -63313 -72328 -81634
1494 -81634 -85391 -81305 -71211 -56265 -41362 -37188 -38993 -34814 -22937 -9064 46 1267 -6373
1481 -6373 -20442 -30712 -32627 -37902 -54315 -74582 -86567 -91905 -104665 -130649 -160003 -177879 -173451
1468 -173451 -148161 -114153 -83957 -65707 -61070 -66184 -70096 -65947 -61622 -67803 -84488 -100814 -104015
1455 -104015 -92838 -80071 -81453 -97026 -116233 -134046 -139039 -125793 -107896 -95140 -87330 -85610
1443 -85610 -88993 -95823 -106162 -115835 -120724 -115229 -93417 -62063 -34897 -12973 9083 25925 32342
1430 32342 21046 -9020 -43091 -66096 -75531 -84753 -103113 -124850 -144875 -154932 -141553 -107543
1418 -107543 -68316 -32666 -7081 1916 -4700 -24473 -49740 -75252 -100888 -117601 -115769 -102580
$$ packed form
1508e9528N72K230O258M999l707j2698q656O082J0922K912n473p226r015r306
1494h1634l757M086J0094J4946J4903M174j805M179J1877J3873R110J221p640
1481f373j4069j0270j915n275j6413k0267j1985n338j2760k5984k9354j7876M428
1468a73451K5290L4008L0196J8250M637n114l912M149M325o181j6685j6326l201
1455a04015J1177J2767j382j5573j9207j7813m993J3246J7897J2756P810J720
1443h5610l383o830j0339r673m889N495K1812L1354K7166K1924K2056J6842O417
1430C2342j1296l0066l4071k3005r435r222j8360k1737k0025j0057J3379L4010
1418a07543L9227L5650K5585Q997o616j9773k5267k5512k5636j6713J832J3189
$$ plain form
1406 -102580 -87361 -71498 -50814 -23134 820 9359 298 -24142 -53301 -71110 -67730 -49676
1394 -49676 -34965 -27482 -18795 -3024 17436 29077 22794 3297 -21416 -44188 -60031 -65630 -63188
1381 -63188 -63153 -71561 -86244 -98521 -101034 -95647 -91168 -93955 -96995 -83472 -58691 -35138 -15103 -8174
1367 -8174 -19645 -41368 -60845 -71825 -79179 -85958 -86457 -77994 -61215 -43037 -35761 -41313 -53527
1354 -53527 -62342 -58063 -46280 -41201 -44484 -50602 -58406 -62904 -57695 -43240 -25799 -12828 -7225 -8308
1340 -8308 -12043 -16159 -21103 -21618 -16305 -10315 -3973 1248 -401 -6753 -10015 -6851 1229 11982 23004
1325 23004 35649 57465 89713 115441 119501 106578 91579 88059 96404 103983 100661 87815 77091
1312 77091 72449 63358 46195 29280 19986 21965 32928 44925 50108 50403 46445 30254 8304
$$ packed form
1406a02580J5219J5863K0684K7680K3954Q539r061k4440k9159j7809L380J8054
1394d9676J4711P483Q687J5771K0460J1641o283j9497k4713k2772j5843n599K442
1381f3188L5q408j4683j2277k513N387M479k787l040J3523K4781K3553K0035O929
1367h174j1471k1723j9477j0980p354o779m99Q463J6779J8178P276n552j2214
1354e3527q815M279J1783N079l283o118p804m498N209J4455J7441J2971N603j083
1340h308l735m116m944n15N313N990O342N221j649o352l262L164Q080J0753J1022
1325B3004J2645K1816L2248K5728M060j2923j4999l520Q345P579l322j2846j0724
1312G7091m642r091j7163j6915r294J979J0963J1997N183K95l958j6191k1950
$$ plain form
1299 8304 -2643 -445 6188 11032 13920 12478 -714 -21197 -35769 -38326 -32973 -20196 -2839
1286 -2839 7619 10157 12909 21088 34583 46664 46863 38375 32255 30602 39953 75982 131268 176714
1272 176714 200783 209289 208230 199057 193970 210174 242471 275766 307856 345261 379140 365670
1260 365670 261502 105237 -21023 -88017 -116905 -133681 -149615 -164866 -174379 -179217 -183592 -187251
1248 -187251 -186272 -175830 -156289 -134203 -121775 -124417 -134532 -145478 -150900 -147676 -141128 -134773 -127809
1235 -127809 -116901 -99694 -80213 -63404 -50823 -44272 -45115 -49373 -49055 -40064 -25883 -19449 -28157
1222 -28157 -45717 -57883 -54947 -41607 -29217 -22018 -13539 705 14981 27290 39223 46756 43507
1209 43507 28301 8472 -5481 -13051 -23925 -43578 -61183 -62969 -48639 -30429 -21355 -26579 -41611
$$ packed form
1299H304j0947K198O633M844K888j442j3192k0483j4572k557N353J2777J7357
1286b839J0458K538K752Q179J3495J2081J99q488o120j653R351L6029N5286M5446
1272A76714K4069Q506j059r173n087J6204L2297L3295L2090L7405L3879j3470
1260C65670j04168j56265j26260o6994k8888j6776j5934j5251r513m838m375l659
1248a87251R79J0442J9541K2086J2428k642j0115j0946n422L224O548O355O964
1235a27809J0908J7207J9481J6809J2581O551q43m258L18Q991J4181O434q708
1222b8157j7560j2166K936J3340J2390P199Q479J4244J4276J2309J1933P533l249
1209D3507j5206j9829j3953p570j0874j9653j7605j786J4330J8210R074n224j5032
$$ plain form
1196 -41611 -56941 -65787 -70631 -79714 -94577 -104184 -92512 -67386 -46386 -30680 -19109 -15814 -14866
1183 -14866 -4328 19012 46352 67611 81681 95053 107878 108442 89671 62564 41565 29354
1171 29354 28743 40395 53949 63180 65987 61956 56038 53939 51204 41364 28388 19289 15835 19044
1157 19044 31205 47030 60554 70714 78874 82782 79438 70600 58611 45360 34569 28356 24981
1144 24981 22529 11711 -13172 -37622 -43706 -33405 -21888 -18536 -16196 -5730 8692 22610 37043
1131 37043 51681 61814 59063 40464 15540 -6024 -18495 -17283 -1681 19240 34095 37271
1119 37271 34203 34893 46493 64261 75965 75566 63151 40194 18746 9117 1922 -9905 -22922
1106 -22922 -38318 -58423 -78877 -99006 -119088 -137462 -151579 -154047 -141351 -119878 -101960 -95901
$$ packed form
1196d1611j5330q846m844r083j4863r607J1672K5126K1000J5706J1571L295R48
1183a4866J0538K3340K7340K1259J4070J3372J2825N64j8771k7107k0999j2211
1171B9354o11J1652J3554R231K807m031n918k099k735r840j2976r099l454L209
1157A9044J2161J5825J3524J0160Q160L908l344q838j1989j3251j0791o213l375
1144B4981k452j0818k4883k4450o084J0301J1517L352K340J0466J4422J3918J4433
1131C7043J4638J0133k751j8599k4924k1564j2471J212J5602K0921J4855L176
1119C7271l068O90J1600J7768J1704l99j2415k2957k1448r629p195j1827j3017
1106b2922j5396k0105k0454k0129k0082j8374j4117k468J2696K1473J7918O059
$$ plain form
1094 -95901 -96715 -97391 -94838 -85544 -71958 -62147 -58194 -54245 -40549 -17383 -327 -2580 -26867 -65051
1080 -65051 -100544 -121920 -131346 -136494 -139963 -142344 -141824 -136700 -135404 -141553 -146098 -139968 -118245 -89749
1066 -89749 -69815 -67813 -80873 -91511 -81484 -47720 -10432 9388 13677 21402 42239 65729
1054 65729 84277 93163 81683 55231 28352 2564 -20773 -32712 -28642 -14482 -1843 -1722 -17121
1041 -17121 -37739 -40484 -21032 -2287 8953 27294 59786 88137 89416 66872 40146 22984
1029 22984 13092 3595 -4970 -4780 3035 8576 7425 3066 -2173 -10732 -24365 -36152 -38282 -29770
1015 -29770 -12758 2360 5782 -4156 -17866 -22212 -22784 -28542 -32975 -26269 -11564 495 4103 -1086
1001 -1086 -10350 -17485 -20739 -17531 -8353 -3547 -9787 -26891 -49450 -63078 -59098 -43703 -24646 -10033
$$ packed form
1094i5901q14o76K553R294J3586R811L953L949J3696K3166J7056k253k4287l8184
1080f5051l5493k1376r426n148l469k381N20N124J296o149m545O130K1723K8496
1066h9749J9934K002j3060j0638J0027L3764L7288J9820M289P725K0837K3490
1054F5729J8548Q886j1480k6452k6879k5788k3337j1939M070J4160J2639J21j5399
1041a7121k0618k745J9452J8745J1240J8341L2492K8351J279k2544k6726j7162
1029B2984r892r497q565J90P815N541j151m359n239q559j3633j1787k130Q512
1015b9770J7012J5118L422r938j3710m346n72n758m433O706J4705J2059L608n189
1001a086r264p135l254L208R178M806o240j7104k2559j3628L980J5395J9057J4613
$$ plain form
987 -10033 -455 8544 15800 19936 21729 26307 35925 46900 56359 65049 72938 79396 86561 92523 96808
972 96808 103902 110931 111144 102888 93364 81050 61824 41898 27738 18571 13236 13713 16684 17206 14168
957 14168 4599 -13792 -33439 -40136 -28615 -8857 7891 19137 23074 17148 10721 10311 11948 13043
943 13043 8601 -2211 -12925 -19065 -13518 2154 20119 36791 50780 60015 63793 59386 47771
930 47771 36117 27300 21906 22340 22173 14170 4849 -2525 -14979 -33492 -45919 -44833 -40492 -44928
916 -44928 -57843 -73312 -85149 -91775 -92821 -84552 -66677 -46270 -29186 -17199 -10927 -5749 2293
903 2293 8772 11697 10930 2041 -15547 -33946 -44715 -42600 -33267 -28148 -29848 -40327 -55752 -69709
889 -69709 -79236 -81184 -78351 -82420 -97253 -114577 -126374 -127304 -119695 -108954 -95296 -78457 -64694
$$ packed form
987a0033R578Q999P256M136J793M578R618J0975R459Q690P889O458P165N962M285
972I6808P094P029K13q256r524j2314j9226j9926j4160r167n335M77K971N22l038
957A4168r569j8391j9647o697J1521J9758J6748J1246L937n926o427m10J637J095
943A3043m442j0812j0714o140N547J5672J7965J6672J3989R235L778m407j1615
930D7771j1654q817n394M34j67q003r321p374j2454j8513j2427J086M341m436
916d4928j2915j5469j1837o626j046Q269J7875K0407J7084J1987O272N178Q042
903B293O479K925p67q889j7588j8399j0769K115R333N119j700j0479j5425j3957
889f9709r527j948K833m069j4833j7324j1797r30P609J0741J3658J6839J3763
$$ plain form
876 -64694 -61866 -63777 -58243 -47629 -40989 -43076 -48765 -51601 -48663 -39555 -34096 -38286 -40455 -29973
862 -29973 -18899 -13986 -6097 6240 10724 368 -17763 -34161 -44284 -47076 -44935 -39352 -31807
849 -31807 -29936 -39288 -52425 -57283 -52061 -44026 -33400 -14422 11835 34957 49289 57947 59368
836 59368 54419 52342 57676 66761 70684 66787 59942 50983 37495 20308 5904 -3342 -8086 -8539
822 -8539 -7368 -7799 -12197 -20798 -25371 -26309 -31189 -47116 -77076 -117794 -158352 -184882 -170896 -76027
808 -76027 94445 241682 281648 238868 177690 134877 114478 105253 98172 83665 55444 26420
$$ packed form
876f4694K828j911N534J0614O640k087n689k836K938R108N459m190k169J0482
862b9973J1074M913P889J2337M484j0356j8131j6398j0123k792K141N583P545
849c1807J871r352j3137m858N222Q035J0626J8978K6257K3122J4332Q658J421
836E9368m949k077N334R085L923l897o845q959j3488j7187j4404r246m744m53
822h539J171m31m398q601m573r38m880j5927k9960m0718m0558k6530J3986R4869
808g6027J70472J47237L9966m2780o1178m2813k0399r225p081j4507k8221k9024
$$ [...]
##END NTUPLES=NMR SPECTRUM
##END=
