##TITLE=C13_IBA1203-1
 CDCl3, 22100 sc

 13.3.2024
##JCAMPDX= 6.0         $$ Bruker NMR JCAMP-DX V2.0
##DATA TYPE= NMR SPECTRUM
##DATA CLASS= NTUPLES
##ORIGIN= UXNMR, Bruker Analytische Messtechnik GmbH
##OWNER= root
$$ XWIN-NMR		Version 3.5
$$ Thu Mar 14 13:41:33 2024 Russian Standard Time (UT+4h)  she@DPX200
##.OBSERVE FREQUENCY= 50.327896
##.OBSERVE NUCLEUS= ^13C
##.ACQUISITION MODE= SIMULTANEOUS
##.ACQUISITION SCHEME= undefined
##.AVERAGES= 17180
##.DIGITISER RES= 17
##SPECTROMETER/DATA SYSTEM= spect
##.PULSE SEQUENCE= zgpg30
##.SOLVENT NAME= MeOD
##.SHIFT REFERENCE= (INTERNAL, MeOD, 0, 222.646)
##AUDIT TRAIL= $$ (NUMBER, WHEN, WHO, WHERE, WHAT)
$$ ##TITLE= Audit trail, XWIN-NMR		Version 3.5
$$ ##JCAMPDX= 5.01
$$ ##ORIGIN= Bruker BioSpin GmbH
$$ ##OWNER= she
$$ F:/spectra/data/she/nmr/c13/1/pdata/1/auditp.txt
$$ ##AUDIT TRAIL=  $$ (NUMBER, WHEN, WHO, WHERE, WHAT)
(   1,<2024-03-14 09:00:48.28 +0400>,<she>,<DPX200>,
      <created by zg, POWCHK disabled, PULCHK disabled
       terminated by command 'halt'
       configuration hash MD5:
       00 E9 B6 7A A2 85 ED C7 34 08 36 98 17 FE 4E 26
       data hash MD5: 32K
       44 9B F3 57 9A 57 36 B0 3D 21 D8 3E 59 F3 04 2C>)
(   2,<2024-03-14 13:39:08.03 +0400>,<she>,<DPX200>,
      <Start of raw data processing
       efp BC_mod = 2 LB = 2 FT_mod = 6 PKNL = 1 PHC0 = -383.0577 PHC1 = 26.7862 SI = 32K 
       data hash MD5: 32K
       B8 00 19 A3 29 0B 0C A8 80 24 FA 0F 51 C4 4B 99>)
(   3,<2024-03-14 13:39:14.65 +0400>,<she>,<DPX200>,
      <abs ABSG = 5 
       data hash MD5: 32K
       0E 76 46 95 6D 0F 7B E9 25 4F 90 5E 44 AA 5D A6>)
(   4,<2024-03-14 13:40:08.75 +0400>,<she>,<DPX200>,
      <pk PHC0 = -3.5183 PHC1 = 1.200001 
       data hash MD5: 32K
       B7 B0 CA A2 06 F3 3E AA 6B E5 8B 59 87 07 91 B1>)
(   5,<2024-03-14 13:40:12.51 +0400>,<she>,<DPX200>,
      <abs ABSG = 5 
       data hash MD5: 32K
       CC E5 46 9B 4F 79 D5 2D 55 8D F5 B2 57 A9 6E 83>)
$$ ##END=
$$ 
$$ hash MD5
$$ 74 5B D6 9C 24 25 A2 E1 83 FC 01 47 10 3B 18 67
##$RELAX= 
##$RELAX= 
##$RELAX= 
##$RELAX= 
##$RELAX= 
##$RELAX= 
##$RELAX= 
##$RELAX= 
$$ Bruker specific parameters
$$ --------------------------
##$DU= <F:/spectra>
##$EXPNO= 1
##$NAME= <c13>
##$PROCNO= 1
##$TYPE= <nmr>
##$USER= <she>
##$AMP= (0..31)
100 100 100 100 100 100 100 100 100 100 100 100 100 100 100 100 100 100 
100 100 100 100 100 100 100 100 100 100 100 100 100 100 
##$AQSEQ= 0
##$AQ_mod= 1
##$AUNM= <au_zg>
##$AUTOPOS= <>
##$BF1= 50.322709
##$BF2= 200.13
##$BF3= 50.322709
##$BF4= 500.13
##$BF5= 500.13
##$BF6= 500.13
##$BF7= 500.13
##$BF8= 500.13
##$BYTORDA= 1
##$CFDGTYP= 0
##$CFRGTYP= 5
##$CHEMSTR= <none>
##$CNST= (0..31)
1 1 145 1 1 1 1 1 1 1 1 1 1 1 1 1 1 1 1 1 1 1 1 1 1 1 1 1 1 1 1 1 
##$CPDPRG= <waltz16>
##$CPDPRG1= <>
##$CPDPRG2= <waltz16>
##$CPDPRG3= <>
##$CPDPRG4= <mlev>
##$CPDPRG5= <mlev>
##$CPDPRG6= <mlev>
##$CPDPRG7= <mlev>
##$CPDPRG8= <mlev>
##$CPDPRGB= <>
##$CPDPRGT= <>
##$D= (0..31)
$$ [...]
##$SUBNAM4= <"">
##$SUBNAM5= <"">
##$SUBNAM6= <"">
##$SUBNAM7= <"">
##$SUBNAM8= <"">
##$SUBNAM9= <"">
##$SW= 239.972175391363
##$SWIBOX= (0..15)
0 1 3 0 0 0 0 0 0 0 0 0 0 0 0 0 
##$SW_h= 12077.2946859903
##$TD= 32768
##$TD0= 1
##$TE= 0
##$TE2= 300
##$TE3= 300
##$TEG= 300
##$TL= (0..7)
120 120 120 120 120 120 120 120 
##$TP= (0..7)
150 150 150 150 150 150 150 150 
##$TP07= 0
##$TPNAME0= <>
##$TPNAME1= <>
##$TPNAME2= <>
##$TPNAME3= <>
##$TPNAME4= <>
##$TPNAME5= <>
##$TPNAME6= <>
##$TPNAME7= <>
##$TPOAL= (0..7)
0.5 0.5 0.5 0.5 0.5 0.5 0.5 0.5 
##$TPOFFS= (0..7)
0 0 0 0 0 0 0 0 
##$TUNHIN= 0
##$TUNHOUT= 0
##$TUNXOUT= 0
##$USERA1= <user>
##$USERA2= <user>
##$USERA3= <user>
##$USERA4= <user>
##$USERA5= <user>
##$V9= 5
##$VALIST= <valist>
##$VCLIST= <CCCCCCCCCCCCCCC>
##$VD= 0
##$VDLIST= <DDDDDDDDDDDDDDD>
##$VPLIST= <PPPPPPPPPPPPPPP>
##$VTLIST= <TTTTTTTTTTTTTTT>
##$WBST= 1024
##$WBSW= 4
##$XGAIN= (0..3)
0 0 0 0 
##$XL= 0
##$YL= 0
##$YMAX_a= 95414473
##$YMIN_a= -103939723
##$ZGOPTNS= <>
##$ZL1= 120
##$ZL2= 120
##$ZL3= 120
##$ZL4= 120
##$ABSF1= 222.646
##$ABSF2= -17.35081
##$ABSG= 5
##$ABSL= 3
##$ALPHA= 0
##$AQORDER= 0
##$ASSFAC= 0
##$ASSFACI= 0
##$ASSFACX= 0
##$ASSWID= 0
##$AUNMP= <proc_1d>
##$AZFE= 0.1
##$AZFW= 0.5
##$BCFW= 0
##$BC_mod= 2
##$BYTORDP= 0
##$COROFFS= 0
##$CY= -3
##$DATMOD= 1
##$DC= 0
##$DFILT= <>
##$DTYPP= 0
##$F1P= 0
##$F2P= 0
##$FCOR= 0.5
##$FTSIZE= 32768
##$FT_mod= 6
##$GAMMA= 0
##$GB= 0
##$INTBC= 1
##$INTSCL= 4.134877e-10
##$ISEN= 128
##$LB= 2
##$LEV0= 0
##$LPBIN= 0
##$MAXI= 10000
##$MC2= 0
##$MEAN= 0
##$ME_mod= 0
##$MI= 0.1934396
##$NCOEF= 0
##$NC_proc= 4
##$NLEV= 6
##$NOISF1= 120.0001
##$NOISF2= 80.00006
##$NSP= 0
##$NTH_PI= 0
##$NZP= 0
##$OFFSET= 222.646
##$PC= 1.4
##$PHC0= -386.576
##$PHC1= 27.9862
##$PH_mod= 1
##$PKNL= yes
##$PPARMOD= 0
##$PSCAL= 0
##$PSIGN= 0
##$REVERSE= no
##$SF= 50.3227304925793
##$SI= 32768
##$SIGF1= 140
##$SIGF2= 120
##$SINO= 11.81781
##$SIOLD= 32768
##$SREGLST= <13C.CDCl3>
##$SSB= 0
##$STSI= 32768
##$STSR= 0
##$SW_p= 12077.2946859903
##$SYMM= 0
##$S_DEV= 0
##$TDeff= 32768
##$TDoff= 0
##$TI= <>
##$TILT= no
##$TM1= 0
##$TM2= 0
##$TOPLEV= 0
##$USERP1= <user>
##$USERP2= <user>
##$USERP3= <user>
##$USERP4= <user>
##$USERP5= <user>
##$WDW= 1
##$XDIM= 32768
##$YMAX_p= 387386798
##$YMIN_p= -749376
$$ End of Bruker specific parameters
$$ ---------------------------------
##NTUPLES= NMR SPECTRUM
##VAR_NAME=  FREQUENCY,     SPECTRUM/REAL,   SPECTRUM/IMAG
##SYMBOL=    X,             R,               I
##VAR_TYPE=  INDEPENDENT,   DEPENDENT,       DEPENDENT
##VAR_FORM=  AFFN,          ASDF,            ASDF
##VAR_DIM=   32768,         32768,           32768
##UNITS=     HZ,            ARBITRARY UNITS, ARBITRARY UNITS
##FACTOR=    0.368581032318806, 1,           1
##FIRST=     11204.1544566776, 0,            0
##LAST=      -873.140229312654, 0,           0
##MIN=       -873.140229312654, -749376,     0
##MAX=       11204.1544566776, 387386798,    0
$$ Real data points
##PAGE= N=1
##DATA TABLE= (X++(R..R)), XYDATA
$$ [...]
7926E106076m79428m16680l52326k94885k57951k30869j98570j74411j68917j67202
$$ 5106076 4626648 4209968 3857642 3562757 3304806 3073937 2875367 2700956 2532039 2364837
7916B364837j50970j22386r5326n7836k2243j0497j7363k0536n653K3029M8668
$$ 2364837 2213867 2091481 1996155 1938319 1916076 1905579 1888216 1867680 1862027 1885056 1933724
7905A933724P8559J26762J87178K16042J48824j9813j86407k46968k07897j24350
$$ 1933724 2012283 2139045 2326223 2542265 2691089 2671276 2484869 2237901 2030004 1905654
7895A905654l9155r90m0239j31932j96518j83577j31347j02828q3947n7064l9449
$$ 1905654 1866499 1865509 1825270 1693338 1496820 1313243 1181896 1079068 995121 938057 898608
7884H98608m0426m7827n2721n5504o0757o2670m9538l0713l1618m4390l7852j7045
$$ 898608 858182 810355 757634 702130 641373 578703 529165 498452 466834 422444 384592 367547
7872C67547n291k541M278J7356K1218P945j2141k5388l2899l9491m0175m3020
$$ 367547 362256 359715 363993 381349 402567 410512 398371 372983 340084 300593 260418 217398
7860B17398m3030l1971j4852L352K7117N0683N3680M1977K4245J3680R629m001
$$ 217398 174368 142397 127545 130897 158014 208697 262377 304354 328599 342279 351908 347907
7848C47907j9804k3629j3751n078j5184l3285m3268l9284j8093L046L518j275
$$ 347907 328103 304474 290723 285645 270461 237176 193908 154624 136531 139577 143095 141820
7836A41820R851K0744J0371j1150k2766j3778O138J7455Q803N461J8683K7339
$$ 141820 151671 172415 182786 171636 148870 135092 141230 158685 167488 172949 191632 218971
7824B18971K0731N232n753m069J132q766l9610p0220p2566n4960k5899J6814M9427
$$ 218971 239702 244934 239181 235112 236244 227478 187868 117648 45082 -9878 -35777 -18963 30464
7811C0464N2341L2622J3225L885r355k0034j7736j233K5203L3110K5817J6752
$$ 30464 82805 115427 128652 132537 123182 103148 85412 84179 109382 142492 168309 185061
7799A85061N112k817K122J2206J2358j325j5343j1337M765J3153P556q377l0813
$$ 185061 190173 187356 189478 201684 214042 212717 197374 186037 190802 203955 211511 203134 172321
7786A72321m7029m5154l4961j4361J4032K7539K2861R433j5531l9678l8622j5969
$$ 172321 125292 80138 45177 30816 44848 72387 95248 104681 89150 49472 10850 -5119
7774e119J4433L3128L1152K6426K6554K4453K4145K5702K7995J6372j2270l1097
$$ -5119 9314 42442 73594 100020 126574 151027 175172 200874 228869 245241 232971 201874
7762B01874l6349m7519n1671m5367m2454k9897M620L4945L6311J4309j0741l0853
$$ 201874 165525 118006 66335 20968 -21486 -51383 -46763 -11818 24493 38802 28061 -2792
7750b792m8673m3017l744M0668N7465L8087J1466L709M732O828J1582J3604M792
$$ -2792 -51465 -94482 -98226 -57558 -93 37994 49460 53169 57901 64729 76311 89915 94707
7737I4707j1962k4867k2485k150J3284J0454j180j2377j6934n020J1786J0987
$$ 94707 82745 57878 35393 33243 46527 56981 55801 43424 26490 21470 33256 44243
7725D4243j018q024n799j139M52k571m835j4203k5739j9407Q15Q637M487K811
$$ 44243 43225 35201 29402 28263 28715 26144 21309 7106 -18633 -38040 -37225 -28588 -24101 -21290
7711b1290M033p11j2764j5353l567M308m130j9419k3732j5965n327P398J5525
$$ -21290 -17257 -17968 -30732 -46085 -49652 -45344 -49474 -68893 -92625 -108590 -113917 -106519 -90994
7698i0994J8591J5712J1361J5753K4946L7042L7785K0940J869j4092k5466k4265
$$ -90994 -72403 -56691 -45330 -29577 -4631 32411 70196 91136 93005 78913 53447 29182
7686B9182j4054j3811k2775j5261Q250K8494K8369L60k8655k8672p409J1193O014
$$ 29182 15128 1317 -21458 -36719 -28469 25 28394 28754 99 -28573 -35982 -24789 -18775
7673a8775j5364k1266j1588n992o372j374P299J3478J2751Q800J642o537j4186
$$ -18775 -34139 -55405 -66993 -72985 -79357 -80731 -73432 -59954 -47203 -38403 -36761 -43298 -57484
7660e7484j0324Q506K5145L3040L2222L0699L6721M3243K9267m956k6632k1735
$$ -57484 -67808 -59302 -34157 -1117 31105 61804 98525 141768 171035 166079 139447 117712
7648A17712p462l026m004p790k4720l9549l2544j9190j6014k0166j9253k1491
$$ 117712 110250 107224 103220 95430 70710 31161 -1383 -20573 -36587 -56753 -76006 -97497
7636i7497k8432j7829N108M917k3176l7576j6456J6319L5664K8630K648j2439
$$ -97497 -125929 -143758 -138650 -133733 -156909 -194485 -210941 -194622 -158958 -130328 -127680 -140119
7624a40119n037M393M375J5318L8141O2844R6348J28288J08307K9295m5966p4594
$$ -140119 -145156 -140763 -136388 -121070 -82929 -20085 76263 204551 312858 342153 296187 221593
7612B21593o1073k5039j069p797j8914k0883k7432l0845k4432k1753k2211r42
$$ 221593 160520 135481 134412 126615 107701 86818 59386 28541 4109 -17644 -39855 -40797
7600d0797K7836L6018J9522j0450l4229l8154k1916o063j550M120J5893K4846
$$ -40797 -12961 23057 42579 32129 -2100 -40254 -62170 -68233 -69783 -65663 -49770 -24924
7588b4924K6898K2243J4062P986N973N717M521M899K502o275k4736l9549l3540
$$ -24924 1974 24217 38279 46265 52238 57955 62476 67375 69877 63602 38866 -683 -34223
7575c4223j0706M081L711P72K732J5327K7652K0751q186k7756k5614j0067J5379
$$ -34223 -44929 -40848 -37137 -36365 -33633 -18306 9346 30097 21911 -5845 -31459 -41526 -26147
7562b6147L9622M2658K4319R783P847J755o234j3646k9190l6280j7142J3397L7314
$$ -26147 13475 56133 80452 90235 98082 99837 93603 79957 50767 14487 -2655 10742 48056
7549D8056L9943K4138J4715J8482K2761K1761K0550R321j5181l1604l7850m5524
$$ 48056 87999 112137 126852 145334 168095 189856 210406 219727 204546 172942 135092 89568
7537H9568m0374j7332j3990m4696o8338n8762k9355K499K4218L6275L3572J8589
$$ 89568 49194 31862 17872 -26824 -95162 -153924 -183279 -180780 -156562 -120287 -86715 -68126
7525f8126N724n60p027p803j695J0149K3674K2113P101r781k1832l2609l8867
$$ -68126 -62402 -62962 -69989 -77792 -79487 -69338 -45664 -23551 -16450 -26231 -48063 -80672 -119539
7512a19539k8745j1483o70L628P012J0251j016j6652j7589q607j515n420m835
$$ -119539 -148284 -159767 -160437 -156809 -149797 -139546 -140562 -157214 -174803 -183410 -184925 -190345 -195180
7499a95180J3743L6696N2705M7245J0089l0719m0280j8724O342J6588o63l4105
$$ -195180 -181437 -144741 -92036 -44791 -34702 -65421 -105701 -124425 -118083 -101495 -102158 -136263
7487a36263m6667k1400K4946M6911M0898L2310K8635K2327O546k63N868J3497
$$ -136263 -182930 -204330 -179384 -132473 -91575 -59265 -30630 -8303 -1757 -2020 3848 17345
7475A7345K2288K6990J8769N539l250o885j0279j5423j3438q148j2877k1831k6364
$$ 17345 39633 66623 85392 90931 87681 80796 70517 55094 41656 33508 20631 -1200 -27564
7462b7564k0393j0279L019J6776K5252L1136K1412m533l0900m4726l6740j6752
$$ -27564 -47957 -58236 -55217 -38441 -13189 17947 39359 34826 3926 -40800 -77540 -94292
7450i4292k33N243N118J0704K2944L9405M3461J4713k1548k9946j7835k907O287
$$ -94292 -94525 -89282 -84164 -73460 -50516 -11111 32350 47063 25515 -4431 -22266 -25173 -18886
7437a8886J4117K1460J9991J0438o532j0049M819J9783K5321J7797J0404L832
$$ -18886 -4769 16691 36682 47120 40588 30539 35358 55141 80462 98259 108663 112495
7425A12495j6787m9020o3223l4427R637L1938K1391q427k9072m6941n9384m9555
$$ 112495 95708 46688 -16535 -50962 -41325 -9387 12004 3577 -25495 -72436 -131820 -181375
7413a81375k1115J587Q727J4810K2162J6129p349l8004m6924k0207J0339K2896
$$ -181375 -202490 -200903 -192176 -177366 -155204 -139075 -146424 -184428 -231352 -251559 -241220 -218324
7401b18324K6594K3725J0735J683k687j1872j5217n464J1473K6439K9808J3866
$$ -218324 -191730 -168005 -157270 -155587 -158274 -170146 -185363 -190827 -179354 -152915 -123107 -109241
7389a09241p894j6657j5213q950o473r762j5258j8163j4685j43J9512K8159L0266
$$ -109241 -117135 -133792 -149005 -157955 -164428 -174190 -189448 -207611 -222296 -222439 -202927 -174768 -144502
7376a44502K8098J8673J4057J7336J8125J7960K2416K4917J2749o799k1629k0353
$$ -144502 -116404 -97731 -83674 -66338 -48213 -30253 -7837 17080 29829 23030 1401 -18952
7364a8952p434l890p202q398m876O499J4277L329j6843k1975j0348L111J3711
$$ -18952 -26386 -30276 -37478 -45876 -50752 -44253 -29976 -26647 -43490 -65465 -75813 -72702 -58991
7351e8991K1369K7609L1840K8254L0275L5084K7115Q819r622j4068p353m329j5851
$$ -58991 -37622 -10013 21827 50081 80356 115440 142555 151374 141752 127684 120331 116002 100151
7338A00151k4694r740J1878J9230J8007J0513M461Q687J9208K9319K5326n73k6781
$$ 100151 75457 65717 77595 96825 114832 125345 129806 138493 157701 187020 212346 211773 184992
7325A84992k9030m924J3045J466j6024j0419J396n783k2139l0119j7489M548R719
$$ 184992 155962 151038 164083 165549 149525 139106 140502 134719 112580 82461 64972 69520 79239
7312G9239J417n564q776p465q940k1355l3972k9407j3791j000N249R648J1825
$$ 79239 80656 75092 66316 58851 49911 28556 -5416 -34823 -48614 -49614 -44365 -34717 -22892
7299b2892Q896j199l558J5448L9348L7729K2281J2038m70j3123k1919k1674j2307
$$ -22892 -13996 -15195 -18753 -3305 36043 73772 96053 108091 107621 94498 72579 50905 38598
7286C8598l752J965Q331O639Q460J9528K1018L054j8051k3167j1581o101j5710
$$ 38598 34846 36811 45142 51781 60241 79769 100787 103841 85790 62623 51042 44941 29231
7273B9231k3780j6579K972K8577M8087M9142L3520O238j9223k9759l4598m2807
$$ 29231 5451 -11128 -8156 20421 68508 117650 151170 157408 138185 108426 73828 31021
7261C1021m4847k8918m101Q600Q179O551P728P563J4495K4013L4566L9320L3974
$$ 31021 -13826 -42744 -46845 -38245 -30066 -23515 -15787 -8224 6271 30284 64850 104170 138144
7248A38144J8985n145j7886r579L182M489j4876l9383m4862k3793L576J7603K1484
$$ 138144 157129 151984 134098 124519 127701 132190 117314 77931 33069 9276 12852 30455 51939
7235E1939J6501L293l212L604P476j501j7668l9388m9754l7770j1663P552M844
$$ 51939 68440 71733 68521 72125 79601 78100 60432 21044 -28710 -66480 -78143 -70591 -65747
7222f5747q833n083R616J1502M71j2021j7551j4886o156N139R542M384n653j4516
$$ -65747 -74580 -79663 -70047 -58545 -58074 -70095 -87646 -102532 -108688 -103549 -94007 -89623 -95276 -109792
7208a09792n166J6801L4475M7521M6143K4358L822P032J7451J2110o529j8522
$$ -109792 -114958 -98157 -63682 -16161 29982 54340 58162 65194 82645 94755 88226 69704
7196F9704j6272n324R059K8004M3317K7684j4431m5912m9291m0418k4514r27P861
$$ 69704 53432 48108 57167 85171 128488 156172 141741 95829 46538 6120 -18394 -19321 -11460
7183a1460N799J2114J5402O587p718j5156p664N90K430O624M608P92J6630L6399
$$ -11460 -5661 6453 21855 28442 20724 5568 -2096 -1506 924 7548 12156 12948 29578 65977
7169F5977K9363J2962J1961K5447L3327J2436k5027m8029n1496l6446j1599R565
$$ 65977 95340 108302 120263 145710 179037 191473 166446 118417 66921 30475 18876 28441
7157B8441K7785K8776J3301n701k7190l2060k1128j1253o19J4054K1514N983j5682
$$ 28441 56226 85002 98303 92602 65412 33352 12224 971 352 14406 35920 41903 26221
7144B6221j3879n545r230p252R380K3172K3817R821j989n15M210Q999J1930J2388
$$ 26221 12342 6797 -2433 -9685 -305 22867 46684 56505 54516 54001 58211 67210 79140 91528
7130I1528J1083L591p734j0434O029J8105J5832L0478N2868M8271J7313k1020
$$ 91528 102611 106202 98468 88034 94063 112168 128000 158478 211346 259617 276930 255910
7118B55910m7239m6583k2459N363R843p40K609J2243J4971J1305L748k0204n4542
$$ 255910 208671 162088 139629 144992 154835 154095 156704 168947 183918 195223 198971 178767 124225
7105A24225p1157o0149k5555O237K5194L3950K7297R807L841J4326K1408K5116
$$ 124225 53068 -7081 -32636 -26399 -1205 32745 60042 69849 73690 88016 109424 134540
7093A34540K0355j66k5809m1692m1447l1511k5528j3206J0328K1281K2817K3325
$$ 134540 154895 154729 128920 87228 45781 14270 -11258 -24464 -14136 7145 29962 53287
7081E3287J3783J169o458o791k990N214J9948L1259L0572J4422k031j389j0823
$$ 53287 67070 68239 61781 54990 52000 57214 77162 108421 138993 153415 151384 149995 139172
7068A39172k7699k0741j2059k8287m5604m5022l7641l3462l0960k1680k698J2153
$$ 139172 111473 90732 78673 50386 4782 -40240 -77881 -111343 -142303 -163983 -166681 -154528
7056a54528J5377J5725J8737J7202R328L629p474j9422j7816k468J5534L2685
$$ -154528 -139151 -123426 -104689 -87487 -78159 -74530 -82004 -101426 -119242 -121710 -106176 -73491
7044g3491M3176K7722n352k3888j9363j1484j0648j494P237l654m839J0536J9992
$$ -73491 -30315 -2593 -7945 -31833 -51196 -62680 -73328 -74822 -67585 -71239 -76078 -65542 -45550
7031d5550J4937M615P379K0090L0178L4787L6887K0834j7240m6867n1404l9758
$$ -45550 -30613 -25998 -18619 1471 31649 66436 103323 124157 106917 60050 8646 -31112
7019c1112k2421r757j8543l6284m2118l2122q359K0789N5274Q1103O6550K4787
$$ -31112 -53533 -63290 -81833 -118117 -160235 -192357 -200716 -179927 -124653 -43550 23000 47787
7007D7787K522J1232K7755L6370K8420J6260Q368p325j1683q02n32j8625k7716
$$ 47787 50309 61541 89296 125666 154086 170346 178714 171389 159706 158904 158372 139747 112031
6994A12031j7453j525J3403K3431K2429J7556K9069M1709M5136M7272L7981K3704
$$ 112031 94578 93053 106456 129887 152316 169872 198941 240650 285786 333058 371039 394743
6982C94743K3106K1670R269j42M139J7346K5430L2057N3430Q2471R2697Q6601
$$ 394743 417849 439519 448788 448646 452785 470131 495561 527618 581048 663519 756216 842817
6970H42817R0305J12383J56636K12913K54201K90199L44787M15117M93348O00301
$$ 842817 933122 1045505 1202141 1415054 1669255 1959454 2304241 2719358 3212706 3813007
6960C813007P61718R86991J288358J640988J899451J766576J019166j82468j298371
$$ 3813007 4574725 5561716 6850074 8491062 10390513 12157089 13176255 12993787 11695416
6951A1695416j831417j756587j393773r97846o62589m14978k72187k92565m47323
$$ 11695416 9863999 8107412 6713639 5715793 5053204 4638226 4366039 4073474 3626151
6942C626151n59612n43657m61527l77711l11624k60924k19566j79740j29355p1485
$$ 3626151 3066539 2522882 2061355 1683644 1372020 1111096 891530 711790 582435 510950
6932E10950k2943q76j1579l7298n7349n3307l1477j6605k4366m5749n2802m5913
$$ 510950 488007 487131 475552 438254 380905 327598 296121 279516 255150 209401 156599 110686
6920A10686m0148l9477l1723j1771L663J3013K6214L6829L2777J8549R78j2101
$$ 110686 70538 31061 -662 -12433 -8770 4243 30457 67286 100063 118612 119590 107489
6908A07489j2301n035J758L399L013N609J0657O764n48M000Q670K067j6452m1000
$$ 107489 95188 90153 91911 95310 98323 103932 114589 121353 120805 124805 133475 135542 119090 78090
6894G8090n5638n4586l8234j3874n924j4706j5478n815M991K4589L6790K3939
$$ 78090 22452 -32134 -70368 -84242 -90166 -104872 -120350 -126165 -121174 -96585 -59795 -35856
6882c5856K623K827K3128L2186J1294k2373m4015m3439k5552n641J1021K0113
$$ -35856 -33233 -30406 -7278 24908 36202 13829 -30186 -73625 -99177 -104818 -93797 -73684
6870g3684K6175K0715Q91o683OJ0810K0002J3809p119k3054k6565j1848J9385
$$ -73684 -47509 -26794 -25903 -32586 -32580 -21770 -1768 12041 4922 -18132 -44697 -56545 -37160
6857c7160M6417N1555L6476J8527J1319P155P436M819j1591k2756l0454m3296
$$ -37160 9257 60812 97288 115815 127134 134289 141725 146544 134953 112197 81743 38447
6845C8447l9140q257J9802J2512k2115n0657n3989l8561j3687J2101L2761M3572
$$ 38447 -693 -8950 10852 23364 1249 -49408 -103397 -141958 -155645 -143544 -110783 -67211
6833f7211M7649M3419L1320K4070K6787K4360J707l0597m9831n1419l2621l809
$$ -67211 -19562 23857 55177 79247 106034 130394 132101 101504 51673 254 -32367 -36176
6821c6176Q923M909K351J312M218J1567J0182Q57q09J720M182J7414K7857J9099
$$ -36176 -27253 -22344 -19993 -18681 -14463 -2896 7286 8143 7334 9054 13236 30650 58507 77606
6807G7606P210L371K880P460J6502K2908J7151R90j4659k2025j0953J3598L0646
$$ 77606 84816 88187 91067 98527 115029 137937 155088 156078 141419 119394 108441 122039 152685
6794A52685L4192K2878j211k3286l5880l7811k5435J404L2902O3205Q2289Q5073
$$ 152685 186877 209755 208544 185258 149378 111567 86132 87536 120438 183643 265932 351005
6782C51005Q3527Q6285J05213J22325Q6147o042q5674j15234j18325j07095p8038
$$ 351005 434532 520817 626030 748355 834502 828460 742786 627552 509227 402132 324094
6771C24094o0063o5870o6640l8041k038R019J2491K5441L0036J2662j5014l9981
$$ 324094 264031 198161 131521 93480 91442 100461 112952 138393 168429 181091 166077 126096
6759A26096n0518l7442j1739O422p3j4172k1016j5941K685K0698L3404N1663N5731
$$ 126096 75578 38136 26397 32819 32746 18574 -2442 -18383 -15698 5000 38404 90067 145798
6746A45798L2092J0519P660O001m661j2488j5319j3132q361n169n421j5832k7003
$$ 145798 177890 188409 196069 202070 197409 184921 169602 156470 148109 142940 137519 121687 94684
6733I4684k3980n181J3279J3789R798K2242K7438J1609M43O261P085L091J5931
$$ 94684 70704 65523 78802 92591 102389 124631 152069 163678 164121 170382 177467 180558 196489
6720A96489L6964N4993N9554N0698L8911J6703j1137k2488k4384l4385l5591k6223
$$ 196489 233453 288446 348000 398698 437609 454312 443175 420687 396303 361918 326327 300104
6708C00104k5511l5363l7032k5392k8404l4744k0980n844J1057M1554N8683N3416
$$ 300104 274593 239230 202198 176806 148402 113658 92678 86834 97891 139445 198128 251544
6696B51544M0666J9111j7380m8315n2436m1825j9523O303J3159O756L659q34j2076
$$ 251544 292210 311321 293941 245626 193190 151365 131842 138145 151304 158060 161719 160885 148809
6683A48809j4961j0851j6942k9861k3522o09J2062N996k819J0277L9949N6425
$$ 148809 133848 122997 106055 76194 52672 52063 64125 70121 67302 77579 117528 173953
6671A73953M5868J6878j8093m1576n0895m6503l0420k0649r185N053R42j5785
$$ 173953 219821 236699 218606 177030 126135 79632 49212 28563 19378 24431 25373 9588
6659I588k4827j4683J51o453k1339j8663k329r90j9897k9824k0235o069N599J5704
$$ 9588 -15239 -29922 -29771 -36224 -57563 -76226 -78555 -79545 -99442 -129266 -149501 -155570 -149971 -134267
6645a34267J2523l432q774N708K0635J5228p39j8421j9283J3135L8958L9257L2384
$$ -134267 -121744 -125176 -133950 -128242 -107607 -92379 -93118 -111539 -130822 -117687 -78729 -39472 -7088
6632g088J8901P77p719k279M646N713O18j0574k0823k5405j4104J3602K7031J8071
$$ -7088 11813 12590 4871 2592 7238 12951 13569 2995 -17828 -43233 -57337 -43735 -16704 1367
6618A367L721r792n879K0456M3045L8760R117k7046n3521o3177m7749j3734J3355
$$ 1367 5088 -4704 -10583 9873 52918 91678 100795 73749 20228 -42949 -90698 -104432 -91077
6605i1077K3316K0847R879J3050L6358M3734K3183M839n32p897k4562l9154n5549
$$ -91077 -67761 -46914 -37035 -23985 12373 56107 79290 84129 83597 75700 51138 11984 -43565
6592d3565o1681l3414O424L0773L8410K5586J263j5514j7766m930J5589L8300
$$ -43565 -105246 -138660 -132236 -101463 -63053 -37467 -36204 -51718 -69484 -74414 -58825 -20525
6580b0525M9372M0649K0306O206P542Q382Jp859n712M003J1705J7173K6411M3275
$$ -20525 28847 69496 89802 96008 103550 111932 111933 104074 98362 102365 114070 131243 157654 200929
6566B00929O6194Q0970P7847Q3067J05966J28177J21462N8880n1982j52119j85249
$$ 200929 267123 348093 425940 509007 614973 743150 864612 923492 871510 719391 534142
6555E34142j63504j29110q8976n4568m7270m7295l1180n694O159M88n54P84q301
$$ 534142 370638 241528 152552 97984 50714 3419 -27761 -33455 -27296 -26808 -27362 -26578 -34879
6542c4879j0064P78J6253K8810L6923M8811N2271M0421K6103P417j6808l0897
$$ -34879 -44943 -44165 -27912 898 37821 86632 138903 179324 205427 212844 196036 165139
6530A65139k2023o896j0184k6508k7316q608J0292R784p915k3693l4975m3611
$$ 165139 143116 136220 126036 99528 72212 63604 73896 83680 75765 52072 17097 -26514
6518b6514k8924M608K5966J0541l1904n6639l7115r892j3504l3521m8036m0915
$$ -26514 -55438 -50830 -24864 -14323 -46227 -102866 -139981 -149873 -163377 -196898 -244934 -285849
6506b85849j5076M032J7704L8012M6967K9219J1526J0005P948L825Q219J5990
$$ -285849 -300925 -296893 -279189 -241177 -194210 -164991 -153465 -143460 -135512 -131687 -123468 -107478
6494a07478J2081L041J0150J8577M294j5269k0368j2363q768j188K4378M8508
$$ -107478 -95397 -92356 -82206 -63629 -59335 -74604 -94972 -107335 -116103 -117291 -92913 -44405
6482d4405N2364J6223l4279m3239j1023K3269L2696K0515m148k7524k6386p126
$$ -44405 7959 24182 -10097 -53336 -64359 -41090 -8394 12121 7973 -19551 -45937 -53063
6470e3063M824q55q638j3181k2946l6315m3850k7507J4769O0295P9141O3186L2365
$$ -53063 -48239 -49094 -57732 -70913 -93859 -130174 -174024 -201531 -186762 -126467 -47326 15860 48225
6457D8225J1984J582j3256k8032l7754m4233m5025k6565J2478L7557L2309J6904
$$ 48225 60209 61791 48535 20503 -17251 -61484 -106509 -133074 -120596 -83039 -50730 -33826
6445c3826J1577J3342M841j2824k0700j2671M017J1067J0118R982M776j1016k6839
$$ -33826 -22249 -8907 -4066 -16890 -37590 -50261 -46244 -35177 -25059 -15077 -10301 -21317 -48156
6432d8156k2082K930L1315M5753M6700M0626L3198K3357Q269k204j3519k8446
$$ -48156 -70238 -67308 -35993 9760 56460 97086 130284 153641 161910 159706 146187 117741
6420A17741l3730l2689l3977l0827j5822O281K3223K8844J6500n633k0932l1925
$$ 117741 84011 51322 17345 -13482 -29304 -23023 200 29044 45544 39911 18979 -12946
6408a2946l9588l4328k3986j6279j3771j1195M028L0951N1451N6985N3435M0523
$$ -12946 -52534 -86862 -110848 -127127 -140898 -152093 -148065 -117114 -65663 -8678 44757 85280
6396H5280K2941Q698m680q973R09R853l562k9715m9005n2310l3208j8311j4111
$$ 85280 108221 116919 112239 103266 104175 114028 110466 80751 31746 -20564 -53772 -72083 -86194
6383h6194O189L1785M1386L2288Q391j6131k7139k5768k4090j6102L850K3505
$$ -86194 -80005 -48220 -6834 25454 33845 17714 -9425 -35193 -59283 -75385 -71535 -48030
6371d8030K4902J2784O379J2114J0866j7679l9084l9157k4886L206J3718l144
$$ -48030 -23128 -10344 -3965 8149 19015 1336 -37748 -76905 -101791 -98585 -84867 -88011
6359h8011k3203l5769l3473k8505k0336Q745L3053L0071J9502J6798J2845M268
$$ -88011 -111214 -146983 -180456 -208961 -229297 -220552 -187499 -157428 -137926 -121128 -108283 -104015
6347a04015Q614K7080K5946P63j4835p404L757K50j647J1539K5257K6107K2441
$$ -104015 -95401 -68321 -42375 -41612 -56447 -63851 -60094 -59844 -61491 -49952 -24695 1412 23853
6334B3853J9362J4753J7351J9734Q605j1908k7042l1988k6881j6481j72J2096
$$ 23853 43215 57968 75319 95053 103658 91750 64708 32720 5839 -10642 -10814 1282
6322A282J2482J4511K1962K3038J3519O958J2385J8384M345j4023j7505j6799
$$ 1282 13764 28275 50237 73275 86794 93752 106137 124521 128866 114843 97338 80539
6310H0539j9512j9920j6581j6219j7468j5257k798O261l184k1966l0555j9236
$$ 80539 61027 41107 24526 8307 -9161 -24418 -27216 -20955 -24139 -46105 -76660 -95896
6298i5896j600k334j3578j1946k150J2165K1673Q268j0928j2340Q21J2549K5142
$$ -95896 -97496 -99830 -113408 -125354 -127504 -115339 -93666 -85398 -96326 -108666 -107845 -95296 -70154
6285g0154L6228L5797K2570N275k250j2088k4739k1893n585O941Q683J8549K5047
$$ -70154 -33926 1871 24441 29716 27466 15378 -9361 -31254 -36839 -29898 -21215 -2666 22381
6272B2381J2938O77j145J521n223j2687j144K3861L1390K0828J0520q300m0465
$$ 22381 35319 35996 34851 36372 31149 18462 17318 41179 72569 93397 103917 95617 55152
6259E5152o6195o9764m9476j4547J5958L0859L4425K4827K746k1297l1839j9408
$$ 55152 -11043 -80807 -130283 -144830 -128872 -98013 -63588 -38761 -36015 -57312 -89151 -108559
6247a08559P922L6164M4645M0617L1641R565k6435n8056o0505l0246M919P746
$$ -108559 -100637 -64473 -19828 20789 52430 61995 35560 -22496 -83001 -113247 -108328 -100582
6235a00582j3983k1150r244O614J2970R559J2209K0123J4311K910R88J368J270
$$ -100582 -114565 -135715 -144959 -138345 -125375 -115816 -103607 -83484 -69173 -66263 -65275 -63907 -62637
6222f2637M170J2653J6332P019m841r047N392K4194K4026N320j5762k3486k5100
$$ -62637 -58467 -45814 -29482 -22463 -27304 -36351 -30959 -6765 17261 22581 6819 -16667 -41767
6209d1767j9070K588K3898K7848J9983J2340Q007J1070J0233o537j7943r858L938
$$ -41767 -60837 -58249 -34351 -6503 13480 25820 33827 44897 55130 48593 30650 20792 24730
6196B4730O122m095j9286k8490l5733m4791m7172l1772j3819m982K133O688Q767
$$ 24730 30852 26757 7471 -21019 -56752 -101543 -148715 -180487 -194306 -199288 -197155 -190467 -181700
6183a81700P427L740Q695K7297L2672J6112N823J6082L4409M8102N3718N5084
$$ -181700 -174273 -170533 -161838 -134541 -101869 -85757 -79934 -63852 -29443 18659 72377 127461
6171A27461N5566M2846J4757q583k9215m4403m4355l7333l2284k4802o141K3340
$$ 127461 183027 225873 240630 232047 202832 158429 114074 76741 44457 19655 13514 36854
6159C6854M5712M2735J8165p537j6715p468O795J2154r85k5155m0544m8269m8998
$$ 36854 82566 125301 143466 135929 119214 111746 118541 130695 129710 104555 64011 15742 -33256
6146c3256l4846r065J1115J2385J0556Q832J4887L1002L5485K2395L023L417K1483
$$ -33256 -68102 -77167 -66052 -53667 -43111 -34279 -19392 11610 47095 69490 72513 75930 97413
6133I7413L3467K6457P543m432l046J469o106k5594m6198o0215n2225k5686Q24
$$ 97413 130880 157337 164880 160448 157402 158871 152765 127171 80973 20758 -31467 -57153 -56329
6120e6329J2304P793J935r995k4660k1863r099r121k6854l9509l1514j2430K617
$$ -56329 -44025 -36232 -34297 -44292 -68952 -90815 -99914 -109035 -135889 -175398 -206912 -219342 -216725
6107b16725J1051J2254J5459K4296K5758J1197o988q496N221K2531L0196J8218
$$ -216725 -205674 -193420 -177961 -153665 -127907 -116710 -123698 -132194 -126973 -104442 -74246 -56028
6095e6028L274k255j376p89M051J1098J0823N157R900J7593Q667n536r924j3764
$$ -56028 -52754 -55009 -56385 -57174 -53123 -42025 -31202 -26045 -16145 1448 10115 4579 -5345 -19109
6081a9109j8819q275J0337J7637J2156L137K842K576n149o147l438p441q271K905
$$ -19109 -37928 -46203 -35866 -18229 -6073 -2936 -94 2482 -2667 -8814 -12252 -19693 -27964 -25059
6067b5059J5171J4916L627j499J444M386J7187K4383N781k6054m9041n1591l3245
$$ -25059 -9888 5028 8655 7156 8600 12986 30173 54556 60337 34283 -14758 -66349 -99594
6054i9594M917L7328L3953J8012J7609K1348K2411L1298L5607J4460k3773m5921
$$ -99594 -94677 -57349 -23396 -5384 12225 33573 55984 87282 122889 137349 113576 67655
6042F7655l9017k1836l836R514J2175J1617J8014K7534L1069L1163L3497L5261
$$ 67655 28638 6802 2966 12480 24655 36272 54286 81820 112889 144052 177549 212810
6030B12810K6429l83k4819m2068o3764p5968n7562k2277k13Q372K3778M0689M0368
$$ 212810 239239 238856 214037 171969 108205 32237 -25325 -47602 -47815 -39443 -15665 25024 65392
6017F5392K3538N048R47R814J5311J1174Q125l553k0852j6696n588q158p775Q433
$$ 65392 88930 93978 94925 104739 120050 131224 139349 135796 114944 98248 92660 84502 76727 85160
6003H5160L0879N3400O3570M5999j193l7024l0178j2705j6698l9730n0230l1255
$$ 85160 116039 169439 233009 279008 277815 240791 210613 197908 181210 141480 91250 59995
5991E9995r581o530j7555l1368l9647l6146l1691l0107k8365k4232j9031r660
$$ 59995 50414 43884 26329 -5039 -44686 -80832 -112523 -142630 -170995 -195227 -214258 -223918
5979b23918K291J2498K1017K8669L1229K2752L307n500P502J3813M174M913O937
$$ -223918 -221627 -209129 -188112 -159443 -128214 -105462 -102155 -107655 -100153 -86340 -82166 -77253 -70316
5966g0316N92M360J4768K4716L4681L9702L5015K5183J8312J6352J8789J3813
$$ -70316 -69724 -65364 -50596 -25880 8801 48503 83518 108701 127013 143365 162154 175967
5954A75967j120j9061l1576l2681l7673m2701k8950k215K0011J8100j1168l3259
$$ 175967 174847 155786 124210 91529 53856 11155 -17795 -20010 1 18101 6933 -26326
5942b6326l3135j6346O146K3360K0803l568k6411k1987Q405L2736L0878J4644
$$ -26326 -59461 -75807 -69661 -46301 -25498 -29066 -55477 -77464 -69059 -36323 -5445 9199
5930I199l435j1484j3987j9979j8509p592L380R079J8105L1323L5598L4661L6558
$$ 9199 5764 -5720 -19707 -39686 -58195 -65787 -62407 -53328 -35223 -3900 31698 66359 102917
5917A02917L7382L8736J9465k1551m7524n0944m4360l6876l9190m0057j2889K3802
$$ 102917 140299 179035 198500 176949 129425 78481 34121 -2755 -41945 -82002 -94891 -71089
5905g1089M1183M1429K7942L542r011m454m673j2631j3221m516M109J0503J4352
$$ -71089 -29906 11523 39465 43007 33996 29542 24869 12238 -983 -5499 -1390 9113 23465
5892B3465R766o521k0552j5252J061p78j2190j7110l0771m0887l6723l4898l2344
$$ 23465 33231 26710 6158 -9094 -8033 -8811 -21001 -38111 -68882 -109769 -146492 -181390 -213734
5879b13734j8794j475O262J5006M0820O0004N2907L5753J9484L772k644O533N167
$$ -213734 -232528 -234003 -227741 -212735 -171915 -111911 -59004 -23251 -3767 5 -2639 3894 9061
5866I061j3050l1004l3747k4124j5483l975J2074K3823L1843L7677K7266K535
$$ 9061 -3989 -34993 -68740 -92864 -108347 -112322 -100248 -76425 -44582 -6905 20361 22896
5854B2896j4113j0708k00J796o404j4908r023N795R704M201M359P019l02r335
$$ 22896 8783 -1925 -2125 -329 -6733 -21641 -30664 -24869 -15165 -10964 -6605 414 112 -9223
5840i223l090J8165L5995K9089j785j9579j7351q478M071J7936L4692M3193L7865
$$ -9223 -12313 5852 41847 70936 69151 49572 32221 23743 27814 45750 80442 123635 161500
5827A61500K9227J9370M057j3597k4223k1770j3352R76K4265L7033K6282m87k5281
$$ 161500 190727 210097 214154 200557 176334 154564 141212 142188 166453 203486 229768 229281 204000
5814B04000k6730l62L5416M1784r052j20910k21197j96952o6332N1335P7689M2488
$$ 204000 177270 176908 212324 254108 245056 124146 -97051 -294003 -360335 -309000 -231311 -188823
5802a88823K5393N4888Q8527R4287P3857K7045j0458k3632k3547k754K9393M1242
$$ -188823 -163430 -108542 -20015 74272 148129 175174 164716 141084 117537 114783 144176 185418
5790A85418L1091K3248J8539J0626j886j9913l8548m1625k9082k8573l6377k0794
$$ 185418 216509 239757 258296 268922 267036 247123 208575 166950 137868 109295 72918 52124
5778E2124J1023L5717M6211L8388J6789q766k9436l3763j9821m441K608J8873
$$ 52124 63147 98864 145075 183463 200252 191486 162050 128287 108466 104025 106633 125506
5766A25506K2499q797m1820m5477l4114l6322m7540m3613l0327k1928k0963j4557
$$ 125506 148005 139208 97388 51911 17797 -18525 -66065 -109678 -140005 -161933 -182896 -197453
5754a97453O190L3575N5518N9717M5387K2674j443j4953j9364j4384M417J9022
$$ -197453 -191263 -157688 -102170 -42453 2934 25608 24165 9212 -10152 -24536 -20119 -1097
5742a097J5240P459J768j1947j5061n877j070k878j1695l2523m6150l7869k5588
$$ -1097 14143 21602 23370 11423 -3638 -9515 -10585 -13463 -25158 -57681 -103831 -141700 -167288
5729a67288j3583J1071L9509N4020M5714J9598o77j5205k7824k8709j5401O290
$$ -167288 -180871 -169800 -130291 -76271 -30557 -10959 -11636 -26841 -54665 -83374 -98775 -92485
5717i2485K1039J8393J0676J6146K9091L4883K9877K3586K3275J6555o894k6573
$$ -92485 -71446 -53053 -42377 -26231 2860 37743 67620 91206 114481 131036 124142 97569
5705I7569k2384j1621j6086k8839l8772l6577j5723J0099J9209O797j4766k2159
$$ 97569 75185 63564 47478 18639 -20133 -56710 -72433 -62334 -43125 -36328 -51094 -73253
5693g3253r883P077J0143M38j01R333J7153K3771K8681J5401l091m191M835J7081
$$ -73253 -83136 -76059 -65916 -65478 -65579 -56246 -39093 -15322 13359 28760 25669 21478 26313 43394
5679D3394K3637K5343K2712J4744m371k5215m0721n1515l5135L874L0560L1220
$$ 43394 67031 92374 115086 129830 125459 100244 59523 8008 -27127 -23253 7307 38527
5667C8527J6888L446k133l334n320n449M211J5620K1759K2446K3359J8765M404
$$ 38527 55415 58861 56728 53394 48074 42625 46836 62456 84215 106661 130020 148785 153189
5654A53189j1444k8171m2436l9836j4269P758K795q783j3857j8270j8260j9124
$$ 153189 141745 113574 71138 31302 17033 24791 27586 18803 4946 -13324 -31584 -50708
5642e0708k8216l7185l0289j5476k045J0077J4097O422k848p462j2869j4038k900
$$ -50708 -78924 -116109 -146398 -161874 -163919 -153842 -139745 -133323 -136171 -143633 -156502 -170540 -173440
5629a73440L903p416k8691l9541k2003J5349M4848M8915L0710L389k2911l0094
$$ -173440 -169537 -176953 -205644 -245185 -267188 -251839 -206991 -158076 -127366 -123977 -146888 -176982
5617a76982j8930L187L5269O1427N6248K8280J2676R660M284J076r695k6796k9402
$$ -176982 -195912 -192725 -157456 -96029 -39781 -11501 1175 10835 15119 16195 6500 -20296 -49698
5604d9698j1659R595J6943M051k3388l5845k7442j1431O223J4287R280j1099k6863
$$ -49698 -61357 -51762 -34819 -30768 -54156 -90001 -117443 -128874 -122651 -108364 -99084 -110183 -137046
5591a37046q007K6243M3665M8827M2457K2581M403j2931k4298j3360K5233O4132
$$ -137046 -145053 -118810 -75145 -26318 16139 38720 43123 30192 5894 -7466 17767 81899
5579H1899P5405N6171K0705q256l2378m7762m6769n1509n6317m0987j4796N122
$$ 81899 157304 213475 234180 225924 193546 145784 99015 47506 -8811 -49798 -64594 -59472
5567e9472J9523L2946L3056J7374m017k5773l8263l8536k7427m250J7784K7350
$$ -59472 -39949 -7003 26053 43427 39410 13637 -24626 -63162 -90589 -94839 -77055 -49705
5555d9705K1290J5916K1691K6607J8305O217N792J0641O534n758j2566j307K6252
$$ -49705 -28415 -12499 9192 35799 54104 60321 66113 76754 83288 77530 64964 63657 89909
5542H9909M0077K3956r111l6141l8130k8357k1482n821M369Q276J9770L4478L8808
$$ 89909 129986 153942 144831 108690 70560 42203 20721 14900 19269 27545 47315 81793 120601
5529A20601L5161K8732J4069k918j3815j3569l57P223N445J4200J6865n707j9874
$$ 120601 155762 184494 198563 195645 181830 168261 167904 175127 180572 194772 211637 205930 186056
5516A86056j7063j2921n944n061j1520j2289n245P558K7336L6627J9529n166k5673
$$ 186056 168993 156072 150128 145067 133547 121258 116013 123571 150907 187534 207063 201897 176224
5503A76224l7431l3751l2048l1035j8096j016J4056J8227M219j3347j6285j2091
$$ 176224 138793 105042 72994 41959 23863 22847 36903 55130 59349 46002 29717 17626
5491A7626j4364j1847L508K3559L9080M1054K3624j944j8535k4631j8065j0042
$$ 17626 3262 -8585 -5077 18482 57562 98616 122240 120296 101761 77130 59065 49023
5479D9023o853n733k140N067J984j0439k3749k2055K25K8926L9539K5094l094
$$ 49023 42170 36437 34297 39364 41348 30909 7160 -14895 -14670 14256 53795 78889 75795
5466G5795l0518m4067m2049l5629k5468j4756l882Q514J4283J3390R591K466j346
$$ 75795 45277 1210 -40839 -76468 -101936 -116692 -120574 -112060 -97777 -84387 -74796 -72330 -73676
5453g3676L597J0182J1736O750O338J7831L0343L2978L3141K6724J0780L56j0931
$$ -73676 -70079 -59897 -48161 -41411 -35073 -17242 13101 46079 79220 105944 116724 117080 106149
5440A06149k3298j9812p489m776j0325j5504k7929m8901n5605l3701J0501M2513
$$ 106149 82851 63039 55550 50774 40449 24945 -2984 -51885 -107490 -141191 -130690 -88177
5428h8177M2612L0094J9906P278j1537k3230k4994j3938J4909L7810L3245J6431
$$ -88177 -45565 -15471 4435 11713 176 -23054 -48048 -61986 -47077 -9267 23978 40409
5416D0409P926N673J5811M1953N7988N2879L1803P411j5086l4343l8925k6373
$$ 40409 48335 54008 69819 111772 169760 222639 254442 261853 246767 212424 173499 147126
5404A47126j4585j0289p806r579p197J265j796j5257k3525k1471j6566k7921m7082
$$ 147126 132541 122252 114446 104867 97670 98935 97139 81882 58357 36886 20320 -7601 -54683
5391e4683o1601o8795n8486k7047J3234M4325O9019Q2844O7286L0013j9701o0074
$$ -54683 -116284 -185079 -243565 -270612 -257378 -213053 -144034 -61190 6096 36109 16408 -43666
5379d3666o2053l7401j6287n703j114J906Q952K3775L7098L7365K3230P525J0529
$$ -43666 -105719 -143120 -159407 -165110 -166224 -164318 -155366 -131591 -94493 -57128 -33898 -26373 -15844
5366a5844K4472L3786L4898K2377Q669J4861L6152P4833J36072J92161J75011
$$ -15844 8628 42414 77312 99689 108358 123219 159371 234204 370276 562437 737448
5355G37448N4502r7275j78830j57767q5243k1663J218j944K26j19q492r275m517
$$ 737448 791950 694675 515845 358078 272835 251172 252390 250446 250672 250553 242061 232786 228269
5342B28269m285r730j2674l559J5705L3068L2977J5743N584K3865O6061J08639
$$ 228269 223984 214254 201580 198021 213726 246794 279771 295514 301098 324963 391024 499663
5330D99663J43413J79546K13954K41801K65671K90876L44083M45636N85329P13582
$$ 499663 643076 822622 1036576 1278377 1544048 1834924 2179007 2624643 3209972 3923554
5320C923554P08207M12698j35276o22229q05131p45314o02622m53415l33587k59438
$$ 3923554 4631761 5044459 4909183 4286954 3481823 2736509 2133887 1680472 1346885 1087447
5310A087447k10282j64985j23737q7908n0609j8301q891j2693l0313o3276p5627
$$ 1087447 877165 712180 588443 500535 449926 431625 422734 410041 379728 316452 240825
5299B40825n8684l8820k3028K538K9635M1485L0624O408j2157j4004o909n69L78
$$ 240825 182141 143321 120293 122831 152466 193951 224575 230983 218826 204822 197913 197344 197722
5286A97722k002K8J234m809o977K794J1214J3790J0908j21j7438k2272q359J867
$$ 197722 195720 195748 196982 192173 185196 187990 199204 212994 223902 223781 206343 184071 175712 177579
5272A77579j2739l9772m3715k5542j0633n089M144K4485L9963L6488K4715P464
$$ 177579 164840 125068 81353 55811 45178 40089 44233 68718 108681 145169 169884 177348
5260A77348j3662j6409l409P455O618p962k3940k9574k3972l085K9772O0620P7001
$$ 177348 163686 147277 143868 151323 157941 149979 126039 96465 72493 69408 99180 159800 236801
5247B36801P0242N1586J5123k7327l6761k0111m156j832j5882m1847o2583o7631
$$ 236801 307043 358629 373752 346425 309664 289553 285397 283565 267683 225836 163253 95622
5235I5622n6806l5606j3838J590K0324K7527J8474J5971J3312K472m323n87O422
$$ 95622 38816 3210 -10628 -9038 11286 38813 57287 73258 86570 89042 84719 84132 90554
5222I0554R832R960Q827L501j026q53N632Q616kk080J1736K6483K0540l573j3006
$$ 90554 100386 110346 119173 122674 121648 120795 126427 135043 135041 132961 144697 171180 191720 188147 175141
5207A75141P63R155K415m100J658J1848R083k574l479L524M892J1792K6284L1111
$$ 175141 175904 185059 187474 183374 185032 196880 205963 203389 199910 203434 208326 220118 246402 277513
5193B77513J8433m352j9774j8552q929j3120k3674k4565k3239k3442k2332j5329
$$ 277513 295946 291594 271820 253268 244339 231219 207545 182980 159741 136299 113967 98638
5181I8638J972J4906J1050p952k0944j8403l397J4748K2864K3881K3565L1477
$$ 98638 100610 115516 126566 118614 97670 79267 75870 90618 113482 137363 160928 192405
5169A92405M3549L9586K2068N597j407o353j5713k0802j8826j5152j4003j3318
$$ 192405 235954 275540 297608 303205 301798 295445 279732 258930 240104 224952 210949 197631
5157A97631o697M821R850Q595J5501K2151J4946J1691J5346K1303L0870L6860
$$ 197631 190934 195755 205605 214200 229701 251852 266798 278489 293835 315138 346008 382868
5145C82868L9385L8098K6290K1896L7793O1117P5451P0987L2852k9997o6867n6962
$$ 382868 422253 460351 486641 508537 546330 607447 682898 753885 786737 756740 689873 632911
5133F32911k8701p988j2426l2915m8959n2406m6214m1114n0763o5568o6286m7002
$$ 632911 604210 596222 583796 550881 501922 449516 403302 362188 311425 245857 179571 132569
5121A32569j8986M322J8704J7812M102k313O26J0321K3491J9159J804o360j980
$$ 132569 113583 117905 136609 154421 158523 156210 156836 167157 190648 209807 211611 205251 203271
5108B03271M029K395j2867k1667j1914J178K4061L8007K2286P46j0802j9225k4858
$$ 203271 207300 209695 196828 175161 163247 164425 188486 226493 248779 249525 238723 219498 194640
5095A94640k3950k9309l9551l9869l2542j3608J4321L0306L2107K5494K3483K2184
$$ 194640 170690 141381 101830 61961 29419 15811 30132 60438 92545 118039 141522 163706
5083A63706J9765K5500K5581J2204l730j4021j7084j5241j7926k8071l2683l2523
$$ 163706 183471 208971 234552 246756 243026 229005 211921 196680 178754 150683 118000 85477
5071H5477k8522j5060m1K462p392j2571N21K1751K9050J6076k794o318R478L0327
$$ 85477 56955 41895 41854 44316 36924 24353 24874 46625 75675 91751 88957 82639 92117 122444
5057A22444L5057K3853K0184J8988l112l2154m0367l2624k3938j7406k0436k3562
$$ 122444 157501 181354 201538 220526 217414 185260 144893 112269 88331 70925 50489 26927
5045B6927r539J3364L7918O4941P0407L5430q295k3673j9229j3068J558R930O599
$$ 26927 17388 30752 68670 133611 204018 239448 231153 207480 188251 175183 176741 186671 193270
5032A93270N0j1934k1532j7592n022J3770L2075L7609K9235J1004p516j2934p428
$$ 193270 193320 181386 159854 142262 137240 151010 183085 220694 249929 260933 253417 240483 233055
5019B33055l201l921j600M362l737k6674l3385j2218Q397J4108J366k7889m2694
$$ 233055 229854 225933 224333 228695 224958 198284 164899 152681 161078 175186 176552 148663 105969
5006A05969k3460J10L648o42O707J9014R225k148J1968L2609M4459N0823N1155
$$ 105969 82509 82619 86267 85625 92332 111346 120571 118423 130391 163000 207459 258282 309437
4993C09437M9273L0010n644k0657o407J8269L0571K5492J3415l867k2425l4833
$$ 309437 358710 388720 383076 362419 356012 374281 404852 430344 443759 439892 417467 382634
4981C82634k8038o397P382R160Q408O253M65N548J2919O933O10M079Q752M728
$$ 382634 354596 348199 355581 364741 373149 379402 379867 385415 398334 405267 405877 409956 418708 423436
4967D23436L22R377K2798K8104K6119K5263K6001L1302M2828M6127L6353J8363
$$ 423436 423758 433135 455933 484037 510156 535419 561420 592722 635550 681677 718030 736393
4955G36393q590k4723j2428P244J3135K2961M3811N6555N8027N3134L9624K2528
$$ 736393 727803 703080 690652 697896 711031 733992 777803 834358 892385 945519 985143 1007671
4943A007671J7499L5995O5062P7754P6181P4924P2514P0210R1913J46489K17737
$$ 1007671 1025170 1061165 1126227 1203981 1280162 1355086 1427600 1497810 1589723 1736212 1953949
4932A953949K80188L25287L73952M45386N26030O23878P75244R98755J278163
$$ 1953949 2234137 2559424 2933376 3378762 3904792 4528670 5303914 6302669 7580832
4923G580832J598089J930892K194866K295693K315669K546842L141181L816982
$$ 7580832 9178921 11109813 13304679 15600372 17916041 20462883 23604064 27421046
4915B7421046L714951J760793j698452m453619n184082m547572l553144k672286
$$ 27421046 31135997 32896790 31198338 26744719 21560637 17013065 13459921 10787635
4907A0787635j988935j480197j121569r04806p79637o76725n66949m65266l79140
$$ 10787635 8798700 7318503 6196934 5292128 4512491 3835766 3268817 2803551 2424411
4898B424411k99361k37187k03160j74237j42663j23437j16468j14026j04848q8462
$$ 2424411 2125050 1887863 1684703 1510466 1367803 1244366 1127898 1013872 909024 820562
4888H20562o6385m6597m0571m1107l2026j6431j482J8867L7197K9256K037k1443
$$ 820562 754177 707580 667009 625902 593876 577445 575963 594830 632027 661283 663320 641877
4876F41877l3023k3995m314P202Q688J86j0454j159K2305L5257L3785K4620M080
$$ 641877 608854 584859 580545 587747 596435 596621 586167 585008 607313 642570 676355 700975 705055
4863G05055j9234l6260m7887n8389n7228l8799j4942L178J810q819j5183j2053
$$ 705055 685821 649561 601674 543285 486057 447258 432316 435494 437304 428485 413302 401249
4851D01249r407k0139l8684m6739l3479n827J3788J3821J0888K6021M3000M4407
$$ 401249 391842 371703 333019 286280 252801 246974 260762 274583 285471 311492 354492 398899
4839C98899L5148P520k1816k0813o495K648J1132N030j1883j8909k0023j5362
$$ 398899 434047 441567 419751 398938 392443 395091 406223 411253 399370 380461 360438 345076
4827C45076L765J9051Q850j5065l9509n7258o1782n2546k4642J4319M4254O1730
$$ 345076 348841 367892 376742 361677 322168 264910 203128 150582 125940 140259 184513 246243
4815B46243P0566N9405L2579K1789K8511K4323j203l8850o2114n2505l3063k5088
$$ 246243 316809 376214 408793 430582 459093 483416 482213 443363 381249 328744 295681 270593
4803B70593k5782l1210k6575q925Q903K4548K6274J8383J6165J5312J5973R314
$$ 270593 244811 213601 187026 178101 187004 211552 237826 256209 272374 287686 303659 312973
4791C12973Q25N953J2330J5033K0527K4597K0470Q05r503O838K0659J8821J5339
$$ 312973 313798 319751 332081 347114 367641 392238 412708 413513 404010 410848 431507 450328 465667
4778D65667J7727J6094l931k4135l1450l1118j5805K669Q006Q098P027J217q610
$$ 465667 483394 499488 495557 471422 439972 408854 393049 395718 403724 411822 418849 420066 411456
4765D11456j5052o915J0741J6845Q805R040J7333K541l4265n6847n0873l7880
$$ 411456 396404 389489 400230 417075 425880 434920 452253 454794 420529 363682 312809 274929
4753B74929k2285J098J5289J3706J4267J4645L989p570m210J2921K6946L8423
$$ 274929 252644 253742 269031 282737 297004 311649 315638 308068 303858 316779 343725 382148
4741C82148N1439O2545O8096O1774O1563P4246P6449M1213j8494m7058l3985j8472
$$ 382148 433587 496132 564228 626002 687565 761811 838260 879473 860979 813921 779936 761464
4729G61464j0537N097K6518L1261J2166q552k6223m9058o9704p6572n8922k7331
$$ 761464 750927 756024 782542 813803 825969 817417 791194 742136 672432 595860 536938 509607
4717E09607M102J9278Q934R91Q526J2490M367o568j3016j8814l0266l9714l7417
$$ 509607 513709 532987 541921 542912 551438 563928 568295 561727 548711 529897 499631 459917 422500
4704D22500j9121N751J8379J8473J1378K297m523r437q858P916L8706N7500M5262
$$ 422500 403379 409130 427509 445982 457360 459657 455134 445697 436839 444755 483461 540961 586223
4691E86223J2321j3963j8557j1928J954J7399J4223k059j3036k9722m5655m4788
$$ 586223 598544 584581 566024 554096 556050 573449 587672 585613 572577 542855 497200 452412
4679D52412k4086j611J997q8M134J1110J2802m136l1051m2561k6436M528K4325
$$ 452412 428326 426715 428712 428624 432758 443868 456670 452534 421483 378922 352486 357014 381339
4666C81339L1372M0896M7070L6950L2255L5498K8062J3753o156k5251k1938j0923
$$ 381339 412711 453607 500677 537627 569882 605380 633442 647195 641039 615788 593850 582927
4654E82927p156L961J9810L0894M0375M4559L9946K7867J0987K803P193J0658
$$ 582927 575771 579732 599542 630436 670811 715370 755316 783183 794170 796973 804166 814824
4642H14824R424N334m513q625p358r623r234N918L1113N4872O6289O9848Q0560
$$ 814824 824248 829582 825069 816444 809086 799463 790229 796147 827260 882132 948421 1018269 1098829
4629A098829R1813R7706J15603J50402K01030K63487K97273K53017R8982j13595
$$ 1098829 1190642 1288348 1403951 1554353 1755383 2018870 2316143 2569160 2668142 2554547
4619B554547k68209l09269k67282j87497j13534o7248m2922l9465n0491n4313
$$ 2554547 2286338 1977069 1709787 1522290 1408756 1341508 1298586 1259121 1208630 1154317
4609A154317n1543o0322o7308o1021n5140m4139k6817j5242o726m234l131N426
$$ 1154317 1102774 1042452 975144 914123 858983 814844 788027 772785 766059 761825 758694 764120
4597G64120J8400K1714J2728J4803K3025Q843k4143n2660n5105m4008m3885m8865
$$ 764120 782520 804234 816962 831765 854790 863633 839490 786830 731725 687717 643832 594967
4585E94967m9134m9278m0435j9103o580j1127j3572J252K9025M1895K3341R35
$$ 594967 545833 496555 456120 437017 430437 419310 405738 406990 436015 477910 501251 502186
4573E02186N759K0334K2112K1772K6817K6277K2461K1530J2652J31N845K0038
$$ 502186 507945 528279 550391 572163 598980 625257 647718 669248 681900 682031 687876 707914
4561G07914K6237K1143J939j8328l0666k8073o387J3654J2700m145j7835j5339
$$ 707914 734151 755294 757233 738905 708239 680166 673779 687433 700133 695988 678153 662814
4549F62814P053L4965N3262N5121M5791L5925J8921j154l074R110J8775J7881
$$ 662814 669867 704832 758094 813215 859006 894931 913852 912698 909624 918734 937509 955390
4537I55390L42l0006m3734k6428J365K4249K7998J5960O602J5843M3307N6172
$$ 955390 955732 925726 881992 855564 856929 881178 909176 925136 931738 947581 990888 1047060
4525A047060M6582M7378N5612O0297O3609N4840L8454L4012M3691N4732O0390
$$ 1047060 1093642 1141020 1196632 1256929 1320538 1375378 1413832 1447844 1491535 1546267 1606657
4514A606657N7613M7378M8127O2373P1927Q3506J11983J35243J40628J46782J57130
$$ 1606657 1664270 1711648 1759775 1822148 1894075 1977581 2089564 2224807 2365435 2512217 2669347
4503B669347J76774K12876K61063L17843L67876L85225L28168J60772o0684k04532
$$ 2669347 2846121 3058997 3320060 3637903 4005779 4391004 4719172 4879944 4819260 4614728
4493D614728k16313j44266n4760K2059R5566J64735K13121K38242K58717K83057
$$ 4614728 4398415 4254149 4199389 4221448 4317014 4481749 4694870 4933112 5191829 5474886
4483E474886L12256L54241M05803M54783N06378N71203O43952P16858Q11252R46428
$$ 5474886 5787142 6141383 6547186 7001969 7508347 8079550 8723502 9440360 10251612 11198040
4473A1198040J110764J310004J566043J874549K221974K634779L153188L810686
$$ 11198040 12308804 13618808 15184851 17059400 19281374 21916153 25069341 28880027
4465B8880027M639038N652488O864673Q334115J0163906J2511042J5587909J9626779
$$ 28880027 33519065 39171553 46036226 54370341 64534247 77045289 92633198 112259977
4457A12259977K4963768L2094109M1429110N2045408N8542789M9330770J6720867
$$ 112259977 137223745 169317854 210746964 262792372 321335161 370665931 387386798
4450C87386798k6671876n6158703o1927244n3122626m1029766l0664584k2909177
$$ 387386798 360714922 304556219 242628975 189506349 148476583 117811999 94902822
4443I4902822j7332718j3329679j0414760q260782o644347n405307m442115l676629
$$ 94902822 77570104 64240425 53825665 45564883 38920536 33515229 29073114 25396485
4435B5396485l054459k558501k167568j851538j587722j369466j192613j038963
$$ 25396485 22342026 19783525 17615957 15764419 14176697 12807231 11614618 10575655
4427A0575655r00804p91417o87526n76699m82970m18396l87150l81197l60817
$$ 10575655 9674851 8883434 8195908 7619209 7136239 6717843 6330693 5949496 5588679
4418E588679l26152l02617k74628k29161j83675j59359j52774j37172j16410r7956
$$ 5588679 5262527 4959910 4685282 4456121 4272446 4113087 3960313 3823141 3706731 3608775
4408C608775o1291J550P4058J44765J86819J39582l2935k59470m05192m22738
$$ 3608775 3547484 3549034 3623092 3767857 3954676 4094258 4061323 3801853 3396661 2973923
4398B973923l66633k89749k15398j60696j40643j27559j01017p2014n6264n6646
$$ 2973923 2607290 2317541 2102143 1941447 1800804 1673245 1572228 1500214 1443950 1387304
4388A387304o2350o5435o5306o3236m5321j0390M611j2391l7692n3725n6594l6620
$$ 1387304 1324954 1259519 1194213 1130977 1085656 1075266 1079877 1067486 1029794 976069 919475 882855
4376H82855l219J4527P01k3177k9658k4615k2054k5982l9811m5513l4310j2738
$$ 882855 879636 894163 894864 871687 842029 817414 795360 769378 729567 684054 649744 637006
4364F37006J0431J3385L365l815j4539k6732j4532J3134K0166O484o225j4627
$$ 637006 647437 660822 664187 660372 645833 619101 604569 617703 637869 644353 638128 623501
4352F23501k8745m2445m2109k2534p694j2391j3887k197J1190J6110R308N226
$$ 623501 594756 552311 510202 487668 479974 467583 453696 451499 462689 478799 488107 493333
4340D93333K572K654Q037L062j5742l3999l4339k0168p288M294K3576M4881N5993
$$ 493333 495905 498559 506596 509658 493916 459917 425578 405410 398122 402416 425992 470873 526866
4327E26866M3126J2697r869j6350p656O430K1942K9016J2539k0648n1360n4088
$$ 526866 569992 582689 572820 556470 548814 555244 577186 606202 618741 598093 546733 492645
4315D92645k6484k618L898k979j6642k1099m707J5536K4074K2053Q193n976j2442
$$ 492645 466161 463543 467441 464462 447820 426721 422014 437550 461624 483677 491870 485894 473452
4302D73452k7177m9564n5169l9835k3648j4990j1521k1463l0762k2015p144M508
$$ 473452 446275 396711 341542 301707 278059 263069 251548 230085 199323 177308 170164 174672
4290A74672J5508J8991J2500M076q427j0001O930J9999J0120q48R1j63j2868k9730
$$ 174672 190180 209171 221671 225747 217320 207319 214249 234248 244368 243520 243611 243448 230580 200850
4276B00850l0273q900J3076J4646M121O7j458o932l127N124L799m953o185J461
$$ 200850 170577 161677 174753 189399 193520 193587 192129 185197 182070 187194 190993 186040 179855 181316
4262A81316O961J2115J0040k326k4522n6560o4915l9875j5811j0252k1051k9434
$$ 181316 188277 200392 210432 208106 183584 127024 62109 22234 6423 -3829 -24880 -54314
4250e4314j3883Q512K6984N0757O7589O1099M2650K3386M917n71J5950L0619J2331
$$ -54314 -68197 -59685 -32701 18056 85645 146744 189394 212780 217697 217126 233076 263695 276026
4237B76026j7597l4517l5021j8037P315K1472K3699K3164J9323o859m3483n8820
$$ 276026 258429 223912 188891 170854 178169 199641 223340 246504 265827 258968 215485 156665
4225A56665o0444o0046m9381l8664l6758l3335k6200j7374n811K087J639j343
$$ 156665 96221 36175 -13206 -51870 -88628 -121963 -148163 -165537 -171348 -169261 -167622 -168965
4213a68965K175J7179L8316N5488O4126O6472N6242L2819J2909K791j1487k5533
$$ -168965 -166790 -149611 -111295 -55807 8319 74791 131033 163852 176761 179552 168065 142532
4201A42532k4346j3587m136n589j4513o037K3035M0531K8790O132p739j4987k2966
$$ 142532 118186 104599 100463 94874 80361 74324 97359 137890 166680 172812 165073 150086 127120
4188A27120j9194j1206j3345j2606p923r128o675N651J3122Q802J279n031l315
$$ 127120 107926 96720 83375 70769 62846 53718 47043 52694 65816 74618 75897 70866 67551
4175F7551M986L633j2783l9281n3307l7686j1826l871n705N841K7373K7158N904
$$ 67551 72537 76170 63387 24106 -29201 -66887 -78713 -82584 -88289 -82448 -55075 -27917 -22013
4162b2013K0J6961K7028J9762J4778J7770R690j8758l8515k7979J897J7001J9731
$$ -22013 -21993 -5032 21996 41758 56536 74306 83996 65238 26723 -1256 641 17642 37373
4149C7373K8614L1365K9865L2736L0390O236l0537n2304n3039m7915m5805l3422
$$ 37373 65987 97352 127217 159953 190343 196579 166042 113738 60699 12784 -33021 -66443
4137f6443j2060p80O290J7468K4013K2438K0330K4785L1908L5503M4115M8110
$$ -66443 -78503 -79283 -72993 -55525 -31512 -9074 11256 36041 67949 103452 147567 195677
4125A95677K2997j1873l6691m8458n0004m0360j4916K2452L9446K9570J8505J2807
$$ 195677 218674 206801 170110 121652 71648 31288 16372 38824 78270 107840 126345 139152
4113A39152J0929Q655M306J130q430k9865l7167k6217k0077k0166k3269k4674
$$ 139152 150081 158736 163042 164172 155742 125877 88710 62493 42416 22250 -1019 -25693
4101b5693k4873k3152j7269L626L6798N5889M0251J0125J402Q418J0093J2858
$$ -25693 -50566 -73718 -90987 -87361 -50563 5326 45577 55702 57104 65522 75615 88473
4089H8473J2213L418q198j3297o074O073J1963J0725J446j7061k1837p950N095
$$ 88473 100686 104104 95906 82609 76535 82608 94571 105296 106742 89681 67844 59894 64989
4076F4989J0555Q385P574J6773K6960L9460M1171K0092j0180k7974k0192L30J5988
$$ 64989 75544 83929 91503 108276 135236 174696 215867 235959 225779 197805 177613 177943 193931
4063A93931J9956J2930k846k2342l8390m4259l8435k6439k5107k9782k4804j2176
$$ 193931 213887 226817 223971 201629 163239 118980 80545 54106 28999 -783 -25587 -37763
4051c7763Q75J6260L4642M2191K9281k167l6038l6132L06K2147Q803j2738k3784
$$ -37763 -36888 -20628 14014 56205 85486 83319 47281 11149 11455 33602 42405 29667 5883
4038E883k4431m743K4611L1124K0890J5970K2266J8614n296k1264l2124m8252
$$ 5883 -18548 -23291 1320 32444 53334 69304 91570 110184 104888 83624 51500 3248
4026C248m1339p313J9224J0245r573j1600J3133M4534N1253M3279L0497J3668
$$ 3248 -38091 -45404 -26180 -15935 -25508 -37108 -23975 20559 71812 115091 145588 159256
4014A59256k659j2957r112J942J078r101r270r511j8240j9382p976P895K9137
$$ 159256 156597 143640 134528 136470 137548 128447 119177 109666 91426 72044 64068 71963 101100
4001A01100O0908R2459R7092N3440j079k5363j5850J382n714k1041j6301n490
$$ 101100 162008 254467 351559 404999 403920 378557 362707 364089 358375 337334 321033 315543
3989C15543o378j3373k0914k6570l3648m5172n9975p0112o3201l6517N652M5775
$$ 315543 309165 295792 274878 248308 214660 169488 109513 39401 -23800 -60317 -54665 -8890
3977h890N7928L5976L850o652K625J3950J5835o209l6850l5754j3005O579J5745
$$ -8890 49038 85014 88864 82212 84837 98787 114622 108413 71563 35809 22804 29383 45128
3964D5128J1862R90k572O391J9607K0384J4013J1802P773N976J789r598k3282
$$ 45128 56990 57980 55408 61799 81406 101790 115803 127605 135378 141354 143143 133545 110263
3951A10263k9402k1808m380P605J3930J6604J0949J0215R018J238k673o129j3863
$$ 110263 80861 59053 54673 62278 76208 92812 103761 113976 122994 124232 121559 115430 101567
3938A01567j5000q474o447q533r772o975j6725l6348l3568k2711j8212m420J1480
$$ 101567 86567 78093 71646 63113 53341 46366 29641 -6707 -40275 -62986 -81198 -85618 -74138
3925g4138L0278M5661M1686J4080j2042j6083M740K9647L5953K1992q469k7484
$$ -74138 -43860 1801 43487 57567 45525 29442 34182 63829 99782 121774 113305 85821
3913H5821r257J2657P286j975k574n515k0774l2978k6408k652J9567K9482L9477
$$ 85821 76564 89221 96507 94532 91958 86443 65669 32691 6283 3631 23198 52680 92157
3900I2157L7214J7203N969J1880J0320n268k0724k0422j5052k9329n2400n2288
$$ 92157 129371 146574 152543 164423 174743 169475 148751 128329 113277 83948 31548 -20740
3888b0740l3295j8061j3530p825l105p903j0324R1K8958O6769Q1605N5495J4646
$$ -20740 -54035 -72096 -85626 -93451 -96556 -104459 -114783 -114692 -85734 -18965 62640 118135 132781
3875A32781n580j3211j3285J885K055k2545l3860k7818l1472m6477n5173m1696
$$ 132781 127201 113990 100705 102590 104645 82100 48240 20422 -11050 -57527 -112700 -154396
3863a54396j6059J896J5931L1365K9757J1932J392R110K6486L4305J5791j0465
$$ -154396 -170455 -168559 -152628 -121263 -91506 -79574 -78182 -69072 -42586 -8281 7510 -2955
3851b955j7964j5071j6373j5446r978O317K9915L1424J6324O262N157J3138K2436
$$ -2955 -20919 -35990 -52363 -67809 -77787 -71470 -41555 -10131 6193 12455 17612 30750 53186
3838E3186J8155l09j1270J704J1828l238k0138l4033m7121m1383k1612j1624j3567
$$ 53186 71341 71032 59762 61466 73294 70056 49918 15885 -31236 -72619 -94231 -105855 -119422
3825a19422m485K3724M7040M1892J5468q771j5509j1584j2609j9614k2393j4882
$$ -119422 -123907 -100183 -53143 -11251 4217 -4554 -20063 -31647 -44256 -63870 -86263 -101145
3813a01145j1576j3985r297l144J816J1325K6490L7005K6865J2240J7120K4427
$$ -101145 -112721 -126706 -136003 -139147 -137331 -126006 -99516 -62511 -35646 -23406 -6286 18141
3801A8141J1617n393m706O016J3039Q527J95J5573M9938N6104K3412k0882m5714
$$ 18141 29758 24365 19659 25675 38714 47241 47436 63009 112947 169051 192463 171581 125867
3788A25867l4863j1513R82P221O492N024J6401L1755K9603J3280j461q125j0105
$$ 125867 91004 79491 80473 87694 94186 99210 115611 147366 176969 190249 188788 180663 170558
3775A70558j3320j9361j8782j9081l3534m5208m0739k7868j6876j1823j4076k2015
$$ 170558 157238 137877 119095 100014 66480 21272 -19467 -47335 -64211 -76034 -90110 -112125
3763a12125k6485k6069j8931l780l846j3890r290J1017L0003M0227M1033K8759
$$ -112125 -138610 -164679 -183610 -187390 -191236 -205126 -214416 -203399 -173396 -133169 -92136 -63377
3751f3377P706j6444l3988l8067k3133m850O843J7086L2735M1680K8945Q562l279
$$ -63377 -55671 -72115 -106103 -144170 -167303 -172153 -165310 -148224 -115489 -73809 -44864 -36302 -39581
3738c9581r570j1879k329J8200M4133N5271M0109K0963Q844o475k1760l4071l7506
$$ -39581 -49151 -61030 -63359 -45159 -1026 54245 94354 115317 124161 117686 95926 61855 24349
3725B4349l5045k9416j9330q105k467m884p309L260J6284Q816j2355k5595k6238
$$ 24349 -10696 -40112 -59442 -67547 -70014 -74898 -82207 -78947 -62663 -53847 -66202 -91797 -118035
3712a18035j6968m788K767N088O053J3157K1103J5952J5959L2463M0333L4824
$$ -118035 -135003 -139791 -137024 -131936 -125883 -112726 -91623 -75671 -59712 -27249 13084 47908
3700D7908K1713L545j3800l1178l4181k1197l029P167Q256P339j658q053k005
$$ 47908 69621 73166 59366 28188 -5993 -27190 -30219 -23052 -14796 -7457 -9115 -17168 -19173
3687a9173K85j5632k5413j5871m386J055L47o431j4720j7429j4625o013N148J5446
$$ -19173 -18888 -34520 -59933 -75804 -80190 -79135 -78788 -85219 -99939 -117368 -131993 -138006 -132858 -117412
3673a17412P231k4574m5335l8822k7089j5467M684K3168M2705O1001N6684K8774
$$ -117412 -110181 -134755 -180090 -218912 -246001 -261468 -256784 -233616 -190911 -129910 -73226 -44452
3661d4452n145k6284j8027J3322M1812N2418L8022N060j8587k6768k4377k4267
$$ -44452 -49597 -75881 -93908 -80586 -38774 13644 51666 56726 38139 11371 -13006 -37273
3649c7273l4628l5415j7357O889J9984J5325L225J652J0129J7080J7608N406j7638
$$ -37273 -71901 -107316 -124673 -117784 -97800 -82475 -79250 -77598 -67469 -50389 -32781 -27375 -45013
3636d5013l3159l6760k8107n548J3174J0929n661k0454j8352P851K9814K7301
$$ -45013 -78172 -114932 -143039 -148587 -135413 -124484 -130145 -150599 -168951 -161100 -131286 -103985
3624a03985J7640J5938K0282K4365K8662K4010N369q334j5438k1178j2611O725
$$ -103985 -86345 -70407 -50125 -25760 2902 26912 32281 23947 8509 -12669 -25280 -18555
3612a8555K5691M0436L8136J7949k37j0106k5861m2520l6213j3918j239m842j5457
$$ -18555 7136 47572 85708 103657 103420 93314 67453 24933 -11280 -25198 -26437 -31279 -46736
3599d6736j2298J0846K8368K5070J2587J271m540r671j7623k6865l1331l3019
$$ -46736 -59034 -48188 -19820 5250 17837 19108 14568 4897 -12726 -39591 -70922 -103941
3587a03941l2811l0289k9612k0592m736J3029K7105L0323J8183k417j0484k839
$$ -103941 -136752 -167041 -196653 -217245 -221981 -208952 -181847 -151524 -133341 -135758 -146242 -149081
3575a49081P499K0222K5549K2040K5453K7651L447l2511l7979q057J6156J0049
$$ -149081 -141582 -121360 -95811 -73771 -48318 -20667 -17220 -49731 -87710 -95767 -79611 -69562
3563f9562r479k4208j8613J385J2038K0866L9001N3071M4311K2512J0863J4507
$$ -69562 -79041 -103249 -121862 -120477 -108439 -87573 -48572 4499 48810 71322 82185 96692
3551I6692L4891Q4787J58340J89822R1936j05032k36630k20337j20897j5374L9737
$$ 96692 131583 216370 374710 564532 656468 551436 314806 94469 -26428 -41802 -2065
3540b065L3883M561r213j1479j9420k2317k1812k0353j1426N450K1108K2419J5410
$$ -2065 31818 36379 27166 15687 -3733 -26050 -47862 -68215 -79641 -74191 -53083 -30664 -15254
3527a5254P559P849R884M042p43J599J6207L3588L6770J7538j3136l2735l4719
$$ -15254 -7695 154 10038 14080 13337 14936 31143 64731 101501 119039 105903 73168 38449
3514C8449k5708k1262l3658m4963l5669q132J4707K1985J6504R476J0243J1699
$$ 38449 12741 -8521 -42179 -87142 -122811 -130943 -116236 -94251 -77747 -68271 -58028 -46329
3502d6329M885l178k345J4621L9786M6730K7499N498j921m009j999J4163K2621
$$ -46329 -41444 -44622 -46967 -32346 7440 54170 81669 87167 85246 81237 79238 93401 116022
3489A16022P232j3557j6930j1018j0269j4104k2098k3512j4122l717m648j9375
$$ 116022 123254 109697 92767 81749 71480 57376 35278 11766 -2356 -6073 -10721 -30096
3477c0096k4634r693J4570K7861K3826K0020K0843R649q443j5571r206N727J6615
$$ -30096 -54730 -64423 -49853 -21992 1834 21854 42697 52346 43903 28332 19126 24853 41468
3464D1468J1519k925o657N788K4740K6972J0882p580k6291m5573n6972m6465k8442
$$ 41468 52987 50062 43405 49193 73933 100905 111787 104207 77916 32343 -24629 -71094 -99536
3451i9536j9701k1862j8662m191R738K5703M4851M5906J9612m512r757l458R94
$$ -99536 -119237 -141099 -159761 -163952 -154214 -128511 -83660 -37754 -18142 -22654 -32411 -35869 -34875
3438c4875Q03M626K818j2812k4326k7491k5779n184J8385K2714J2284K872m801
$$ -34875 -34072 -29446 -26628 -39440 -63766 -91257 -117036 -122220 -103835 -81121 -68837 -65965 -70766
3425g0766j3539p813O598J4335J2490N783J641J536J3991K0668J695j7326j4395
$$ -70766 -84305 -92118 -85520 -71185 -58695 -52912 -51271 -49735 -35744 -15076 -13381 -30707 -45102
3412d5102p81J0014J0097R10r305j6308j7010l504J8998K3252O510j9409l9723
$$ -45102 -45883 -35869 -25772 -24862 -34167 -50475 -67485 -70989 -51991 -28739 -22229 -41638 -81361
3399h1361l1378L270K5943K1278O251q122j8149j7205r923q501r025k089R763
$$ -81361 -112739 -109469 -83526 -62248 -55997 -64119 -82268 -99473 -109396 -117897 -126922 -129011 -119248
3386a19248J7698J7157J8818L1863M1182L8969K5922J030k0029k6692k1144j2203
$$ -119248 -101550 -84393 -65575 -33712 7470 46439 72361 73391 53362 26670 5526 -6677
3374f677j5964l2457l5790k2397j1115o115M576K0229J3454j2070k1742j2554
$$ -6677 -22641 -55098 -90888 -113285 -124400 -130515 -125939 -105710 -92256 -104326 -126068 -138622
3362a38622j170K358M824J5790J5994Q66j971J7261L4029K0813J221J0847M1742
$$ -138622 -139792 -137434 -132610 -116820 -100826 -99960 -101931 -84670 -50641 -29828 -28607 -17760 23982
3349B3982N1605K8114n669k7402k6839j9223j5239O04K2734L0122K2706L106k4719
$$ 23982 75587 103701 98032 70630 43791 24568 9329 9933 32667 62789 85495 88601 63882
3336F3882m4862m5224k5416O214K3239J1356q950j5636p104O078K738j7962k2894
$$ 63882 19020 -26204 -51620 -45406 -22167 -10811 -19761 -35397 -42501 -36423 -33685 -51647 -74541
3323g4541r07J6516K0654K4900K4449J1178o871p443P033J8231J2484m578q917
$$ -74541 -75448 -58932 -38278 -13378 11071 22249 15378 7935 14968 33199 45683 41105 32188
3310C2188l285m086n337J2562K6153J1078p469q223k716o611j7121k7134k8901
$$ 32188 28903 24817 19480 32042 58195 69273 61804 53581 50865 44254 27133 -1 -28902
3297b8902j5828O649J5640K623j6374k0089k3922l1104j6426J3447L3990L8083
$$ -28902 -44730 -38081 -22441 -19818 -36192 -56281 -80203 -111307 -127733 -114286 -80296 -42213
3285d2213L6645K6409N530m791o301j5755k0654j4808j0533k2279m1039m6193
$$ -42213 -5568 20841 26371 21580 15279 -476 -21130 -35938 -46471 -68750 -109789 -155982
3273a55982l6918k4291j6472r977m445M107K1475L8252M0226J7652j5641l4870
$$ -155982 -192900 -217191 -233663 -243640 -248085 -243978 -222503 -184251 -144025 -126373 -142014 -176884
3261a76884k9816j0646J965N144L295o34l253L140J1474P552R829K5858L7033
$$ -176884 -206700 -217346 -215381 -210237 -206942 -207576 -210829 -207689 -196215 -188663 -178834 -152976 -115943
3248a15943M1460M1997L5047K3063J6011J3663m52j9953k7050k3112j5708m29
$$ -115943 -74483 -32486 2561 25624 41635 55298 54846 34893 7843 -15269 -30977 -31406
3236c1406J9274J6938l927p121J1920J1353j5732l6281l5150k3434k4245m2144
$$ -31406 -12132 4806 879 -6242 5678 17031 1299 -34982 -70132 -93566 -117811 -159955
3224a59955m2696r329K6112L3206K1651O909m609L039L3628O2243O1211M1933
$$ -159955 -202651 -211980 -185868 -152662 -131011 -124102 -128711 -125672 -92044 -29801 31410 73343
3212G3343K5421J0833q488k5868l2503m0376m9720l8135j8506j1109p761M468
$$ 73343 98764 109597 101109 75241 42738 2362 -47358 -85493 -103999 -115108 -122869 -118401
3200a18401J4753M231j1108r883J2138K6058K3477K5183K7468J7395L683m751
$$ -118401 -103648 -99417 -110525 -120408 -108270 -82212 -58735 -33552 -6084 11311 14994 10243
3188A0243j963J3409K3592J8083P130j41o485j2782j7094j4763j3109j4761j6358
$$ 10243 8280 21689 45281 63364 70494 70353 63868 51086 33992 19229 6120 -8641 -24999
3175b4999k0306k1226j0820J504Q8r114p811J2220M3615N2732K2019o495k241
$$ -24999 -45305 -66531 -77351 -75847 -75759 -84873 -92684 -80464 -36849 15883 37902 31407 29166
3162B9166L510n068j3676j8761j1027J119l474j3820k1342k3891j3211M782J8097
$$ 29166 32676 27608 13932 -4829 -15856 -14737 -18211 -32031 -53373 -77264 -90475 -85693 -67596
3149f7596J1062j3254k7467k0366q854N42R316P727J646r719k2210j8562p589
$$ -67596 -56534 -69788 -97255 -117621 -126475 -125933 -116617 -108890 -107244 -116963 -139173 -157735 -165324
3136a65324l119J299J2877K1082J9730J1712M085N282P102R070J7281J6917N150
$$ -165324 -168443 -167144 -154267 -133185 -113455 -101743 -97658 -92376 -85274 -76204 -58923 -42006 -36856
3123c6856j1178k5453k7873j9067N370K9015L0558J6928R557O519m126k1839l9077
$$ -36856 -48034 -73487 -101360 -120427 -115057 -86042 -55484 -38556 -28999 -22480 -26606 -48445 -87522
3110h7522m6345l2254j5365j8309l2865l4240j7778l380o224l9875q7964j13984
$$ -87522 -133867 -166121 -181486 -199795 -232660 -266900 -284678 -288058 -294282 -334157 -422121 -536105
3098e36105j10460q3403j9408J04490K23347K33477J43997N1622k342l0191l0844
$$ -536105 -646565 -729968 -749376 -644886 -421539 -188062 -44065 7557 5215 -24976 -55820
3087e5820r990J0091K6679L9275L1726R600q470j4134r008L060J4243J6910Q089
$$ -55820 -65810 -55719 -29040 10235 41961 51561 43091 28957 19949 23009 37252 54162 62251
3074F2251J134K193l583k2256l9603m5018l6298k1653q306k513j3085k7903l7163
$$ 62251 63385 65578 61995 39739 136 -44882 -81180 -102833 -111139 -113652 -126737 -154640 -191803
3061a91803l0914j7108q668M271J3482P566j70L544J5032K1616K9061M2317M7682
$$ -191803 -222717 -239825 -248493 -244222 -230740 -223174 -223344 -219800 -204768 -183152 -154091 -111774 -64092
3048f4092K9328l937k0989k2412k3002k3333k1396r478J9652M3875L6734J2185
$$ -64092 -34764 -38701 -59690 -82102 -105104 -128437 -149833 -159311 -139659 -95784 -59050 -46865
3036d6865Q89J3920K8878L9973M1677K0758k051k0167k2557m139R34j3096k1352
$$ -46865 -45976 -32056 -3178 36795 78472 99230 97179 77012 54455 50316 51250 38154 16802
3023A6802q717L017q436k4524k4097j1048L094J0036P560N540l121k2018l6330
$$ 16802 8085 11102 2666 -21858 -45955 -57003 -53909 -43873 -36313 -30773 -33894 -55912 -92242
3010i2242k2272J6755L8963L6756L5098L0177J5365Q07q061k794O763r11j5103
$$ -92242 -114514 -97759 -58796 -22040 13058 43235 58600 59407 51346 48552 55315 54404 39301
2997C9301j7563j7036j3450N502K9193L8129L9279M2459M6191M7625L7215J1139
$$ 39301 21738 4702 -8748 -3246 25947 64076 103355 145814 192005 239630 276845 287984
2985B87984k5310m8473m9081m4749m4839m8454m8548l3293j2983j161l534r166
$$ 287984 262674 214201 165120 120371 75532 27078 -21470 -54763 -67746 -68907 -72441 -81607
2973h1607o575R342K9460L5253K0953k022l1565n3232m5646j7439J6978L6835
$$ -81607 -88182 -78840 -49380 -14127 6826 4804 -26761 -79993 -125639 -143078 -126100 -89265
2961h9265K9808J2891P05p892j1677j1843j3210j1149j631P185Q586J6059L5669
$$ -89265 -59457 -46566 -45861 -53753 -65430 -77273 -90483 -101632 -103263 -96078 -87492 -71433 -35764
2948c5764N0883L7679N834r886o422o773j6888k2212o856N738r534l6422m9751
$$ -35764 15119 52798 58632 48746 42324 35551 18663 -3549 -10405 -4667 -14201 -50623 -100374
2935a00374l6029p263J5954K7124J9065J617j0909j5362j2174m126R806K3102
$$ -100374 -136403 -143666 -127712 -100588 -81523 -79906 -90815 -106177 -118351 -122477 -112671 -89569
2923h9569K9470K7454K3899K8105L3858K8504M076k8523l5691j4698P476N720
$$ -89569 -60099 -32645 -8746 19359 53217 81721 85797 57274 21583 6885 14361 20081
2911B0081p925j2575j0140p714n749m124k151J839L613n790j3925o216J3080L4035
$$ 20081 12156 -419 -10559 -18273 -24022 -28146 -30297 -28458 -24845 -30635 -44560 -50776 -37696 -3661
2897c661M4303L1921K085k2432l1713k6688j7718r357n07O586L668j8506m4021
$$ -3661 40642 72563 74648 52216 20503 -6185 -23903 -33260 -33767 -27181 -23513 -42019 -86040
2884h6040m5821k4157J178P691n988j1566J2920M5378N7823N2943M6827L9263
$$ -86040 -131861 -156018 -154840 -147149 -153137 -164703 -151783 -106405 -48582 4361 51188 90451
2872I0451K7206J5489J990j4365j9127m011J4332J7133J664k2407m5824n7379
$$ 90451 117657 133146 135136 120771 101644 97633 111965 129098 130762 108355 62531 5152
2860E152l9804j5424k462P382J0744R206J4313K0332O739k0634l5735k9886k2555
$$ 5152 -34652 -50076 -52538 -45156 -34412 -25206 -10893 9439 16178 -4456 -40191 -70077 -92632
2847i2632k3989k7845l1089l0582k0718k660J4654K7904L9696M1077K8124J7471
$$ -92632 -116621 -144466 -175555 -206137 -226855 -229515 -214861 -186957 -147261 -106184 -78060 -60589
2835f0589J8588J1930r181k4178l0937l5853l4136k6737j5105J786J6885K3666
$$ -60589 -42001 -30071 -39252 -63430 -94367 -130220 -164356 -191093 -206198 -204412 -187527 -163861
2823a63861K8402L8086M4601L4792J1077j6962l6548l5824k1624n204R900J6780
$$ -163861 -135459 -97373 -52772 -17980 -6903 -23865 -60413 -96237 -117861 -123065 -113165 -96385
2811i6385J2331K0283M6763O1057M9548K8961J0869j4571m5692o2613o1247m2153
$$ -96385 -84054 -63771 -17008 44049 93597 122558 133427 118856 73164 10551 -50696 -92849
2799i2849j5376k710k18J0332K4785K2317O928m932l064P985P620k78p917n992
$$ -92849 -108225 -110935 -111153 -100821 -76036 -53719 -46791 -51723 -54787 -46802 -39182 -39460 -47377 -53369
2785e3369N652K868j0583k6129k8472o713J8592L3415L5944L5667L2419J5887
$$ -53369 -47717 -44849 -55432 -81561 -110033 -116746 -98154 -64739 -28795 6872 39291 55178
2773E5178m650j4475j2409j3445n470J4575J7152K9j2362j3517j5259j6800m425
$$ 55178 50528 36053 23644 10199 4729 19304 36456 36485 24123 10606 -4653 -21453 -25878
2760b5878J8711K8899J2883q729j7256j9598k0035q479P481Q668m088k0995j8045
$$ -25878 -7167 21732 34615 25886 8630 -10968 -31003 -39482 -32001 -23333 -27421 -48416 -66461
2747f6461P312L3983L7033M537j7186n424Q662J1395J1496R233P026K321p724
$$ -66461 -59149 -25166 11867 16404 -782 -6206 2456 13851 25347 34580 41606 43927 36203
2734C6203j6243j0329J760m48j4134k6557k9825l1174l4429l4492k6787l705J9213
$$ 36203 19960 9631 11391 10943 -3191 -29748 -59573 -90747 -125176 -159668 -186455 -190160 -170947
2721a70947K4383J3304M749J0330K0235K4682K1166R792p375k1029j9012m535
$$ -170947 -146564 -133260 -128511 -118181 -97946 -73264 -52098 -42306 -49681 -70710 -89722 -94257
2709i4257K102M50O776J3152K671j6377k2323j2116O526K8943M6008M6871L0554
$$ -94257 -92155 -91705 -84929 -71777 -69106 -85483 -107806 -119922 -113396 -84453 -38445 8426 38980
2696C8980J1700J407m224p758j8750l1407k5144o421O880R232O12j7569k6416
$$ 38980 50680 52087 47863 40105 21355 -10052 -35196 -41617 -34737 -25505 -24893 -42462 -68878
2683f8878j2567M00r393j3806N615J7093L812j3684j8702j8424k0364k2136j2429
$$ -68878 -81445 -81045 -90438 -104244 -98629 -81536 -77724 -91408 -110110 -128534 -148898 -171034 -183463
2670a83463J3964L8014L9193K1406K965K312K2369M0249M1484M1555M5569L2368
$$ -183463 -169499 -131485 -92292 -70886 -67921 -65609 -43240 -2991 38493 80048 125617 157985
2658A57985R431M387J606j6915m1883n3727l8460j2221M584j188k3973m0055l9983
$$ 157985 167416 171803 173409 156494 114611 60884 22424 10203 14787 13599 -10374 -50429 -90412
2645i0412j6007L4078P8171P7264L2963p424j5341q048q88J1313K3963K0494N987
$$ -90412 -106419 -72341 5830 83094 116057 108633 93292 85244 84356 95669 119632 140126 146113
2632A46113P074J3549n925l6880m6167l6636l2605l8176l7422k7488j6554o625
$$ 146113 153187 166736 160811 123931 77764 41128 8523 -29653 -67075 -94563 -111117 -117742
2620a17742L530P265R408J9737L6453M4779L3420J4150j149m260p880k1790k8195
$$ -117742 -114212 -106947 -97539 -77802 -41349 3430 36850 51000 49851 45591 37711 15921 -12274
2607a2274k1427j6054j5690j0746n104k890m558j0463j9925l1345l5895l0119
$$ -12274 -33701 -49755 -65445 -76191 -81295 -84185 -88743 -99206 -119131 -150476 -186371 -216490
2595b16490j5785Q979L3350M2820M8963N5452N2073M4822M2217L3861P792k9883
$$ -216490 -232275 -223296 -189946 -147126 -98163 -42711 9362 54184 96401 130262 138054 108171
2583A08171n4020m6733k6733k2337k5872j6895J480J9179K8849K9021K4843K9023
$$ 108171 54151 7418 -19315 -41652 -67524 -84419 -82939 -63760 -34911 -5890 18953 47976
2571D7976M0039L6831N692l5526n7395m4566j1616J3828J3890j788p728r306j3889
$$ 47976 88015 124846 130538 95012 37617 -6949 -18565 -4737 9153 7365 -363 -9669 -23558
2558b3558j3888j2446p771M128J8482L1448L8269L5199J8232m067k0467k6104
$$ -23558 -37446 -49892 -57663 -53535 -35053 -3605 34664 69863 88095 84028 63561 37457
2546C7457k1293j4541j3946j4038l228J1657K3022K8404J8327q7m139l712j5264
$$ 37457 16164 1623 -12323 -26361 -29589 -17932 5090 33494 51821 51734 47595 43883 28619
2533B8619l2718m6909m9995l4236j933L0180M2681L7096K7138J6189O885j228
$$ 28619 -4099 -51008 -101003 -135239 -137172 -106992 -64311 -27215 -77 16112 22997 21769
2521B1769o375j4793l5883n0392l3099l75J5436R083L126P743J7799K7493K4539
$$ 21769 15394 601 -35282 -85674 -118773 -119148 -103712 -94629 -91503 -83760 -65961 -38468 -13929
2508a3929P175k039O654J2810J0459J4421K2634K6842K1447L939k3875m6913n5164
$$ -13929 -6754 -8793 -2139 10671 21130 35551 58185 85027 106474 110413 86538 39625 -15539
2495a5539m2281l800K8406K7702J2329L037m742j2783Q3J3544O98n932m99n342
$$ -15539 -57820 -61620 -33214 -5512 6817 9854 5112 -7671 -7588 5956 6654 722 223 -5119
2481e119o360M082O457k212j1363j4674l655K3409L7086K5751J0676p954k9177
$$ -5119 -11479 -7397 -940 -3152 -14515 -29189 -32844 -9435 27651 53402 64078 56124 26947
2468B6947l3253n781L4677M6863K9749J5573R918n121j4425j7123k1843j9257
$$ 26947 -6306 -12087 22590 69453 99202 114775 124693 119572 105147 88024 66181 46924
2456D6924j1677j107J4964K2886J2966j8975m2935k8683Q592L9996M2935K4490
$$ 46924 35247 34140 49104 71990 84956 65981 23046 -5637 2955 42951 85886 110376
2444A10376J5863J7516Q211m520l549q452l6185n8575m6687j1526K0830L3965
$$ 110376 126239 143755 151966 147446 143897 135445 99260 40685 -6002 -17528 3302 37267
2432C7267L5311L8627L4056J8443N237P708J5179J9393K0244R256p371k3495l9781
$$ 37267 72578 111205 145261 163704 168941 176649 191828 211221 231465 240721 233350 209855 170074
2419A70074n7575n6511k5991N856J7666J9242J7413J2470K378r399j5803j7410
$$ 170074 112499 55988 29997 35853 53519 72761 90174 102644 105022 95623 79820 62410
2407F2410j3872j1687j3568k0467k4275j1568Q146J9045J6814O059N160J2051
$$ 62410 48538 36851 23283 2816 -21459 -33027 -24881 -5836 10978 17037 22197 34248
2395C4248P396o097k6010m2175m0485k1891n040J74Q427J7573K4513K5048J5984
$$ 34248 41644 35547 9537 -32638 -73123 -95014 -100054 -99880 -91453 -73880 -49367 -24319 -8335
2382h335L645n711l534j911j0279j2329r810k8123m9000m0029j1782J0929J8820
$$ -8335 -4690 -10401 -13935 -15846 -26125 -38454 -48264 -76387 -125387 -165416 -177198 -166269 -147449
2369a47449J7083J1964R422J7755L3396M4214M7117M7582M0991J6785j5731l5511
$$ -147449 -130366 -118402 -108980 -91225 -57829 -13615 33502 81084 122075 138860 123129 87618
2357H7618m0695m6318n5830o1500n9895m1773j1617J7002L9506N1202N9421P0338
$$ 87618 46923 605 -55225 -116725 -176620 -218393 -230010 -213008 -173502 -122300 -62879 7459
2345G459O6115M8739L8037K8144R467k5864n5069n3304l8004k7916k0840j5064
$$ 7459 73574 122313 160350 188494 197961 172097 117028 63724 25720 -2196 -23036 -38100
2333c8100j3500j6684k0763j6427m919Q871K0720K2661K2276L0573M4252M8627
$$ -38100 -51600 -68284 -89047 -105474 -110393 -101522 -80802 -58141 -35865 -5292 38960 87587
2321H7587L0592J473j2991j1199j2430k1051l0632l8596l7089k7406j3991J3514
$$ 87587 118179 119652 106661 95462 83032 61981 31349 -7247 -44336 -71742 -85733 -72219
2309g2219N7996Q1687O3896K2712j6447m8376o9865p0822n2588k5232Q287K4580
$$ -72219 -14223 67464 131360 154072 137625 89249 19384 -51438 -104026 -129258 -120971 -96391
2297i6391N959j2726j6609j5622p417J0010K8438M0049L3111J1752q364k5628
$$ -96391 -90432 -103158 -119767 -135389 -142806 -132796 -104358 -64309 -31198 -19446 -27810 -53438
2285e3438l0073j8340j2101j1605n144J894r34j1110j2150O050K3935L2797K8934
$$ -53438 -83511 -101851 -113952 -125557 -130701 -128807 -129741 -140851 -153001 -146951 -123016 -90219 -61285
2272f1285J4275K322j0104j5642j1959j3495k4387k4267j3200L292J9105K5560
$$ -61285 -47010 -44688 -54792 -70434 -82393 -95888 -120275 -144542 -157742 -154450 -135345 -109785
2260a09785K8161K8435K6909L2055M2307M0627J7044j8676l5004k6624k8807m4603
$$ -109785 -81624 -53189 -26280 5775 48082 88709 105753 87077 52073 25449 -3358 -47961
2248d7961m6189l0232j4893o370M880K3581K8540J1105q976j5936k0756k9306
$$ -47961 -94150 -124382 -139275 -145645 -140765 -117184 -88644 -77539 -86515 -102451 -123207 -152513
2236a52513l3370k9674j8241p740o949k065K2333M7928M7147K8960K2314K9885
$$ -152513 -185883 -215557 -233798 -241538 -248487 -250552 -228219 -180291 -133144 -104184 -81870 -51985
2224e1985L5259M0719M1495K9350J000k2897l0002l3454k5904k1694l1325l0106
$$ -51985 -16726 23993 65488 94838 95838 72941 42939 9485 -16419 -38113 -69438 -99544
2212i9544j3396N079K0681K6276J9554J4525K6692L4507L4428M5088M2993K1602
$$ -99544 -112940 -107861 -87180 -60904 -41350 -26825 -133 34374 68802 113890 156883 178485
2200A78485O862O212J635j2692l3549m8171m5600l6202k7331j3087j177o496k4825
$$ 178485 185347 191559 193194 180502 146953 98782 53182 16980 -10351 -23438 -24615 -31111 -55936
2187e5936l9375l4473q958J6783L1130M0425L1358R216n7p696l2433m7509k7110
$$ -55936 -95311 -129784 -138742 -121959 -90829 -50404 -19046 -9830 -9887 -17583 -50016 -97525 -124635
2174a24635J1348L4677K6159R622J2343K3887K3733J1192o84j357L264k366j9864
$$ -124635 -113287 -78610 -52451 -42829 -30486 -6599 17134 28326 27642 26285 29549 27183 7319
2161G319k5633j2826l225K155q31j4046j7672o107J0571L1063M8051M6028K8216
$$ 7319 -18314 -31140 -34365 -32210 -33041 -47087 -64759 -70866 -60295 -29232 18819 64847 93063
2148I3063J4667J0343O098n947k4146m8740p2217p1147m6124j3447P344J8643
$$ 93063 107730 118073 124171 118224 94078 45338 -26879 -98026 -144150 -157597 -150253 -131610
2136a31610K5613K5678K8676L0630K7321K5682J8673L877K028J9580L2010J9926
$$ -131610 -105997 -80319 -51643 -21013 6308 31990 50663 54540 56568 76148 108158 128084
2124A28084j122j1540j5341l5453n3987m6828k5287K20K8592M0765K8716J1780
$$ 128084 126962 115422 100081 64628 10641 -36187 -61474 -61254 -32662 8103 36819 48599
2112D8599q278k6684l2535l0214k8554k7368k5008j5310r03J6006K2851J5474
$$ 48599 40321 13637 -18898 -49112 -77666 -105034 -130042 -145352 -146255 -130249 -107398 -91924
2100i1924R987O222N364J0868J1628N270L212K986l487k3443m6950m2561r013
$$ -91924 -81937 -75715 -70351 -59483 -47855 -42585 -39373 -36387 -39874 -63317 -110267 -152828 -161841
2087a61841K6893M1945L7023J8614p641j4129J2965L3621K4204J5238J8466K5365
$$ -161841 -134948 -93003 -55980 -37366 -45007 -59136 -46171 -12550 11654 26892 45358 70723
2075G0723L5597L2000M263k7880m0218j8569J1551K2841J5383L035n843K466L3935
$$ 70723 106320 138320 142583 114703 74485 55916 67467 90308 105691 108726 102883 105349 139284
2062A39284O1517N1099M269l3731k9580j4009k3322m2254m3648j9707J6600L4021
$$ 139284 200801 251900 256169 222438 192858 178849 155527 113273 69625 49918 66518 100539
2050A00539K1173R39j0930j7691j4681r959j0742l142J47j7305l3608l2017j0455
$$ 100539 121712 122651 111721 94030 79349 69390 58648 55506 55653 38348 4740 -27277 -37732
2037c7732J5278K0202J5934K4295L5037L2217J8580J0578J3411J4940N357k030
$$ -37732 -22454 -2252 13682 37977 73014 105231 123811 134389 147800 162740 168097 166067
2025A66067o42Q614R433j1648l6551m0007j0885K7210M2373K7191N235j96L57
$$ 166067 165425 174039 183472 171824 135273 95266 84381 111591 153964 181155 186390 186194 186551
2012A86551o059j0722r353n954m985j4864k7367k2724n884j474j3980k3684k8012
$$ 186551 180492 169770 160417 154463 149478 134614 107247 84523 78639 77165 63185 39501 11489
1999A1489l9453m1378k8877p893J0523J4527J1976O951j599j2227j7852j4178
$$ 11489 -27964 -69342 -98219 -106112 -95589 -81062 -69086 -62135 -63734 -75961 -93813 -107991
1987a07991n750M513J6033K1290J8012J8921J4658n925k2721j8063m555M017O288
$$ -107991 -113741 -109228 -93195 -71905 -53893 -34972 -20314 -26239 -48960 -67023 -71578 -67561 -61273
1974f1273R453J7838K0134J8923K0548J6726P529n980k7829m2053l3573j5797
$$ -61273 -51820 -33982 -13848 5075 25623 42349 49878 43898 16069 -25984 -59557 -75354
1962g5354m861M334Q348R063N691J311J952J507j920J48J6899L4046K9542J3423
$$ -75354 -80215 -75881 -67533 -58470 -52779 -51468 -49516 -48009 -49929 -49781 -32882 1164 30706 44129
1948D4129P415R899J3701J7706K1887K2409J8677J1300K672m816j9703l5499l7886
$$ 44129 51544 61443 75144 92850 114737 137146 155823 167123 169795 164979 145276 109777 71891
1935G1891l0128k1931j6773k1095k4522o975K1716M1771L9262J3960l175l641
$$ 71891 41763 19832 3059 -18036 -42558 -49533 -27817 13954 53216 67176 64001 60360
1923F0360n023j5156k1889k5524k3930l018J6156Q698n501r748j0717j4591j9970
$$ 60360 55337 40181 18292 -7232 -31162 -34180 -18024 -9326 -14827 -24575 -35292 -49883 -69853
1910f9853k8240l1416k7207r685J2447L0057M0059L1649J3369J598j443J232R029
$$ -69853 -98093 -129509 -156716 -166401 -153954 -123897 -83838 -52189 -38820 -37222 -38665 -37433 -28404
1897b8404J2335J2923J5255J5995J3196O935L682R125J9594K4818J3435l278j2212
$$ -28404 -16069 -3146 12109 28104 41300 48235 51917 61042 80636 105454 118889 115611 103399
1884A03399k3244k8157k0156r051k420p049j3317j8382k5138k9640k1192K438
$$ 103399 80155 51998 31842 22791 20371 13322 5 -18377 -43515 -73155 -94347 -91909
1872i1909J9051K3016L1051L6509L1620K2761J323k7513m7721m3801r445K5589
$$ -91909 -72858 -49842 -18791 17718 49338 72099 73422 45909 -1812 -45613 -55058 -29469
1860b9469L1757J7982M098n163j2033j6108r785L502K2085K3478j618j7596r547
$$ -29469 2288 20270 24368 19205 7172 -8936 -18721 -15219 6866 30344 28726 11130 1583
1847A583K280Q902K2439M1320M2451K8995J9130L983j8521l8621n7083n7016l5140
$$ 1583 3863 12765 35204 76524 118975 147970 167100 171083 152562 113941 56858 -158 -35298
1834c5298j8902j0839M114J8212J1576m306r125q188l262P091J7512K2050J6754
$$ -35298 -54200 -65039 -60925 -42713 -31137 -35443 -44568 -52756 -56018 -48927 -31415 -9365 7389
1821G389N689m126k901N307J3761J2153o052k7883l2324p544J8520K3379K1375
$$ 7389 13078 8952 6051 11358 25119 37272 31220 3337 -28987 -36531 -18011 5368 26743
1808B6743J6622R528J0457P891p225k5151k9978k1236j0315N09O796j346j1254
$$ 26743 43365 52893 63350 71241 64016 38865 8887 -12349 -22664 -22155 -15359 -16705 -27959
1795b7959p022l687j2136j3646J928R045j866k824J5922K9064J7337j3538l7676
$$ -27959 -34981 -38668 -50804 -64450 -62522 -53477 -55343 -58167 -42245 -13181 4156 -9382 -47058
1782d7058l3734j1341P438J4582J0382K310p554j3057l128J3756K7202K6420J3803
$$ -47058 -80792 -92133 -84695 -70113 -59731 -57421 -64975 -78032 -81160 -67404 -40202 -13782 21
1769B1Q333R887M854J0646K9198L5841J9127j0297k1441n640L555p187k2047k5465
$$ 21 8354 18241 23095 33741 62939 98780 117907 107610 86169 80529 84084 76897 54850 29385
1755B9385j5644O257K7775K7665J4311p069l3671m7162l8659j5891N914J8711
$$ 29385 13741 19998 47773 75438 89749 82680 49009 1847 -36812 -52703 -46789 -28078
1743b8078K0287J1573J3600K7574K5895O224j0883n698P811P411L629K993J722
$$ -28078 -7791 3782 17382 44956 70851 77075 66192 60494 68305 75716 79345 82338 84060
1730H4060k068j0279k6770l9137l1796j5721o773m408o098o492N307K8158L9466
$$ 84060 81992 71713 44943 5806 -25990 -41711 -48484 -52892 -58990 -65482 -60175 -32017 7449
1717G449K7984Q560K085O914J4176J6662J3490J4776J6177J6606K2525K4075K311
$$ 7449 35433 43993 46078 52992 67168 83830 97320 112096 128273 144879 167404 191479 193790
1704A93790k4535k6460j2587k266O310Q763k963j3024j0635p991j2541j9142k2712
$$ 193790 169255 142795 130208 127942 134252 143015 140052 127028 116393 108402 95861 76719 54007
1691E4007j8449j2297r494r539j1100k228J8013L9426N1887M0705J4153j4520
$$ 54007 35558 23261 13767 4228 -6872 -9100 8913 48339 100226 140931 155084 140564
1679A40564l8237l6991j5704m946j0339j9700j8241m570k611j1636l813N004L004
$$ 140564 102327 65336 49632 44686 34347 14647 -3594 -8164 -10775 -22411 -26224 -21220 -18216
1666a8216K553M884J7364K9780K1379m032k4574k5481n113J5620J2872R196J6679
$$ -18216 -15663 -10779 6585 36365 57744 53712 29138 3657 -1456 14164 27036 36232 52911
1653E2911K0367K5166L3616L5003L0711L0816K5998J1748q773k8183l2020k8534
$$ 52911 73278 98444 132060 167063 197774 228590 254588 266336 257563 229380 197360 168826
1641A68826k1474j1768p661r694j9158l4688l6269j7509o02Q586K2285M2115N6261
$$ 168826 147352 135584 127923 118229 99071 64383 28114 10605 10003 18589 40874 82989 139250
1628A39250M9726K2905l135j4241l2747n5913m8611j4977J1538J5202J2590J3741
$$ 139250 188976 211881 208746 194505 161758 105845 57234 42257 53795 68997 81587 95328
1616I5328N961n544m597q66p402k1485k2474j0617o927r558M807K4790K0218Q167
$$ 95328 101289 95745 91148 90282 82880 61395 38921 28304 21377 11819 16626 41416 61634 69801
1602F9801P479J1665J2061j021j5213m487K3444K3933K176m144m371j6505k3695
$$ 69801 77280 88945 101006 99985 84772 80285 103729 127662 129838 125694 121323 104818 81123
1589H1123k0811k2789l6439n5780n3207j8940J5616K7709K1156O561j980K135
$$ 81123 60312 37523 1084 -54696 -107903 -126843 -111227 -83518 -62362 -55801 -57781 -55646
1577e5646J5071K5177K5998K1770J5903O582j520j444p119k4573l5879k8667n256
$$ -55646 -40575 -15398 10600 32370 48273 54855 53335 51891 44772 20199 -15680 -44347 -49603
1564d9603K6726M9699M9965M1088L1245K3134J5855O480J349j065j0631l7577
$$ -49603 -22877 26822 76787 117875 149120 172254 188109 194589 195938 194873 184242 146665
1552A46665o4698n4496k2719l387J5686K8023J8373l826j7832j2940j3352k4711
$$ 146665 81967 27471 4752 1365 17051 45074 63447 59621 41789 28849 15497 -9214
1540i214k9740k2049j7286k1143j5889L32J1248O183j1504j6811n474j043J04
$$ -9214 -38954 -61003 -78289 -99432 -115321 -114989 -103741 -97558 -109062 -125873 -131347 -132390 -132286
1527a32286J2984K9743M0800M8627M6509L6400J9590Q825J7987K7606K8279K0713
$$ -132286 -119302 -89559 -48759 -132 46377 82777 102367 111192 129179 156785 185064 205777
1515B05777J0801K905k854l738K236M471l206j2273j7110j5641j4233k1767l4860
$$ 205777 216578 219483 216629 212891 215127 219598 216392 204119 187009 171368 157135 135368 100508
1502A00508m1560k7220r21N991r812k0602j3157J286P786P308J4111J0319j0095
$$ 100508 58948 31728 30807 36798 26986 6384 -6773 -5487 2299 9607 23718 34037 23942
1489B3942k1729j8711j5461k0131k1549m197J5243J6893M757j3299k0587j7454
$$ 23942 2213 -16498 -31959 -52090 -73639 -77836 -62593 -45700 -40943 -54242 -74829 -92283
1477i2283r357J9508M9091M9106J9690j3502k6111j7657m057O954J8873K2576
$$ -92283 -101640 -82132 -33041 16065 35755 22253 -3858 -21515 -25572 -18618 255 22831
1465B2831J4906N576L634L806n762j9565k3996q292P045P187J0103K0647K3314
$$ 22831 37737 43313 46947 50753 44991 25426 1430 -6862 183 7370 17473 38120 61434
1452F1434J8666J0893l598m657J4353K9263L4569L1674J4291p006k5949l9655
$$ 61434 80100 90993 87395 82738 97091 126354 160923 192597 206888 199882 173933 134278
1440A34278m2567l0955j2647L204J5429J8359J5609J4522P544l541j0476q747
$$ 134278 91711 60756 48109 51313 66742 85101 100710 115232 122776 119235 108759 100012
1428A00012j0247j9150l0030k8014p710J2033J8223J6270K7329M3427M3624K6229
$$ 100012 89765 70615 40585 12571 4861 16894 35117 51387 78716 122143 165767 191996
1416A91996M205j1636j5000j7750l0980m6309n4204l9235q421K018r168p857K134
$$ 191996 196201 184565 169565 151815 120835 74526 20322 -18913 -27334 -25316 -34484 -42341 -40207
1403d0207j327m523L250J0245J1559J2924N305r080j2593o110j6286l9589m3944
$$ -40207 -41534 -46057 -42807 -32562 -21003 -8079 -2774 -11854 -24447 -30557 -46843 -86432 -130376
1390a30376l3777k9533n414L8216M7019J9846K540P556J1466K537n745j0628j1299
$$ -130376 -164153 -193686 -199100 -160884 -113865 -94019 -91479 -83923 -72457 -69920 -75665 -86293 -97592
1377i7592N957K5549L1592K7182J0142n698l324J9676M1327L3264M592q393j2379
$$ -97592 -91635 -66086 -34494 -7312 2830 -2868 -6192 13484 54811 88075 92667 84274 71895
1364G1895k3016j3728O003L423j5277l0282l5328k0601R07J9288L5856L9654L4556
$$ 71895 48879 35151 41154 44577 29300 -982 -36310 -56911 -56004 -36716 -860 38794 73350
1351G3350L5857L0177N703j2685j7933k5111l0296k9038k2505k1561l5012n1057
$$ 73350 109207 139384 145087 132402 114469 89358 59062 30024 7519 -14042 -49054 -100111
1339a00111m5460k3455m926L672J3690L4321N1631N1429L7933K6851J8158l453
$$ -100111 -145571 -169026 -173952 -170280 -156590 -122269 -70638 -19209 18724 45575 63733 60280
1327F0280k5625l0339j5244O152P440k843p670O687L2721L9639K8493p21m0924
$$ 60280 34655 4316 -10928 -4776 2664 -179 -7849 -1162 31559 71198 99691 98970 58046
1314E8046o1756m4638j213L7236M4983J6018j2871j1746N400J4401L915j0897
$$ 58046 -3710 -48348 -49561 -12325 32658 48676 35805 24059 29459 43860 47775 36878
1302C6878r102p250j0038l265J3921L2927M1523L2019J4098P938J2674K1647M3497
$$ 36878 27776 20526 10488 7223 21144 54071 95594 127613 141711 149649 162323 183970 227467
1289B27467P3294Q1572L9251n1690j35854j56398j16423n4559L387L7213K2892
$$ 227467 300761 382333 421584 369894 234040 77642 -38781 -93340 -89953 -52740 -29848
1278b9848o877j9562k0498j4225j1739j7593j5837k68K2172L8217L4811J7909
$$ -29848 -36725 -56287 -76785 -91010 -102749 -120342 -136179 -136447 -114275 -76058 -41247 -23338
1266b3338L635J814P088J4800K1348K2790J5871O707J2333K6467K8502J2358l596
$$ -23338 -19703 -17889 -10801 3999 25347 48137 64008 70715 83048 109515 138017 150375 146779
1253A46779l311J620j391m304m857j3387k7341m5581o4281o7611n9348n5266m6407
$$ 146779 143468 145088 143697 139393 134536 121149 93808 48227 -16054 -83665 -143013 -198279 -244686
1240b44686l2023j4805J4115M7127N8376M4047L1990L1324K2135m244k8819l1025
$$ -244686 -276709 -291514 -277399 -230272 -171896 -127849 -95859 -64535 -42400 -46644 -75463 -106488
1228a06488j1526K546J357P478L2152N5755N2480L3237J4646j547j5153k8859
$$ -106488 -118014 -115468 -114111 -106633 -74481 -18726 33754 66991 81637 80090 64937 36078
1216C6078l3448l3082l0343k0422j373J5106J6551J3147R749l290o346J8174L6991
$$ 36078 2630 -30452 -60795 -81217 -82590 -67484 -50933 -37786 -28037 -31327 -37673 -19499 17492
1203A7492L7719J9006j2467k7967k8313l5883n0411n3678l6045m839K9913N1007
$$ 17492 55211 74217 61750 33783 5470 -30413 -80824 -134502 -170547 -175386 -145473 -94466
1191i4466M9690L7396J8358O128J4464L5096N0150M7005K9825O674j5776k5296
$$ -94466 -44776 -7380 10978 17106 31570 66666 116816 163821 193646 200320 184544 159248
1179A59248j8945j5250j8382q142R443J4360N064j1879l2897n1168m8974l1611
$$ 159248 140303 125053 106671 98529 107972 122332 127396 115517 82620 31452 -17522 -49133
1167d9133k3279l1339m0968k8493M669L8762N4178M6149L2111K0665Q602o44p335
$$ -49133 -72412 -103751 -144719 -173212 -168543 -129781 -75603 -29454 2657 23322 31924 31280 23945
1154B3945k0633k4808o46K7616K5407j729j7818j2564p305j8219l2563l8234l8757
$$ 23945 3312 -21496 -22142 5474 30881 29152 11334 -1230 -8535 -26754 -59317 -97551 -136308
1141a36308j8468J4501L5099L7137L1043J9124L773l330r427j5493j4121m94J7995
$$ -136308 -154776 -140275 -105176 -68039 -36996 -17872 -14099 -17429 -26856 -42349 -56470 -56964 -38969
1128c8969K7391K5613K4651K7793K0671J2249J5026J0343r994k0716j0334O076
$$ -38969 -11578 14035 38686 66479 87150 99399 114425 124768 114774 94058 83724 89800
1116H9800J7079K3693K0811J8023Q975L440J9588L3918K7765P777n943o972q651
$$ 89800 106879 130572 151383 169406 178381 181821 201409 235327 263092 270869 264926 257954 249303
1103B49303k6927l3998r714L77j6836l5320m0942m5809n7331n1318k0129R524
$$ 249303 222376 188378 178664 179041 162205 126885 85943 40134 -17197 -68515 -88644 -79120
1091g9120J9219J9112J2228n683k7541l2753q668J6407J8920j682k0028j4081
$$ -79120 -59901 -40789 -28561 -34244 -61785 -94538 -103206 -86799 -67879 -69561 -89589 -103670
1079a03670l375M847Q085Q724J8618K6179J4562p144j6283r738j0156j1711L669
$$ -103670 -107045 -102198 -94113 -85389 -66771 -40592 -26030 -33174 -49457 -59195 -69351 -81062 -77393
1066g7393J1448L053r912k0514k1052k0361j4449m566k435k923m102p19J2294
$$ -77393 -65945 -62892 -72804 -93318 -114370 -134731 -149180 -153746 -156181 -159104 -163206 -163925 -151631
1053a51631K5403L2208K2070n684l4943m3005l1302j7506n321R630K2353K4195
$$ -151631 -126228 -94020 -71950 -77634 -112577 -155582 -186884 -204390 -209711 -200081 -177728 -153533
1041a53533J3704l216k1368k6464j4538N71K3644L6770J1459j9184j6144J506
$$ -153533 -139829 -143045 -164413 -190877 -205415 -204844 -181200 -144430 -132971 -152155 -168299 -166793
1029a66793Q449l198j1031l629l193p304J524K1002L9218M7846N0322L8700J7083
$$ -166793 -158344 -161542 -172573 -176202 -179395 -186699 -185175 -164173 -124955 -77109 -26787 11913 28996
1016B8996j211j4704j1654L177N133m777j1886j5747k5423l9547m2346k5571j748
$$ 28996 27785 13081 1427 4604 9737 4960 -6926 -22673 -48096 -87643 -129989 -155560 -157308
1003a57308J1996J6769J9895J9891J3018k377k0610l4627k4474K2792O1492O7879
$$ -157308 -145312 -128543 -108648 -88757 -75739 -78116 -98726 -133353 -157827 -135035 -73543 -5664
991e664N5582L5134R753j0780q509K874K361j231L583j461j7684k2741j3092O942
$$ -5664 49918 85052 94805 84025 75516 78390 80751 79520 83103 81642 63958 41217 28125 35067
977C5067J9346J3122l181p890M310K0376K9117J6105j1532k7006j7528R524K4423
$$ 35067 54413 67535 64354 56464 60774 81150 110267 126372 114840 87834 70306 79830 104253
964A04253J4731q146k7224k5666r294R606J8787J1738p418k3910k5912j5867O34
$$ 104253 118984 110838 83614 57948 48654 58260 77047 88785 81367 57457 31545 15678 16312
951A6312J1084J867j3780j0382J0701J5791r081k3245k1812k3207k8614k5838
$$ 16312 27396 29263 15483 5101 15802 31593 22512 -733 -22545 -45752 -74366 -100204
939a00204m587J1764O962o679j4604j1391J833K1085L4956L2153K3144J7266O992
$$ -100204 -104791 -93027 -86065 -92744 -107348 -118739 -116906 -95821 -60865 -28712 -5568 11698 18690
926A8690j13K287l10p673q488p572p481o208N433K5872L4496J6152m407L438K1362
$$ 18690 18577 20864 20554 12881 4393 -3179 -10660 -16868 -11435 14437 48933 65085 60678 64116 85478
911H5478J7445j1062m2122n7217m5893j8340O280N670r147j5519j2889m101R945
$$ 85478 102923 91861 49739 -7478 -53371 -71711 -65431 -59761 -68908 -84427 -97316 -101417 -91472
898i1472J6952K491j9339k2530k569J6785K3851K4726K9675L2887K2247R523R399
$$ -91472 -74520 -72029 -91368 -113898 -116467 -99682 -75831 -51105 -21430 11457 33704 43227 52626
$$ [...]
##END NTUPLES=NMR SPECTRUM
##END=
