##TITLE=C13_DE-75K3 TFA
 CDCl3, 22400sc

 24.12.2024
##JCAMPDX= 6.0         $$ Bruker NMR JCAMP-DX V2.0
##DATA TYPE= NMR SPECTRUM
##DATA CLASS= NTUPLES
##ORIGIN= UXNMR, Bruker Analytische Messtechnik GmbH
##OWNER= root
$$ XWIN-NMR		Version 3.5
$$ Thu Dec 26 13:39:26 2024 Russian Standard Time (UT+4h)  she@DPX200
##.OBSERVE FREQUENCY= 50.327896
##.OBSERVE NUCLEUS= ^13C
##.ACQUISITION MODE= SIMULTANEOUS
##.ACQUISITION SCHEME= undefined
##.AVERAGES= 18210
##.DIGITISER RES= 17
##SPECTROMETER/DATA SYSTEM= spect
##.PULSE SEQUENCE= zgpg30
##.SOLVENT NAME= D2O
##.SHIFT REFERENCE= (INTERNAL, D2O, 0, 222.565)
##AUDIT TRAIL= $$ (NUMBER, WHEN, WHO, WHERE, WHAT)
$$ ##TITLE= Audit trail, XWIN-NMR		Version 3.5
$$ ##JCAMPDX= 5.01
$$ ##ORIGIN= Bruker BioSpin GmbH
$$ ##OWNER= she
$$ F:/spectra/data/she/nmr/c13/1/pdata/1/auditp.txt
$$ ##AUDIT TRAIL=  $$ (NUMBER, WHEN, WHO, WHERE, WHAT)
(   1,<2024-12-26 09:52:56.90 +0400>,<she>,<DPX200>,
      <created by zg, POWCHK disabled, PULCHK disabled
       terminated by command 'halt'
       configuration hash MD5:
       00 E9 B6 7A A2 85 ED C7 34 08 36 98 17 FE 4E 26
       data hash MD5: 32K
       67 FC C7 3F D4 82 34 79 2C 32 28 27 C1 7B 90 F4>)
(   2,<2024-12-26 13:37:00.75 +0400>,<she>,<DPX200>,
      <Start of raw data processing
       efp BC_mod = 2 LB = 2 FT_mod = 6 PKNL = 1 PHC0 = -401.0959 PHC1 = 27.88833 SI = 32K 
       data hash MD5: 32K
       99 A9 8E 28 03 88 48 1F 5B DF E1 FA 68 85 BC 20>)
(   3,<2024-12-26 13:37:03.87 +0400>,<she>,<DPX200>,
      <abs ABSG = 5 
       data hash MD5: 32K
       36 12 A1 7E 9C E1 52 3E 69 6D 92 70 06 FD 43 8E>)
(   4,<2024-12-26 13:37:28.37 +0400>,<she>,<DPX200>,
      <pk PHC0 = 3.221696 PHC1 = -4 
       data hash MD5: 32K
       AA 4A 28 F0 C7 A9 81 87 62 8F D9 B6 AE EC FA C7>)
(   5,<2024-12-26 13:37:33.98 +0400>,<she>,<DPX200>,
      <abs ABSG = 5 
       data hash MD5: 32K
       E7 56 27 67 03 B9 4E 57 27 02 D0 43 51 2E 17 A9>)
$$ ##END=
$$ 
$$ hash MD5
$$ 30 31 50 2D C3 98 43 75 4B 29 5B 03 98 26 9B 7A
##$RELAX= 
##$RELAX= 
##$RELAX= 
##$RELAX= 
##$RELAX= 
##$RELAX= 
##$RELAX= 
##$RELAX= 
$$ Bruker specific parameters
$$ --------------------------
##$DU= <F:/spectra>
##$EXPNO= 1
##$NAME= <c13>
##$PROCNO= 1
##$TYPE= <nmr>
##$USER= <she>
##$AMP= (0..31)
100 100 100 100 100 100 100 100 100 100 100 100 100 100 100 100 100 100 
100 100 100 100 100 100 100 100 100 100 100 100 100 100 
##$AQSEQ= 0
##$AQ_mod= 1
##$AUNM= <au_zg>
##$AUTOPOS= <>
##$BF1= 50.322709
##$BF2= 200.13
##$BF3= 50.322709
##$BF4= 500.13
##$BF5= 500.13
##$BF6= 500.13
##$BF7= 500.13
##$BF8= 500.13
##$BYTORDA= 1
##$CFDGTYP= 0
##$CFRGTYP= 5
##$CHEMSTR= <none>
##$CNST= (0..31)
1 1 145 1 1 1 1 1 1 1 1 1 1 1 1 1 1 1 1 1 1 1 1 1 1 1 1 1 1 1 1 1 
##$CPDPRG= <waltz16>
##$CPDPRG1= <>
##$CPDPRG2= <waltz16>
##$CPDPRG3= <>
##$CPDPRG4= <mlev>
##$CPDPRG5= <mlev>
##$CPDPRG6= <mlev>
##$CPDPRG7= <mlev>
##$CPDPRG8= <mlev>
##$CPDPRGB= <>
##$CPDPRGT= <>
##$D= (0..31)
$$ [...]
##$SUBNAM4= <"">
##$SUBNAM5= <"">
##$SUBNAM6= <"">
##$SUBNAM7= <"">
##$SUBNAM8= <"">
##$SUBNAM9= <"">
##$SW= 239.972175391363
##$SWIBOX= (0..15)
0 1 3 0 0 0 0 0 0 0 0 0 0 0 0 0 
##$SW_h= 12077.2946859903
##$TD= 32768
##$TD0= 1
##$TE= 0
##$TE2= 300
##$TE3= 300
##$TEG= 300
##$TL= (0..7)
120 120 120 120 120 120 120 120 
##$TP= (0..7)
150 150 150 150 150 150 150 150 
##$TP07= 0
##$TPNAME0= <>
##$TPNAME1= <>
##$TPNAME2= <>
##$TPNAME3= <>
##$TPNAME4= <>
##$TPNAME5= <>
##$TPNAME6= <>
##$TPNAME7= <>
##$TPOAL= (0..7)
0.5 0.5 0.5 0.5 0.5 0.5 0.5 0.5 
##$TPOFFS= (0..7)
0 0 0 0 0 0 0 0 
##$TUNHIN= 0
##$TUNHOUT= 0
##$TUNXOUT= 0
##$USERA1= <user>
##$USERA2= <user>
##$USERA3= <user>
##$USERA4= <user>
##$USERA5= <user>
##$V9= 5
##$VALIST= <valist>
##$VCLIST= <CCCCCCCCCCCCCCC>
##$VD= 0
##$VDLIST= <DDDDDDDDDDDDDDD>
##$VPLIST= <PPPPPPPPPPPPPPP>
##$VTLIST= <TTTTTTTTTTTTTTT>
##$WBST= 1024
##$WBSW= 4
##$XGAIN= (0..3)
0 0 0 0 
##$XL= 0
##$YL= 0
##$YMAX_a= 116863218
##$YMIN_a= -34777653
##$ZGOPTNS= <>
##$ZL1= 120
##$ZL2= 120
##$ZL3= 120
##$ZL4= 120
##$ABSF1= 222.5654
##$ABSF2= -17.4314
##$ABSG= 5
##$ABSL= 3
##$ALPHA= 0
##$AQORDER= 0
##$ASSFAC= 0
##$ASSFACI= 0
##$ASSFACX= 0
##$ASSWID= 0
##$AUNMP= <proc_1d>
##$AZFE= 0.1
##$AZFW= 0.5
##$BCFW= 0
##$BC_mod= 2
##$BYTORDP= 0
##$COROFFS= 0
##$CY= -3
##$DATMOD= 1
##$DC= 0
##$DFILT= <>
##$DTYPP= 0
##$F1P= 0
##$F2P= 0
##$FCOR= 0.5
##$FTSIZE= 32768
##$FT_mod= 6
##$GAMMA= 0
##$GB= 0
##$INTBC= 1
##$INTSCL= 4.134877e-10
##$ISEN= 128
##$LB= 2
##$LEV0= 0
##$LPBIN= 0
##$MAXI= 10000
##$MC2= 0
##$MEAN= 0
##$ME_mod= 0
##$MI= 0.1934396
##$NCOEF= 0
##$NC_proc= 2
##$NLEV= 6
##$NOISF1= 120.0001
##$NOISF2= 80.00006
##$NSP= 0
##$NTH_PI= 0
##$NZP= 0
##$OFFSET= 222.5654
##$PC= 1.4
##$PHC0= -397.8742
##$PHC1= 23.88833
##$PH_mod= 1
##$PKNL= yes
##$PPARMOD= 0
##$PSCAL= 0
##$PSIGN= 0
##$REVERSE= no
##$SF= 50.3227345484362
##$SI= 32768
##$SIGF1= 140
##$SIGF2= 120
##$SINO= 11.81781
##$SIOLD= 32768
##$SREGLST= <13C.CDCl3>
##$SSB= 0
##$STSI= 32768
##$STSR= 0
##$SW_p= 12077.2946859903
##$SYMM= 0
##$S_DEV= 0
##$TDeff= 32768
##$TDoff= 0
##$TI= <>
##$TILT= no
##$TM1= 0
##$TM2= 0
##$TOPLEV= 0
##$USERP1= <user>
##$USERP2= <user>
##$USERP3= <user>
##$USERP4= <user>
##$USERP5= <user>
##$WDW= 1
##$XDIM= 32768
##$YMAX_p= 339914650
##$YMIN_p= -1552727
$$ End of Bruker specific parameters
$$ ---------------------------------
##NTUPLES= NMR SPECTRUM
##VAR_NAME=  FREQUENCY,     SPECTRUM/REAL,   SPECTRUM/IMAG
##SYMBOL=    X,             R,               I
##VAR_TYPE=  INDEPENDENT,   DEPENDENT,       DEPENDENT
##VAR_FORM=  AFFN,          ASDF,            ASDF
##VAR_DIM=   32768,         32768,           32768
##UNITS=     HZ,            ARBITRARY UNITS, ARBITRARY UNITS
##FACTOR=    0.368581032318806, 1,           1
##FIRST=     11200.0995020947, 0,            0
##LAST=      -877.195183895579, 0,           0
##MIN=       -877.195183895579, -1552727,    0
##MAX=       11200.0995020947, 339914650,    0
$$ Real data points
##PAGE= N=1
##DATA TABLE= (X++(R..R)), XYDATA
$$ [...]
16079b90163j6595O500N9714J10260R2171K4154r8823k35505k86396j95239k4971
$$ -290163 -306758 -300258 -240544 -130284 -38113 -13959 -112782 -348287 -634683 -829922 -854893
16068h54893J54299K77404K38677Q6156J6488N8093L4374q1939j35626r7650q074
$$ -854893 -700594 -423190 -184513 -98357 -81869 -23776 10598 -71341 -206967 -304617 -312691
16057c12691J24802J62042N2244n2037r2658j44556j97619j71251j04204n9450
$$ -312691 -187889 -25847 26397 -25640 -118298 -262854 -460473 -631724 -735928 -795378
16047g95378j2268N9587J18661J14888Q5431O8731M4059k6978j23646j60872j27855
$$ -795378 -807646 -748059 -629398 -514510 -429079 -360348 -316289 -343267 -466913 -627785 -755640
16036g55640n8992R199J2738p1334j50847j00901L5636J34024J64388J46645P7244
$$ -755640 -814632 -805433 -792695 -864029 -1014876 -1115777 -1080141 -946117 -781729 -635084 -557840
16025e57840j4059q7339j22928r9923o4779m1739J4634P2080R8673J02123Q5635
$$ -557840 -571899 -659238 -782166 -882089 -946868 -988607 -973973 -901893 -803220 -701097 -615462
16014f15462O1512P231q5185j12462k6306R5601J76585J52338N2591m6955j04219
$$ -615462 -553950 -546719 -631904 -744366 -770672 -675071 -498486 -346148 -293557 -340512 -444731
16003d44731q9033k4981K5093L9983q746j01455j31565m6815O7594J37133J60774
$$ -444731 -533764 -558745 -533652 -493669 -502415 -603870 -735435 -782250 -714656 -577523 -416749
15992d16749J13406L0705k8702n0335k4438J9850L4713M373k8834q055P4519J34004
$$ -416749 -303343 -272638 -301340 -351675 -376113 -356263 -321550 -317177 -346011 -354066 -279547 -145543
15980a45543Q6501k614m2119j0238O1668J16891Q9221n264r6649j14073o8521
$$ -145543 -59042 -61656 -103775 -114013 -52345 64546 153767 148503 51854 -62219 -130740
15969a30740k4270M6864J38278J88960J29803K5069l9689j12780j54694j06351
$$ -130740 -155010 -108146 30132 219092 348895 373964 334275 221495 66801 -39550
15959c9550p0098j01496r4972K3228J13471M0851n3648q5844j00399q1106j6019
$$ -39550 -109648 -211144 -306116 -282888 -169417 -128566 -182214 -268058 -368457 -449563 -465582
15948d65582L6387K580o8855j06697j31795j29024q2105L863Q3150P4086P5691
$$ -465582 -429195 -426615 -495470 -602167 -733962 -862986 -945091 -941228 -858078 -783992 -708301
15937g08301J81902K77100K59174J94596J67576P6659j13960k27925j82657q5655
$$ -708301 -526399 -249299 9875 204471 372047 448706 334746 106821 -75836 -161491
15927a61491m9609r2499r9617l3300j6910p5184r8712j3915J16168J75659J50936
$$ -161491 -211100 -303599 -403216 -436516 -453426 -528610 -627322 -641237 -525069 -349410 -198474
15916a98474J22846J06240R5193R0421N4773j5562q5227r2145p0904q0041o7138
$$ -198474 -75628 30612 125805 216226 270999 255437 170210 78065 7161 -72880 -140018
15905a40018l1547n1356j30898j97086j94948p8674Q5095J75731J55860J19947
$$ -140018 -171565 -222921 -353819 -550905 -745853 -824527 -739432 -563701 -407841 -287894
15895b87894J22208J21230P4891m8608j87217k21937j31173j3182M1374L5431
$$ -287894 -165686 -44456 30435 -18173 -205390 -427327 -558500 -571682 -530308 -494877
15885d94877J8163L3165N5862O2425R1841R9363M5665J678k065m930j8452l5306
$$ -494877 -476714 -443549 -387687 -325262 -233421 -134058 -88393 -86715 -88780 -93710 -112162 -147468
15873a47468n0461l1733M4274J08919O5501m1307p0053L2462J30681R8300j285
$$ -147468 -197929 -229662 -185388 -76469 -10968 -52275 -122328 -89866 40815 139115 137830
15862A37830o3785q0671r5046j14820j08828j11798j52197k04386k29926j59214
$$ 137830 74045 -6626 -101672 -216492 -325320 -437118 -589315 -793701 -1023627 -1182841
15852a182841p816J06899R1560K169k3345O7888J44231J36484J31723J71300J92751
$$ -1182841 -1190657 -1083758 -992198 -990029 -1013374 -945486 -801255 -664771 -533048 -361748 -168997
15841a68997J68434J15161N8417J0915k6224j6640J9892j087n7837o9466m6056
$$ -168997 -563 114598 173015 183930 157706 141066 160958 159871 102034 32568 -13488
15830a3488j2300j0843j9967J1772N7215Q9975P5133k2203j01378j07863j05428
$$ -13488 -25788 -36631 -56598 -44826 12389 102364 177497 155294 53916 -53947 -159375
15819a59375p2649K9026J32161J56014R0035j5503j22407j55287j26968m5884
$$ -159375 -232024 -202998 -70837 85177 175212 159709 37302 -117985 -244953 -290837
15809b90837R3855J92909K15356J69638J07966P8068K7397n7756j35671j88834
$$ -290837 -196982 -4073 211283 380921 488887 566955 594352 536596 400925 212091
15799B12091j79010j37189p2112O0013J84626K28492J85879M6078j06533j56908
$$ 212091 33081 -104108 -176220 -116207 68419 296911 482790 528868 422335 265427
15789B65427j13497n7133o5208j26219j88472k08424j75077j22654r9664r2319
$$ 265427 151930 94797 29589 -96630 -285102 -493526 -668603 -791257 -890921 -983240
15779i83240n567O8340N0296M9844J35188J88474J64739J33581J19870J11534
$$ -983240 -988807 -920467 -870171 -820327 -685139 -496665 -331926 -198345 -78475 33059
15769C3059J03627R1967O0904K6929j312j8357m2070q7201r2048m1649r666m2326
$$ 33059 136686 228653 289557 316486 315174 296817 254747 167546 75498 33849 24183 -18143
15757a8143j21487k04671k08127j37772l1312Q9176J80246K17923K10202J85104
$$ -18143 -139630 -344301 -552428 -690200 -721512 -632336 -452090 -234167 -23965 161139
15747A61139J12496J1408o5902j12501j14212o7516j4495J5988r624r4210j84641
$$ 161139 273635 285043 219141 106640 -7572 -75088 -89583 -73595 -83219 -177429 -362070
15736c62070k10514j55887o9782j325M2173O5495R7123J16681N8074l0578p8339
$$ -362070 -572584 -728471 -798253 -799578 -757405 -691910 -594787 -478106 -420032 -450610 -528949
15725e28949q1104m3447L8797N5796L0293N8175Q8013J16761K03080K76923K54589
$$ -528949 -610053 -653500 -614703 -558907 -528614 -470439 -382426 -265665 -62585 214338 468927
15714D68927J26281m3455j46010j62866j40171l6969J00442J65737J41041K6813
$$ 468927 595208 551753 405743 242877 102706 65737 166179 331916 472957 499770
15704D99770j04613j71242j48316o4700J5093J8252k6262m9586l9249j2948J5160
$$ 499770 395157 223915 75599 10899 25992 44244 17982 -31604 -70853 -83801 -68641
15693f8641L3264R441n894l687K0432N6244Q08j28134k18287k06917j27821l5660
$$ -68641 -35377 -25936 -31830 -35517 -15085 41159 41967 -86167 -304454 -511371 -639192 -674852
15681f74852L8269Q5270R3161O3947L5939O2102J04724O8951l6785j13820j15442
$$ -674852 -636583 -551313 -458152 -394205 -358266 -296164 -191440 -122489 -159274 -273094 -388536
15670c88536o8969P766M4109M3832K1039M366N2379P1013Q049n6033r7032j37788
$$ -388536 -457505 -449739 -405630 -361798 -340759 -336393 -284014 -213001 -204952 -260985 -358017 -495805
15658d95805j05513M894O2344J6051n8588r9506r6579m4369K3232Q0700R1991
$$ -495805 -601318 -596424 -534080 -518029 -576617 -676123 -772702 -817071 -793839 -713139 -621148
15647f21148P1785Q4082O5543J4508K673q043l3816m9333n5532m4245m1431o43
$$ -621148 -549363 -465281 -399738 -385230 -382557 -390600 -424416 -473749 -529281 -573526 -614957 -615600
15635f15600J03378J39447N0124j7277o397J3612K384l9539j10949j64148j37384
$$ -615600 -512222 -372775 -322651 -339928 -346325 -332713 -330329 -369868 -480817 -644965 -782349
15624g82349r1349l6320N5547J50538K12300K28900K34289K33206J52063L5679
$$ -782349 -873698 -910018 -854471 -703933 -491633 -262733 -28444 204762 356825 392504
15614C92504j7330l9977p4138n9227K5778O4712j0478r6794p1174o898N055n9269
$$ 392504 375174 335197 261059 201832 227610 292322 281844 185050 113876 106978 112033 52764
15602E2764j13327r5053o6847q3004j00547o6187o2777r1091n6763j4440k6878
$$ 52764 -60563 -155616 -222463 -305467 -406014 -472201 -534978 -626069 -682832 -697272 -724150
15591g24150p0147p7307j7081R1164K33464K99081J78123m9146j60510j62142
$$ -724150 -794297 -871604 -888685 -797521 -564057 -264976 -86853 -135999 -296509 -458651
15581d58651j58483j25172n1137O1128J43189J37521Q1085L6529L7916L8947k7558
$$ -458651 -617134 -742306 -793443 -732315 -589126 -451605 -370520 -333991 -296075 -257128 -284686
15570b84686j22535j84034j52479m3236J6175J1271J9517K4920J0512n0305j09623
$$ -284686 -407221 -591255 -743734 -786970 -770795 -759524 -740007 -715087 -704575 -754880 -864503
15559h64503q2944k2135k1056o6866q4889l0030N6228J12655P5612k1972q6943
$$ -864503 -947447 -969582 -990638 -1057504 -1142393 -1172423 -1116195 -1003540 -927928 -949900 -1036843
15548a036843q5277j6223P3936J26282J51294J24811M2357l6871m6343L4817O1619
$$ -1036843 -1122120 -1138343 -1064407 -938125 -786831 -662020 -619663 -656534 -702877 -668060 -606441
15537f06441k1915j11343j31635j09894n8278N9346J88009K28070J76356P1690
$$ -606441 -628356 -739699 -871334 -981228 -1039506 -980160 -792151 -564081 -387725 -316035
15527c16035k9153n4362k4358L8292J42687K61440K62185J12695O14k451q379
$$ -316035 -345188 -399550 -423908 -385616 -242929 18511 280696 393391 394005 391554 383175
15516C83175m6588q8522j13864j22027r0140n3489q8508j11528m9180L0487P3753
$$ 383175 336587 248065 134201 12174 -77966 -131455 -219963 -331491 -380671 -350184 -276431
15505b76431Q1980O4268N9823M6674J334o3853j35073j69058j43786p9265L81
$$ -276431 -194451 -130183 -70360 -23686 -22352 -86205 -221278 -390336 -534122 -613387 -613006
15494f13006N0166Q7563J18693Q6796K8930L0015M2941Q641k5481l3894l6151
$$ -613006 -562840 -475277 -356584 -269788 -240858 -210843 -167902 -159261 -184742 -218636 -254787
15483b54787n1034q8524j04958j13433j16680n5236Q6300J60954J10295J2000
$$ -254787 -305821 -394345 -499303 -612736 -729416 -784652 -698352 -537398 -427103 -415103
15473d15103j10960j74950j29074j7642M5093L3370O5556J34854J61087J31690
$$ -415103 -526063 -701013 -830087 -847729 -802636 -769266 -703710 -568856 -407769 -276079
15463b76079O9142J9144J2646K209N609N1891N9372K4004k7297j00535j29693
$$ -276079 -206937 -187793 -175147 -172938 -167329 -115438 -56066 -32062 -59359 -159894 -289587
15452b89587j21101j49863j65062j32437j03211j07734j24319j10699l0893R1503
$$ -289587 -410688 -560551 -725613 -858050 -961261 -1068995 -1193314 -1304013 -1334906 -1243403
15442a243403K03961K52213K05603J32866P3799R652k3149k6545m4114j17813
$$ -1243403 -1039442 -787229 -581626 -448760 -374961 -365309 -388458 -415003 -459117 -576930
15432e76930j96560j68354p1154M4747J72166K30346J84482Q4731R352J5743O6212
$$ -576930 -773490 -941844 -1012998 -968251 -796085 -565739 -381257 -296526 -287174 -271431 -205219
15421b05219R6712J16422J09210M2569j5811M12Q38n6635j01984q3199j8248L4232
$$ -205219 -108507 7915 117125 159694 143883 144295 145133 88498 -13486 -96685 -114933 -80701
15409h0701Q8232J01286M8867N3877J41234J79803J12111j2346r0999p3154l4653
$$ -80701 7531 108817 157684 211561 352795 532598 644709 632363 541364 468210 433557
15398D33557l3397o4508j06006j80915k40599k11401j15711J1682J01880J42051
$$ 433557 400160 335652 229646 48731 -191868 -403269 -518980 -507298 -405418 -263367
15388b63367J41327N3063p9795j38659j10098p9433n3271P406M9948J2763m1353
$$ -263367 -122040 -68977 -148772 -287431 -397529 -476962 -530233 -522827 -472879 -460116 -501469
15377e01469k5700j0960n9498j08818r7471o1954r0046j81649j79594p7894k2008
$$ -501469 -527169 -538129 -597627 -706445 -803916 -865870 -955916 -1137565 -1317159 -1395053 -1417061
15366a417061K0233O1819M8905N6838J51830K47213K04287P6556J5705K1181L5400
$$ -1417061 -1396828 -1335009 -1286104 -1229266 -1077436 -830223 -625936 -549380 -533675 -512494 -477094
15355d77094L4065K8167M1975M1405M914o9392j17390n0544N2142Q1902J07218
$$ -477094 -443029 -414862 -372887 -331482 -326568 -395960 -513350 -563894 -511752 -429850 -322632
15344c22632J16321O4521M3024O1341L1834n1661j09624q8486l4181k0844k0797
$$ -322632 -206311 -141790 -98766 -37425 -5591 -57252 -166876 -255362 -289543 -310387 -331184
15333c31184P614K0512J3754P911J9590L982n8872j01929j19074j18908o0232
$$ -331184 -323570 -303058 -289304 -281393 -261803 -257821 -316693 -418622 -537696 -656604 -716836
15322g16836K779K0024L2981P4021J15214J15321O9156K9457N2417J01393P2655
$$ -716836 -714057 -694033 -661052 -587031 -471817 -356496 -287340 -257883 -205466 -104073 -31418
15311c1418k0492l9011K1986K6122n6132r3821o3533l2535q855K6028R5881J47696
$$ -31418 -51910 -90921 -68935 -42813 -98945 -192766 -256299 -288834 -297689 -271661 -175780 -28084
15299b8084J10089N5108P4976J09468O0051m8876j38501j29750k1510Q4565J15259
$$ -28084 82005 137113 212089 321557 381608 332732 194231 64481 42971 127536 242795
15288B42795O0126j4294m1880k837Q4210J34795Q5086n9816k40702l21225k45553
$$ 242795 302921 288627 246747 243910 328120 462915 548001 488185 247483 -73742 -319295
15277c19295j01592L6482J26678J48243R4256j7494j24732j51641j14348n4647
$$ -319295 -420887 -384405 -257727 -109484 -15228 -32722 -157454 -309095 -423443 -478090
15267d78090p500K516j6837m9960o8385o4110j5699P4220J22395J00663P8328
$$ -478090 -485590 -483074 -499911 -549871 -618256 -682366 -698065 -623845 -501450 -400787 -322459
15256c22459O6642K6616k6436l9298L215R2663J46520J03167M1877J8769O319
$$ -322459 -255817 -229201 -255637 -294935 -291720 -199057 -52537 50630 92507 111276 117595
15245A17595j1763k3934n3485j17237j57534j21227j9545Q5819J07041L2375l4157
$$ 117595 105832 81898 28413 -88824 -246358 -367585 -387130 -301311 -194270 -161895 -196052
15234a96052m2896l8229p398M4214P0074N2383j2730q1768q6609k2837P6674J26114
$$ -196052 -238948 -277177 -284575 -240361 -170287 -117904 -130634 -212402 -299011 -321848 -245174 -119060
15222a19060P8988l330m1542n2034p4357r6012p4074q2994j50355j49122j1715
$$ -119060 -40072 -43402 -84944 -136978 -211335 -307347 -381421 -464415 -614770 -763892 -775607
15211g75607J23752J17869N9883L7598J6291j8828n8462q1584r6550j18031j26546
$$ -775607 -651855 -533986 -474103 -436505 -420214 -439042 -497504 -579088 -675638 -793669 -920215
15200i20215r6954J015R7812J08325Q8861M4383k8593o8272q0475p5667l5064
$$ -920215 -1017169 -1016154 -918342 -810017 -721156 -676773 -705366 -773638 -854113 -929780 -964844
15189i64844j03R296N8092R6107L3283p0041j28927r7195L5336J61587J87671
$$ -964844 -964947 -955651 -897559 -801452 -768169 -838210 -967137 -1064332 -1028996 -867409 -679738
15178f79738J10363M701m1314m1711o8205p8330J6969J15710R5356j3864j14830
$$ -679738 -569375 -564674 -605988 -647699 -715904 -794234 -777265 -661555 -566199 -580063 -694893
15167f94893j20587m6587Q3070K50399L37517K76534J57812J37517J84383J08605
$$ -694893 -815480 -862067 -778997 -528598 -191081 85453 243265 380782 565165 673770
15157F73770o8358j73922j85046k01097k16239k22398k09629j54219p9122j2744
$$ 673770 605412 431490 246444 45347 -170892 -393290 -602919 -757138 -836260 -849004
15147h49004P9628J89517J97804J18440N1603L0401J1684l3059j00618j57107
$$ -849004 -769376 -579859 -382055 -263615 -212012 -181611 -169927 -202986 -303604 -460711
15137d60711j35755o1830J1112Q5666J22248J06836N0002k0626p3545p6640k7901
$$ -460711 -596466 -658296 -647184 -561518 -439270 -332434 -282432 -303058 -376603 -453243 -481144
15126d81144J4338K2996k1879q6913j03968o8159l844N8914J01834J16127O9248
$$ -481144 -466806 -443810 -465689 -552602 -656570 -724729 -728573 -669659 -567825 -451698 -382450
15115c82450r533n3892n3206m2014n1930l6531Q423L8029M9740M4596K2848j5272
$$ -382450 -391983 -445875 -499081 -541095 -593025 -629556 -621133 -583104 -533364 -488768 -465920 -481192
15103d81192j6015l760n4698p7492k8468k0064j15726j75619r6239M8719J63103
$$ -481192 -497207 -500967 -555665 -633157 -661625 -681689 -797415 -973034 -1069273 -1020554 -857451
15092h57451J77081J40866R9035P0145J00027J57074J55577P4557n6811j68925
$$ -857451 -680370 -539504 -440469 -370324 -270297 -113223 42354 116911 60100 -108825
15082a08825j66849p0094J0761N714j870M8695R4702J09024O0537l6920j14686
$$ -108825 -275674 -345768 -335007 -329293 -331163 -282468 -187766 -78742 -18205 -55125 -169811
15071a69811j32559r1596n3068o0096p9485q0185j2406R6704J66995J72539J41017
$$ -169811 -302370 -393966 -447034 -507130 -586615 -666800 -679206 -582502 -415507 -242968 -101951
15060a01951Q0032K5440K6895j122q5638j71008j90360j00033J9314Q6247P2674
$$ -101951 -21919 3521 30416 29294 -56344 -227352 -417712 -517745 -498431 -412184 -339510
15049c39510k7780j63928j69499o215J35334J32798K2920l7841n018q126l3954
$$ -339510 -367290 -531218 -700717 -706932 -571598 -438800 -415880 -453721 -458739 -466865 -500819
15038e00819R925O2559L4905j9737m9874m5407q957J9777J1735n819J2301K6730
$$ -500819 -490894 -428335 -393430 -413167 -463041 -508448 -517405 -497628 -485893 -491712 -479411 -452681
15026d52681K5501L3697P8557J43281J65026R1385o656j5322j7861m8786k2796
$$ -452681 -427180 -393483 -314926 -171645 -6619 84766 78110 62788 44927 -3859 -26655
15015b6655M6210R6651J41458K24732K51976J58747L6181m4481j05185j34893
$$ -26655 19555 116206 257664 482396 734372 893119 929300 884819 779634 644741
15005F44741r2498m7433q6190j36134r2137j7581j6823l6251l2852j6149N0774
$$ 644741 552243 504810 418620 282486 190349 172768 155945 119694 86842 70693 121467
14994A21467J15162O6559o9967j10583k2120J0629k3724j8336k3900m3471k0596
$$ 121467 236629 303188 233221 122638 100518 111147 87423 69087 45187 1716 -18880
14983a8880R453K8962L5237K972q1075j62036j72407q6307K1257L8072P895L243
$$ -18880 -9427 19535 54772 57744 -23331 -185367 -357774 -444081 -422824 -384752 -376857 -373614
14971c73614K4576O1481P5881N5108j6869j35965k05669j60132m6875P2549J24350
$$ -373614 -349038 -287557 -211676 -156568 -173437 -309402 -515071 -675203 -722078 -649529 -525179
14960e25179O7357j2031j9320K0829K3749Q148K1304K1258m0715j22744j48880
$$ -525179 -457822 -469853 -489173 -468344 -444595 -436447 -415143 -393885 -434600 -557344 -706224
14949g06224j11596m9217K4140N5550L0526K588l691j7262l8944N3995K44444
$$ -706224 -817820 -867037 -842897 -787347 -756821 -754233 -757924 -775186 -814130 -760135 -515691
14938e15691L47470L04108J99684J16448M0443n4886j36887j80871j42160p3148
$$ -515691 -168221 135887 335571 452019 492462 437576 300689 119818 -22342 -95490
14928i5490l3177K8570J15131J55787P2154j12533k24693j42665J2882N3010o353
$$ -95490 -128667 -100097 15034 170821 242975 130442 -94251 -236916 -224034 -171024 -177377
14917a77377r569J6618K4789K1970p5228k21100k58734j88289j15922o9825k2709
$$ -177377 -186946 -170328 -145539 -123569 -198797 -419897 -678631 -866920 -982842 -1052667 -1075376
14906a075376J9398K1945K9250M7176M7367M5033L9221L1604K8195N1768O7835
$$ -1075376 -1055978 -1034033 -1004783 -957607 -910240 -865207 -825986 -794382 -766187 -714419 -646584
14895f46584N9058J8160l0671k4624J4646M0140P4036R0464P3736P14j28324j84597
$$ -646584 -587526 -569366 -600037 -624661 -610015 -569875 -495839 -405375 -331639 -330925 -459249 -643846
14883f43846j30608k6968N7426O8287L7499M3412Q9791J31754J63203J35072N3127
$$ -643846 -774454 -801422 -743996 -675709 -638210 -594798 -505007 -373253 -210050 -74978 -21851
14872b1851m4688j08541q9661o0496m9988l3840n7716j12257j11114j4707J29413
$$ -21851 -66539 -175080 -264741 -325237 -375225 -409065 -466781 -579038 -690152 -704859 -575446
14861e75446J89696J32037L4961l7481m1437l4719n5624m7824k2850q871k2611
$$ -575446 -385750 -253713 -218752 -256233 -297670 -332389 -388013 -435837 -458687 -467558 -490169
14850d90169m5438m1045k9816q370M4898R2191J04927R9245R6921P8195L6177
$$ -490169 -535607 -576652 -606468 -614838 -569940 -477749 -372822 -273577 -176656 -98461 -62284
14839f2284K9848J1752n8057o7979L8855J51790J31400q193j00780m2055N4248
$$ -62284 -32436 -20684 -78741 -146720 -107865 43925 175325 167132 66352 24297 78545
14828G8545P9776Q8320N8615o5977k03529k17125j13168n0377m3727k0478L326
$$ 78545 158321 246641 305256 239279 35750 -181375 -294543 -344920 -388647 -409125 -405799
14817d05799P264K8682P9794J08354R6668N5701K9024K4515J9561K1278J5944
$$ -405799 -398535 -369853 -290059 -181705 -85037 -29336 -312 24203 43764 65042 80986
14806H0986K9534N8734P8724P3616L1752r902p945K8398L0272n2817j29288j21893
$$ 80986 110520 169254 247978 321594 353346 343444 335499 363897 394169 341352 212064 90171
14794I0171p9471l1906K2913N7225K3847l2959p5096j39159j88196j89897j74272
$$ 90171 10700 -21206 1707 58932 82779 49820 -25276 -164435 -352631 -542528 -716800
14783g16800j03764L8262J40621J66832J60758J74287J56749P0655j2160m9513
$$ -716800 -820564 -782302 -641681 -474849 -314091 -139804 16945 87600 75440 25927
14773B5927o8977l7229L9687N5173K534J2339J00379J06101k2804j61960j93724
$$ 25927 -43050 -80279 -40592 14581 17115 29454 129833 235934 213130 51170 -142554
14762a42554j32224n4400k3036l7697n2083l9167k0783o778K3714J6606l9136
$$ -142554 -274778 -329178 -352214 -389911 -441994 -481161 -501944 -508722 -485008 -468402 -507538
14751e07538n9735j6329M6854P8161O0429M375o1897r0472n5370P85o988o4450
$$ -507538 -567273 -583602 -536748 -458587 -398158 -393783 -455680 -546152 -601522 -600737 -607725 -672175
14739f72175q4496n0898M4652J50498J85960J53594J14614M2682o9169j73150
$$ -672175 -756671 -807569 -762917 -612419 -426459 -272865 -158251 -115569 -184738 -357888
14729c57888k06665j15738L3219J23545J14477N0551K4163P0939J24089J31150
$$ -357888 -564553 -680291 -647072 -523527 -409050 -358499 -334336 -263397 -139308 -8158
14719h158R0926N8329P7200R2300K1322q4710m6255J02947J66484P4289p8649
$$ -8158 82768 141097 218297 310597 331919 247209 200954 303901 470385 544674 466025
14708D66025j55435j10199p704O1471R1467P4491K3835p550K4992R1723R1665
$$ 466025 310590 200391 192687 254158 345625 420116 443951 436401 461393 553116 644781
14697F44781K3366l4482o5915j05704j15000j09534j02637p6131k6601Q586N372
$$ 644781 668147 633665 567750 462046 347046 237512 134875 58744 32143 40729 46101
14686D6101j8996o3839p6025n5304n4481r6507j39423q9103M3015J63558K13030
$$ 46101 27105 -36734 -112759 -168063 -222544 -319051 -458474 -547577 -504562 -341004 -127974
14675a27974J85072P6634o2335j52081j67741j00544n31L1963r45M146N7641Q2880
$$ -127974 57098 133732 71397 -80684 -248425 -348969 -349500 -317537 -318482 -314336 -256695 -173815
14663a73815N2540K7790J1131j8049l7023o1027n7020O240P7621Q2323M1803l468
$$ -173815 -121275 -93485 -82354 -100403 -137426 -198453 -255473 -249233 -171612 -89289 -47486 -50954
14651e0954n9432p7847n3388o731N7709J03637Q4253l858r3835j06628m1758M6754
$$ -50954 -110386 -188233 -241621 -248352 -190643 -87006 -2753 -6611 -100446 -207074 -248832 -202078
14639b02078P3176J8923m5309p2568m5867J4045P2369R7817O9403J3926k5142
$$ -202078 -128902 -109979 -155288 -227856 -273723 -259678 -187309 -89492 -20089 -6163 -31305
14628c1305k0100Q198J570l3213n5968r9408j55101j64055o8558L8624K7707k1118
$$ -31305 -51405 -43207 -41637 -74850 -130818 -230226 -385327 -549382 -617940 -579316 -551609 -572727
14616e72727r112R5853K48233L17721K43364Q2371p3107j14527m0206K398K1781
$$ -572727 -581839 -485986 -237753 79968 323332 405703 332596 218069 177863 180261 202042
14605B02042P6565J18153R6646j7733j63853k00641j62612j48217j23853n9893
$$ 202042 278607 396760 493406 475673 311820 111179 -51433 -199650 -323503 -383396
14595c83396J9280P4107N9294L477p4686j25953q2145l2430l2254k1643J9161
$$ -383396 -364116 -290009 -230715 -227238 -301924 -427877 -510022 -542452 -574706 -596349 -577188
14584e77188Q5693J68647J68170J00554J0737q6250j11249o9991l5007j0149L168
$$ -577188 -491495 -322848 -154678 -54124 -43387 -129637 -240886 -310877 -345884 -356033 -352865
14573c52865k7524n3526j8834J7457J1767j0197j9673j6013p578k3096o2517n6713
$$ -352865 -380389 -433915 -452749 -435292 -423525 -433722 -453395 -469408 -476986 -500082 -562599 -619312
14561f19312J0809M1771j6859p7956j11076j29661q6666r351R0104J69367J28967
$$ -619312 -608503 -566732 -583591 -661547 -772623 -902284 -988950 -998301 -908197 -738830 -609863
14550f09863J6261l6489J4376O2567L7572l7003q5168r7109o1618N9483J98685
$$ -609863 -593602 -630091 -615715 -553148 -515576 -552579 -637747 -734856 -796474 -736991 -538306
14539e38306K35036J53435N0266J8213K9849L3876N6384P4798M7918k3448r7136
$$ -538306 -303270 -149835 -99569 -81356 -51507 -17631 38753 113551 161469 138021 40885
14528D0885j30391j43153j68941j10046N4439J47934R2984K0323q914o8617j62026
$$ 40885 -89506 -232659 -401600 -511646 -457207 -309273 -216289 -195966 -204880 -273497 -435523
14517d35523k12224j54678l774J09977Q5570k2844q5672o9394k8433P766J0984
$$ -435523 -647747 -802425 -806199 -696222 -610652 -633496 -719168 -788562 -816995 -809229 -798245
14506g98245p410L1898J14436J64172P5659n8804l5672L1552M7423R2180J11601
$$ -798245 -805655 -773757 -659321 -495149 -419490 -478294 -513966 -482414 -434991 -342811 -231210
14495b31210J6170j01414r4697J4775J11957J29999R5248Q0617J13179J28000
$$ -231210 -215040 -316454 -411151 -396376 -284419 -154420 -59172 21445 134624 262624
14485B62624Q7246K5690n268l0796n2349p4582j38743j68045j26685r2915j11475
$$ 262624 349870 375560 370292 339496 287147 212565 73822 -94223 -220908 -313823 -425298
14474d25298r4882j44J08486J42843J29354P8045m186o3943n5096J0298N7442
$$ -425298 -520180 -520324 -411838 -268995 -139641 -61596 -65782 -129725 -184821 -174523 -117081
14463a17081O7986M5462j379k5986j7673P755J3948p775k1871k3398n4819o7270
$$ -117081 -49095 -3633 -5012 -30998 -48671 -40916 -26968 -34743 -56614 -80012 -134831 -202101
14451b02101K426O5708P2149M0919j97n6082j32311j59325j08136p5869p7569
$$ -202101 -199675 -133967 -61818 -20899 -21096 -77178 -209489 -368814 -476950 -552819 -630388
14440f30388l9192L3962J06973J67514J68903R1290k6129j19171j14356k1525
$$ -630388 -669580 -635618 -528645 -361131 -192228 -100938 -127067 -246238 -360594 -382119
14430c82119M4769K6814j3068l2905m7749m5663j3180K4988L7064L542n7877p9157
$$ -382119 -337350 -310536 -323604 -356509 -404258 -449921 -463101 -438113 -401049 -397507 -455384 -534541
14418e34541O027J33467J40177M0494P115L2258L7500J8452j8055l1533l9601
$$ -534541 -528514 -395047 -254870 -214376 -207261 -175003 -137503 -119051 -137106 -168639 -208240
14407b08240r0391j34578r4369j1901M7622J09074J15975K7293m1305j9717k6763
$$ -208240 -298631 -433209 -527578 -539479 -491857 -382783 -266808 -239515 -280820 -300537 -327300
14396c27300j22350k52656k83173j50383J6995J33255J66877J33859P2294Q107
$$ -327300 -449650 -702306 -985479 -1135862 -1118867 -985612 -818735 -684876 -612582 -604475
14386f04475j132L6154O0861J0893r0356j10390j5445P1917O6228M828o3636r8226
$$ -604475 -605607 -569453 -508592 -497699 -588055 -698445 -713890 -641973 -575745 -570917 -634553 -732779
14374g32779n6758N8689J28708J12572O9340K3642j5935o3249p0776n4825q3600
$$ -732779 -789537 -730848 -602140 -489568 -420228 -396586 -412521 -475770 -546546 -601371 -684971
14363f84971j44164j94734j54893m0445N2310J12185J73236K07197J51616O1781
$$ -684971 -829135 -1023869 -1178762 -1219207 -1166897 -1054712 -881476 -674279 -522663 -460882
14353d60882N271k810n660l14O3364J47130J92151J13330n8782j45133j42940
$$ -460882 -455611 -458421 -464081 -464395 -401031 -253901 -61750 51580 -7202 -152335 -295275
14342b95275j60286j55513p5048L0769Q4210O2185N2246R8867J32169J36187J50645
$$ -295275 -455561 -611074 -686122 -655353 -571143 -508958 -456712 -357845 -225676 -89489 61156
14331F1156J41076Q1278K3122j7379m2641n8173n0798m5366n4478m9592m4506
$$ 61156 202232 283510 306632 289253 246612 188439 137641 92275 37797 -11795 -56301
14320e6301o7302j04987j35573r4539L4209J90903K86173K70593J90846Q7696
$$ -56301 -123603 -228590 -364163 -458702 -424493 -233590 52583 323176 514022 601718
14310F01718k8495j20372j20623m5339P6006J57882Q1323j12875k41927k73655
$$ 601718 573223 452851 332228 286889 362895 520777 602100 489225 247298 -26357
14300b6357k25299j31972q2757n7295m6808n8239k8384N8038J39010J51378R9312
$$ -26357 -251656 -383628 -466385 -523680 -570488 -628727 -657111 -599073 -460063 -308685 -209373
14289b09373L3902J1772Q4981J39459J15384N3581q618k6193p270k539l5260p6788
$$ -209373 -175471 -163699 -78718 60741 176125 229706 221088 194895 187625 185086 149826 73038
14277G3038j46678j44319k412J25045J58285R7655l0496j21310j06054o0521r142
$$ 73038 -73640 -217959 -220371 -95326 62959 160614 130118 8808 -97246 -157767 -166909
14266a66909K1325j8183n9508l8584L8708J80449K76675K34026J28304j6850j30373
$$ -166909 -145584 -163767 -223275 -261859 -223151 -42702 233973 467999 596303 579453 449080
14255D49080j19819p2332p1009r7156p3871J9130J11396J58332J38945L1616r6765
$$ 449080 329261 256929 185920 88764 14893 34023 145419 303751 442696 474312 377547
14244C77547j50416j17534l165J41340K04382J52303M0228l2605o0112q8534r3786
$$ 377547 227131 109597 106432 247772 452154 604457 644685 612080 551968 463434 369648
14233C69648n5056l1403o9592j66415k18317j50088l7180L8733P4633J01027J47790
$$ 369648 314592 283189 213597 47182 -171135 -321223 -358403 -319670 -245037 -144010 3780
14222C780J73336J21951J41j14829j64731j65782j54431j73964j71368j27504
$$ 3780 177116 299067 299208 184379 19648 -146134 -300565 -474529 -645897 -773401
14212g73401q9648k4972N2622Q8154N1024l7971j16379j15723j3163J07883J44574
$$ -773401 -863049 -888021 -835399 -747245 -696221 -734192 -850571 -966294 -979457 -871574 -727000
14201g27000J09053J08323J55108J76891J24062K9877j8548j3869l2831n7823
$$ -727000 -617947 -509624 -354516 -177625 -53563 -23686 -42234 -56103 -88934 -146757
14191a46757n0581m4453r5598j93630k64145k13288p3584L9888N8908O4161J09369
$$ -146757 -197338 -241791 -337389 -531019 -795164 -1008452 -1082036 -1042148 -983240 -919079 -809710
14180h09710J18277P7062M9315L4509L1291J7441l54j485k4513k6711J8610K2106
$$ -809710 -691433 -614371 -565056 -530547 -499256 -481815 -482169 -483654 -508167 -534878 -516268 -494162
14168d94162l6066p6312o1875M9833J79468J86153J04191L2539j810k5543o1567
$$ -494162 -530228 -606540 -668415 -618582 -439114 -252961 -148770 -116231 -118041 -143584 -205151
14157b05151p9015m6585P42M7008O0659J6849o1990j13579r9712n4731n7062j04757
$$ -205151 -284166 -330751 -330009 -283001 -222342 -205493 -267483 -381062 -480774 -535505 -592567 -697324
14145f97324j20732j09860p0906M1738J44200J25081P0933P3379J06953Q9171
$$ -697324 -818056 -927916 -998822 -957084 -812884 -687803 -616870 -543491 -436538 -347367
14135c47367O122o6046p5968p9345j23594j63279j58319r3058o30J21833J92101
$$ -347367 -341245 -407291 -483259 -562604 -686198 -849477 -1007796 -1100854 -1101484 -979651 -787550
14124g87550J66146Q6530j5026p8982j03703j14644j25356j51250j64059j19490
$$ -787550 -621404 -534874 -549900 -628882 -732585 -847229 -972585 -1123835 -1287894 -1407384
14114a407384q4889o0454K5065J06354J10037J18649J21393M1688o5989j12890
$$ -1407384 -1492273 -1552727 -1527662 -1421308 -1311271 -1192622 -1071229 -1029541 -1095530 -1208420
14104a208420n0809Q1509J27474M5549k8089j7592N6383J13155J48767J13112
$$ -1208420 -1259229 -1177720 -1050246 -1004697 -1032786 -1050378 -993995 -880840 -732073 -618961
14094f18961k7632r4407k8890N0378J17503J40114N4042p7263j40342o5662O8353
$$ -618961 -646593 -741000 -769890 -719512 -602009 -461895 -407853 -485116 -625458 -691120 -622767
14083f22767J27488R7299m1379k03800k17575q3793Q9364J78952J25155K7892
$$ -622767 -495279 -397980 -439359 -643159 -860734 -944527 -855163 -676211 -551056 -523164
14073e23164k2331n4830n4147P149J05744J47253P3353K06k6935p5343j11124
$$ -523164 -545495 -600325 -654472 -647323 -541579 -394326 -320973 -320767 -347702 -423045 -534169
14062e34169q9293l4330J4329L3097O8361J06630J35545J40126J15908J29081
$$ -534169 -623462 -657792 -643463 -610366 -542005 -435375 -299830 -159704 -43796 85285
14052H5285J17349L6285l7853o5428p9565q8827j05412j47211j51706r0312J8258
$$ 85285 202634 238919 201066 135638 56073 -32754 -138166 -285377 -437083 -527395 -509137
14041e09137J53988K45482K68833K14349R2355m2290j40097j52731j17197j00986
$$ -509137 -355149 -109667 159166 373515 465870 423580 283483 130752 13555 -87431
14031h7431k9994J35819K11959J33013L8224r883k8495r1292j83499j83314j27982
$$ -87431 -117425 18394 230353 363366 401590 391707 363212 271920 88421 -94893 -222875
14020b22875q9091n2227k8872k1628Q992L8623N7264R6312J17060Q0141n643j00450
$$ -222875 -311966 -364193 -393065 -414693 -405701 -367078 -309814 -213502 -96442 -16301 -21944 -122394
14008a22394j37709r4551j1771N0985K7060m8167o7444k9442J2226J3351l1451
$$ -122394 -260103 -354654 -366425 -315440 -288380 -336547 -403991 -433433 -421207 -407856 -439307
13997d39307q2907r0352k1836O6906J11739R5583Q8930J25017J33228J01863O1847
$$ -439307 -522214 -612566 -634402 -567496 -455757 -360174 -271244 -146227 -12999 88864 150711
13986A50711K6329J5115K7332K6041J4634J6844l2652j17552r7556j9934O311
$$ 150711 177040 192155 219487 245528 260162 277006 244354 126802 29246 9312 15623
13975A5623O296j3867o2048j02301j09534p7928j8679M746j9337m7117m6673J5782
$$ 15623 21919 8052 -53996 -156297 -265831 -343759 -362438 -357692 -377029 -424146 -470819 -455037
13963d55037R0807Q5455J521o3366m8880L2828J01233P3737m582p7263j08889
$$ -455037 -364230 -278775 -277254 -340620 -389500 -356672 -255439 -181702 -186284 -263547 -372436
13952c72436o5746K6392Q1023N5921J8403J1656P134q198m1440r7658j08759n4337
$$ -372436 -438182 -411790 -330767 -274846 -256443 -244787 -237653 -245851 -287291 -384949 -493708 -548045
13940e48045L5075Q5763O6116M9518N8067N0298Q83p7543j46511j55645o6610
$$ -548045 -512970 -427207 -361091 -311573 -253506 -203208 -202325 -279868 -426379 -582024 -648634
13929f48634J07401J94045J10032K2287K0505J6748l3869m7365r900k4067j05459
$$ -648634 -541233 -347188 -237156 -214869 -194364 -177616 -211485 -258850 -268750 -292817 -398276
13918c98276j51212j61214j31669j7508Q7162J02880Q9470Q5691M9370k455k3695
$$ -398276 -549488 -710702 -842371 -859879 -772717 -669837 -580367 -494676 -445306 -447761 -471456
13907d71456k2612K0339M9349k5548j18719j04801k5821K2266N6698J22006J53350
$$ -471456 -494068 -473729 -424380 -449928 -568647 -673448 -699269 -677003 -620305 -498299 -344949
13896c44949O9458o1837q5166j4533L3815K7305l763p412P572m012j3862p478
$$ -344949 -275491 -337328 -422494 -437027 -403212 -375907 -379670 -387082 -379510 -383522 -397384 -404862
13884d04862m1224m9074J6502J12193K15554K69879J98688N4758n3594j39765
$$ -404862 -446086 -495160 -478658 -366465 -150911 118968 317656 372414 318820 179055
13874A79055k01066j73285r7472o5148j14581j44976j14724p1885l0386O998P3110
$$ 179055 -22011 -195296 -292768 -357916 -472497 -617473 -732197 -804082 -834468 -827470 -754360
13863g54360J43824J20982M1716k4683o1501m9585q244P769m2310j23210j29706
$$ -754360 -610536 -489554 -447838 -472521 -534022 -583607 -591851 -584082 -626392 -749602 -879308
13852h79308q9619p0746K451J05225J55862K15022K63843K50073K02579J39864
$$ -879308 -968927 -1039673 -1037222 -931997 -776135 -561113 -297270 -47197 155382 295246
13842B95246N6334k9638p2880o9614n0997j3136Q5158J56028R6446m3089j65832
$$ 295246 351580 321942 249062 179448 128451 115315 200473 356501 452947 409858 244026
13831B44026k38927k22654q2069R2808J67158O9131r2490j79259j90801j63047
$$ 244026 5099 -217555 -299624 -206816 -39658 29473 -63017 -242276 -433077 -596124
13821e96124j06178p3963n3354M9507K12377K74296J79492N8086l7496j09152
$$ -596124 -702302 -776265 -829619 -780112 -567735 -293439 -113947 -55861 -93357 -202509
13811b02509j64600j61797q1553r477J2965j3770k5564j6260k8512m7082n3485
$$ -202509 -367109 -528906 -610459 -619936 -606971 -620741 -646305 -662565 -691077 -738159 -791644
13800g91644n2751n2341k4638P8775J75182J17087m990k8849L7239R9281J07882
$$ -791644 -844395 -896736 -921374 -842599 -667417 -550330 -555320 -584169 -546930 -447649 -339767
13789c39767O8681M3790J03421J94754K43863J93718J1602j28763j42341j43765
$$ -339767 -271086 -227296 -123875 70879 314742 508460 520062 391299 248958 105193
13779A05193j53849j29421p3627j302K0153m120J6546P8870P0939l1690j60296
$$ 105193 -48656 -178077 -251704 -253006 -232853 -236973 -220427 -141557 -70618 -102308 -262604
13768b62604j87531q3561O172J9539K5095L1165K8447K6611Q4686J91800K70409
$$ -262604 -450135 -533696 -527524 -507985 -482890 -451725 -423278 -396667 -311981 -120181 150228
13757A50228K78082J85102M0585p3868r9825o3411k4086L3221J14516J65480J40409
$$ 150228 428310 613412 653997 580129 480304 416893 392807 426028 540544 706024 846433
13746H46433N2078m7561j18864j46860j32927j11145j12385q6181K5533J23037
$$ 846433 898511 850950 732086 585226 452299 341154 228769 142588 168121 291158
13736B91158J00682N6j38624k18312j86816j37138j04410o0239L2094Q6851L5879
$$ 291158 391840 391896 253272 34960 -151856 -288994 -393404 -453643 -421549 -334698 -298819
13725b98819o437o337k7274m4517m4052m4318o5158p1518p336N9163Q1630R7553
$$ -298819 -305256 -311593 -338867 -383384 -427436 -471754 -536912 -608430 -615766 -556603 -474973 -377420
13713c77420J13343Q4775O5756R1624Q9926N5737O7552J15642J06561J3876q6368
$$ -377420 -264077 -179302 -113546 -21922 68004 123741 191293 306935 413496 427372 341004
13702C41004j28134j01287m7217k8739n5518n7653M646L4249l4238q1348o5840
$$ 341004 212870 111583 64366 35627 -19891 -77544 -72898 -38649 -72887 -154235 -220075
13691b20075n9172l3790R17K2360M7625M9449M1576M8178J6931j5741q399k9292
$$ -220075 -279247 -313037 -312120 -289760 -242135 -192686 -151110 -102932 -86001 -101742 -110141 -139433
13679a39433q2546j11270j17963p5724l7779m0880j2932R3136J98713J84070J05442
$$ -139433 -221979 -333249 -451212 -526936 -564715 -605595 -618527 -525391 -326678 -142608 -37166
13668c7166L9775l9578j10464j55438j79375j39245m6144K6584L8468J8156K0221
$$ -37166 2609 -36969 -147433 -302871 -482246 -621491 -667635 -641051 -602583 -584427 -564206
13657e64206Q6722J73223K01289J46838L3226r2020j71793k33576k07674o3823
$$ -564206 -477484 -304261 -102972 43866 77092 -14928 -186721 -420297 -627971 -691794
13647f91794L5699K6745M5518J40878J54040O9830n2168j46929j55889q6914M5268
$$ -691794 -656095 -629350 -583832 -442954 -288914 -219084 -271252 -418181 -574070 -660984 -615716
13636f15716J53665J44006Q9235J10032J48958J48322J18715K2813j03046j55264
$$ -615716 -462051 -318045 -228810 -118778 30180 178502 297217 320030 216984 61720
13626F1720j62113j30279o5547l7510k6437j0443p709J3928O0316Q6638J04463
$$ 61720 -100393 -230672 -296219 -333729 -360166 -370609 -378318 -364390 -304074 -217436 -112973
13615a12973R1401L8055K0147N4424R1691J05986R8791P0298J2138q4178j50884
$$ -112973 -21572 16483 36630 91054 182745 288731 387522 457820 469958 385780 234896
13604B34896j84543j97846j08238L9251Q4740J1314p9963j60814k10200j54773
$$ 234896 50353 -147493 -255731 -216480 -131740 -120426 -200389 -361203 -571403 -726176
13594g26176r811J22220J73222J54154J13699J03768R5250M7909j591J8281J02854
$$ -726176 -735987 -613767 -440545 -286391 -172692 -68924 26326 74235 72644 90925 193779
13583A93779J29852Q8100K8955K698r68k2569k8318L779M2337M0099l0767q4692
$$ 193779 323631 411731 440686 443384 442416 419847 391529 395308 437645 477744 446977 362285
13571C62285n6292q934J6678L5989L7798j8455j06086j30654o2761J9084O5873
$$ 362285 305993 297059 313737 349726 387524 369069 262983 132329 69568 88652 154525
13560A54525O1457K2731K0r97l9317j24592j32497n6096l1722j9643L7376R9694
$$ 154525 215982 238713 238733 237736 198419 73827 -58670 -114766 -146488 -166131 -128755 -29061
13548b9061J52837J81086J19501K2887J1334J07077J94138J61176J5912j60236
$$ -29061 123776 304862 424363 447250 458584 565661 759799 920975 936887 776651
13538G76651k57238k27154j40822r1042o4370l7199K0438J26390J69066J00898
$$ 776651 519413 292259 151437 60395 -3975 -41174 -20736 105654 274720 375618
13528C75618J8903k1142P59M2975L6679J0733k879m2175j04672j48826j70610
$$ 375618 394521 373379 374138 417113 453792 464525 461646 419471 314799 165973 -4637
13517d637j47082j32669j49314j16456j9143P8002J20388R8646P5982R3559J20440
$$ -4637 -151719 -284388 -433702 -550158 -569301 -491299 -370911 -272265 -196283 -102724 17716
13506A7716J48150J65625J60401O5950k7942q152K0151j9815r0536j23429r0080
$$ 17716 165866 331491 491892 557842 529900 521748 541899 522084 431548 308119 218039
13495B18039n0154q7790j06415j5404M2680j5551p6606o3783k1767L7284R2670
$$ 218039 167885 80095 -26320 -41724 956 -14595 -91201 -154984 -176751 -139467 -46797
13484d6797J27100J39070J22970K8528r9500j69980j85154j28608R383J64819
$$ -46797 80303 219373 342343 370871 271371 101391 -83763 -212371 -202988 -38169
13474c8169K18480J79091R0693l6045j34404j52668j35649p1918J9007K8583l3138
$$ -38169 180311 359402 450095 414050 279646 126978 -8671 -80589 -61582 -32999 -66137
13463f6137p7372m6770l942J1525L1231P8274J24473J16721M6086k8543q0485
$$ -66137 -143509 -190279 -194221 -182696 -151465 -73191 51282 168003 214089 185546 105061
13452A05061j15251j32104j45560j45979j30313p5419Q776P2870Q7330M8991J704
$$ 105061 -10190 -142294 -287854 -433833 -564146 -639565 -630789 -557919 -470589 -421598 -419894
13441d19894q784J6202K2531k1815p5761q3985p0389k8391J01090K51913L23928
$$ -419894 -428678 -412476 -389945 -411760 -487521 -571506 -641895 -670286 -569196 -317283 6645
13430F645L16282K55898J31305j0110p3970r6208j85594k26092q6563P8421J53701
$$ 6645 322927 578825 710130 700020 626050 529842 344248 118156 31593 110014 263715
13419B63715J72238J51078J16152O1435k5038j01880j25891p7336j0461L5958
$$ 263715 435953 587031 703183 764618 739580 637700 511809 434473 424012 459970
13409D59970R842j01843k00972j96802j18490p8968j36331k06611j58921o0605
$$ 459970 469812 367969 166997 -29805 -148295 -227263 -363594 -570205 -729126 -789731
13399g89731l9508n046O4992O4140N5479R3989J34782J47829J11160N3567P981
$$ -789731 -829239 -834285 -769293 -705153 -649674 -555685 -420903 -273074 -161914 -108347 -100366
13388a00366j3112J0599J6704k8631l5799j8863j4338m426J3947M4969K8691n1063
$$ -100366 -113478 -102879 -86175 -114806 -150605 -169468 -183806 -188232 -174285 -129316 -100625 -151688
13376a51688p8583j5623J6515k8604q2899p0247J4375R3270J06303O3471J5829
$$ -151688 -230271 -245894 -229379 -257983 -340882 -411129 -396754 -303484 -197181 -133710 -117881
13365a17881j7178m9517k2805N5940N9778k4900j09307j09337l6163M3106Q8213
$$ -117881 -135059 -184576 -207381 -151441 -91663 -116563 -225870 -335207 -371370 -328264 -240051
13354b40051P3125J3455R83K5944j8252r5823r2955j2735R4453J93560K26766
$$ -240051 -166926 -153471 -152488 -126544 -144796 -240619 -333574 -346309 -251856 -58296 168470
13343A68470J97379J74417J07816o9906k17401k06116q4763K5452P4870P2663
$$ 168470 365849 540266 648082 578176 360775 154659 69896 95348 170218 242881
13333B42881M1968k645n0422q7590q6039r0370j08697q4187P351P5504O3847K2315
$$ 242881 284849 282204 231782 144192 58153 -32217 -140914 -225101 -217750 -142246 -78399 -56084
13321e6084N4197J08259P7824j7843j39089k17163j59912j8243M9691J9857k9319
$$ -56084 -1887 106372 184196 166353 27264 -189899 -349811 -368054 -318363 -298506 -327825
13310c27825m1055k0286l7673q8894o7028L6055J35737J32238O4244J9591L9847
$$ -327825 -368880 -389166 -426839 -515733 -582761 -546706 -410969 -278731 -214487 -194896 -155049
13299a55049J12906J70730J99331K14190J69811N1468j4031p230l7406o7344p8590
$$ -155049 -42143 128587 327918 542108 711919 763387 749356 742126 704720 637376 558786
13288E58786r1282p9739n8454o4810r0786o7742n417K7439N135k5119l2718k4439
$$ 558786 467504 387765 329311 264501 173715 105973 100556 127995 133130 108011 75293 50854
13276E0854N7066J55265J30781k0593j37913j21621j9242J5526n0094j02207r7836
$$ 50854 107920 263185 393966 373373 235460 113839 94597 110123 60029 -42178 -140014
13265a40014l8523L3011N5949O8109O3195K8778j3392n6757o8733k5804M485K8901
$$ -140014 -178537 -145526 -89577 -21468 41727 70505 57113 356 -68377 -94181 -89696 -60795
13253f0795Q1133R9792N1286j0523n0975p5436o4179J13O7677J20614J81238K26005
$$ -60795 20338 120130 171416 160893 109918 34482 -29697 -29584 38093 158707 339945 565950
13241E65950K34649J99406J37986M6513k4398m300O7157R2595O9077M4184l073
$$ 565950 800599 1000005 1137991 1184504 1160106 1155806 1222963 1315558 1384635 1428819 1425746
13230A425746o1298r1626r5671q1627p3868r1313q5187j5961N1839N2604J7586
$$ 1425746 1364448 1272822 1177151 1095524 1021656 930343 845156 829195 881034 933638 951224
13219I51224M1896J24641J83168J21381k6930j42371j48344n9597N1860R7913
$$ 951224 993120 1117761 1300929 1422310 1395380 1253009 1104665 1045068 1096928 1194841
13209A194841R0321P0493L0863j5741m6728o4312o5410n1321j5775N1884Q3938
$$ 1194841 1285162 1355655 1386518 1370777 1324049 1259737 1194327 1143006 1127231 1179115 1263053
13198A263053J0834j08572r8516N8814K21904K54821J88644J09458P144q6930
$$ 1263053 1273887 1165315 1066799 1125613 1347517 1602338 1790982 1900440 1907584 1820654
13188A820654j47980k01601k06595j64187j54411j63499j06473j1357M6672J31608
$$ 1820654 1672674 1471073 1264478 1100291 945880 782381 675908 664551 711223 842831
13178H42831K25704J96931M4392r8630j12254n7486o842N5091Q2979N319o7770
$$ 842831 1068535 1265466 1309858 1211228 1098974 1041488 1034646 1089737 1172716 1178035 1110265
13167A110265m8331l8815l9885j7538n788J3897R2293J28633P7377N451l0227
$$ 1110265 1061934 1023119 983234 965696 959908 973805 1066098 1194731 1272108 1277559 1247332
13156A247332M1925J56323J34280q741r6082j05079n7912K7872N8432N2617P8230
$$ 1247332 1289257 1445580 1579860 1571119 1475037 1369958 1312046 1339918 1398350 1450967 1529197
13145A529197J24282J36402J11715O2414k570o9254j08684j23963j42664j32332
$$ 1529197 1653479 1789881 1901596 1964010 1961440 1892186 1783502 1659539 1516875 1384543
13135A384543n5753l83P118K7878M4432N8144P2418M6475l410k9233L2671J45541
$$ 1384543 1328790 1328407 1335525 1363403 1407835 1465979 1538397 1584872 1581462 1552229 1584900 1730441
13123A730441J43286N2637J7439J4221j6248k9161K3439P9322O9165K8589K6367
$$ 1730441 1873727 1926364 1943803 1958024 1941776 1912615 1936054 2015376 2084541 2113130 2139497
13112B139497P9800J14460P2425j1217p2732j17954r6039L9325J50669J48472
$$ 2139497 2219297 2333757 2406182 2394965 2322233 2204279 2108240 2147565 2298234 2446706
13102B446706J21730J00692Q0307R2890J26400J27269R9112P6183P3824N2413
$$ 2446706 2568436 2669128 2749435 2842325 2968725 3095994 3195106 3271289 3345113 3397526
13092C397526j2730l1485M659L1220Q989n2308r4187j01734r9295j08023j04064
$$ 3397526 3384796 3353311 3357970 3389190 3398179 3345871 3251684 3149950 3050655 2942632 2838568
13081B838568m9412r070k692M3139J37984K17893K58979K27658J48329J19493
$$ 2838568 2789156 2780086 2777394 2820533 2958517 3176410 3435389 3663047 3811376 3930869
13071C930869J27421R0428K1604l8136q6646r7698r3248j27068j67577j12921
$$ 3930869 4058290 4148718 4170322 4132186 4045540 3947842 3854594 3727526 3559949 3447028
13061C447028O110P3015R3193J28309J84761J94618J62402J27147O4765L5600
$$ 3447028 3453138 3526153 3619346 3747655 3932416 4127034 4289436 4416583 4481348 4516948
13051D516948N4152P7609Q4965J10595J81103K35878K41353K30334K29898J76946
$$ 4516948 4571100 4648709 4733674 4844269 5025372 5261250 5502603 5732937 5962835 6139781
13041F139781P1784K4158L1908M8491Q3928J54888J84735J36522Q7913M6458O33
$$ 6139781 6211565 6235723 6267631 6316122 6400050 6554938 6739673 6876195 6964108 7010566 7011199
13030G011199l9801m6621J8306J29237K37894L06822L29826L76830M36394M25448
$$ 7011199 6971398 6924777 6943083 7072320 7310214 7617036 7946862 8323692 8760086 9185534
13020I185534L54319K86200K20407J56492J34946K02000L26043M22659N05664
$$ 9185534 9539853 9826053 10046460 10202952 10337898 10539898 10865941 11288600 11794264
13011A1794264O00734O18288N48696M52624L87884M16214N47582O82300P12588
$$ 11794264 12394998 13013286 13561982 14014606 14402490 14818704 15366286 16048586 16761174
13002A6761174P13590Q35437J058181J220839J314260J453621J638858J847322
$$ 16761174 17474764 18310201 19368382 20589221 21903481 23357102 24995960 26843282
12994B6843282K087714K305164K538993K842100L199339L628326M231799N021884
$$ 26843282 28930996 31236160 33775153 36617253 39816592 43444918 47676717 52698601
12986E2698601N897514O871384Q006577R382002J1143384J3369568J6062678J9282656
$$ 52698601 58596115 65467499 73474076 82856078 93999462 107369030 123431708 142714364
12978A42714364K3092869K7325865L1481003L4385150L3869499K7288594J3498429
$$ 142714364 165807233 193133098 224614101 258999251 292868750 320157344 333655773
12971C33655773m596722k0970210l1080813l4421564l3138161k9566914k5214043
$$ 333655773 329059051 308088841 277008028 242586464 209448303 179881389 154667346
12964A54667346k1022085j7394317j4356001j1861875r887888q336543p040603
$$ 154667346 133645261 116250944 101894943 90033068 80145180 71808637 64768034
12957F4768034n973360n178752m537187l974969l504864l077666k659183k298863
$$ 64768034 58794674 53615922 49078735 45103766 41598902 38521236 35862053 33563190
12949C3563190k042217j823267j602316j348631j132727r94966q56061p09283
$$ 33563190 31520973 29697706 28095390 26746759 25614032 24619066 23763005 23053722
12941B3053722o25664o08439n72960m82357l85942l11153k25674j22507o7793
$$ 23053722 22428058 21819619 21246659 20764302 20378360 20067207 19841533 19719026 19651233
12932A9651233q6390j17701r3505k7359J6028M3406J32935K80722M66308O98062
$$ 19651233 19564843 19447142 19353637 19326278 19342306 19385712 19518647 19799369 20265677 20963739
12922B0963739R15958J073557J179485J308469J497269J680840J831423J910867
$$ 20963739 21879697 22953254 24132739 25441208 26938477 28619317 30450740 32361607
12914C2361607J801798J410871Q53758L61816J06259K05566N99101J024644J371122
$$ 32361607 34163405 35574276 36428034 36789850 36896109 37101675 37700776 38725420 40096542
12905D0096542J690527K075191K613800L320112M137359M960382N822884O850526
$$ 40096542 41787069 43862260 46476060 49796172 53933531 58893913 64716797 71567323
12897G1567323Q083028R597808J1463143J3777052J6672695K0233938K4403026
$$ 71567323 79650351 89248159 100711302 114488354 131161049 151394987 175798013
12890A75798013K8886343L2986889L5275317L3377340K4681662Q909086r854608
$$ 175798013 204684356 237671245 272946562 306323902 331005564 339914650 330060042
12883C30060042k5314728l3701793l5419383l2989125k8829186k4357749k0172793
$$ 330060042 304745314 271043521 235624138 202635013 173805827 149448078 129275285
12876A29275285j6587143j3745951j1516742r697815q167818o911236n856931
$$ 129275285 112688142 98942191 87425449 77727634 69559816 62648580 56791649
12869E6791649m909526m134611l608492l234988k928517k691663k433669k123314
$$ 56791649 51882123 47747512 44139020 40904032 37975515 35283852 32850183 30726869
12861C0726869j780233j437174j170710j020229r60843q91359p26036n55133m54978
$$ 30726869 28946636 27509462 26338752 25318523 24357680 23466321 22740285 22185152 21730174
12852B1730174l92695l96597m95325n37842m82421m26835l76837l29646k58026
$$ 21730174 21337479 20940882 20445557 19907715 19425294 18998459 18621622 18291976 18033950
12843A8033950j77606j19002k5906P5747R7380M4432r141p855R9739L04091M60661
$$ 18033950 17856344 17737342 17711436 17787183 17884563 17928995 17919854 17911999 18011738 18315829 18776490
12832A8776490N10809N38142N93578O93631Q42859J017699J086615J091798J201508
$$ 18776490 19287299 19825441 20419019 21112650 21955509 22973208 24059823 25151621 26353129
12823B6353129J388440J567555J750214J992588K323203K681711L043360L440352
$$ 26353129 27741569 29309124 31059338 33051926 35375129 38056840 41100200 44540552
12815D4540552L919591M544166N303187O206492P318306Q652157J0260301J2273133
$$ 44540552 48460143 53004309 58307496 64513988 71832294 80484451 90744752 103017885
12807A03017885J4770538J7726304K1146363K5055924K9282055L3019696L4437397
$$ 103017885 117788423 135514727 156661090 181717014 210999069 244018765 278456162
12800B78456162L0914665K0322938L582604j4371545k7761277l4070135l4478666
$$ 278456162 309370827 329693765 333276369 318904824 291143547 257073412 222594746
12793B22594746l1553626k7414432k3203652j9372883j6070117j3317306j1088170
$$ 222594746 191041120 163626688 140423036 121050153 104980036 91662730 80574560
12786H0574560r269236p728103o478422n579959m867391m180010l576611l086638
$$ 80574560 71305324 63577221 57098799 51518840 46651449 42471439 38894828 35808190
12778C5808190k665588k307758k027106j846275j716319j579357j469482j405267
$$ 35808190 33142602 30834844 28807738 26961463 25245144 23665787 22196305 20791038
12770B0791038j304960j139709j019745r44534q55166p37457o20775n55275n76503
$$ 20791038 19486078 18346369 17326624 16382090 15526924 14789467 14168692 13613417 13036914
12761A3036914o41518o60853o12210n29002m71872m71532m46760l46257k85224
$$ 13036914 12395396 11734543 11122333 10593331 10121459 9649927 9203167 8856910 8571686
12752H571686l11568l29896l01369k42390j53373j15102j60672k20321k12522
$$ 8571686 8260118 7930222 7628853 7386463 7233090 7117988 6957316 6736995 6524473
12743F524473j63007j96144k97121k91790j37446j732K6062K4833J1493o3478
$$ 6524473 6361466 6165322 5868201 5576411 5438965 5437233 5463295 5488128 5499621 5436143
12733E436143j59338k05233k02351j99493j98081j50658m4261M5932N6530M1487
$$ 5436143 5276805 5071572 4869221 4669728 4471647 4320989 4276728 4322660 4379190 4420677
12723D420677J1150n2114j37949k21485k37749j73936j09236n7159k0966o3450
$$ 4420677 4431827 4379713 4241764 4020279 3782530 3608594 3499358 3442199 3421233 3357783
12713C357783j29723j25541p732J30480J31581j3619j25402j26112r8656p4827
$$ 3357783 3228060 3102519 3094787 3225267 3356848 3343229 3217827 3091715 2993059 2918232
12703B918232n4176n9859q1367q9957p4726p5823j50839k26843j48697K0029P3736
$$ 2918232 2864056 2804197 2722830 2632873 2558147 2482324 2331485 2104642 1955945 1975974 2049710
12692B049710j6026r4549q5991m3791l862P7477J59653J29142J2662q2838j05693
$$ 2049710 2033684 1939135 1853144 1809353 1805491 1882968 2042621 2171763 2184425 2101587 1995894
12681A995894n5940j9806o1368j14641q8598P818L4428j229k7098j0732K8214
$$ 1995894 1939954 1920148 1858780 1744139 1655541 1663359 1697787 1696558 1669460 1658728 1686942
12670A686942R783k1720K8575J64254K46180J73083L4861o1927j12521r6894k3681
$$ 1686942 1696725 1675005 1703580 1867834 2114014 2287097 2321958 2260031 2147510 2050616 2026935
12659B026935O1670J37687J33052L0906q1483j38861j38671r3714j4664L1219
$$ 2026935 2088605 2226292 2359344 2390250 2308767 2169906 2031235 1937521 1922857 1954076
12649A954076M1652L5948K488o8970j69674k16068j49253m029J56301K04567J24893
$$ 1954076 1995728 2031676 2034164 1965194 1795520 1579452 1430199 1426170 1582471 1787038 1911931
12638A911931M1618j4461m1387j9097O745l0878o7525o7206j06586j68382j96805
$$ 1911931 1953549 1939088 1897701 1878604 1885349 1854471 1786946 1719740 1613154 1444772 1247967
12627A247967j25622J5895Q5540K8598p9300j02564o2742p6284j25405j44788
$$ 1247967 1122345 1138240 1223780 1252378 1173078 1070514 1007772 931488 806083 661295
12617F61295j21743q8256p1548j9512Q1462J66999J87235J57917J25724J18492
$$ 661295 539552 451296 379748 360236 441698 608697 795932 953849 1079573 1198065
12607A198065Q0719L7784M3070O2265L0627k6760o3095j07219j37939j22155n1666
$$ 1198065 1278784 1316568 1359638 1421903 1452530 1425770 1362675 1255456 1117517 995362 943696
12596I43696M1271L5935j11361k29449k15332j06939P328M6600Q3546J57437J61652
$$ 943696 984967 1020902 909541 680092 464760 357821 365149 411749 495295 652732 814384
12585H14384Q7995M7707J9866n5729j61745k19779k07918j60530r2419O645P2701
$$ 814384 902379 950086 969952 914223 752478 532699 324781 164251 71832 78477 151178
12574A51178Q477j01787j05529n4605m2238k2480M9509J34724J91736J95771J17341
$$ 151178 159655 57868 -47661 -102266 -144504 -166984 -117475 17249 208985 404756 522097
12563E22097J7584J270L1660J4777k9668l2503K2667Q9480Q8632m850j15228j57986
$$ 522097 539681 540951 572611 587388 557720 525217 547884 637364 725996 721146 605918 447932
12551D47932q8601K8751R5292P6187L8399O8500Q4031K1384n2170j04085j47122
$$ 447932 359331 388082 483374 559561 597960 666460 750491 771875 719705 615620 468498
12540D68498j63111j25216n2737o033k804M2714Q8855O9441L5977L3862K1673
$$ 468498 305387 180171 127434 121401 118597 161311 250166 319607 355584 389446 411119
12529D11119j0070k2646p597L8762P2937N8254j8899o5419m2440N045N1479O2777
$$ 411119 401049 378403 370806 409568 482505 540759 521860 456441 414001 419046 470525 533302
12517E33302J4311m9363m5744j098j4822n5043q6496j28704j22976o3442k0716
$$ 533302 547613 498250 452506 451408 436586 381543 295047 166343 43367 -20075 -40791
12506d0791K0166P5997J22469J70993K06640J74131J03984K8106p2469j78246
$$ -40791 -20625 55372 177841 348834 555474 729605 833589 861695 789226 610980
12496F10980k55069k32283j14364J2635P6347Q8026O3600l2619j27542j41822
$$ 610980 355911 123628 9264 21899 98246 186272 249872 217253 89711 -52111
12486e2111j22657r3204k8355M4139M8352R790O938N9111Q9915Q5189N7072M992
$$ -52111 -174768 -267972 -296327 -252188 -203836 -194046 -187108 -127997 -38082 47107 104179 109171
12474A09171k9520n1595p6587m8405K3644J10689K04044K26592J71676Q5431M35
$$ 109171 79651 28056 -48531 -96936 -73292 37397 241441 468033 639709 725140 725575
12463G25575p8775j54869j97933j58133m1842J5015n91R573J4643o593P907L6424
$$ 725575 646800 491931 293998 135865 94023 109038 108447 118020 132663 126070 133977 170401
12451A70401O4041R7970J06028O0765j5943l4876Q574M7588Q062n6852n8419n8105
$$ 170401 234442 332412 438440 499205 483262 448386 456960 504548 512610 455758 397339 339234
12439C39234m9160P309K8902j8851p0357q3777j06575j20072m8932K9879M7611
$$ 339234 290074 297383 326285 307434 237077 153300 46725 -73347 -122279 -92400 -44789
12428d4789O5382O5020L4198K7535O2722J05114R7175O6690J6218q0215j46952
$$ -44789 20593 85613 119811 147346 210068 315182 412357 479047 495265 415050 268098
12417B68098j32008n2995N5996J47993J66477O1619j31548k23502j54962o7914
$$ 268098 136090 83095 139091 287084 453561 515180 383632 160130 5168 -62746
12407f2746m6179k5948M482M2462R4950J35088J46851J34086R2908P5807J15953
$$ -62746 -108925 -134873 -130391 -87929 7021 142109 288960 423046 515954 591761 707714
12396G07714J37414R3369J1360o4441j01966l1650J13540K00668J65893N6148
$$ 707714 845128 938497 949857 885416 783450 751800 865340 1066008 1231901 1288049
12386A288049m5778r8158q5248n5764j03448j82979j80396j12042m7894K0180
$$ 1288049 1242271 1144113 1058865 1003101 899653 716674 536278 424236 376342 396522
12376C96522Q9004R9051N4176q033m8461k2730J09385K13752J29564l7749j44743
$$ 396522 485526 584577 638753 630720 582259 559529 668914 882666 1012230 974481 829738
12365H29738j43311q3404k2565k732j6384n901K1504K1382K2361K6549O370Q565
$$ 829738 686427 603023 580458 577726 561342 555441 576945 598327 620688 647237 653607 662172
12353F62172j7056q1600j33701j75219j38819P134J53103J68000O9022q170m778
$$ 662172 645116 563516 429815 254596 115777 122911 276014 444014 513036 504866 500088
12342E00088M8478J34715J57891Q6549j632o9425j47164k59614l25540k90516
$$ 500088 548566 683281 841172 927721 926089 856664 709500 449886 124346 -166170
12332a66170j68353m069Q8090R7693P9431O6987J02078J52951J27721M8947K697
$$ -166170 -334523 -338592 -250502 -152809 -73378 -6391 95687 248638 376359 425306 428003
12321D28003k9727m2064j9572j8992n9915j21450j26726j19920j11590r1179n5635
$$ 428003 398276 356212 336640 317648 257733 136283 9557 -110363 -221953 -313132 -368767
12310c68767Q0351K27613K42961J43409Q232j04897j18141q0509n5012j8741M7069
$$ -368767 -288416 -60803 182158 325567 333799 228902 110761 30252 -24760 -43501 3568
12299C568J11245J05778N9276O3217Q8078M7318l8659j09365j48181j30313m4600
$$ 3568 114813 220591 279867 343084 431162 478480 439821 330456 182275 51962 7362
12288G362K3741J2710J5241Q0311J28747J03645J7158p8103j11092r4667p3709
$$ 7362 31103 43813 59054 139365 268112 371757 388915 310812 199720 105053 31344
12277C1344p0856r5779j22050r0427O715J04103J22843N4202o9616j71259j96074
$$ 31344 -39512 -135291 -257341 -347768 -341053 -236950 -114107 -59905 -129521 -300780 -496854
12266d96854j24570j8120N6938O4504J4815m995J1999J163k8944m344P1779J52210
$$ -496854 -621424 -639544 -582606 -518102 -503287 -508282 -496283 -495120 -524064 -528408 -456629 -304419
12254c04419J55781J12571P7137K6698j895J1904J4328K2882L1684M0053P5348
$$ -304419 -148638 -36067 41070 67768 65873 77777 92105 114987 146671 186724 262072
12243B62072O9227L5029M2305P3613N9194l9625j16620r1698j2889N6071O340
$$ 262072 331299 366328 408633 482246 541440 501815 385195 293497 280608 336679 343019
12232C43019j29986j90175j62575q8236j3735K8924L8341K6366L666m951K7608
$$ 343019 213033 22858 -139717 -227953 -241688 -212764 -174423 -148057 -144391 -149342 -121734
12221a21734M8943M8233L5782O332l9893q4413q2101m4449j5285N5757J42960
$$ -121734 -72791 -24558 11224 17556 -22337 -106750 -188851 -233300 -248585 -192828 -49868
12210d9868J43014J07931O5457L3944M0994M9919M7493O7453O9073L3530L6895
$$ -49868 93146 201077 266534 300478 341472 391391 438884 506337 575410 608940 645835
12199F45835L9797o4298k34490l29495k66444j12078K3268J28009J89797J46574
$$ 645835 685632 621334 386844 57349 -209095 -321173 -297905 -169896 19901 166475
12189A66475L5310k2269j5453o632J5609N2884N5541M3737R156n5190n7588k4963
$$ 166475 201785 179516 164063 157431 173040 225924 281465 325202 334358 279168 221580 196617
12177A96617o5376j48851j60955r0268r883N0107O1060q681n2647m026Q0371P3347
$$ 196617 131241 -17610 -178565 -268833 -278716 -228609 -167549 -176230 -228877 -232903 -152532 -79185
12165g9185o3901j64561j21976k5173J8967n9418j92904j80015k0676J27578J64595
$$ -79185 -143086 -307647 -429623 -454796 -435829 -495247 -688151 -868166 -888842 -761264 -596669
12154e96669J19934K20449M07640L88209K23175P7064j6263n6092l9242L847N2407
$$ -596669 -476735 -256286 151354 539563 762738 839802 823539 767447 728205 732052 784459
12143G84459M8598J8801K0055J5761m581n034N659j4318o3315j42273j74983j24612
$$ 784459 833057 851858 871913 887674 883093 878059 883718 869400 806085 663812 488829 364217
12131C64217j5773J11523J81691J74912J27450R0095Q3197P9785N5752M5925J8848
$$ 364217 348444 459967 641658 816570 944020 1034115 1117312 1197097 1252849 1298774 1317622
12120A317622o4827j53768j99661k03472j64136j09619m9527j5814j3873j7776
$$ 1317622 1252795 1099027 899366 695894 531758 422139 372612 356798 342925 325149
12110C25149k3983j6711k484l1913m5321J3775M8014J1236j7520K0887J05397
$$ 325149 301166 284455 281971 250058 204737 218512 266526 277762 260242 281129 386526
12099C86526J50120R7757J3358n5124j07365q0863O13N7846O0678P676n8086n9581
$$ 386526 536646 634403 647761 592637 485272 404409 405022 462868 523546 531222 473136 413555
12087D13555M2051J23869J07998M2765j2129M353O3390P0103N8908L0250m6279
$$ 413555 455606 579475 687473 730238 718109 722462 785852 855955 914863 945113 898834
12076H98834j08164j13959q2918k4180M1106N2498j0983j24965k08859j76074
$$ 898834 790670 676711 593793 569613 610719 663217 652234 527269 318410 142336
12066A42336j00797j07912j47554j55176j35660q7325K730J01542J14220K5352
$$ 142336 41539 -66373 -213927 -369103 -504763 -592088 -589358 -487816 -373596 -348244
12056c48244m4750j00984j61795j50459r2975n2706l0100Q230N0599J25224K29854
$$ -348244 -392994 -493978 -655773 -806232 -899207 -951913 -982013 -973783 -923184 -797960 -568106
12045e68106K75841K26031J30380m442j17673j21829o6475l2562o768Q2881K10170
$$ -568106 -292265 -66234 64146 59704 -57969 -179798 -246273 -278835 -285603 -202722 7448
12034G448K74733K32775J28256J4372n8428o5998j7430Q302n5260j58621k25872
$$ 7448 282181 514956 643212 657584 599156 533158 515728 524030 468770 310149 84277
12023H4277j68068p885J37562K11827K00470J32825Q1721M9829M310o1123j38368
$$ 84277 -83791 -91676 45886 257713 458183 591008 672729 722558 726868 665745 527377
12012E27377j48937j20963j01437n6484q615j6715o9500o3278L614Q0472J33035
$$ 527377 378440 257477 156040 99556 90941 74226 4726 -58552 -54938 25534 158569
12001A58569J40410J22714N2799p8440k08091k74032j98557k6167N5258j7059
$$ 158569 298979 421693 474492 396052 187961 -86071 -284628 -310795 -255537 -272596
11991b72596j07427r7977R010J22663J91679J86078J04180k9568j32418j39193
$$ -272596 -380023 -478000 -468990 -346327 -154648 31430 135610 106042 -26376 -165569
11981a65569r8054o3849p5291j20160r2890L0863J09281Q7653N1924K3605l479
$$ -165569 -263623 -327472 -402763 -522923 -615813 -584950 -475669 -388016 -336092 -312487 -315966
11970c15966q552K872N0439R7896J11826J13016R3255M073r9622j48559j59678
$$ -315966 -324518 -321646 -271207 -173311 -61485 51531 144786 148859 49237 -99322 -259000
11959b59000j63140j55107j13427l2508K9797Q7317J54220J54178J28292J75996
$$ -259000 -422140 -577247 -690674 -723182 -693385 -606068 -451848 -297670 -169378 6618
11949F618K24541J83624J07779L5827m9352j18662j44331j49434j66526j44067
$$ 6618 231159 414783 522562 558389 509037 390375 246044 96610 -69916 -213983
11939b13983k3670N6053L604k4282L2536Q2948R0146N7751p987j09713j97384
$$ -213983 -237653 -181600 -177996 -202278 -169742 -86794 3352 61103 53116 -56597 -253981
11928b53981k05450j28829o0475n3575k0525L9207K3061l2570p6947o0174L8706
$$ -253981 -459431 -588260 -648735 -702310 -722835 -683628 -660567 -693137 -770084 -830258 -791552
11917g91552J52332K39976K06041N9924l9446k3759J037m6644q6882k4236Q9690
$$ -791552 -639220 -399244 -193203 -133279 -172725 -196484 -195447 -242091 -328973 -353209 -263519
11906b63519J37687J31029J40715J72581J86323J45597P5478J1991n6895j32323
$$ -263519 -125832 5197 145912 318493 504816 650413 725891 737882 680987 548664
11896E48664j78469j74948j58419j42609o3222N4479R4719L5390m8384j07848
$$ 548664 370195 195247 36828 -105781 -169003 -114524 -19805 15585 -32799 -140647
11886a40647j36898j27431q8044n7776n8771o4422l3525L0390P1224N5481M7709
$$ -140647 -277545 -404976 -493020 -550796 -609567 -673989 -707514 -677124 -605900 -550419 -502710
11875e02710J12106J60692J26260O9715K6633K5183M4967O8886J24981J59248
$$ -502710 -390604 -229912 -103652 -33937 -7304 17879 62846 131732 256713 415961
11865D15961J07370N326r0051j44197j69077j42445q9465q5878m0386M1575Q0885
$$ 415961 523331 528657 438606 294409 125332 -17113 -106578 -192456 -232842 -191267 -110382
11854a10382Q7830K0185r9478j43023k6756J57992K01270P3681j1044L9049O6681
$$ -110382 -22552 -2367 -101845 -244868 -271624 -113632 87638 161319 150275 189324 256005
11843B56005k1476j53620j99057j25755j1210M7884M5988O4283J80937L37578
$$ 256005 234529 80909 -118148 -243903 -255113 -207229 -161241 -96958 83979 421557
11833D21557L84740L02135J88667J56019K33197J62137k10816n49441n08229k78519
$$ 421557 806297 1108432 1297099 1453118 1686315 1848452 1637636 1088195 579966 301447
11823C01447j56018j42661k38700k99777j93376k1949J33255J54226O4121j031
$$ 301447 145429 2768 -235932 -535709 -729085 -751034 -617779 -463553 -399432 -400463
11813d00463q830j2631l1784o864R3111K04733J87398Q8535L7283K7128N251J299
$$ -400463 -409293 -421924 -453708 -460572 -367461 -162728 24670 113205 150488 177616 182867 184166
11801A84166N5881J06193Q0488p399j09396k14084k52572j60991n4716q6054j76402
$$ 184166 240047 346240 426728 419329 309933 95849 -156723 -317714 -372430 -458484 -634886
11790f34886j30015M0000J46428J21955Q2069R7546J22264R2628K3651K0326O8673
$$ -634886 -764901 -724901 -578473 -456518 -374449 -276903 -154639 -62011 -38360 -18034 50639
11779E0639K7340q0296j01861p9347r7002j16701q4614j4872K4333K2416n552
$$ 50639 77979 -2317 -104178 -183525 -280527 -397228 -481842 -496714 -472381 -449965 -455517
11768d55517L6098J68861K34883J68312N2291l6304o9757o1011k2300J7580K5706
$$ -455517 -419419 -250558 -15675 152637 204928 168624 98867 37856 15556 33136 58842
11757E8842m237l2415m6296r3656j40015r0295Q3985K42056K21451M3100j16739
$$ 58842 54605 22190 -24106 -117762 -257777 -348072 -264087 -22031 199420 242520 125781
11746A25781j21043l9719M7818Q9478N1326l693M427O8600J19294J13930Q3510
$$ 125781 4738 -34981 12837 102315 153641 149948 154375 222975 342269 456199 539709
11735E39709O8117P2493N1537j2123m7369m1252l4098j2259J9035P791k010J3593
$$ 539709 607826 680319 731856 719733 672364 631112 597014 584755 603790 611581 609571 623164
11723F23164j1702q9999j03693l1615L4968P1365O6516J0035n1033j04368j61579
$$ 623164 611462 521463 417770 386155 421123 492488 559004 569039 518006 413638 252059
11712B52059j98202j80231j48696j54676j22229n769J30095J92125J21701l7713
$$ 252059 53857 -126374 -275070 -429746 -551975 -557744 -427649 -235524 -113823 -151536
11702a51536j71185k38684k27003j19690K9711J44037J69927J49177J52129J22347
$$ -151536 -322721 -561405 -788408 -908098 -878387 -734350 -564423 -415246 -263117 -140770
11692a40770p854j58629k39477k25903j25936n0247n8876r0451o0958L1127J21028
$$ -140770 -148624 -307253 -546730 -772633 -898569 -948816 -1007692 -1098143 -1159101 -1127974 -1006946
11681a006946J59805J92124K25609J78650L4578p6980o6380k4985k3751n0054
$$ -1006946 -847141 -655017 -429408 -250758 -216180 -293160 -359540 -384525 -408276 -458330
11671d58330l7811J3719O3707Q1336N6112M81l7712J4821J11992J70408J60983
$$ -458330 -496141 -482422 -418715 -337379 -281267 -280786 -318498 -303677 -191685 -21277 139706
11660A39706J19658J10302R7656L0464p6069j53171j76183j22396M315J01968
$$ 139706 259364 369666 467322 497786 421717 268546 92363 -30033 -25718 76250
11650G6250P2711k2931n5400j5383J1300M071Q861L5357N4075M1235K7355K0938
$$ 76250 148961 126030 70630 55247 66547 70618 79479 114836 168911 210146 237501 258439
11638B58439r920q4089j55289j52283q3987p6690j30719j03826J2252J06635J58804
$$ 258439 248519 164430 9141 -143142 -227129 -303819 -434538 -538364 -526112 -419477 -260673
11627b60673J81728J42746O3490q413j7863J6153k437n5465n8801m71M8706P1733
$$ -260673 -78945 63801 127291 118878 101015 117168 114731 59266 465 -6 48700 120433
11615A20433Q5385N6952J1109J915K8850O4921R2985P0565n524r1385j23876p8817
$$ 120433 205818 262770 273879 275794 304644 369565 462550 533115 527591 436206 312330 233513
11603B33513m4552q1715j43595j57053j08067n2046j4112M3567R8780P5476k7677
$$ 233513 188961 107246 -36349 -193402 -301469 -353515 -367627 -324060 -225280 -149804 -177481
11592a77481p3378J3807J08619J14390Q4634M1530J0659j2196n4268p3462m1339
$$ -177481 -250859 -237052 -128433 -14043 70591 112121 122780 110584 56316 -17146 -58485
11581e8485J5118R2453J42971J19140Q5786O9910M6355j868n8049q5820q1669
$$ -58485 -43367 49086 192057 311197 396983 466893 513248 511380 453331 367511 285842
11570B85842q8852q1191n1297k3554j6487k0924j1881r832o3936j44984j90554
$$ 285842 196990 115799 64502 40948 24461 3537 -8344 -18176 -82112 -227096 -417650
11559d17650k23569k55780k24949q0325M8411N1265R207L78M9339O3444M1228
$$ -417650 -641219 -896999 -1121948 -1202273 -1153862 -1102597 -1093390 -1093012 -1043673 -980229 -939001
11548i39001O5345J31499J84374J50937N5519m4460j07203j21726j24943j10376
$$ -939001 -873656 -742157 -557783 -406846 -351327 -395787 -502990 -624716 -749659 -860035
11538h60035n4709R010J1409m921N8218J59030K09656K32532J99712P4396m5291
$$ -860035 -914744 -905734 -894325 -899246 -841028 -681998 -472342 -239810 -40098 34298 -10993
11527a0993q2179n0944P023M6712L1304K89k821J3446J6998j7552q8740j23237
$$ -10993 -93172 -144116 -137093 -90381 -59077 -58788 -61609 -48163 -31165 -48717 -137457 -260694
11515b60694p6536k8233J690Q9702J49021Q7652j0939l3926R346M3274K0715m7174
$$ -260694 -337230 -365463 -363773 -274071 -125050 -37398 -48337 -82263 -72917 -29643 -8928 -56102
11503e6102j45491k20137k12766p8914J00852K19130K37305J75743R7089M8480
$$ -56102 -201593 -421730 -634496 -713410 -612558 -393428 -156123 19620 116709 165189
11493A65189L8289Q371p0805j79061k09275j19681k4453M902L9165Q9555R1257
$$ 165189 203478 211849 141044 -38017 -247292 -366973 -391426 -386524 -347359 -257804 -166547
11482a66547O2265L7481J6988o823k0593J7609R1627J26326Q5795O3668J06008
$$ -166547 -104282 -66801 -49813 -56636 -77229 -59620 32007 158333 244128 307796 413804
11471D13804J01474K95r2261q3937q480K3325n5684j84435k19999r5322R9184
$$ 413804 515278 515573 423312 339375 330895 354220 298536 114101 -105898 -201220 -102036
11460a02036K26283K33109J23732j5092p3237m5137L7046J28107J45990O0610
$$ -102036 124247 357356 481088 465996 392759 347622 384668 512775 658765 719375
11450G19375k2860n5345q1256j06113p7420l8726o5714r3274r9343o8612j5342
$$ 719375 696515 641170 559914 453801 376381 337655 271941 178667 79324 10712 -4630
11439d630O278J3664M2003P0533Q9213O3215k5147j12017j12908n6173N0963J61200
$$ -4630 1648 15312 57315 127848 217061 280276 255129 143112 30204 -25969 24994 186194
11427A86194J59086O2098j3880l0225l3299q237K7927L273r7785j38995q4011
$$ 186194 345280 407378 393498 363273 329974 321737 349664 352937 255152 116157 32146
11416C2146j6552N4958J34498J89772K07006J47503P4378P4192J30345J44028
$$ 32146 15594 70552 205050 394822 601828 749331 823709 897901 1028246 1172274
11406A172274J44254K05160L05827M20070N78520Q23446J036281J096505R40601
$$ 1172274 1316528 1521688 1827515 2247585 2826105 3649551 4685832 5782337 6722938
11397F722938M81783k28262q25218j003273q98864p51586o00697m71467m20137
$$ 6722938 7204721 6976459 6151241 5147968 4249104 3497518 2896821 2425354 2005217
11388B005217m02248l73396l09736j88584m5595L8201L6302r090o9816r2989p7230
$$ 2005217 1602969 1229573 919837 731253 685658 723859 760161 751071 681255 588266 511036
11377E11036q0441j05541j52695j65349j32798j08674o1830J8910P4303J09717
$$ 511036 430595 325054 172359 7010 -125788 -234462 -296292 -277382 -203079 -93362
11367i3362J83548K42612K45538J87623Q6649j5052r1689j75100k81503l01137
$$ -93362 90186 332798 578336 765959 852608 837556 745867 570767 289264 -11873
11357a1873k38409j55463m9451K1424J8551K663M0933Q0800M9377j6013o5270
$$ -11873 -250282 -405745 -455196 -433772 -415221 -412558 -371625 -290825 -241448 -257461 -322731
11346c22731o2562j3655N4013R5610Q4619L8051l281j8829l3186j01797j70799
$$ -322731 -385293 -398948 -344935 -249325 -164706 -126655 -129936 -148765 -181951 -283748 -454547
11335d54547j51557r8060l6042K8003R9920J72185K41987K30081J16942J3714
$$ -454547 -606104 -704164 -740206 -712203 -612283 -440098 -198111 31970 148912 162626
11325A62626l5035p8300j45119j66423p4385L9741R7062R9941P1360K6655n1501
$$ 162626 127591 49291 -95828 -262251 -336636 -296895 -199833 -99892 -28532 -1877 -53378
11314e3378j65157k25412j69065o0922J7654L9881M8270Q0528J30552J88066J89197
$$ -53378 -218535 -443947 -613012 -673934 -656280 -616399 -568129 -487601 -357049 -168983 20214
11303B0214J21869L0883p7788j76768k03816j28005P389J65486K84198K53169
$$ 20214 142083 172966 95178 -81590 -285406 -413411 -406022 -240536 43662 296831
11293B96831J09920j9369r9518r6580j0553M5963K3527k2904o2829q7802p5197
$$ 296831 406751 387382 287864 191284 180731 226694 250221 227317 164488 76686 1489
11282A489j5316L9752L4583j1931l3426q288N605k9874k9444N1211J20514J08093
$$ 1489 -13827 25925 60508 48577 15151 6863 12468 -17406 -46850 4361 124875 232968
11270B32968L7761j47M5147Q9295M9471r990R568O0257R0623J03486M1634j20931
$$ 232968 270729 270582 315729 405024 454495 444505 454073 514330 604953 708439 750073 629142
11258F29142k56616k55778j59309k7605J01119J40272O6269J1395N3362N4247
$$ 629142 372526 116748 -42561 -70166 30953 171225 237494 248889 302251 356498
11248C56498r794m3969j7866K0770j252l5721l9641l7341n3371o0275l1264L8970
$$ 356498 346704 302735 284869 305639 304387 268666 229025 191684 138313 78038 46774 85744
11236H5744J26389J65031R5805j7016j06767j59168j65062r8362o919N8752R9302
$$ 85744 212133 377164 472969 455953 349186 190018 24956 -73406 -80325 -21573 77729
11225G7729N9534l3518r8414q9878p0804p7939j8786N7699O0842N2233K8747k4052
$$ 77729 137263 103745 5331 -84547 -155351 -233290 -252076 -194377 -133535 -81302 -52555 -76607
11213g6607q1411q5327j0439O5802J19801J31249N7656l7618m8302l542M5159
$$ -76607 -158018 -243345 -253784 -187982 -68181 63068 120724 83106 34804 31262 76421
11202G6421P9401O8600N231m1422l3599Q226N0760O9401P6324O5352m383n9444
$$ 76421 155822 224422 229653 188231 154632 162858 213618 283019 359343 424695 420312 360868
11190C60868m8786o8382j77522k60606k24373j16998p4034p7177o2569o0355m0993
$$ 360868 312082 243700 66178 -194428 -418801 -535799 -609833 -687010 -749579 -809934 -850927
11179h50927O696O1879J37234J69207R4160M8722N9696O0245Q9306Q7816K4668
$$ -850927 -844231 -782352 -645118 -475911 -381751 -333029 -273333 -213088 -123782 -35966 -11298
11168a1298j6915n5344j07824j35053j17776l6240O0994J08266J23582J09696
$$ -11298 -28213 -83557 -191381 -326434 -444210 -480450 -419456 -311190 -187608 -77912
11158g7912Q0641M6626K8261M610k2039j4117k6367o2523m1221j2303n2266j16202
$$ -77912 2729 49355 77616 82226 60187 46070 19703 -42820 -84041 -96344 -148610 -264812
11146b64812j18893p9685J8621J42956J71211Q9864K5706R267j9871l8739j7650
$$ -264812 -383705 -463390 -444769 -301813 -130602 -40738 -15032 -5765 -25636 -64375 -82025
11135h2025K0414K9396j1335l2185l9802q2706q0832j6248K5452L244k2893K2828
$$ -82025 -61611 -32215 -43550 -75735 -115537 -198243 -279075 -295323 -269871 -266627 -289520 -266692
11123b66692N7280M0574K7968K2257m516k4267j0631J554j2975m5439r4175j82188
$$ -266692 -209412 -168838 -140870 -118613 -123129 -147396 -158027 -156473 -169448 -214887 -309062 -491250
11111d91250j99417j07695p266O6625J02863R5033Q0626Q7679Q4739O3264K3352
$$ -491250 -690667 -798362 -805628 -739003 -636140 -541107 -460481 -372802 -288063 -224799 -201447
11100b01447l282J1855N1509J26727J97298J52224O1996n3054j70067j85784j47836
$$ -201447 -204729 -192874 -141365 -14638 182660 334884 396880 343826 173759 -12025 -159861
11089a59861r1663l814J03572J56283R0719L213M3017J50532J51368P5789L2974
$$ -159861 -251524 -255338 -151766 4517 95236 98449 141466 291998 443366 519155 552129
11078E52129K7812j6335j03009j61022j61647j37099j09243q2174p5698o8224
$$ 552129 579941 563606 460597 299575 137928 829 -108414 -190588 -266286 -334510
11068c34510m1428J1727Q6622R6898M7584R642l874L7894J16451J86754K16458
$$ -334510 -375938 -364211 -277589 -180691 -133107 -123465 -127339 -89445 27006 213760 430218
11057D30218J80478J44599J46760J29761P4290o719q1857j13597j05121m9980
$$ 430218 610696 755295 902055 1031816 1106106 1099387 1017530 903933 798812 748832
11047G48832J5989K6544j4427p4906n3182Q4364K15574K15707J33746L9012j9910
$$ 748832 764821 791365 776938 702032 648850 733214 948788 1164495 1298241 1337253 1317343
11036A317343o418M0892P8716J09328J29473J12810L5940n4330j04331j00265
$$ 1317343 1310925 1351817 1430533 1539861 1669334 1782144 1818084 1763754 1659423 1559158
11026A559158m1151N3053J26323J22080P0554N8041L5825o7842j79262j71753
$$ 1559158 1518007 1571060 1697383 1819463 1890017 1948058 1983883 1916041 1736779 1565026
11016A565026n5630M1809J06894J83383K37317K02849R9638L4560L3812O9311
$$ 1565026 1509396 1551205 1658099 1841482 2078799 2281648 2381286 2415846 2449658 2518969
11006B518969Q1469K8159p3526j15912q6362q2905j25803j42744j12554q4905
$$ 2518969 2600438 2628597 2555071 2439159 2352797 2269892 2144089 2001345 1888791 1803886
10996A803886n9169q3581j32142j21835r2008q9862j01183o8239j2914K1357N6684
$$ 1803886 1744717 1661136 1528994 1407159 1315151 1225289 1124106 1055867 1042953 1064310 1120994
10985A120994J05203J64014K16260K02543J77900J75996J02267k7259r3889o5757
$$ 1120994 1226197 1390211 1606471 1809014 1986914 2162910 2265177 2237918 2144029 2078272
10975B078272K441P1292J07626R4272O4455M3745n269o2595l9951L6924Q3463
$$ 2078272 2080713 2152005 2259631 2353903 2418358 2462103 2456834 2394239 2354288 2391212 2474675
10964B474675N7398j1317n5078o8645n0698O118L2093O254j3033Q265M5204N2280
$$ 2474675 2532073 2520756 2465678 2397033 2346335 2352453 2384546 2390800 2377767 2386032 2431236 2483516
10952B483516K9132k1655j03643j63484j88183j79653j56441p5123M7740R5190
$$ 2483516 2512648 2490993 2387350 2223866 2035683 1856030 1699589 1624466 1672206 1767396
10942A767396P9394Q4134P5866K1467k2163l7459p1138j36843j24921K8591K03829
$$ 1767396 1846790 1930924 2006790 2028257 2006094 1968635 1897497 1760654 1635733 1664324 1868153
10931A868153L06509L36217K74242J46748Q445q5274j19826o1206O0363J36933
$$ 1868153 2174662 2510879 2785121 2931869 2940314 2855040 2735214 2674008 2734371 2871304
10921B871304J59607J81767J76579J32976J44802K11619K60285K62010J84713
$$ 2871304 3030911 3212678 3389257 3522233 3667035 3878654 4138939 4400949 4585662
10912D585662P4901j3452o143J52107K74947K52566J85402J49178J36189J73981
$$ 4585662 4660563 4647111 4640968 4793075 5068022 5320588 5505990 5655168 5791357 5965338
10902E965338K18908K19665J76224P1047l364k4073l6183p6871o9295J8265J32774
$$ 5965338 6184246 6403911 6580135 6651182 6647818 6623745 6587562 6510691 6441396 6459661 6592435
10891F592435K33056K63019K41069K37173K58509L06497L26495K93809J92177
$$ 6592435 6825491 7088510 7329579 7566752 7825261 8131758 8458253 8752062 8944239
10882H944239J0534j48728k59712l78249m75796n36893n21389m42212l96486m02205
$$ 8944239 8954773 8806045 8546333 8168084 7692288 7155395 6634006 6191794 5795308 5393103
10872E393103m47607m37529l53898k48421j19140o8073j24830j82484k71326l57808
$$ 5393103 4945496 4507967 4154069 3905648 3786508 3718435 3593605 3411121 3139795 2781987
10862B781987k96816r0498R8844J59847Q8860l7316r2144p9805m9010k794j1751
$$ 2781987 2485171 2394673 2493517 2653364 2742224 2704908 2612764 2532959 2483949 2481155 2469404
10851B469404o8248r8142j02070j22206j45924j68850j52461q0121k1593j7255
$$ 2469404 2401156 2303014 2200944 2078738 1932814 1763964 1611503 1531382 1509789 1492534
10841A492534j8524j227N996N4633O2773l5963j17954j34906j39139j50521j70673
$$ 1492534 1474010 1472783 1478779 1533412 1596185 1560222 1442268 1307362 1168223 1017702 847029
10830H47029j36615j092J33897J20442k2668k17201l39791k98424j70939k6356
$$ 847029 710414 709322 843219 963661 940993 723792 384001 85577 -85362 -111718
10820a11718Q9936J01687j8391j83574k46812j99040j43461n5971O5181J21729
$$ -111718 -21782 79905 61514 -122060 -368872 -567912 -711373 -767344 -702163 -580434
10810e80434J06047R5322R1206R8228J58323J83525J12786M5186P118n8239j09553
$$ -580434 -474387 -379065 -287859 -189631 -31308 152217 265003 310189 317307 259068 149515
10799A49515p7564M5326J47887J39394L6260j03945j68467j25455p0129n2887
$$ 149515 71951 117277 265164 404558 440818 336873 168406 42951 -27178 -80065
10789h0065n1133p1988r9669q9916o5333p0944o3124R858O4777N5493M4300K9853
$$ -80065 -131198 -203186 -302855 -392771 -458104 -529048 -592172 -582314 -517537 -462044 -417744 -387891
10777c87891K154J2507N5762Q6831N5062r553m5732n1544l6350K8015J18139J86137
$$ -387891 -385737 -373230 -317468 -230637 -175575 -185128 -230860 -282404 -318754 -290739 -172600 13537
10765A3537J68607N3336p9221j01224m7623l4606r0556q2021K0065P4342N9113
$$ 13537 182144 235480 156259 55035 7412 -27194 -117750 -199771 -179706 -105364 -46251
10754d6251L3634J9349K7585L4482M504n8459j49361k28300k57887k10741j28520
$$ -46251 -12617 6732 34317 68799 73303 14844 -134517 -362817 -620704 -831445 -959965
10743i59965m6649J6024O7973Q8794J01187J52071K20353K38345J58583N1689
$$ -959965 -1006614 -990590 -922617 -833823 -732636 -580565 -360212 -121867 36716 88405
10733H8405r981j5061l6111j10759j74518j72396j17914l4986K5263K0653k3429
$$ 88405 78424 63363 27252 -83507 -258025 -430421 -548335 -583321 -558058 -537405 -560834
10722e60834n5890j14557j57949n2015J85707M11241M72983L17624R7085j949
$$ -560834 -616724 -731281 -889230 -941245 -755538 -344297 128686 446310 543395 541446
10712E41446M3829Q3651O7383P7857J04376O5808k8206r9290j10601o5913j400
$$ 541446 585275 668926 736309 814166 918542 984350 956144 856854 746253 680340 678940
10701F78940N1126P9330P3015j5124j07528j49414j65381j29910l1274L5528J8884
$$ 678940 730066 809396 882411 867287 759759 610345 444964 315054 283780 319308 338192
10690C38192k5172r766M1336L5078J6193K4927M5423N1417N3296O8469N2092K5384
$$ 338192 313020 303254 344590 379668 395861 420788 466211 517628 570924 639393 691485 716869
10678G16869O92n7762o9844l7215n2502r9781r9728l5403m2673j08209o8450L3528
$$ 716869 717561 659799 589955 552740 500238 400457 300729 265326 222653 114444 45994 79522
10666G9522P1501J8860p5300r6402k7192M9345J5129l9949m452J1929l1248o3593
$$ 79522 151023 169883 94583 -1819 -29011 20334 35463 -4486 -8938 2991 -28257 -91850
10654i1850r0481q8648j653J07240J60829J67436J55489J38852R3680K3612o0774
$$ -91850 -182331 -270979 -272632 -165392 -4563 162873 318362 457214 550894 574506 513732
10643E13732j66395k26339j22038O4852J20607K6395q3947j02176L665J37186
$$ 513732 347337 120998 -1040 63812 184419 210814 126867 24691 28356 165542
10633A65542J81514J45013J17077J14210J09681P8571M5456K4166l134R057N2890
$$ 165542 347056 492069 609146 723356 833037 911608 957064 981230 978096 987153 1040043
10622A040043L7870K933j5600p2647j96363l20220l34399l16130k98196j57215
$$ 1040043 1077913 1080846 1065246 992599 796236 476016 141617 -174513 -472709 -629924
10612f29924R5588K86364K83557J17042n3302j10822q5892p78R2841Q6107o67
$$ -629924 -534336 -247972 35585 152627 99325 -11497 -97389 -98167 -5326 80781 80114
10601H0114o6531j31579j38392m2616L786k5083j0229N9124J32758J43340J51486
$$ 80114 13583 -117996 -256388 -299004 -295218 -320301 -330530 -271406 -138648 4692 156178
10590A56178J90967J71750J24665J13783R7659L9104l3255j18831j71378j28781
$$ 156178 347145 518895 643560 757343 855002 894106 860851 742020 570642 441861
10580D41861n4562l0175m762L8850O0702N1066O0952J12954J08748L6813o3355
$$ 441861 387299 357124 352362 391212 451914 502980 563932 676886 785634 822447 759092
10569G59092j34842j32828r5898m7648J6679N1147M1172J8187n518k8535q4496
$$ 759092 624250 491422 395524 347876 364555 415702 456874 475061 469543 441008 356512
10558C56512j55173j30995o576J05526J64827J76769J63912J25948M4149k2519
$$ 356512 201339 70344 63768 169294 334121 510890 674802 800750 844899 822380
10548H22380o2179j30748k19214k32473j86013j65715j13452l5361L3967P2242
$$ 822380 760201 629453 410239 177766 -8247 -173962 -287414 -322775 -288808 -216566
10538b16566N4973k9459j52696j71283k8654J78460L15486L72590L87389K89101
$$ -216566 -161593 -191052 -343748 -515031 -543685 -365225 -49739 322851 710240 999341
10528I99341Q4766j06026j67817j63969j41403r1412k9657K9781Q3597J00432
$$ 999341 1084107 978081 810264 646295 504892 413480 383823 413604 497201 597633
10518E97633N7470j0999p7549p0436P3M9882J6770p6754r9518q4700r6961r6898
$$ 597633 655103 644104 566555 496119 496192 546074 562844 486090 386572 301872 204911 108013
10506A08013q0892n0219q306K9870Q5971J32425J42499J48202J37680R6222L9240
$$ 108013 27121 -23098 -31404 -1534 84437 216862 359361 507563 645243 741465 780705
10495G80705q357l8081K528R3870J18219J01881Q1505p182j44965k16974j77672
$$ 780705 772348 734267 736795 830665 948884 1050765 1132270 1125088 980123 763149 585477
10484E85477r8729k8282J5017K0897K8909L7471R583m5847o4988n4234n5322n5494
$$ 585477 486748 458466 473483 494380 523289 560760 570343 524496 459508 405274 349952 294458
10472B94458m9165r3364j89886k47200k12714r1125R8675K78488L57955L09117
$$ 294458 245293 151929 -37957 -285157 -497871 -588996 -490321 -211833 146122 455239
10462D55239J81736M7370n2259o9460n5793r1267j39119j34204j13467r6942p7869
$$ 455239 636975 684345 632086 562626 506833 415566 276447 142243 28776 -68166 -146035
10451a46035n8168p0526q7237l5511K613N723J5776K8826M6296J3950m4026o9109
$$ -146035 -204203 -274729 -361966 -397477 -394864 -389141 -373365 -344539 -298243 -284293 -328319 -397428
10439c97428j04522j41271j35923p4013L5691R2887M9795L5236N6897N3402M7142
$$ -397428 -501950 -643221 -779144 -853157 -817466 -724579 -674784 -639548 -582651 -529249 -482107
10428d82107P5389J37125K03318J88662J12215N2463m6379j05604n0682L2886
$$ -482107 -406718 -269593 -66275 122387 234602 287065 240686 135082 84400 117286
10418A17286P3469N8381P529q1206j51016j08337J3360Q3636N3274N0864J12654
$$ 117286 190755 249136 256665 175459 24443 -83894 -70534 13102 66376 117240 229894
10407B29894R5105P133l9105p3933j10376j28334j41144q3148M1575R3007P1272
$$ 229894 324999 332132 293027 219094 108718 -19616 -160760 -243908 -202333 -109326 -38054
10396c8054Q7506J33227J47004J20632O8268j8831j19194j77753j48477r4134
$$ -38054 49452 182679 329683 450315 518583 499752 380558 202805 54328 -39806
10386c9806j16513j40800p9171L2828J14957J05061L6445l2712n7025l6297n663
$$ -39806 -156319 -297119 -376290 -343462 -228505 -123444 -86999 -119711 -176736 -213033 -218696
10375b18696J4585k7828o3651j2766N6602J11342J45160J00393j817k9911L2897
$$ -218696 -204111 -231939 -295590 -308356 -251754 -140412 4748 105141 103324 73413 106310
10364A06310J11988K06826K96770L07679K63468J99776O0301j12916j85094j95281
$$ 106310 218298 425124 721894 1029573 1293041 1492817 1553118 1440202 1255108 1059827
10354A059827j87013j40230p6609l2376j8049m2772p1912n2399q869L9153J09203
$$ 1059827 872814 732584 655975 623599 605550 562778 490866 438467 429598 468751 577954
10343E77954J29019M0937q3872j33593o4832K9859N2646J0615n7108j08489j02477
$$ 577954 706973 747910 664038 530445 465613 495472 548118 558733 501625 393136 290659
10332B90659n7521l1479j2323Q659J3668J5461l5065j17713j17828j03728j49147
$$ 290659 233138 201659 189336 197995 211663 227124 192059 74346 -43482 -147210 -296357
10321b96357j64610j19838m7809K5236J02338J81756K10331J91340J69919J50011
$$ -296357 -460967 -580805 -628614 -603378 -501040 -319284 -108953 82387 252306 402317
10311D02317P3480l2299n8881m7445m2203k2585k8998l4877p440L0988O0009L6626
$$ 402317 475797 443498 384617 337172 294969 272384 243386 208509 201069 232057 292066 328692
10299C28692k3136k5728m549l77j4432l5463k8744n5656q8650j05569j03213p2699
$$ 328692 305556 279828 275279 274902 260470 225007 196263 140607 51957 -53612 -156825 -229524
10287b29524m4770m1663p8450q9347j2183K7327m1574j00001r8487j11300j37699
$$ -229524 -274294 -315957 -394407 -483754 -495937 -468610 -510184 -610185 -708672 -819972 -957671
10276i57671r2901L5859J38459J60543J06394L8163j164j0796K7502J07294J32550
$$ -957671 -1050572 -1014713 -876254 -715711 -609317 -571154 -572318 -583114 -555612 -448318 -315768
10265c15768N5690J9952P6125J07866R0740O0593J4620n694k251k7163l8625L768
$$ -315768 -260078 -240126 -164001 -56135 34605 95198 109818 104124 101873 74710 36085 39853
10253C9853J04014J50508O2768n0587o6211l6157J5037Q2685O2582K8391P8238
$$ 39853 143867 294375 357143 306556 240345 204188 219225 301910 364492 392883 471121
10242D71121J34494J15395M8416P23j8527l0523m3876l7789N753K3685Q467j4780
$$ 471121 605615 721010 769426 770149 751622 721099 677223 639434 645187 668872 677339 662559
10230F62559q7836j64633j52020j09504j01032j07466j03150r2457q9079p8567
$$ 662559 574723 410090 258070 148566 47534 -59932 -163082 -255539 -344618 -423185
10220d23185m6141K8406Q6994O3168K3440K6634K1720m616j9481j5970K6575N7572
$$ -423185 -469326 -440920 -353926 -290758 -267318 -240684 -218964 -223580 -243061 -259031 -232456 -174884
10208a74884q064r6318j11456l8837M8542J22724J79546J87028J21996j0639j07455
$$ -174884 -182948 -279266 -390722 -429559 -381017 -258293 -78747 108281 230277 219638 112183
10197A12183q7300j0103M9954Q2930N7331l1089j01576p7067M3749J40065J27687
$$ 112183 24883 14780 64734 147664 204995 173906 72330 -4737 39012 179077 306764
10186C06764M3613k1660m0803p1356j78655k71073j65003J0618K5316o4825j19289
$$ 306764 350377 328717 287914 216558 37903 -233170 -398173 -387555 -362239 -427064 -546353
10175e46353o1889O4553J38913J32644J19458J46390J46054O5682m669K707m044
$$ -546353 -608242 -543689 -404776 -272132 -152674 -6284 139770 205452 200783 203490 199446
10164A99446m1078k4412k2033j01995j10163l370M7236M317l2769J2958O7605
$$ 199446 158368 133956 111923 9928 -100235 -103605 -56369 -52052 -84821 -71863 -4258
10153d258L5721m7578j10437j30441r7897j7650K8234L9377L0157l4408r3960
$$ -4258 31463 -16115 -126552 -256993 -354890 -372540 -344306 -304929 -274772 -309180 -403140
10142d03140p8425q048P8430J05245O9977K6218p841l7156J7466J34630J47671
$$ -403140 -481565 -489613 -411183 -305938 -235961 -209743 -217584 -254740 -237274 -102644 45027
10131D5027O5236J8359K5378L7051K7103j8574p8042j31739j71459j73915p5698
$$ 45027 110263 128622 154000 191051 218154 199580 121538 -10201 -181660 -355575 -431273
10120d31273J10434J98616J35969N2123L2861N8006M8604n1583j39374j30326
$$ -431273 -320839 -122223 13746 65869 98730 156736 205340 153757 14383 -115943
10110a15943o5890K152J20389K35759K03154O4558k2378K0468Q0680L2909q5625
$$ -115943 -181833 -179681 -59292 176467 379621 444179 421801 442269 522949 555858 470233
10099D70233j52069j11868q717O425r5426j65188j35792n0469r782m4195q4773
$$ 470233 318164 206296 197579 204004 108578 -56610 -192402 -242871 -252653 -296848 -381621
10088c81621o5335j2829M4079J28316J69421J03441n193r6400j14398l8840P7061
$$ -381621 -446956 -459785 -415706 -287390 -117969 -14528 -19721 -116121 -230519 -269359 -192298
10077a92298J44347J17126N8627K4359L7140O5663L3672l1051l3873j910k5248
$$ -192298 -47951 69175 127802 152161 189301 254964 288636 257585 223712 221802 196554
10066A96554o0948o9514q0555o6654k2075r148n7212j14954j34893q9440N912
$$ 196554 135606 66092 -14463 -81117 -103192 -112340 -169552 -284506 -419399 -508839 -502927
10055e02927J03446J21129P4562J5438n9015j04064j45848j96833j86794p4843
$$ -502927 -399481 -278352 -203790 -188352 -247367 -351431 -497279 -694112 -880906 -955749
10045i55749N7538J15760J33327J39060J21368P8246q292j04240j20408j10653
$$ -955749 -898211 -782451 -649124 -510064 -388696 -310450 -318742 -422982 -543390 -654043
10035f54043j34463r2211N381P8649J33255J64519J52988J00152M1291J5114L4643
$$ -654043 -788506 -880717 -875336 -796687 -663432 -498913 -345925 -245773 -204482 -189368 -154725
10024a54725O7425Q9519J19786J51740J28919K9167r5758j60351j49002r8295
$$ -154725 -87300 2219 122005 273745 402664 431831 336073 175722 26720 -71575
10014g1575n9191m5497p6529j58726k06474j14338L9306J30009J48273R7339K2087
$$ -71575 -130766 -176263 -252792 -411518 -617992 -732330 -693024 -563015 -414742 -317403 -295316
10003b95316j563P836L5136J18329J79292J25657L411q9894j08196p4097m6628
$$ -295316 -296879 -289043 -253907 -135578 43714 169371 172782 82888 -25308 -99405 -146033
9992a46033m4108n2000K1175K06437L56121L43806K08038M9215p7338j57555j63916
$$ -146033 -190141 -242141 -220966 -14529 341592 685398 893436 942651 865313 707758 543842
9981E43842p5224M9716R7388P1086M5052L3381K0057N564n4270j43903j92231
$$ 543842 468618 518334 615722 686808 731860 765241 785298 790862 736592 592689 400458
9970D00458k11206k20874k25055k10684j29619J818J08797J66170J56279N7612
$$ 400458 189252 -31622 -256677 -467361 -596980 -595162 -486365 -320195 -163916 -106304
9960a06304m9081l8121J1487k21n2495q6109n3435K721K2371K91J860N551J0572
$$ -106304 -155385 -193506 -182019 -182240 -234735 -320844 -374279 -371558 -349187 -348896 -347036 -341485 -330913
9947c30913P0519J39540J32701N9079o512j8066j7218j9508l4521r9948j47798
$$ -330913 -260394 -120854 11847 70926 64414 46348 29130 9622 -24899 -124847 -272645
9936b72645j24983r2089n8226N845N0728L7347L373k8231m5504l3597j1273L4810
$$ -272645 -397628 -489717 -547943 -542098 -491370 -454023 -450650 -478881 -524385 -557982 -569255 -534445
$$ [...]
##END NTUPLES=NMR SPECTRUM
##END=
