##TITLE=C13_DE2_k
 CDCl3, 22300 sc

 4.7.2023
##JCAMPDX= 6.0         $$ Bruker NMR JCAMP-DX V2.0
##DATA TYPE= NMR SPECTRUM
##DATA CLASS= NTUPLES
##ORIGIN= UXNMR, Bruker Analytische Messtechnik GmbH
##OWNER= root
$$ XWIN-NMR		Version 3.5
$$ Wed Jul  5 13:40:16 2023 Russian Standard Time (UT+4h)  she@DPX200
##.OBSERVE FREQUENCY= 50.327896
##.OBSERVE NUCLEUS= ^13C
##.ACQUISITION MODE= SIMULTANEOUS
##.ACQUISITION SCHEME= undefined
##.AVERAGES= 22301
##.DIGITISER RES= 17
##SPECTROMETER/DATA SYSTEM= spect
##.PULSE SEQUENCE= zgpg30
##.SOLVENT NAME= DMSO
##.SHIFT REFERENCE= (INTERNAL, DMSO, 0, 222.624)
##AUDIT TRAIL= $$ (NUMBER, WHEN, WHO, WHERE, WHAT)
$$ ##TITLE= Audit trail, XWIN-NMR		Version 3.5
$$ ##JCAMPDX= 5.01
$$ ##ORIGIN= Bruker BioSpin GmbH
$$ ##OWNER= she
$$ F:/spectra/data/she/nmr/c13/1/pdata/1/auditp.txt
$$ ##AUDIT TRAIL=  $$ (NUMBER, WHEN, WHO, WHERE, WHAT)
(   1,<2023-07-05 13:38:52.15 +0400>,<she>,<DPX200>,
      <created by zg, POWCHK disabled, PULCHK disabled
       terminated by command 'halt'
       configuration hash MD5:
       00 E9 B6 7A A2 85 ED C7 34 08 36 98 17 FE 4E 26
       data hash MD5: 32K
       5D DE CF 63 CE B1 03 AB D5 3E 6B E7 F3 0C 2B 9D>)
(   2,<2023-07-05 13:38:56.26 +0400>,<she>,<DPX200>,
      <Start of raw data processing
       efp BC_mod = 2 LB = 2 FT_mod = 6 PKNL = 1 PHC0 = -379.1749 PHC1 = 34.76414 SI = 32K 
       data hash MD5: 32K
       9B 35 C2 F8 1D 94 4A 1A A1 0F 1D 71 DC B5 34 F2>)
(   3,<2023-07-05 13:39:03.25 +0400>,<she>,<DPX200>,
      <abs ABSG = 5 
       data hash MD5: 32K
       E7 F5 C2 03 8F 72 89 7A 36 7C 16 95 88 02 2C 2C>)
(   4,<2023-07-05 13:39:23.76 +0400>,<she>,<DPX200>,
      <pk PHC0 = 0.459999 PHC1 = -3.800001 
       data hash MD5: 32K
       A3 1E F0 EE 37 95 B9 A6 0F 2A 39 DC 42 C5 62 DF>)
(   5,<2023-07-05 13:39:27.51 +0400>,<she>,<DPX200>,
      <abs ABSG = 5 
       data hash MD5: 32K
       2B CA AE 95 2A DB 19 1E BA 0D B5 93 16 24 9F AE>)
$$ ##END=
$$ 
$$ hash MD5
$$ B6 1C 7F D7 E6 AE 89 0D 17 23 33 9A 4F 68 09 9E
##$RELAX= 
##$RELAX= 
##$RELAX= 
##$RELAX= 
##$RELAX= 
##$RELAX= 
##$RELAX= 
##$RELAX= 
$$ Bruker specific parameters
$$ --------------------------
##$DU= <F:/spectra>
##$EXPNO= 1
##$NAME= <c13>
##$PROCNO= 1
##$TYPE= <nmr>
##$USER= <she>
##$AMP= (0..31)
100 100 100 100 100 100 100 100 100 100 100 100 100 100 100 100 100 100 
100 100 100 100 100 100 100 100 100 100 100 100 100 100 
##$AQSEQ= 0
##$AQ_mod= 1
##$AUNM= <au_zg>
##$AUTOPOS= <>
##$BF1= 50.322709
##$BF2= 200.13
##$BF3= 50.322709
##$BF4= 500.13
##$BF5= 500.13
##$BF6= 500.13
##$BF7= 500.13
##$BF8= 500.13
##$BYTORDA= 1
##$CFDGTYP= 0
##$CFRGTYP= 5
##$CHEMSTR= <none>
##$CNST= (0..31)
1 1 145 1 1 1 1 1 1 1 1 1 1 1 1 1 1 1 1 1 1 1 1 1 1 1 1 1 1 1 1 1 
##$CPDPRG= <waltz16>
##$CPDPRG1= <>
##$CPDPRG2= <waltz16>
##$CPDPRG3= <>
##$CPDPRG4= <mlev>
##$CPDPRG5= <mlev>
##$CPDPRG6= <mlev>
##$CPDPRG7= <mlev>
##$CPDPRG8= <mlev>
##$CPDPRGB= <>
##$CPDPRGT= <>
##$D= (0..31)
$$ [...]
##$SUBNAM4= <"">
##$SUBNAM5= <"">
##$SUBNAM6= <"">
##$SUBNAM7= <"">
##$SUBNAM8= <"">
##$SUBNAM9= <"">
##$SW= 239.972175391363
##$SWIBOX= (0..15)
0 1 3 0 0 0 0 0 0 0 0 0 0 0 0 0 
##$SW_h= 12077.2946859903
##$TD= 32768
##$TD0= 1
##$TE= 0
##$TE2= 300
##$TE3= 300
##$TEG= 300
##$TL= (0..7)
120 120 120 120 120 120 120 120 
##$TP= (0..7)
150 150 150 150 150 150 150 150 
##$TP07= 0
##$TPNAME0= <>
##$TPNAME1= <>
##$TPNAME2= <>
##$TPNAME3= <>
##$TPNAME4= <>
##$TPNAME5= <>
##$TPNAME6= <>
##$TPNAME7= <>
##$TPOAL= (0..7)
0.5 0.5 0.5 0.5 0.5 0.5 0.5 0.5 
##$TPOFFS= (0..7)
0 0 0 0 0 0 0 0 
##$TUNHIN= 0
##$TUNHOUT= 0
##$TUNXOUT= 0
##$USERA1= <user>
##$USERA2= <user>
##$USERA3= <user>
##$USERA4= <user>
##$USERA5= <user>
##$V9= 5
##$VALIST= <valist>
##$VCLIST= <CCCCCCCCCCCCCCC>
##$VD= 0
##$VDLIST= <DDDDDDDDDDDDDDD>
##$VPLIST= <PPPPPPPPPPPPPPP>
##$VTLIST= <TTTTTTTTTTTTTTT>
##$WBST= 1024
##$WBSW= 4
##$XGAIN= (0..3)
0 0 0 0 
##$XL= 0
##$YL= 0
##$YMAX_a= 131709737
##$YMIN_a= -44435450
##$ZGOPTNS= <>
##$ZL1= 120
##$ZL2= 120
##$ZL3= 120
##$ZL4= 120
##$ABSF1= 222.624
##$ABSF2= -17.3728
##$ABSG= 5
##$ABSL= 3
##$ALPHA= 0
##$AQORDER= 0
##$ASSFAC= 0
##$ASSFACI= 0
##$ASSFACX= 0
##$ASSWID= 0
##$AUNMP= <proc_1d>
##$AZFE= 0.1
##$AZFW= 0.5
##$BCFW= 0
##$BC_mod= 2
##$BYTORDP= 0
##$COROFFS= 0
##$CY= -3
##$DATMOD= 1
##$DC= 0
##$DFILT= <>
##$DTYPP= 0
##$F1P= 0
##$F2P= 0
##$FCOR= 0.5
##$FTSIZE= 32768
##$FT_mod= 6
##$GAMMA= 0
##$GB= 0
##$INTBC= 1
##$INTSCL= 4.134877e-10
##$ISEN= 128
##$LB= 2
##$LEV0= 0
##$LPBIN= 0
##$MAXI= 10000
##$MC2= 0
##$MEAN= 0
##$ME_mod= 0
##$MI= 0.1934396
##$NCOEF= 0
##$NC_proc= 2
##$NLEV= 6
##$NOISF1= 120.0001
##$NOISF2= 80.00006
##$NSP= 0
##$NTH_PI= 0
##$NZP= 0
##$OFFSET= 222.624
##$PC= 1.4
##$PHC0= -378.7149
##$PHC1= 30.96414
##$PH_mod= 1
##$PKNL= yes
##$PPARMOD= 0
##$PSCAL= 0
##$PSIGN= 0
##$REVERSE= no
##$SF= 50.3227315983092
##$SI= 32768
##$SIGF1= 140
##$SIGF2= 120
##$SINO= 11.81781
##$SIOLD= 32768
##$SREGLST= <13C.CDCl3>
##$SSB= 0
##$STSI= 32768
##$STSR= 0
##$SW_p= 12077.2946859903
##$SYMM= 0
##$S_DEV= 0
##$TDeff= 32768
##$TDoff= 0
##$TI= <>
##$TILT= no
##$TM1= 0
##$TM2= 0
##$TOPLEV= 0
##$USERP1= <user>
##$USERP2= <user>
##$USERP3= <user>
##$USERP4= <user>
##$USERP5= <user>
##$WDW= 1
##$XDIM= 32768
##$YMAX_p= 316206253
##$YMIN_p= -1636338
$$ End of Bruker specific parameters
$$ ---------------------------------
##NTUPLES= NMR SPECTRUM
##VAR_NAME=  FREQUENCY,     SPECTRUM/REAL,   SPECTRUM/IMAG
##SYMBOL=    X,             R,               I
##VAR_TYPE=  INDEPENDENT,   DEPENDENT,       DEPENDENT
##VAR_FORM=  AFFN,          ASDF,            ASDF
##VAR_DIM=   32768,         32768,           32768
##UNITS=     HZ,            ARBITRARY UNITS, ARBITRARY UNITS
##FACTOR=    0.368581032318806, 1,           1
##FIRST=     11203.0474430531, 0,            0
##LAST=      -874.247242937185, 0,           0
##MIN=       -874.247242937185, -1636338,    0
##MAX=       11203.0474430531, 316206253,    0
$$ Real data points
##PAGE= N=1
##DATA TABLE= (X++(R..R)), XYDATA
$$ [...]
15959c11998j82820j39579n8528M1119J18668J30526R1049K6449l7797j04869
15949d27780j56115j47491r4119m3232l1807k2208Q924K9718L6183N2919J31363
15938f63645K11276J86005P5631l2599q3356p7926k7299O4862J20108J35383J38761
15927D7201J62269J56616K6075j08957j01382k5418L2134Q5851J03055Q8399Q0580
15916E46423L8499l1272j08284j77670k12478j68466q3618r5324j50466p6246
15906e18902M6779Q0863R0684J05333N7971l7070p0819o8048q1791j2223J52625
15895b54598K58841K50920J32909m6463j77872k45095k21066q7311J2113L7452
15885c40170L9300P9890J21274P9439O6265J15467Q7764n184k6120M2492R7377
$$ plain form
15959 -311998 -494818 -634397 -692925 -651806 -533138 -402612 -311563 -285114 -322911 -427780
15949 -427780 -583895 -731386 -825505 -868737 -900544 -922752 -913828 -884110 -847927 -795008 -663645
15938 -663645 -452369 -266364 -190733 -223332 -306688 -384614 -411913 -347051 -226943 -91560 47201
15927 47201 209470 366086 392161 283204 181822 156404 188538 274389 377444 465843 546423
15916 546423 584922 553650 445366 267696 55218 -113248 -196866 -292190 -442656 -518902
15906 -518902 -472123 -391260 -300576 -195243 -137272 -174342 -245161 -313209 -395000 -407223 -254598
15895 -254598 4243 255163 388072 341609 163737 -81358 -302424 -389735 -377622 -340170
15885 -340170 -300870 -220980 -99706 -20267 45998 161465 249229 244045 217925 260417 357794
15874C57794Q5676N9286m927j10116j76722j83507j22978l4182l7408j13477j46231
15863d26792o0342O5868J40586J34767j392j66690j78700n8140K4325L4923j1042
15852e02629n1134k9768L1142Q7001J00896J07605J26295J19830M4803m9603m9753
15841f5315O753N7022R8633J01801M2301m623L5480Q3799P2881J2386o1637j06972
15829B72509r8826p0151n4960o1588n4132m4427j7482J5792M036l1791n2062q796
15817b01878R8184J81998J69392O3806m3764n6200N77r35q9334j54950j63089
15806a96193j04397J8803J00466Q4103J8869m0677l3003m2466r0784p4226N0443
15795c09062K18155K27050M9625j19991j32164k3310M7904P111n9693r7917j34908
$$ plain form
15874 357794 443470 502756 497829 387713 210991 27484 -95494 -129676 -167084 -280561 -426792
15863 -426792 -487134 -421266 -280680 -145913 -147305 -313995 -492695 -550835 -526510 -491587 -502629
15852 -502629 -553763 -583531 -552389 -465388 -364492 -256887 -130592 -10762 34041 -15562 -65315
15841 -65315 -58562 -1540 97093 198894 241195 236572 272052 355851 428732 441118 379481 272509
15829 272509 173683 103532 48572 -13016 -67148 -111575 -129057 -113265 -109229 -141020 -193082 -201878
15817 -201878 -103694 78304 247696 311502 267738 211538 212115 211180 121846 -33104 -196193
15806 -196193 -300590 -281787 -181321 -97218 -78349 -119026 -152029 -194495 -285279 -359505 -309062
15795 -309062 -90907 136143 185768 65777 -66387 -89697 -41793 -34682 -94375 -192292 -327200
15784c27200j34515j56621j79873r8406K9152R6904J21189J65776J64670N2277
15774b66647l3185j0206M1567R7375R6613Q0511J02409Q1861K1682j933K6224
15763B36271O5510J23489J74739J32250n975j59768k49059j95965j07862j06800
15753i3170j23006r5801k6685K199o0868j35753j10688j8355P0093J09458J42506
15742c40070K18430K52046J88358Q9677M005p2742j39504j66468j56675r4077
15732b17020l4028o8560j30979r4122J9698P0704L7493O828J6392j6067q3076
15721d92737j24152j50071j52432p9165N1552J60408K04375J82619J24884J01825
15711a72894R7588N0546j4700r3455j91639k07174j11734K0335J43832K17962
$$ plain form
15784 -327200 -461715 -618336 -798209 -896615 -867463 -770559 -649370 -483594 -318924 -266647
15774 -266647 -299832 -310038 -268471 -171096 -74483 6028 108437 190298 211980 210047 236271
15763 236271 301781 425270 600009 732259 726284 566516 317457 121492 13630 -93170
15753 -93170 -216176 -311977 -338662 -336463 -397331 -533084 -643772 -662127 -592034 -482576 -340070
15742 -340070 -121640 130406 318764 408441 412446 339704 200200 33732 -122943 -217020
15732 -217020 -251048 -319608 -450587 -544709 -525011 -454307 -416814 -409986 -393594 -409661 -492737
15721 -492737 -616889 -766960 -919392 -998557 -947005 -786597 -582222 -399603 -274719 -172894
15711 -172894 -75306 -24760 -39460 -132915 -324554 -531728 -643462 -623127 -479295 -261333
15701b61333K09194J71258R3888j8178r8606r5796j3547P1422Q1899K4144P27
15690A65072M6468M7985k6588m9468p41J340o8338j33206j43714r4070k6530O9592
15678b12198J43859J80034J96617J16299m6563j46348j25703k5947N2817M8508
15668A81375K9500M5637M9302J0552k7561k0774K757J4941n975o5923q4476m7371
15656H1984l369L0808Q3872J25760J10916N8742J0794j8503p7466j25148o5818
15645B12572k2404n0916o0032o8214p2642n8045r8427j14595Q824J58901K03823
15634C8845J78722J44952J10203M2409k1664k8885o5492j22886j18679p5543j0351
15623G1631L7733L7529P863l9418m2336O545P6933J11857P0484K5607K7779K9342
$$ plain form
15701 -261333 -52139 119119 213007 194829 96223 427 -13120 58302 140201 164345 165072
15690 165072 211540 259525 232937 183469 182728 184068 115730 -17476 -161190 -255260 -281790 -212198
15678 -212198 -68339 111695 308312 424611 378048 231700 105997 80050 132867 181375
15668 181375 210875 256512 305814 316366 288805 268031 270788 285729 279754 213831 129355 81984
15656 81984 78615 109423 193295 319055 429971 488713 499507 481004 403538 278390 212572
15645 212572 190168 139252 79220 11006 -61636 -119681 -218108 -332703 -323879 -164978 38845
15634 38845 217567 362519 472722 515131 493467 464582 399090 276204 157525 81982 71631
15623 71631 109364 146893 154756 115338 73002 79547 156480 268337 338821 364428 392207 421549
15611D21549P630j0053l4386m0007J6205O8942L3630j08846k29806k37209j70809
15600b83160j27730r1000k1772M6728Q3399O6842L230m842O7905J17266Q5609
15589e7525K0774k6651q0430r9345o0852M238Q2610Q4419R825m0015p1247r7763
15577c31962p3005K089L7695K0864k2339m16P6068K5918q8472r7782l1836J967
15565d81211J6486N7581J42612J94518J75590J26868O4320O0089J13636J74189
15555F44678K15188K14906J52166P3199q911r3259j41450j27259j07102j23666
15545F98490j23318j03097r9703j22193j47143j30358m3790Q0105J16153O5666
15535A90812p776j24209j84090r3828K7781J01317J26911R6211M1667j4440k8317
$$ plain form
15611 421549 429179 419126 384740 344733 360938 429880 463510 354664 124858 -112351 -283160
15600 -283160 -410890 -501890 -523662 -476934 -393535 -326693 -323463 -328305 -260400 -143134 -57525
15589 -57525 -36751 -63402 -143832 -243177 -304029 -299791 -217181 -132762 -122937 -162952 -234199 -331962
15577 -331962 -404967 -402878 -365183 -344319 -366658 -367074 -291006 -265088 -353560 -451342 -483178 -481211
15565 -481211 -464725 -407144 -264532 -70014 105576 232444 296764 356853 470489 644678
15555 644678 859866 1074772 1226938 1300137 1291226 1197967 1056517 929258 822156 698490
15545 698490 575172 472075 372372 250179 103036 -27322 -71112 8993 125146 190812
15535 190812 183036 58827 -125263 -219091 -191310 -89993 36918 133129 174796 160356 132039
15524A32039n859m2711j15622j57701j53523j38911j25874r4566l1798N1117R7991
15513e85418R5422Q2789P9221O8181M2718K9939J9485p146j5434q369K5126J29056
15501d4430K44435K33623J02375p3492j71397j66836j15453n9643j2147N9690
15491c275J04896J17181J61251K47935K88512J96491L4599q3891j65481j92260
15481G05958j52471j03739q0914n8255j9890L4446P4857L4810q7640j76171j45796
15470B5195m1672K3624R755J0353j3384m2397k4283K6405O1275L1352l9804j18185
15458i1766j46942j44540j85178k38823j50940Q0812K51210K38829J14537O9790
15448b03011J24758J46521P1464n8740j26899j15475q5611k4493M3502O9387Q2539
$$ plain form
15524 132039 126180 83469 -32153 -189854 -343377 -482288 -608162 -702728 -734526 -683409 -585418
15513 -585418 -489996 -407207 -327986 -259805 -217087 -187148 -167663 -174809 -190243 -198612 -173486 -44430
15501 -44430 200005 433628 536003 462511 291114 124278 8825 -50818 -62965 -3275
15491 -3275 101621 218802 380053 627988 916500 1112991 1147590 1063699 898218 705958
15481 705958 553487 449748 368834 310579 290689 325135 399992 434802 347162 170991 25195
15470 25195 -16477 7147 16902 27255 13871 -28526 -52809 -26404 34871 66223 26419 -91766
15458 -91766 -238708 -383248 -568426 -807249 -958189 -877377 -626167 -387338 -272801 -203011
15448 -203011 -78253 68268 139732 80992 -45907 -161382 -246993 -271486 -227984 -158597 -76058
15437g6058J03144P7338j2628j20267j86076k22976k16717j42912r0015p7774
15427i64941l8462M4355J23145J36371J42124K14214K84755K84055K08364J21393
15417E55373N4322k6935r8741j27431j36433j20333r7966r6657k8193J21586K24325
15406B22917J76292L4029m6459o1604k2821J07941K03318J66839J27138R1659
15396I99249N953l0782k3410m6749q5244j23509j38761j07702r9360j22412j04154
15385A23119p967N7787J7238n7716q4773n8123j5688J1078l9522j49915k40039
15374d44521k44693j40904l242Q8226J11420M9958l7575o5846k6162J3541p112
15363g06910o9589o8575j2829M468k3470j6742K9304L414l1082P6694J86574J73136
$$ plain form
15437 -76058 27086 104424 91796 -28471 -214547 -437523 -654240 -797152 -887167 -964941
15427 -964941 -1003403 -959048 -835903 -699532 -557408 -343194 -58439 225616 433980 555373
15417 555373 609695 582760 484019 356588 220155 99822 1856 -94801 -122994 -1408 222917
15406 222917 399209 433238 386779 325175 302354 410295 613613 780452 907590 999249
15396 999249 1005202 974420 951010 904261 819017 695508 556747 449045 349685 227273 123119
15385 123119 115152 172939 190177 132461 47688 -10435 -26123 -15045 -54567 -204482 -444521
15374 -444521 -689214 -830118 -833360 -745134 -633714 -583756 -621331 -687177 -713339 -699798 -706910
15363 -706910 -776499 -845074 -857903 -853435 -876905 -893647 -864343 -860929 -892011 -815317 -628743 -455607
15351d55607J21975R8558J14501J03640M5074K6126N5517P0346J7198m2630k3823
15340A30875M1485J9090r5505j33586k2564J20672J55253N5455q4990j29023q4129
15329b6967l2515k4276n8565q0310o3629p8320j50887k34069k29063q8615R2181
15318i75035J66521Q9044m0540q5408j6790L0426O748J4000P2736J21784J24014
15307d92500O8740N9001J38767J72867J17330M5970O0352J18734J20267K9614
15297D39142j47148k61687j98951o59K08594K85573K02990O1524j4949l494L740
15286E74675p0070j56620j62384j34258j00828m2720j0793o9471j44665j31089
15276d48223k9270R7035J83252J70602Q4903M0455P4184J27039J57637J42120
$$ plain form
15351 -455607 -333632 -235074 -120573 -16933 28141 54267 109784 180130 197328 154698 130875
15340 130875 172360 191450 95945 -37641 -60205 60467 215720 271175 186185 57162 -26967
15329 -26967 -59482 -83758 -142323 -222633 -286262 -364582 -515469 -749538 -978601 -1067216 -975035
15318 -975035 -808514 -719470 -760010 -845418 -862208 -831782 -825034 -811034 -738298 -616514 -492500
15307 -492500 -423760 -364759 -225992 -53125 64205 110175 170527 289261 409528 439142
15297 439142 291994 30307 -168644 -169303 39291 324864 527854 589378 574429 570935 574675
15286 574675 504605 347985 185601 51343 -49485 -92205 -102998 -172469 -317134 -448223
15276 -448223 -477493 -380458 -197206 -26604 58299 98754 172938 299977 457614 599734
15266E99734Q6039J0071l6645n564R2m7686k7091M9322O1116O181q6952j89151
15254D19466k24342j69543n4638N0091R1223N4678p2500j71145j51828r8420p4089
15243d01047m4672K5326Q6009O2577j4496k3649N2043O8585o927o5321q3415q3628
15231d28615o5735K136J56782L05347K85534J18746l9617j13635j35382j33676
15221d8115j19894j03706p8868j5762J11289J90476J19976k3139q6268p1977o3412
15210a89400n2299p343N1664Q1770M6583m0247j25437j60837j09119j9168L4009
15199d89824Q1505J18875J30988J36568R9777O9505N4065K890P004R7388J40322
15188D49063Q8137M1833M6333K8135l3426p4247j21029j64672j29091k6950J10775
$$ plain form
15266 599734 685773 695844 659199 653635 653727 606041 578950 628272 689388 695569 608617 419466
15254 419466 195124 25581 -29057 21034 112257 166935 94435 -76710 -228538 -326958 -401047
15243 -401047 -445719 -420393 -334384 -271807 -286303 -309952 -257909 -189324 -196251 -261572 -344987 -428615
15231 -428615 -494350 -492214 -335432 -30085 255449 374195 334578 220943 85561 -48115
15221 -48115 -168009 -271715 -350583 -366345 -255056 -64580 55396 32257 -54011 -125988 -189400
15210 -189400 -241699 -249042 -197378 -115608 -69025 -109272 -234709 -395546 -504665 -523833 -489824
15199 -489824 -408319 -289444 -158456 -21888 77889 147394 201459 204349 211353 308741 449063
15188 449063 537200 579033 625366 653501 620075 545828 424799 260127 131036 104086 214861
15177B14861K01801K00600J50306P4825k2006j63374l24046l75039l04350j77571
15167e23993n1964k0780r5429j42275q7256j2477Q644j503k342N33M2917J00626
15155g85299J04133J29235J86592J53439Q4698L0384p8030k02795k14926n8071
15145f50640J51913K19088J37524O5218L5495k5938p9366k2683O5885M1788l6925
15134i8641o6455p9703n5279J2168M2757L0326j5257j01967j35999J2979J91949
15123b63122K06945O5781r5622j60711j10080k1473N4599J12611J91905K80103
15113B60936K43577R7538p5985j86545j76338j09007m9842K087K9593M6840Q2961
15102A65815P0048k017j8957K1843M8456O6396R3987J02497P8531N6092M5056
$$ plain form
15177 214861 416662 617262 767568 842393 820387 657013 332967 -42072 -346422 -523993
15167 -523993 -575957 -596737 -692166 -834441 -921697 -934174 -925530 -927033 -929375 -928842 -885925 -785299
15155 -785299 -681166 -551931 -365339 -211900 -127202 -96818 -174848 -377643 -592569 -650640
15145 -650640 -498727 -279639 -142115 -76897 -41402 -67340 -146706 -169389 -103504 -61716 -98641
15134 -98641 -165096 -244799 -300078 -287910 -245153 -214827 -230084 -332051 -468050 -455071 -263122
15123 -263122 -56177 9604 -86018 -246729 -356809 -378282 -323683 -211072 -19167 260936
15113 260936 504513 602051 526066 339521 163183 54176 4334 6421 36014 82854 165815
15102 165815 235863 233846 214889 236732 285188 351584 445571 548068 626599 682691 727747
15091G27747P888k1071k6335m9004j01473j37249j90869k71909l07724l09124
15081f79123k65828j62272n1332M0448R2764P6207L1535O8098J36680J31306P4184
15070e07333J5632m7459m7661J3444Q4142J24420J11200N1847k2250o0592m7670
15059c32280m5746k9741M2217O7553J1998k3008J3279L4366J6981J3933L8554
15048a91894Q5063J44429J42574R5200R1945P8089K3779j7905p6405j00063k8174
15037B46638P8180R3070Q80o7680r7977j38158j24802l5932M2287P6663J03169
15026A76338J05180O4209K5513r385n2450o1664m0429J3227O1950N3874j2711
15015C23652r7459j42250j22119j26632j95958k14861j36484O612J07445Q5336
$$ plain form
15091 727747 735635 714564 688229 639225 537752 400503 209634 -62275 -369999 -679123
15081 -679123 -944951 -1107223 -1158555 -1118107 -1025343 -949136 -917601 -849503 -712823 -581517 -507333
15070 -507333 -491701 -539160 -586821 -573377 -489235 -364815 -253615 -201768 -224018 -284610 -332280
15059 -332280 -378026 -407767 -365550 -297997 -285999 -309007 -295728 -261362 -244381 -230448 -191894
15048 -191894 -106831 37598 180172 275372 367317 445406 469185 451280 374875 274812 246638
15037 246638 324818 417888 418768 351088 253111 114953 -9849 -45781 -3494 73169 176338
15026 176338 281518 345727 371240 361855 309405 247741 207312 220539 282489 336363 323652
15015 323652 226193 83943 -38176 -164808 -360766 -575627 -712111 -705499 -598054 -512718
15005e12718M4034O5324R2448P7198K6632m5087r5385o9660j8849J9606R8518
14994c17939J93712K38272J85308R8156N1829K8750J3888J5859O722l6585o4698
14983D13274m3749j6681k2063k8551J3043O2671J10739J34944N8456l555l917
14972F74611m6900j14461p8829M2349J01678O1903l3248j50305j95131j34244
14962A27423j3174R2485R9730M5115k6972j26288j96561j68734q6452k2736j6287
14951b92451m2525m0400k7681L4344J39941J70543R3004j9524q3432n9992O3740
14940f4433J85419K53363K86143K64000J73502N7693o1635j50253r1324R4114
14930I46589K34929K09631P2520o7402j52762j89151k28123k30352j98641j74987
$$ plain form
15005 -512718 -468684 -403360 -310912 -233714 -207082 -252169 -347554 -417214 -436063 -416457 -317939
14994 -317939 -124227 114045 299353 397509 449338 478088 491976 507835 514557 477972 413274
14983 413274 369525 352844 330781 302230 315273 377944 488683 623627 682083 678528 674611
14972 674611 627711 513250 434421 476770 578448 640351 607103 456798 261667 127423
14962 127423 114249 206734 306464 351579 324607 198319 1758 -166976 -253428 -276164 -292451
14951 -292451 -334976 -375376 -403057 -368713 -228772 -58229 34775 15251 -68181 -128173 -64433
14940 -64433 120986 374349 660492 924492 1097994 1155687 1094052 943799 852475 946589
14930 946589 1181518 1391149 1463669 1396267 1243505 1054354 826231 595879 397238 222251
14920B22251j41457o9341K1000O3704O7401M9719p350r2379j81990k41297k37946
14909e47685j75149r5391l3088L1303J15712J81681K14299K07637J35220N7412
14899I1951P944p2276j56694j61453j04094m1931L9822J16322J05835M4293k168
14888a32449m914O230n3090j53886j73329p5448N7414J55469J77478J32710L3513
14877c0302p4761j07838p3517q50R6791J67903J15229m7440j89884k65374k52693
14866f62736j73723q3551o729O2307J21072J34424J32393J13359M4426n649l2767
14855c57174o6579m5629K3791Q9981J17627J03923N9689j5837o2883J2563J57056
14844A6528K19355J79940J09219M6464l0738j06123j29957r8913k1528M0188M6215
$$ plain form
14920 222251 80794 11453 32453 96157 163558 213277 205927 113548 -68442 -309739 -547685
14909 -547685 -722834 -818225 -851313 -820010 -704298 -522617 -308318 -100681 34539 91951
14899 91951 99895 27619 -129075 -290528 -394622 -436553 -396731 -280409 -174574 -130281 -132449
14888 -132449 -137363 -131133 -184223 -338109 -511438 -586886 -529472 -374003 -196525 -63815 -30302
14877 -30302 -105063 -212901 -286418 -287268 -190477 -22574 92655 45215 -144669 -410043 -662736
14866 -662736 -836459 -920010 -926739 -864432 -743360 -608936 -476543 -363184 -318758 -324407 -357174
14855 -357174 -423753 -469382 -445591 -355610 -237983 -134060 -74371 -90208 -153091 -140528 16528
14844 16528 235883 415823 525042 571506 540768 434645 304688 205775 184247 224435 270650
14833B70650k226n9883q2734m2090R948J5911j3604l9924l1943q845l3807j18485
14821a37032j68569j46653r6142o1177j8826k417l7472k6484J5658j13k8254o662
14809g14143O656o486p301l9639q3767o8987Q807Q0615J03946P2385O524j1414
14797f52804N5864Q9518O7738O9463O3342M4264O0892O9626K4399q417O328N6687
14785e3100J25645J46995Q1548l318l1625p0219j47029j61697j36429j38893j16338
14774e04460n6137L2454R8717O9249K0517N3165J24541J39374Q8208k078p5898
14763a2348j8915J43746K35373J62697K1681o2977n9743m7624q3834r5736l7643
14752A44677L8091N5515M9871O1021K7151l9957q2754r6485j13381q7506j767
$$ plain form
14833 270650 268424 208541 125807 83717 93665 109576 95972 56048 24105 15260 -18547 -137032
14821 -137032 -305601 -452254 -548396 -609573 -628399 -630816 -668288 -694772 -679114 -679227 -707481 -714143
14809 -714143 -707487 -713973 -721274 -760913 -844680 -913667 -904860 -824245 -720299 -647914 -641390 -652804
14797 -652804 -596940 -507422 -439684 -370221 -306879 -262615 -201723 -132097 -107698 -116115 -109787 -53100
14785 -53100 72545 219540 301088 297770 266145 195926 48897 -112800 -249229 -388122 -504460
14774 -504460 -560597 -528143 -429426 -360177 -339660 -286495 -161954 -22580 65628 63550 -12348
14763 -12348 -31263 112483 347856 510553 532234 469257 409514 361890 278056 182320 144677
14752 144677 182768 238283 288154 349175 376326 336369 253615 157130 43749 -43757 -45524
14741d5524O7216Q2920L1776l0683k685Q9027J38863J29718J02811N8537l809
14730F18167l4778m5310n6957q5069j40887j67441j07802m1256j9474j7348j3913
14719a12068M4818R6309N9361k5153p5922n4329j7541J354L8033Q5595N4772l8150
14707E7079q6714p1606l4096l3076o3563j53077k82780l35782k68483j18534P1849
14696a318783K29050K65468K31086J90421J00408l4361j14357p2596J4737N4748
14686d54179P6241J16778J13511P4622M1081j3549r3164j19543q7509o6555l9698
14675d51964N902P8929J40338R8301q19o7367q2133j06004j10681j2138Q0753
14664d26883N7792K6603O8040N1343l0357n0626l0010m8629p2322p3742l7579
$$ plain form
14741 -45524 21692 104612 136388 105705 103020 192047 330910 460628 563439 621976 618167
14730 618167 583389 538079 481122 396053 255166 87725 -20077 -61333 -80807 -98155 -112068
14719 -112068 -67250 29059 88420 63267 -12655 -66984 -84525 -83171 -45138 40457 95229 57079
14707 57079 -29635 -101241 -135337 -168413 -231976 -385053 -667833 -1003615 -1272098 -1390632 -1318783
14696 -1318783 -1089733 -824265 -593179 -402758 -302350 -336711 -451068 -523664 -508927 -454179
14686 -454179 -377938 -261160 -147649 -73027 -31946 -45495 -138659 -258202 -345711 -412266 -451964
14675 -451964 -446062 -367133 -226795 -128494 -129313 -196680 -278813 -384817 -495498 -507636 -426883
14664 -426883 -369091 -342488 -274448 -223105 -253462 -304088 -334098 -382727 -455049 -528791 -566370
14653e66370R238K3782q396q1225j69962j90685j00402L5236J23368J72717K02167
14642e50532K08441J91938J40066M9522j3858m4655q5076j46432k18374j80890
14632f49850k2147J04226J04134O5155R8267J38761N5810o5174n1713M8738J68061
14621e732K11214J44786P8842P7517J00843P4868k0019j02293j17610r2599n2149
14610B97668K7564J24706J67210J13782K4394j7666m9281j15465j65302j33764
14600B73846n0707p479m4647p3204o9622p6768r6004j10758p9720N2151J53610
14589a29302Q1481o0921j19527l3041N2140J118q3429n4339N3878J12913J15429
14578f3600J05439P1273J2732m0853m2112k4746m5075p1763n2042J2816L1968
$$ plain form
14653 -566370 -557132 -533350 -541746 -622971 -792933 -983618 -1084020 -1048784 -925416 -752699 -550532
14642 -550532 -342091 -150153 -10087 39435 25577 -19078 -104154 -250586 -468960 -649850
14632 -649850 -671997 -567771 -463637 -398482 -300215 -161454 -105644 -170818 -222531 -173793 -5732
14621 -5732 205482 350268 429110 506627 607470 682338 662319 560026 442416 349817 297668
14610 297668 325232 449938 617148 730930 755324 737658 688377 572912 407610 273846
14600 273846 223139 215660 171013 97809 28187 -48581 -144585 -255343 -335063 -282912 -129302
14589 -129302 -47821 -108742 -228269 -261310 -209170 -208052 -291481 -345820 -291942 -179029 -63600
14578 -63600 41839 113112 125844 84991 42879 18133 -26942 -98705 -150747 -137931 -105963
14567a05963n2305j20269p1509N75K2195J9553K8755M8900N787r5388j23939q9797
14555e33405q7690p9340L301J24941K26391K97992K79329J58668N3359M929m8539
14544C99936j24346j84701j65521n2480P7449J02288J1989q2409q5116p0775j23477
14533b97163j22472o5265j8397J2832K9714L4111L3580Q5846J19434N4362n115
14522a38533J9511N6537L1244r960j6982N3618J57005J65694R1945j840r4391
14511C13848j32812q9235n6790j30392k24139k86819k87607j60202K5558J56753
14501h71837K14745K24559K17122J64533P6186J6965K0211Q4552R9113M2138R295
14490B97582L361l2318q7870j34072j73757j53836l7957R3635J24678P6489N0723
$$ plain form
14567 -105963 -158268 -278537 -350046 -349471 -327276 -307723 -278968 -230068 -224281 -319669 -443608 -533405
14555 -533405 -621095 -700435 -697134 -572193 -345802 -47810 231519 390187 443546 448475 399936
14544 399936 275590 90889 -74632 -127112 -49663 52625 64614 -17795 -102911 -173686 -297163
14533 -297163 -419635 -484900 -503297 -490465 -460751 -426640 -393060 -307214 -187780 -133418 -138533
14522 -138533 -119022 -62485 -31241 -41201 -58183 -4565 152440 318134 410079 408239 313848
14511 313848 181036 91801 35011 -95381 -319520 -606339 -893946 -1054148 -1028590 -871837
14501 -871837 -657092 -432533 -215411 -50878 25308 42273 62484 147036 246149 288287 297582
14490 297582 300943 268625 180755 46683 -127074 -280910 -318867 -225232 -100554 -24065 26658
14479B6658Q0028J42649J62708O9087o3287j49900k16650k10337q4320M7050R7226
14468i9088J02299R6446P5871M7611K0203j9578p9716j20276j11525o2408k7975
14457a78136r724M7084R5942O8512J3253j748l6797j11753j54646j65791j64968
14446e98772j48217q8998j1090L7932Q5056J40057J32406M9011n1354p4604k5478
14435e54051M4185J07319J01935O3055M6232O7177P3096j7707j79591k61888k10385
14424g20623j17063o10J22183K08771K94337L34879K44838J21529L3931l000n435
14413E13737l514N2887J26287R7474j8093j11149j06056m3912j0955l9552n5176
14402D01978J1215Q4421J28664J18127K2177j36330k67374k94478k35307j81644
$$ plain form
14479 26658 106686 249335 412043 481130 417843 267943 51293 -159044 -243364 -196314 -99088
14468 -99088 3211 99657 175528 223139 243342 223764 144048 23772 -87753 -150161 -178136
14457 -178136 -187860 -140776 -44834 23678 36931 35183 -1614 -113367 -268013 -433804 -598772
14446 -598772 -746989 -835987 -847077 -809145 -724089 -584032 -451626 -402615 -453969 -528573 -554051
14435 -554051 -509866 -402547 -300612 -237557 -191325 -124148 -51052 -68759 -248350 -510238 -720623
14424 -720623 -837686 -838296 -716113 -507342 -213005 121874 366712 488241 522172 519172 513737
14413 513737 510223 563110 689397 786871 768778 657629 551573 507661 496706 457154 401978
14402 401978 413193 497614 626278 744405 766582 630252 362878 68400 -166907 -348551
14392c48551j59685j19744m1685Q1885J94950K28272J53325P129r7301j17181
14382b18586n6550J1309J4614L3873R1045J26717J23899Q2519L1315P227j9140
14371B28242n4506n3692j787P6168R8980J0747j21345j65167r5293m7207m8912
14360a73772k1322N5926Q8061P8209P9699O2872n385r6092j39312r7736L0118
14349a38734J50073J63995J06866K086q7292j11110o9619L4196J19271J27998
14339B97730J47112J40973N1503m1156j03242j10279o4842k6142j2225m4859q4629
14328A49944p1825o7775j02186j24018j04215l1651R1982J44581P4766k5918o2312
14317a28627j4117O3854J08175R2680K3944j5324L643J6746k3793r4975j17908
$$ plain form
14392 -348551 -508236 -627980 -669665 -587780 -392830 -164558 -11233 -4104 -101405 -218586
14382 -218586 -275136 -263827 -249213 -215340 -124295 2422 126321 208840 240155 247382 228242
14371 228242 173736 120044 118257 194425 293405 304152 182807 17640 -77653 -124860 -173772
14360 -173772 -195094 -139168 -51107 27102 106801 169673 164288 68196 -71116 -168852 -138734
14349 -138734 11339 175334 282200 284286 196994 85884 16265 50461 169732 297730
14339 297730 444842 585815 637318 596162 492920 382641 317799 291657 279432 234573 149944
14328 149944 78119 10344 -91842 -215860 -320075 -351726 -259744 -115163 -40397 -66315 -128627
14317 -128627 -142744 -78890 29285 121965 145909 130585 134228 150974 127181 32206 -85702
14306h5702o6341K1175Q5167O9228J3097m768J9774J9068k7403p3856j00572q2893
14294b14026k5046J8092J0347j6159o3048j16602j30980o8461N3030J32333J54377
14283b66143K04481K22100Q9642r2126j58411j30467j01491p9571o1953o7093
14273d41032j15580j80814j90633j18483k3668N9029J43237J85195J30904O5476
14263d86369M7947M6419L5650M4369J42094K63426K79824K26356J92215J76040
14253I67971J09157M0874L2100M3125N6201J7409o5057j31209k19608k87857k56432
14242C06674j88361j86769k15496j56871k6412P1252J30062J76675K09636J60112
14232B80502O9220N4781Q8121J14314J18801N8236j7047k3669l0977j01286j74414
$$ plain form
14306 -85702 -152043 -130868 -45701 23527 36624 31856 51630 70698 43295 -30561 -131133 -214026
14294 -214026 -239072 -220980 -210633 -226792 -289840 -406442 -537422 -605883 -552853 -420520 -266143
14283 -266143 -61662 160438 250080 157954 -457 -130924 -232415 -311986 -373939 -441032
14273 -441032 -556612 -737426 -928059 -1046542 -1070210 -1011181 -867944 -682749 -551845 -486369
14263 -486369 -438422 -392003 -356353 -311984 -169890 93536 373360 599716 791931 967971
14253 967971 1077128 1118002 1150102 1193227 1249428 1266837 1201780 1070571 850963 563106 306674
14242 306674 118313 -68456 -283952 -440823 -467235 -395983 -265921 -89246 120390 280502
14232 280502 349722 404503 492624 606938 725739 783975 766928 743259 712282 610996 436582
14221D36582j58820q4891l3934J9308O2464O4538M562j00738j67048j40839q0479
14210a79295j7609P0758J50313J92621J93612J51916J35961J69929J83115J09523
14200A160844k1721j36673k02003j76036p8391j4535j7432p2752j67767k04249
14190F9285j24033M8560J84354J74683N3241l9281j678O9513Q6383M8712N743
14179E75482M2931J22361J18617M264j74066k83943k77247j56953J8460J27624
14169A17530J35927J20211J01568O5126O6985J05358N7953r1096k09766k57504
14159B12292k10686r8960p867J1546L3817R2792J10009N4559L883K6181N1120
14148B78686L9082M3913R2336J49690J78256J29219j720j66142k80589l10586
$$ plain form
14221 436582 277762 192871 158937 178245 240709 305247 309809 209071 42023 -98816 -179295
14210 -179295 -196904 -126146 24167 216788 410400 562316 698277 868206 1051321 1160844
14200 1160844 1139123 1002450 800447 624411 546020 531485 514053 441301 273534 69285
14190 69285 -54748 -6188 178166 352849 406090 366809 365131 434644 521027 569739 575482
14179 575482 618413 740774 859391 863655 689589 405646 128399 -28554 -10094 117530
14169 117530 253457 373668 475236 540362 607347 712705 770658 679562 469796 212292
14159 212292 1606 -97354 -105221 -93675 -59858 32934 142943 197502 201385 227566 278686
14148 278686 317768 361681 454017 603707 781963 911182 909462 743320 462731 152145
14138A52145k54427j58230r5238o9447l7242k754J7350J02132J95125J74622P8759
14127A02795j5297q6375j24704r3623j7496M0578P4925J36042K44021K99324K26968
14116G87158P8888r7299k16473j92899r3684k133O2287O7423L2673J8727m714
14105D39954l6097j7868k1852p0763j24694j08407l9576N701O0038J46692K22979
14094D56107J86874M8708m6645q0542q4296l1186L8235P3300J909j31113k13872
14083B17479j82969r1430n2711p2190n6475l4814m4098l357P7008Q5737K4586
14072a33234m2419r8202j08284o7572k5171K6548Q2901J30396J59134J48860J10664
14061A83621K8692o1123j04827q2020j6376M0295O4564L2695n7772j28147j07497
$$ plain form
14138 152145 -102282 -260512 -355750 -425197 -462439 -465193 -447843 -345711 -150586 24036 102795
14127 102795 87498 1123 -123581 -217204 -234700 -194122 -119197 16845 260866 560190 787158
14116 787158 866046 768747 552274 359375 265691 263558 325845 393268 425941 444668 439954
14105 439954 403857 385989 364137 293374 168680 60273 20697 26398 86436 233128 456107
14094 456107 642981 691689 645044 564502 480206 449020 487255 560555 562464 431351 217479
14083 217479 34510 -56920 -109631 -181821 -238296 -273110 -317208 -320565 -243557 -157820 -133234
14072 -133234 -175653 -273855 -382139 -449711 -474882 -448334 -365433 -235037 -75903 72957 183621
14061 183621 212313 151190 46363 -35657 -52033 -11738 52826 85521 27749 -100398 -207895
14050b07895m4857K2812N4866J5298l7176n7551q0150q7638n5550k9650R193L5394
14038d62904p12k5243m9629o5917m8873r530q65J2527N8545P7815L2022k9818
14026e12582k9369J5258N2648N7464L4905J3975k3122m7221p360N5346J11038
14015b79020J49585J56147R9212l848j23177j91677j50160n6415J2872N3715J02974
14004b29792J18925P5760L72n0972m2244K9905J58827K04728R7941l2596j23566
13993B07288j86995j93885j50911j08563j29227j78620j54560k6060J34578K05225
13983e81730J70984R8513M4166N4293R7654P1891j1243n3184j4588L9433O9239
13972a4572O6728L9635M7227M5824J3876J626j8121j5194N4058J11499Q6851L920
$$ plain form
14050 -207895 -252752 -229940 -175074 -159776 -196952 -254503 -334653 -422291 -477841 -507491 -498298 -462904
14038 -462904 -463616 -488859 -538488 -604405 -653278 -662808 -663673 -651146 -592601 -514786 -482764 -512582
14026 -512582 -541951 -526693 -474045 -416581 -381676 -367701 -390823 -438044 -445404 -390058 -279020
14015 -279020 -129435 26712 125924 122076 -1101 -192778 -342938 -399353 -386481 -332766 -229792
14004 -229792 -110867 -35107 -34735 -85707 -127951 -98046 60781 265509 363450 330854 207288
13993 207288 20293 -173592 -324503 -433066 -562293 -740913 -895473 -921533 -786955 -581730
13983 -581730 -410746 -312233 -268067 -213774 -116120 -44229 -55472 -108656 -123244 -83811 -14572
13972 -14572 52156 91791 139018 184842 198718 200344 182223 167029 221087 332586 419437 423357
13960D23357r2984j32383j51797j75888j81713j41108j08440j14405o2080O7605
13950f69836J69081J49044O1115q074k1395M6700J48328J84087J20337J5449n5081
13939A39755r2669q7078n5995m6007j9684l736l9064m9854n02J5300l9736q1612
13927c60882n2067J6860O3662R9640J20861J29024R0445L2265K9776O4963N3847
13916B88394l232m3402m7814k2434o58l0845p7435r6247j05879q1905l3078k0829
13904b75364J4873J06988K25857K92032K69103J66208j1974j62275j96814j67647
13894B60987j57696j60642j02712J0336J04553J43087Q8874O157m3046r2671j06048
13883d8821p7532o4778n2498j0376O9702J50276J91036J70927N7635k6780l7450
$$ plain form
13960 423357 330373 197990 46193 -129695 -311408 -452516 -560956 -675361 -737441 -669836
13950 -669836 -500755 -351711 -290596 -298670 -320065 -273365 -125037 59050 179387 194836 139755
13939 139755 47086 -39992 -95987 -141994 -161678 -165414 -204478 -254332 -254834 -239534 -279270 -360882
13927 -360882 -412949 -396089 -332427 -232787 -111926 17098 107543 139808 169584 234547 288394
13916 288394 285162 241760 193946 171512 170854 140009 62574 -33673 -139552 -221457 -254535 -275364
13904 -275364 -260491 -153503 72354 364386 633489 799697 787723 625448 428634 260987
13894 260987 103291 -57351 -160063 -149727 -45174 97913 186787 192944 149898 57227 -48821
13883 -48821 -126353 -191131 -243629 -254005 -184303 -34027 157009 327936 385571 358791 321341
13872C21341o9365j21732j04872k3850P5020J31985J30771J05533O4049j9785
13862D89095r7203o1289L1744Q2612N1147n1776j52196j80764j68273j47330o5453
13851b69686M2365J12495J56585K02836K11769J25105m0510j82150j99918j10759
13841D8132j8328N166O295M8397Q6452Q8901Q1661O7926M5386J9201L1386L3064
13829E43639L941n098N282P108Q038M1917R3481J00058k0142j98440k29578r8361
13817B51845k388j263j7460O473J7927l3909l2719K8570L1879q068n0216n8288
13805A32383m9174n7497q9981j01640n5350n0344j17443j45889r9097p0605j13211
13794h17848j50455j13135o1163k177J04083J74210J56060J07324M8383M8897
$$ plain form
13872 321341 251976 130244 25372 1522 76542 208527 339298 444831 508880 489095
13862 489095 391892 330603 362347 444959 496106 444330 292134 111370 -56903 -204233 -269686
13851 -269686 -227321 -114826 41759 244595 456364 581469 540959 358809 158891 48132
13841 48132 29804 34970 41265 89662 176114 265015 346676 414602 459988 479189 510575 543639
13829 543639 547580 542482 547764 554872 562910 604827 698308 798366 778224 579784 350206 251845
13817 251845 249457 248194 230734 237207 255134 221225 188506 217076 248955 240887 190671 132383
13805 132383 83209 25712 -64269 -165909 -221259 -271603 -389046 -534935 -634032 -704637 -817848
13794 -817848 -968303 -1081438 -1142601 -1144778 -1040695 -866485 -710425 -603101 -554718 -505821
13784e05821J54793J78257R3489M4084K7404J5114J4020K9734M9065O7232Q3002
13773B50373Q9437M4789k5455o9052n7207n5598r0707o3864L8373J17052J17067
13762B95208N2111k8305r1827j33018j02572K0279J40503J65847J40957R4377
13752E53560N5455M1231J9933l5479j21803j76761j43590m6252K1828M5613L6614
13741B50349q620n5508o7965q2541r5516o3830q022j0033o2221p1134p117N7236
13729b24922R0231J24649J56630J41490O7135M364M668j187l5760p2069j41624
13718A13605j49600l8911N9003M9282m539p1320j62975j68704o8072P3399K02257
13707a66575K02810O8926m4514q7034o4535j0716n207l1521n267N8535N6312P835
$$ plain form
13784 -505821 -351028 -172771 -79282 -35198 -7794 7320 21340 51074 100139 167371 250373
13773 250373 339810 384599 359144 290092 232885 177287 86580 22716 61089 178141 295208
13762 295208 347319 319014 227187 94169 -8403 11876 152379 318226 459183 553560
13752 553560 609015 650246 670179 634700 512897 336136 192546 146294 168122 213735 250349
13741 250349 241729 186221 118256 35715 -59801 -123631 -131653 -141686 -203907 -275041 -282158 -224922
13729 -224922 -134691 -10042 146588 288078 355213 359577 364245 363058 327298 255229 113605
13718 113605 -35995 -74906 -15903 33379 28840 -42480 -205455 -374159 -442231 -368832 -166575
13707 -166575 36235 105161 60647 -26387 -90922 -101638 -106845 -138366 -143633 -85098 -28786 -20951
13695b0951M0518J26286R9984o4771k04247j80088k6193O5731j1193q9292p5158
13684c39374k7527J7765M7136M4461K3061K5553P0315O2163l3593q4014m7482
13673b41536j5521K5468N0491R966m7985q0130n9244N820K7523l0981p0570k1077
13661d47776N7531J00531O9431L3866L8649N3754M6280k1110j01724j61881j75439
13650e07888q8278N4817P4637k4699j13835j65253j72238j31014l4635J20945
13640i87441K63758K82158K12726J45277O7901K9627O0890P3835j8116j40739
13630a0124j69692j77365j79089j36273j14544j19294m3515J25371K57986K58007
13620c08532J82397J17765P4947P3230J08989J07686M2080l9518r8735j00958
$$ plain form
13695 -20951 19567 145853 245837 181066 -23181 -203269 -229462 -163731 -174924 -264216 -339374
13684 -339374 -366901 -349136 -302000 -257539 -234478 -208925 -138610 -76447 -110040 -194054 -241536
13673 -241536 -257057 -231589 -181098 -171132 -219117 -299247 -358491 -352671 -325148 -356129 -426699 -447776
13661 -447776 -390245 -289714 -220283 -186417 -147768 -94014 -47734 -68844 -170568 -332449 -507888
13650 -507888 -596166 -541349 -466712 -491411 -605246 -770499 -942737 -1073751 -1108386 -987441
13640 -987441 -723683 -441525 -228799 -83522 -15621 14006 74896 148731 130615 -10124
13630 -10124 -179816 -357181 -536270 -672543 -787087 -906381 -949896 -824525 -566539 -308532
13620 -308532 -126135 -8370 66577 139807 248796 356482 398562 359044 260309 159351
13610A59351n6803n1567j29464k06617k18553j95549k04364k11100j11158N6977
13600a168847J55855J75723J32533Q4358J33766K38812K72773J70114M6185q650
13590B32622l3708k3693l0822r8683j54117j24024j6294M6568J1010j6521N590
13579b02072j6107p9804p4441Q840Nq2647l2668J06878J40052L0935j00478j73719
13567d75226j80079j06481M9807J97813K21191J61892J13975P0228K7668L8860
13557A19648R1783J37044J25774K4772k4063M5177Q5502L2899p6466j54746j27341
13546B79983o1117m789L5828O8114P0962M262j04082j75037j61088j24647j17338
13535b88949j24290j05171l2438O3927J00095P6235P7942J16578J36856J34223
$$ plain form
13610 159351 102548 50981 -78483 -285100 -503653 -699202 -903566 -1114666 -1225824 -1168847
13600 -1168847 -1012992 -837269 -704736 -620378 -486612 -247800 24973 195087 241272 232622
13590 232622 198914 175221 144399 45716 -108401 -232425 -248719 -202151 -191141 -207662 -202072
13579 -202072 -218179 -297983 -372424 -363584 -363579 -446226 -478894 -372016 -231964 -201029 -301507 -475226
13567 -475226 -655305 -761786 -711979 -514166 -292975 -131083 -17108 53120 80788 119648
13557 119648 211431 348475 474249 499021 474958 520135 605637 638536 562070 407324 279983
13546 279983 218866 214077 249905 318019 388981 393243 289161 114124 -46964 -171611 -288949
13535 -288949 -413239 -518410 -550848 -486921 -386826 -310591 -232649 -116071 20785 155008
13525A55008O9891n8803j03398n2994l0432n4897q4906o5019R718P5148J14559
13514b6125J46575J85882J73440O7916k7608m1151m3108l1201J0466P856p9476
13503C43466j39911j29360j58589k43922k56929j38891m231J2687j2488K0795
13493g07373R5019J84985K53495K42388J44848K6467j2673r969j5321q329k6612
13482A66925o4755o9009n0299n8431r6793q1072j2621K3695N6535R6847J30937
13471D1959J45310P1799p5803k32372l46362k80870p6878O5910J00979O7938P1235
13460d47155Q9113L7801J2930O3879J54992K42185K80844J81669J5140r4946j26738
13449D09714r6682j6637Q4387J45289P0963o3044q4991l9947j6956l7084n7775
$$ plain form
13525 155008 224899 166096 62698 9704 -20728 -75625 -160531 -225550 -215832 -140684 -26125
13514 -26125 120450 306332 479772 547688 520080 478929 435821 404620 415086 422942 343466
13503 343466 203555 74195 -84394 -328316 -585245 -724136 -728367 -715680 -728168 -707373
13493 -707373 -612354 -427369 -173874 68514 213362 239829 227156 217187 201866 193537 166925
13482 166925 102170 33161 -17138 -75569 -172362 -253434 -266055 -242360 -185825 -88978 41959
13471 41959 187269 259068 183265 -49107 -395469 -676339 -753217 -687307 -586328 -518390 -447155
13460 -447155 -358042 -320241 -307311 -243432 -88440 153745 434589 616258 631398 536452 409714
13449 409714 313032 296395 380782 526071 597034 533990 448999 409052 392096 355012 297237
13438B97237m0560J9331J01621J55143J61776J25478N4656m1665j43309k44546
13428D45162l27692l24474j95626k6259L3907m7779j18754p4444N2016J76030
13418d07913K15469J96613J70311J41229J15433P1854L0623N5330Q0922J4880
13408F84751j02485j57107j46037r4650J7909J16058Q0740N018l3613m9513J4923
13397C35994Q0048N0905m897l4778l9319l0251n8740j10815p1240M0228P9060
13386B36195K6575k1012m0622p3477n8920J9259Q6314J02536O2340J6807K7306
13375C83301N2762Q6142Q3914L4302j4879q5295j69132j50882l4600N0480O2786
13364B98899J7507k6747m4641l8177l486K2052L2131K5450L5191O0554J16509
$$ plain form
13438 297237 256677 276008 377629 532772 694548 820026 874682 833017 689708 445162
13428 445162 117470 -207004 -402630 -428889 -394982 -442761 -561515 -635959 -583943 -407913
13418 -407913 -192444 4169 174480 315709 431142 502996 533619 588949 669871 684751
13408 684751 582266 425159 279122 184472 202381 318439 399179 404197 370584 321071 335994
13397 335994 416042 466947 462050 427272 387953 357702 298962 188147 116907 157135 236195
13386 236195 262770 241758 201136 127659 68739 87998 174312 276848 339188 355995 383301
13375 383301 436063 522205 606119 640421 625542 540247 371115 220233 185633 236113 298899
13364 298899 316406 289659 245018 206841 203355 225407 257538 282988 318179 378733 495242
13353D95242J66583J27978P0652M4067K1695L0228R7157J35541O3270p1429j57204
13342A023780j52529j11458n9756n5697j24124j34442p7387k7036J9544P8246
13332C79141J43881J28244P3915J07971J56207J20056P8535K7779n4247r4991
13322A066491n9122j8336n288Q859O463L0127Q1425R7331N6484m125n8861o3878
13310A137570k7227q076o3134j71364k54377k41634j17115J8411R6241J51252
13300E20547J93614J64519L2854j04219j86337k07024j64469q8095K0622J18468
13290C00480J53311J12609j6331j69773j87755m2786J04061J56911J37095R4003
13280F41825J4855p2076j24471j16284q7294p7559n1338j2299M4309J71692K77177
$$ plain form
13353 495242 661825 789803 860455 904522 926217 956445 1053602 1189143 1252413 1180984 1023780
13342 1023780 871251 759793 700037 644340 520216 385774 308387 281351 300895 379141
13332 379141 523022 651266 725181 833152 989359 1109415 1187950 1215729 1161482 1066491
13322 1066491 1007369 989033 983745 992604 999067 1029194 1110619 1207950 1264434 1260309 1201448 1137570
13310 1137570 1110343 1102267 1039133 867769 613392 371758 254643 273054 369295 520547
13300 520547 714161 878680 911534 807315 620978 413954 249485 161390 182012 300480
13290 300480 453791 566400 550069 380296 192541 149755 253816 410727 547822 641825
13280 641825 656680 584604 460133 343849 256555 178996 127658 115359 159668 331360 608537
13269F08537K36145J12902K635n8472o6997l3867M7333J42938J69291P5758q3363
13258A152840k03449k05259j33110j02889q0637K4110J58501K42553K33230J38005
13248A223895J6758q9826j59623j87150j48381l5009O3939K2179p9951r2365k2181
13237E12285M8779Q7633J36012J55859R7582J3857o9414j25875j08762r4756p9965
13226E73235Q014O8596M6628K4165L5020M5719P1784J36995J76149J30991M630
13215A321926j11177p7369O5906J67744J36360j3j16319j51967j09746l3863K9292
13204A120774P1253P6973L4390k8536r9786j63591k07442k33258k03949j83604
13194A83224j33705k8372O8101J28736J62107J63437J17275K1557n7311m1241
$$ plain form
13269 608537 844682 957584 960219 901747 834750 800883 848216 991154 1160445 1236203 1152840
13258 1152840 949391 744132 611022 508133 427496 451606 610107 852660 1085890 1223895
13248 1223895 1240653 1150827 991204 804054 655673 620664 684603 706782 626831 534466 512285
13237 512285 561064 648697 784709 940568 1038150 1052007 982593 856718 747956 653200 573235
13226 573235 581249 649845 696473 720638 755658 801377 873161 1010156 1186305 1317296 1321926
13215 1321926 1210749 1133380 1199286 1367030 1503390 1503377 1387058 1235091 1125345 1091482 1120774
13204 1120774 1192027 1269000 1303390 1274854 1175068 1011477 804035 570777 366828 183224
13194 183224 49519 21147 89248 217984 380091 543528 660803 682360 625049 583808
13184E83808O3749J76132J95153J16495K6386k3423k197K4439L596K8939R3197
13173A286274O6760j8604r1817j49093j31208p9320p7674p3725K22O4081M7963
13162H43859J8683J4939M5322J46060K14701J81848J95350K62989K27019N6178
13152B206948p1035o1784n7161j74552l22137l40077k48392j37699o8499p7016
13142F48596q5437j4372P9598J31617J72800K14906K28290K08500J79573J67903
13132A931974J56105J55962J43535J06321P6482M5973k1576q7728q4322l5166
13122B387560k3773o5626j19063j64734j57642r3886l0552Q766j0173m7666k1520
13111A661691M4614M3610o5354j61211j43906p8959k526O6436J22554J44157J01584
$$ plain form
13184 583808 647557 823689 1018842 1135337 1161723 1138300 1136103 1160542 1164138 1193077 1286274
13173 1286274 1353034 1334430 1242613 1093520 962312 882992 805318 731593 731815 795896 843859
13162 843859 862542 877481 922803 1068863 1283564 1465412 1660762 1923751 2150770 2206948
13152 2206948 2135913 2074129 2016968 1842416 1520279 1180202 931810 794111 725612 648596
13142 648596 563159 548787 628385 760002 932802 1147708 1375998 1584498 1764071 1931974
13132 1931974 2088079 2244041 2387576 2493897 2570379 2616352 2594776 2507048 2422726 2387560
13122 2387560 2363787 2298161 2179098 2014364 1856722 1762836 1732284 1741050 1730877 1683211 1661691
13111 1661691 1706305 1749915 1684561 1523350 1379444 1300485 1297959 1364395 1486949 1631106 1732690
13100A732690N1822N4678J19140J83643J74645J03648P9202J24810J43499Q4408
13090B852185k4800j01928j07419q8078j10541j29392r3986m0333R154N2017L3703
13079B250582l861K1187R0971J12944M3085j0918K1415R0825J25381J04492Q4547
13068B930650J15336J82224K29687K39926K10915J13511r128q9531q1100l6829
13058C805661l8232m6148K287M0620l410q1060j48145j53744p3724Q8O0417R8335
13046C462945O2855K5459M2566K9218m0629q2166q3338p2759m6232R395J50710
13035C458024L12057L43288K69323K13073K46600K65795K14538J38631N7723K0719
13025E539771N9478R4592M2399L296R4383K11163K24994J79671J51316J28922
$$ plain form
13100 1732690 1784512 1839190 1958330 2141973 2316618 2420266 2499468 2624278 2767777 2852185
13090 2852185 2827385 2725457 2618038 2529960 2419419 2290027 2196041 2155708 2164862 2216879 2250582
13079 2250582 2246721 2267908 2358879 2471823 2514908 2503990 2525405 2616230 2741611 2846103 2930650
13068 2930650 3045986 3228210 3457897 3697823 3908738 4022249 4013121 3923590 3842490 3805661
13058 3805661 3767429 3721281 3723568 3764188 3760778 3679718 3531573 3377829 3304105 3304193 3364610 3462945
13046 3462945 3525800 3551259 3593825 3623043 3582414 3500248 3416910 3344151 3297919 3307314 3458024
13035 3458024 3770081 4113369 4382692 4595765 4842365 5108160 5322698 5461329 5519052 5539771
13025 5539771 5599249 5693841 5736240 5739536 5833919 6045082 6270076 6449747 6601063 6729985
13015F729985J14635J74516K25290K37591L15407L84268L42188K89594L05535
13006I119009K79273K03121J98129K78035L31478L32980L35450L53705M16179
12997A1847359N20113O29857P08265P72880Q55930R27667R27971R30984J063987
12988A9185013J292277J470821J582629J739581K024712K414695K863315L350188
12980C5923231L870783M444802N111365N907207O897711Q162478R671181J1416432
12972I1405190J3545673J6168721J9327152K3067169K7294253L1417459L3815909
12965B56041526L1530809K1244964K874944j7498245l1781369l6910126l5289184
12958A90213319l0633038k5407893k0655983j6588822j3242344j0688290q846673
$$ plain form
13015 6729985 6844620 7019136 7244426 7482017 7797424 8181692 8523880 8813474 9119009
13006 9119009 9398282 9601403 9799532 10077567 10409045 10742025 11077475 11431180 11847359
12997 11847359 12367472 12997329 13705594 14478474 15334404 16262071 17190042 18121026 19185013
12988 19185013 20477290 21948111 23530740 25270321 27295033 29709728 32573043 35923231
12980 35923231 39794014 44238816 49350181 55257388 62155099 70317577 79988758 91405190
12972 91405190 104950863 121119584 140446736 163513905 190808158 222225617 256041526
12965 256041526 287572335 308817299 311692243 294193998 262412629 225502503 190213319
12958 190213319 159580281 134172388 113516405 96927583 83685239 72996949 64150276
12951F4150276p427836o189862n146198m358501l798824l378158k945402k460808
12943B8444687k033416j742458j574144j453492j319081j105356q42282o47731
12935A7726727n58089n01465m69847m76575m70114l97439k97320k40434j73911
12926A4141533m7982M4152M9768K555n1225m1316L2507Q8643J22480K11556L84528
12915A4937199N34032N78389N91981O03121O39034P18180Q03250R12268J019845
12906B1337299J078848J067043R53690P70570O34244O56529Q31034J080650J384618
12897B9794525J805349K303899K795836L246129L685841M186021M903463N857328
12889E8578391P005757Q363358R931744J1818933J4190597J7029817K0379427
$$ plain form
12951 64150276 56722440 50532578 45386380 41027879 37229055 33850897 30905495 28444687
12943 28444687 26411271 24668813 23094669 21641177 20322096 19216740 18374458 17726727
12935 17726727 17168638 16667173 16197326 15720751 15250637 14853198 14555878 14315444 14141533
12926 14141533 14093551 14137703 14187471 14190026 14138801 14097485 14129992 14218635 14341115 14552671 14937199
12915 14937199 15471231 16049620 16641601 17244722 17883756 18601936 19405186 20317454 21337299
12906 21337299 22416147 23483190 24436880 25207450 25841694 26498223 27329257 28409907 29794525
12897 29794525 31599874 33903773 36699609 39945738 43631579 47817600 52721063 58578391
12889 58578391 65584148 73947506 83879250 95698183 109888780 126918597 147298024
12882A47298024K4363539K8809667L2912458L4637049L0586886J7598630k889707
12875C13316546k3096370l5286952l8078636l4942510k9572188k4103984j9382862
12868A08853044j5554112j2604443j0405575q639499p055150n718086m751551
12861D4124628m169570l805618l419084k938258k432242k008256j700192j491150
12853B2160258j315150j124083r65416q34708p47288p43462p25313o33745n05579
12844A4565514l83790l14161k83438k59653j89177o8791M5947R2838M6004k5683
12834A3225610k7860L634M1455J12137J64977J60437J43787J19677J08437J49834
12824A4202125K08974L06094M54285N60676O35427P20381Q09450R08628J050423
$$ plain form
12882 147298024 171661563 200471230 233383688 268020737 298607623 316206253 313316546
12875 313316546 290220176 254933224 216854588 181912078 152339890 128235906 108853044
12868 108853044 93298932 80694489 70288914 61649415 54594265 48876179 44124628
12861 44124628 39955058 36149440 32730356 29792098 27359856 25351600 23651408 22160258
12853 22160258 20845108 19721025 18755609 17920901 17173613 16430151 15704838 15071093 14565514
12844 14565514 14181724 13867563 13584125 13324472 13135295 13066504 13112451 13205289 13251293 13225610
12834 13225610 13197750 13201384 13242839 13354976 13519953 13680390 13824177 13943854 14052291 14202125
12824 14202125 14411099 14717193 15171478 15732154 16367581 17087962 17897412 18806040 19856463
12815A9856463J215675J369535J522716J654297J770920K033993K460785K919543
12807C4803927L409632L975274M650184N417484O316361P460597Q802399J0352607
12799H5188465J2287095J4723139J7718865K1278202K5314378K9529953L2923504
12792B38963601L3227914K7006567J2040695q529472k6532591l5890568l6839454
12785B03446692l3042159k7722291k2594832j8300819j4861705j2108883r887862
12778F4928141q116109o704164n603840m817272m201377l587534l027542k610892
12770B6259411k291526k033804j823246j588303j357820j218089j145701j067289
12762A3733633r66516q95528q67206q34953p06170n62378n55302o25539n48905
$$ plain form
12815 19856463 21072138 22441673 23964389 25618686 27389606 29423599 31884384 34803927
12807 34803927 38213559 42188833 46839017 52256501 58572862 66033459 74835858 85188465
12799 85188465 97475560 112198699 129917564 151195766 176510144 206040097 238963601
12792 238963601 272191515 299198082 311238777 302709305 276176714 240286146 203446692
12785 203446692 170404533 142682242 120087410 101786591 86924886 74816003 64928141
12778 64928141 56812032 50107868 44504028 39686756 35485379 31897845 28870303 26259411
12770 26259411 23967885 21934081 20110835 18522532 17164712 15946623 14800922 13733633
12762 13733633 12767117 11871589 11004383 10169430 9463260 8900882 8345580 7720041 7171136
12753G171136l31421j94314j38384j12732j45230k01850k51816l19194l82758
12744E093437m09252l76604l16137k59863k31077k21766j92409j55799j57663
12735B772867k03709k92366l36113k56262j16866J0985J04751J45281J03930M0113
12725A972611q456m9784p8382p1154n1602q4472j46393j34940m5355M8081J15326
12714A465480J52141J49028J35361J08283O513j15512j34953n7020N5551J56715
12704A921587J34219j0524j46477j65195p5995J7954M9026K2504p3457k00452
12694A473190k13852q8108N2530P4234m7756j70152j71625n0540O5397J01539
12684A024857J07162Q8338J6219q5170j70277k00805j72451q2533J9329P7185
$$ plain form
12753 7171136 6839715 6645401 6507017 6394285 6249055 6047205 5795389 5476195 5093437
12744 5093437 4684185 4307581 3991444 3731581 3500504 3278738 3086329 2930530 2772867
12735 2772867 2569158 2276792 1940679 1684417 1567551 1578536 1683287 1828568 1932498 1972611
12725 1972611 1964155 1914371 1835989 1764835 1713233 1628761 1482368 1347428 1302073 1350154 1465480
12714 1465480 1617621 1766649 1902010 2010293 2016806 1901294 1766341 1709321 1764872 1921587
12704 1921587 2055806 2045282 1898805 1733610 1657615 1675569 1724595 1747099 1673642 1473190
12694 1473190 1259338 1171230 1223760 1297994 1250238 1080086 908461 857921 923318 1024857
12684 1024857 1132019 1220357 1236576 1151406 981129 780324 607873 525340 544669 621854
12674F21854Q8345L5113l1622n7939o2093r5821j34304j34045q4854k9313K2879
12663A38200J01081J31365O1234l7712m8662Q594N9062P7122N6817K9653J4086
12652E90840K0070K8374l2581r7083m5090P2061J15471O4650j7897j08570j51851
12641D38394j07342m2794o0266j38999j89921j46480j9927R1766J91956K69032
12631B85419K80300K88486K30391N5289o8998o1863M181P1093J08558P9683M5163
12620A317702K1423m3260j70599k84865k81492j94417r0677p421L6674L7780l6124
12609C04724j24936r6121K1736J08966R5857R196n8483o3630q587L129n1281o2852
12597G7718o2514p7853m0005N9202J63198K12151J82356P0286o3162j04514r1740
$$ plain form
12674 621854 710199 745312 713690 655751 593658 497837 363533 229488 144634 115321 138200
12663 138200 239281 370646 431880 394168 345506 354100 413162 490284 547101 576754 590840
12652 590840 610910 639284 606703 509620 464530 536591 652062 716712 698815 590245 438394
12641 438394 331052 288258 227992 88993 -100928 -247408 -267335 -175569 16387 285419
12631 285419 565719 854205 1084596 1139885 1070887 1009024 1013205 1084298 1192856 1272539 1317702
12620 1317702 1339125 1295865 1125266 840401 558909 364492 273815 266394 303068 340848 304724
12609 304724 179788 83667 105403 214369 310226 319422 260939 197309 188722 191851 140570 77718
12597 77718 15204 -62649 -102654 -43452 119746 331897 514253 584539 521377 416863 325123
12586C25123j37198j87416j48612j4961J11164J54649J54266J18687Q0901R3853
12576E50456J26097J09039L7631j2667N899M1470L7468k1116r0713q9658Q66O6595
12564G61367P8248P0289K1998k0858n2402p0420o0770m4704l7831k9197k1272
12553E94448m4761p7344o3641n0558J5378J02684J00489O8215M6868k0796j08228
12542E62754j28970l6145P2061J08235J00516N9739o515p8709j13542j03387p7795
12531C58242k3567M7687J18031J59604J88235K33550J81962M4402r2160j80109
12521A035877k02477j66387j07228j17514j60553j08931o7009j12243j60127j53117
12511c19709p6492M3736J22911J44257J77829K55103K91511J84041m749j44152
$$ plain form
12586 325123 187925 509 -148103 -163064 -51900 102749 257015 375702 456603 550456
12576 550456 676553 785592 823223 810556 816455 857925 895393 874277 783564 693906 694772 761367
12564 761367 839615 909904 931902 911044 858642 788222 727452 682748 644917 615720 594448
12553 594448 549687 472343 408702 358144 373522 476206 576695 644910 691778 670982 562754
12542 562754 433784 397639 469700 577935 678451 738190 731675 652966 539424 436037 358242
12531 358242 334675 382362 500393 659997 848232 1081782 1263744 1308146 1215986 1035877
12521 1035877 833400 667013 559785 442271 281718 172787 105778 -6465 -166592 -319709
12511 -319709 -396201 -352465 -229554 -85297 92532 347635 639146 823187 818438 674286
12501F74286k37041k77390k04626n6588J3194l1735j19903j30006m2728N437k2640
12490d29740k5749K4512J2782l7778m0747q989O1241J91634K65738K01256R5710
12479C09870J3816n6791j28954j75512j51306j09389r4366q8394q4917p9277m0092
12468f85312K1406N0455L3561j2591j8938O4294J87392K68673K25452M6021j46083
12457C4330k17767j48054n9498k5951n569j2465l2775J717J03011K04445J94575
12446C5999Q4802l4525j00777q5587k8203K3471O5640M4928q1114j97535j90004
12435d62905j02312k3778J0541J3839K3925P2540J07702O5451O89j6474M638O8145
12423b37999J72606K56348K23427J02394m1137j88374k49885k07675j73201j53928
$$ plain form
12501 674286 437245 159855 -44771 -101359 -88165 -119900 -239803 -369809 -412537 -407100 -429740
12490 -429740 -455489 -430977 -418195 -455973 -496720 -505709 -444468 -252834 12904 214160 309870
12479 309870 323686 266895 137941 -37571 -188877 -298266 -392632 -481026 -565943 -645220 -685312
12468 -685312 -663906 -613451 -579890 -592481 -611419 -547125 -359733 -91060 134392 180413 34330
12457 34330 -183437 -331491 -390989 -416940 -422509 -434974 -467749 -466032 -363021 -158576 35999
12446 35999 120801 86276 -14501 -100088 -128291 -104820 -39180 5748 -75366 -272901 -462905
12435 -462905 -565217 -588995 -578454 -564615 -540690 -468150 -360448 -294997 -294308 -310782 -306144 -237999
12423 -237999 -65393 190955 414382 516776 475639 287265 37380 -170295 -343496 -497424
12413d97424r1701l3693k8018m5329n8126k0278O0501R2763J01898J63955K19370
12402a36082J83725J19076M0833o0679j47362j42731o6686m3208p4010j00573
12392d27697j26059r8990j6034M8853J04435J58350J29690K8858m4538l0312K2630
12381b50814M259m7506l9197k0775m3347l7502J419L4553N6798L1854n0856j49715
12369e10829k00481j66631j02190J7090J56652K45022K54182J47128L9296l83
12359a21144q656m3486j34552k03010j92175j22194j8989Q1697J42537J29550
12349d90422R8096O5852J0646j6400M193N2587P3848J2196q9063q8974k1904L1885
12337c57460P9920R7567O2849L269n9162j15053j31424q5312p246M7577P8546
$$ plain form
12413 -497424 -589125 -622818 -650836 -696165 -754291 -774569 -714068 -621305 -519407 -355452 -136082
12402 -136082 47643 166719 207552 146873 -489 -143220 -209906 -253114 -327124 -427697
12392 -427697 -553756 -652746 -668780 -619927 -515492 -357142 -227452 -198594 -243132 -273444 -250814
12381 -250814 -246555 -294061 -333258 -354033 -397380 -434882 -433463 -398910 -342112 -310258 -361114 -510829
12369 -510829 -711310 -877941 -980131 -963041 -806389 -561367 -307185 -160057 -120761 -121144
12359 -121144 -129800 -173286 -307838 -510848 -703023 -825217 -844206 -762509 -619972 -490422
12349 -490422 -392326 -326474 -315828 -332228 -328035 -275448 -201600 -189404 -278467 -367441 -389345 -357460
12337 -357460 -277540 -179973 -117124 -113855 -173017 -288070 -419494 -504806 -512052 -464475 -385929
12326c85929R5506O0425M5264R6850J50537J61805J07554j1414j34907j83460
12316B231j12739J2619M4164j6566k2068L1162O2135O5339N9948P1639P4577M3874
12304C16315J9266L9893K0338p7179j65822j66275r1830K0370P6546N8855O6197
12293A16674R7057J07627Q8279P0356P1858N0332k1545r4863j17410q4923m2673
12282B40769j8045K3571N5855N4559M9939L7563L2277J3925K0914J0394r0596
12271D31125j47722q6732j2286L5336P9211O4966k4158j35601k19493k05916j03439
12260c24709j4180O2266J22089R6714L3719j8791l1189L602l643n7989o9829m1737
12248b43677j5899n770P733M3857N2835k5806j37273j69546r0584q382K8388M4182
$$ plain form
12326 -385929 -290423 -229998 -184734 -87884 62653 224458 332012 320598 185691 2231
12316 2231 -110508 -97889 -53725 -70291 -92359 -61197 938 66277 126225 197864 272441 316315
12304 316315 335581 375474 395812 318633 152811 -13464 -105294 -84924 -8378 50477 116674
12293 116674 213731 321358 409637 479993 551851 602183 580638 485775 368365 283442 240769
12282 240769 222724 246295 302150 356709 406648 444211 476488 490413 511327 521721 431125
12271 431125 283403 196671 184385 219721 298932 363898 339740 204139 -15354 -221270 -324709
12260 -324709 -338889 -276623 -154534 -57820 -24101 -42892 -74081 -70479 -74122 -132111 -201940 -243677
12248 -243677 -259576 -265346 -257613 -213756 -160921 -186727 -324000 -493546 -584130 -592512 -564124 -519942
12236e19942L8164K9340L5464N9460P8561M3951J1844M7277J44549K21271J88463
12225C78402J31811J20131J05125L1810m339K4220L4234J1484m3246j18633j61630
12214E09369j29808l6255L3781J7461l8398p8367j03983q4425j1674L6755K7547
12203A42003K4648P9889J52476J46692Q0221N6094O8304K7267n4623p7901j5416
12192F29654K7861m891o1302q1729q6438r5685o2646k4022m3069n5352m9183j4907
12180G8291P2694J57762J77637J40657L1279j38956k68702k79867j30352P5067
12170h4490J84781J50506O0473m726n0378j15353j47057j13905k8165P3055J37528
12159F2269J34859R4846Q7681P0026K6078l4849q7193r2875m7775k8616p8022
$$ plain form
12236 -519942 -481778 -452438 -416974 -357514 -278953 -235002 -223158 -175881 -31332 189939 378402
12225 378402 510213 630344 735469 767279 762940 787160 821394 832878 789632 670999 509369
12214 509369 379561 343306 377087 394548 356150 277783 173800 89375 77701 114456 142003
12203 142003 166651 246540 399016 545708 625929 682023 750327 777594 722971 645070 629654
12192 629654 657515 652624 591322 509593 423155 327470 264824 240802 197733 142381 93198 78291
12180 78291 150985 308747 486384 627041 658320 519364 250662 -29205 -159557 -84490
12170 -84490 100291 250797 311270 306544 256166 140813 -6244 -120149 -148314 -75259 62269
12159 62269 197128 291974 379655 449681 475759 440910 353717 260842 213067 184451 106429
12148A06429j04210r9939j22865j24616p2050k6268L0230J14312J73437K13138
12138H7598J48721o145q0060m5331K2010R3277J22556L3648j22765k07367j47992
12127a01850l368Q5601R9303J00096Q1419K1846o0500j36005j71005j14477K3514
12116a75426J39094J48290N8916o5548j61670j82219j05841k9427n012j9208l5881
12105d33932j4173M341K6423R3094J48446J24458N1025J8542K8377L6411Q2088
12094A65100J64745J88545J00622q160r6567j64332j81581j36859m8136J2469
12084d154J5469K1740M7758N7536L2509r633l8200q5474j37066j24377q1059q8690
12072c93641j18828q1244K2942J02919J32248J47032J20010N9302K2372N2282
$$ plain form
12148 106429 2219 -97720 -220585 -345201 -417251 -443519 -413289 -298977 -125540 87598
12138 87598 236319 230174 150114 104783 126793 220070 342626 376274 253509 46142 -101850
12127 -101850 -105218 -19617 79686 179782 261201 283047 222547 86542 -84463 -198940 -175426
12116 -175426 -36332 111958 170874 105326 -56344 -238563 -344404 -373831 -378843 -398051 -433932
12105 -433932 -448105 -443764 -417341 -324247 -175801 -51343 -318 18224 46601 83012 165100
12094 165100 329845 518390 619012 610852 514285 349953 168372 31513 -16623 -4154
12084 -4154 11315 33055 80813 138349 170858 161225 123025 37551 -99515 -223892 -304951 -393641
12072 -393641 -512469 -593713 -570771 -467852 -335604 -188572 -68562 -9260 13112 65394
12062F5394R5114O5160O812m520J3271j9062m7923j361P8082J14521N7819l4554
12050C88753p1546q4814p4903l3721l434J3675K3040J6945J6412J2954k3045r0410
12038H9906j22864r1796r4909j85770k63921k27369j15925R495R3330J46010K00553
12027e63260J89747J05168L246p4236p6681m4025k4931r679l047L2063Q9463J02304
12015b73868R2025J01540J13486R1262O3728N5461O8737J24887J74063J19095
12005G30416j5815j35221j88053j45413p4479q0924j36955j43113m7619M2165
11995a95011M8298P9860J07075O2929M1497P9659J31907J30868N6934j6165n3423
11984D74428r5296j35537q5484N6048J39625J03594K3813k3067L3937J12207O8504
$$ plain form
12062 65394 160508 225668 232480 227960 241231 222169 174246 172885 250967 365488 423307 388753
12050 388753 317207 232393 157490 123769 120335 134010 157050 173995 190407 203361 180316 89906
12038 89906 -32958 -124754 -219663 -405433 -669354 -896723 -1012648 -1003153 -909823 -763813 -563260
12027 -563260 -373513 -268345 -265099 -339335 -416016 -460041 -484972 -494651 -497698 -465635 -376172 -273868
12015 -273868 -181843 -80303 33183 124445 188173 243634 312371 437258 611321 730416
12005 730416 714601 579380 391327 245914 171435 90511 -46444 -189557 -237176 -195011
11995 -195011 -146713 -66853 40222 103151 144648 224307 356214 487082 544016 527851 474428
11984 474428 379132 243595 158111 214159 353784 457378 481191 458124 492061 604268 672772
11973F72772m4100q0902m6163p3980j18500r2221o5426r8185j07078j4959R2518
11962B3776J43765J03697j5116j16013j30751m8615l461n3563r7580n9986J9634
11951b34213N8345N3280L5854K1639M5806J05498J66089K06157J80189J04332
11941G42976O3623K9239m1527j05389j44527j86001k60133k89858j69113N6600
11931c04110K40460K62548J05234o5446p2407M4628J30881J36063J12988N5730
11921F46569n8772j40414r3585l971p384o0287p0618p6980j15281j41073j04764
11910b26560k0915j0894r7354j27892m3841J5511j6766n8936m7996m6735m7338
11899g29716J3377R0757Q4799k4785j27217j15577p0167k7052R040Q027L5553
$$ plain form
11973 672772 628672 547770 501607 427627 309127 216906 151480 53295 -53783 -68742 23776
11962 23776 167541 271238 256122 140109 9358 -39257 -42718 -96281 -193861 -253847 -234213
11951 -234213 -175868 -122588 -86734 -65095 -19289 86209 252298 458455 638644 742976
11941 742976 806599 835838 794311 688922 544395 358394 98261 -191597 -360710 -304110
11931 -304110 -63650 198898 304132 238686 166279 210907 341788 477851 590839 646569
11921 646569 587797 447383 353798 349827 342443 282156 211538 134558 19277 -121796 -226560
11910 -226560 -247475 -258369 -355723 -483615 -527456 -511945 -528711 -587647 -635643 -682378 -729716
11899 -729716 -716339 -625582 -540783 -565568 -692785 -808362 -878529 -905581 -896541 -888514 -852961
11888h52961P3556P0301O4661Q5272R7601J02823J11530O0611n2591j70846k54014
11877f64057k46775j64129n0258Q6352K31482K77886J65557K5791k5706r001J7059
11866c55799L5184O1093Q4078P4642L2704m5805j45165j62611n5880P3131J20360
11855b84068N5064k0787j2618K8472K3803M9165J20912J02112n158r3796j11199
11844a48098k8039N7682O2810O1133R3659J19106J23570J00783N8963N259o1200
11833D45628j20586j42084r4539l8954m0748n2103l4373P75L6542L4659R832M3238
11821D7287J14576J13709L4318k1793K8209J07362J09858O4559J8379n1541j62644
11810D02279k43414k24075j42962n1467p625o5257r5433j7825K1433n4253j25554
$$ plain form
11888 -852961 -779405 -709104 -644443 -559171 -461570 -358747 -247217 -186606 -239197 -410043 -664057
11877 -664057 -910832 -1074961 -1125219 -1038867 -807385 -529499 -363942 -338151 -363857 -372858 -355799
11866 -355799 -320615 -259522 -175444 -100802 -68098 -113903 -259068 -421679 -477559 -404428 -284068
11855 -284068 -229004 -249791 -262409 -233937 -210134 -160969 -40057 62055 56897 -36899 -148098
11844 -148098 -176137 -118455 -55645 5488 99147 218253 341823 442606 501569 506828 445628
11833 445628 325042 182958 88419 49465 8717 -43386 -77759 -76984 -40442 -5783 4049 47287
11821 47287 161863 275572 309890 288097 316306 423668 533526 598085 616464 564923 402279
11810 402279 158865 -65210 -208172 -259639 -267264 -332521 -427954 -445779 -424346 -478599 -604153
11799f04153j15287n2564L5245J06036J38865J18662N7884K2001L4580L6753K0667
11788b01311J94m3117p9972l2028P1016J29187J20669Q2239K9188j7344l4678
11777B4043j2593l1606j02883j06082p0147p7731q2327l7790j4782j0299L8639
11766d83558J02844J20594P7966L0520L6859Q8357J36837J77054J90028J02566
11756E80067q3214k05848j91689j16414r7168j30195j42229r4448L3987J21521
11746c25630N5123p7383j06580n7011n1101p9374n0110M6959J19533J57942J52572
11735b15060Q7834J0562p021m927l1759k8099K0813L4079j4919n5629n9144k4490
11723b87760K26k2441j08893j46230j4829J45104J25685R180m0267n339N3706
$$ plain form
11799 -604153 -719440 -772004 -736759 -630723 -491858 -373196 -315312 -293311 -258731 -221978 -201311
11788 -201311 -201117 -244234 -324206 -356234 -285218 -156031 -35362 46877 76065 58721 24043
11777 24043 11450 -20156 -123039 -229121 -299268 -376999 -459326 -497116 -511898 -522197 -483558
11766 -483558 -380714 -260120 -182154 -151634 -114775 -26418 110419 287473 477501 580067
11756 580067 496853 291005 99316 -17098 -114266 -244461 -386690 -481138 -447151 -325630
11746 -325630 -270507 -347890 -454470 -511481 -562582 -641956 -692066 -645107 -525574 -367632 -215060
11735 -215060 -127226 -116664 -123685 -128612 -160371 -188470 -167657 -133578 -148497 -204126 -263270 -287760
11723 -287760 -287534 -309975 -418868 -565098 -579927 -434823 -309138 -299958 -340225 -345564 -291858
11712b91858P1018K7695k9922k2244K5443R2636J24444O0369j70j4300j5307J1561
11700C9365K0132j7229p2201n9129L0391J03113J48542R9743m4332k13854k99664
11689b65123k55587j09682L4149N5420J1067m1895l9441N6752J55343J89489J44544
11678f4964M9176l5819q3384p6051K0527J77516K32255J59629J26159J41181P9056
11667G25281m4879j45182k09868j97983j00312k0979j0944N670M4384M2284Q877
11656I6349L982k08k5884m6405n9457o8564q2674q6420m3194J8839Q5537J42750
11644f5349R9985j5943r1267j03356o9657m9249o2635m1484R28L6676O9097O4904
11632b27350P23p1368j13139j05711o0686K68P2708Q5174N727n0153j6569Q946
$$ plain form
11712 -291858 -220840 -193145 -223067 -245311 -219868 -127232 -2788 57581 57411 43111 27804 39365
11700 39365 59497 42268 -29933 -89062 -58671 44442 192984 292727 248395 34541 -265123
11689 -265123 -520710 -630392 -596243 -540823 -529756 -571651 -611092 -554340 -398997 -209508 -64964
11678 -64964 -15788 -51607 -134991 -211042 -190515 -12999 219256 378885 505044 646225 725281
11667 725281 680402 535220 325352 127369 27057 6078 -4866 804 45188 87472 96349
11656 96349 100331 100123 74239 27834 -31623 -100187 -182861 -269281 -312475 -293636 -208099 -65349
11644 -65349 34636 18693 -72574 -175930 -245587 -294836 -357471 -398955 -398027 -361351 -292254 -227350
11632 -227350 -226627 -297995 -411134 -516845 -577531 -577263 -504555 -419381 -413654 -463807 -480376 -471430
11620d71430J2462J8685k4698j00726j10213k1923Q6775K03449L13625L32318
11610B38324K70128J82339J00694Q7839Q5323j7857j74087k93796l55763l22156
11600a99012j94940p8510K5547J27904J69635J41161N2310k6507l4292K0159J06603
11589A10058J56002Q7880o0712j44027r9363k5476J8841M3351K8750k6071o3671
11578B5562k5650M7553N2707j0848k0622K9065M1215K710m7628n8872p2471j12798
11566a50077r3924R961J12459J58290J62090J22146L1262p4595j06071o0159j0559
11555A00823r852k3064M4784R5808M7483m4128j03627j01769m3132M8691R9565
11544A11582M1739k8387k1045J6081K5621Q388k0236o7733q5766p2255n7251o42
$$ plain form
11620 -471430 -458968 -440283 -464981 -565707 -675920 -697843 -611068 -407619 -93994 238324
11610 238324 508452 690791 791485 879324 964647 946790 772703 478907 123144 -199012
11600 -199012 -393952 -472462 -446915 -319011 -149376 -8215 44095 17588 -16704 3455 110058
11589 110058 266060 353940 293228 149201 49838 24362 43203 86554 115304 89233 25562
11578 25562 -88 47465 100172 89324 68702 97767 138982 141692 94064 35192 -37279 -150077
11566 -150077 -244001 -234040 -121581 36709 198799 320945 352207 277612 171541 111382 100823
11555 100823 90971 67907 112691 208499 255982 211854 108227 6458 -36674 12017 111582
11544 111582 153321 124934 103889 119970 145591 153979 133743 66010 -19756 -92011 -149262 -149904
11532a49904J09554J65500R1489L1212N8301Q7456J17692J49369J19005M475r5307
11521F88842j01865p4914o0634p1259j46278k12475j74689o0384K6589K9626P439
11510a50002P856K4610M0027O6608J22498J90193J91713J46976J09368N1672l6182
11499G65337j42035k17517k08106j32278k1178Q2072J42987J58862J26650N6778
11489F11572k5541q3782j18219j05282p1628n7691o9520q0651o8831m4002J2951
11478a00624J05998K03894K04556R7461L9029M7782K2458p6137j88636k20979
11468A34802j54628j8607J26267J38738K8350p5341j18897j30280j32303o3112
11458b65011q386m1529q3885r0218n1297L2120P0945Q0269J42511J83471R6751
$$ plain form
11532 -149904 -40350 125150 216639 247851 306152 393608 511300 660669 779674 784149 688842
11521 688842 586977 512063 451429 380170 233892 21417 -153272 -213656 -187067 -157441 -150002
11510 -150002 -142146 -117536 -77509 -10901 111597 301790 493503 640479 749847 801519 765337
11499 765337 623302 405785 197679 65401 44223 126295 269282 428144 554794 611572
11489 611572 586031 502249 384030 278748 207120 149429 79909 -742 -69573 -113575 -100624
11478 -100624 5374 209268 413824 511285 550314 598096 620554 544417 355781 134802
11468 134802 -19826 -38433 87834 226572 254922 179581 60684 -69596 -201899 -265011
11458 -265011 -273397 -314926 -398811 -489029 -540326 -508206 -437261 -356992 -214481 -31010 65741
11447F5741q7311k11676k20195j47804o6501m115M7045P7357P0104K1010o2931
11436e19276j19771j00646n6996o280M8490J25704K44591L38147L11696J49176
11426D14835J0896j8851j0329m4839j17240j41343p1248L0080J08534J05805J4196
11415B80496m2091o799N657r6624k13483k17394q8848N0051R3810Q2945Q9043
11404f3237J07343R8733M5681Q93K5709M3271l1395j28408j42478n1370Q7897
11393g361J97825J98817J23659Q4893O6108o738j07574j41748j01967k7285J3130
11382B91759L0520N1802j294j92479l93586l99686k22821o7147k9829j3784Q1047
11371h65498K23956K67439J34612m0876j18885j03871m8694Q558O7890R6895R8239
$$ plain form
11447 65741 -21570 -233246 -453441 -601245 -667746 -671861 -624816 -547459 -477355 -456345 -519276
11436 -519276 -639047 -739693 -796689 -802969 -754479 -628775 -384184 -46037 265659 414835
11426 414835 425731 406880 396551 351712 234472 93129 21881 51961 160495 266300 280496
11415 280496 238405 231606 237263 140639 -72844 -290238 -379086 -329035 -235225 -152280 -63237
11404 -63237 44106 142839 188520 189413 215122 258393 226998 98590 -43888 -95258 -7361
11393 -7361 190464 389281 512940 597833 663941 657203 549629 407881 305914 278629 291759
11382 291759 322279 374081 372787 180308 -213278 -612964 -835785 -902932 -932761 -946545 -865498
11371 -865498 -641542 -374103 -239491 -280367 -399252 -503123 -551817 -543259 -475369 -378474 -280235
11360b80235Q6965M1206k9427o3096j1611O2713J17457J08420O4760K1038n4980
11349F3210j14302j11139o6175l5424r982P1437J27718O2509l7105l9298N7742
11338c0809J18934O2346q2202j82671j69951j39767j19906p5711k2226J2212j1589
11327f41340p8118j35357j45311j18937n6729j5688J0879N4679J11542J94278
11317h20102K22120K06745K05195K08492K01298J42418J9577r0129j59491k00588
11307f4465j92411j19063J6943J25077J46426J26356O6615J9370L9629P0891K5533
11296B60901m2460o5379k1634M1214n838j18406k17080k56693j83844k6055J13949
11285e21325J90266K13266J74302J18785Q6533M4373R785J0322j7041o5371j08152
$$ plain form
11360 -280235 -193270 -152064 -181491 -244587 -256198 -193485 -76028 32392 97152 118190 63210
11349 63210 -51092 -162231 -228406 -263830 -273812 -202375 -74657 -12148 -49253 -88551 -30809
11338 -30809 88125 150471 68269 -114402 -284353 -424120 -544026 -619737 -641963 -629751 -641340
11327 -641340 -719458 -854815 -1000126 -1119063 -1175792 -1191480 -1180601 -1125922 -1014380 -820102
11317 -820102 -597982 -391237 -186042 22450 223748 366166 385743 295614 136123 -64465
11307 -64465 -256876 -375939 -358996 -233919 -87493 38863 105478 124848 164477 235368 260901
11296 260901 218441 153062 131428 172642 166804 48398 -168682 -425375 -609219 -635274 -521325
11285 -521325 -331059 -117793 56509 175294 261827 306200 315985 326307 309266 243895 135743
11274A35743j54076j19080j7846N0248J00858J69555J87940R6691n1669j13541
11264B84823p2479l8857q7144j17120k0061R4183J14707N9241M3770M4216J6592
11253C21871j5703n6207q6029q0136m7762J8937O1358L8921L319l723K4847N0672
11241B30365L407m0337j4254p301q3672j65057j59069p6866K6849J02889K10993
11230B7947K54234J62602P1360P6289J12217O5450q5057k34021k57694j57360
11220C5967m6318J1967L1587L5734L6325K5679M7024J23673J67674J58301J10220
11209G37833O715o4898o4471n5352p0061j28346j88305j76157j45099j81275k24883
11198e54299j53987j3388N3629M8794J03266J80363J98634K01255J53736K6758
$$ plain form
11274 135743 -18333 -137413 -155259 -105011 -4153 165402 353342 450033 398364 284823
11264 284823 212344 173487 86343 -30777 -50838 43345 158052 217293 261063 305279 321871
11253 321871 306168 249961 163932 83796 36034 54971 116329 155250 158569 154846 179693 230365
11241 230365 233772 193435 179181 171880 88208 -76849 -235918 -312784 -285935 -183046 27947
11230 27947 282181 444783 516143 592432 704649 770099 685042 451021 193327 35967
11220 35967 -10351 1616 33203 68937 105262 130941 177965 301638 469312 627613 737833
11209 737833 744548 679650 615179 559827 489766 361420 173115 -3042 -148141 -329416 -554299
11198 -554299 -708286 -721674 -668045 -619251 -515985 -335622 -136988 64267 218003 244761
11188B44761o9566j08965r2720p4010j06244r5635k0814M7538J07391J40178Q9254
11177F1168K961o7781r1619o4300J0225O1857O6100R0743J04399N4145K8691P0384
11165C26973P0663n3403j77401k06494j42620o6009m3416l5732K2101J24828K05538
11154B5028K30661K18361J73101P7627n3858j53714j43655j04707j20644j39835
11144H365j16835n1520J5611M2669N3431Q4269J22710R8844K3143k8888p2957
11133A78842j23277j11490l3060L0287N1734P4939J06634O2277Q504L5655K7408
11122C08453j7857J7125P2461O5549K2934l2917q0573q1482l4017L3194P4231
11111C47101O0799J6660j7662n463J4977J8793K2833N474m9122j03986r1268k5105
$$ plain form
11188 244761 175195 66230 -26490 -100500 -206744 -302379 -323193 -275655 -168264 -28086 61168
11177 61168 64129 -3652 -95271 -159571 -149346 -87489 -21389 69354 173753 227898 256589 326973
11165 326973 397636 344233 166832 -39662 -182282 -248291 -291707 -327439 -305338 -180510 25028
11154 25028 255689 474050 647151 724778 670920 517206 373551 268844 148200 8365
11144 8365 -108470 -159990 -144379 -101710 -48279 35990 158700 257544 280687 251799 178842
11133 178842 55565 -55925 -88985 -58698 -6964 67975 174609 236886 245390 281045 308453
11122 308453 290596 307721 380182 445731 468665 435748 355175 273693 239676 272870 347101
11111 347101 407900 424560 406898 401435 416412 435205 458038 463512 414390 310404 219136 194031
11099A94031j6134j02147j77591j17673P971J15286J88656K16024J77149N7929
11089E43501l7009k6783J0578L7772O1509P0547K1957o0490o4660j5377L5001
11078E76546L2988j9420n2392l5141L9346J07461J06531O6874N2978Q7088J31268
11067A094127J62657J20289L9867L1488J37168K94058L61291K03767j34277m23091
11057A887344n22055m42392k51636l1665J58803K28098J33375O201o9350n9475
11047A037248M3878J66261K28949J91050R0273J6441k4287l8237n3554j22618
11037A535404j92004j78892p1826N5157J19432R6313L3841m3067q8410n5545N320
11026A215723M1632N9209J24567K51052K98836J96939O8543L7786J04194K06717
$$ plain form
11099 194031 177897 75750 -101841 -219514 -211543 -96257 92399 308423 485572 543501
11089 543501 506492 479709 490287 528059 589568 660115 682072 621582 556922 541545 576546
11078 576546 609534 590114 537722 502581 541927 649388 755919 822793 875771 962859 1094127
11067 1094127 1256784 1377073 1416940 1448428 1585596 1879654 2240945 2444712 2310435 1887344
11057 1887344 1365289 922897 671261 639596 798399 1026497 1159872 1166073 1096723 1037248
11047 1037248 1081126 1247387 1476336 1667386 1757659 1774100 1749813 1711576 1658022 1535404
11037 1535404 1343400 1164508 1092682 1147839 1267271 1363584 1397425 1354358 1265948 1210403 1215723
11026 1215723 1257355 1316564 1441131 1692183 1991019 2187958 2256501 2294287 2398481 2605198
11016B605198K57586K46624K23479K43421K89330K84805L10074L92165M39485
11007E292167M61346N31390O18154P20579Q53576R49326J030594J207504J474268
10998A3138904J865263K413488L019455L636467M322201N122265N977385O567437
10990D6062865O377185N079137K772554j52182l051648n242189o382704o514307
10982C8948711n883733m786437l568821k565010j924075j544671j333461j221547
10974A6120956j117381j036872r76547q37367n82073l51164l22112m16314m81488
10965I999638n42998o07097o25516o05784n76775n15875m34293l83848l78014
10956E329438m05627m08188m07764m45968m80323m66701l75092k52560j69857
$$ plain form
11016 2605198 2862784 3109408 3332887 3576308 3865638 4150443 4460517 4852682 5292167
11007 5292167 5753513 6284903 6903057 7623636 8477212 9426538 10457132 11664636 13138904
10998 13138904 15004167 17417655 20437110 24073577 28395778 33518043 39495428 46062865
10990 46062865 52440050 57519187 60291741 60139559 57087911 51845722 45463018 38948711
10982 38948711 33064978 28278541 24709720 22144710 20220635 18675964 17342503 16120956
10974 16120956 15003575 13966703 12990156 12152789 11570716 11219552 10897440 10481126 9999638
10965 9999638 9456640 8849543 8224027 7618243 7041468 6525593 6091300 5707452 5329438
10956 5329438 4923811 4515623 4107859 3661891 3181568 2714867 2339775 2087215 1917358
10947A917358j26593q4491n7596l0418j4102j320O5987J10188O7135J858k5164
10936A822842n4857j65259k37689j84119r2285n579M7827L5150J0953m1197j08324
10925A027463j05526n8779m652M6082Q8100J18826J62028J97972K10438J98711
10915A880663J12726j5950j05140j83724k39314k04877j41635j09174p8408n6189
10905H58978k3524k4755r9089j23722n3326J8267L7462M7556P8658O6469R336
10894G92310M604N6829J07163P0552m7316j28927j83226k17635j88517j17937
10884A47900m3268N2063J34567J26057N0075J5849K0169j3283r2432j16171j12558
10873A68968j85410k63225k37381q0857J15275K20350J94001J04425J33j10201
$$ plain form
10947 1917358 1790765 1706274 1648678 1618260 1604158 1602838 1668825 1779013 1846148 1848006 1822842
10936 1822842 1767985 1602726 1365037 1180918 1088633 1083054 1130881 1166031 1176984 1135787 1027463
10925 1027463 921937 863158 858506 904588 992688 1111514 1273542 1471514 1681952 1880663
10915 1880663 1993389 1977439 1872299 1688575 1449261 1244384 1102749 993575 915167 858978
10905 858978 835454 810699 711610 587888 534562 552829 590291 637847 716505 782974 792310
10894 792310 796914 853743 960906 1031458 984142 855215 671989 454354 265837 147900
10884 147900 104632 156695 291262 417319 467394 483243 503412 490129 397697 281526 168968
10873 168968 -16442 -279667 -517048 -597905 -482630 -262280 -68279 36146 36279 -73922
10863g3922j63685j31646p0229J0575P6380J11146J17929J16236J02939O1984
10853A57707K6695m50m7763p5285o1908p3568j23208j77765j54565k6139J15029
10842d41220J66769J42989J32428J19568N6424k5496q9061j28017j60777k28069
10832d54462k74461j82134k308J14870J46975J52581J25027M3616n5169j03475
10822d88940n5625O1482J33344J39450J38303J21567O1978M222k3520m8867j4874
10811B8520J01827J95798J24345o6275k00419k04415r3165P0086J57226J00675
10801B14203l2132j17888o2632L3744M3101j6531r6652j46388j39350m2059J32251
10790b30333K68148K25870Q2049m25l568n611n6613r5039q4795j00562j57050
$$ plain form
10863 -73922 -237607 -369253 -439482 -428907 -352527 -241381 -123452 -7216 95723 157707
10853 157707 184402 183952 136189 60904 -1004 -74572 -197780 -375545 -530110 -556249 -441220
10842 -441220 -274451 -131462 966 120534 176958 151462 62401 -65616 -226393 -454462
10832 -454462 -728923 -911057 -913365 -798495 -651520 -498939 -373912 -330296 -385465 -488940
10822 -488940 -544565 -483083 -349739 -210289 -71986 49581 111559 115781 92261 43394 28520
10811 28520 130347 326145 450490 384215 183796 -20619 -113784 -43698 113528 214203
10801 214203 182071 64183 1551 35295 78396 61865 -34787 -181175 -320525 -362584 -230333
10790 -230333 37815 263685 345734 345309 341741 336130 279517 184478 99683 -879 -157929
10779a57929j90139j75985k07150k97893l27683k15674P145K05451K80964K66120
10769h12773K22869K19227K42336J92075O7456o1458j24966j64668j60967q7535
10759d68404J6459J25510J84196J88841J54347P4508j4055p5245j21251j52497
10749h7591r3941N456M5742M4260J0985m9304r4008j17134j53210j55337p2182
10738g16264O9116J54513J54099J37362J12911O0420j1572l2688j4254l7751n6818
10727a80926o6554o7162k3196j6475p4415o5022K7307M0414k6634q8706j00926
10716f42295n3896J4451Q9849J23980J19316P3083k5921o2941n2847l5188K3499
10705d28910O4183O1694K7019o4869j92240k38119j41596l3768J6996J08943K60004
$$ plain form
10779 -157929 -348068 -524053 -731203 -1029096 -1356779 -1572453 -1565308 -1359857 -1078893 -812773
10769 -812773 -589904 -370677 -128341 63734 131190 69732 -55234 -219902 -380869 -468404
10759 -468404 -451945 -326435 -142239 46602 200949 275457 261402 186157 64906 -87591
10749 -87591 -181532 -176076 -130334 -86074 -75089 -124393 -218401 -335535 -488745 -644082 -716264
10738 -716264 -647148 -492635 -338536 -201174 -88263 -27843 -39415 -72103 -86357 -124108 -180926
10727 -180926 -247480 -314642 -337838 -354313 -428728 -493750 -466443 -426029 -452663 -541369 -642295
10716 -642295 -696191 -681740 -591891 -467911 -348595 -275512 -301433 -364374 -417221 -452409 -428910
10705 -428910 -364727 -303033 -276014 -340883 -533123 -771242 -912838 -946606 -929610 -820667 -560663
10694e60663L27681K81966K32642J79749J03546L1905l8925j12883j90286k41454
10684A3278j85658o8918m8671j00832j05439m2874J8210M2804Q8683J56557J88795
10673d4065J35572N4141L9198M8903K1349k0053p4174j65574k21394k01200j31679
10662e58976j6432Q3120R8938R9389J15235J13969J36250J29558K3014j32733
10652I1332k56618k52703j26418J9367J22217J57503J50284J01179j1783j29507
10642a35147j36562o837J49377K35799K38227J67329K3874j12747j57856q1730
10632A83727M5693P9468K5416o2564j38706j22456l4030M0893J03230J72145J85877
10621D78693J08520j2659j36971j86129r0895j0782p5969j83997j90238q8231
$$ plain form
10694 -560663 -232982 48984 281626 461375 564921 596826 557901 445018 254732 13278
10684 13278 -172380 -241298 -289969 -390801 -496240 -539114 -520904 -478100 -389417 -232860 -44065
10673 -44065 91507 145648 184846 233749 255098 235045 160871 -4703 -226097 -427297 -558976
10662 -558976 -575408 -492288 -393350 -293961 -178726 -64757 71493 201051 224065 91332
10652 91332 -165286 -417989 -544407 -525040 -402823 -245320 -95036 6143 -5640 -135147
10642 -135147 -271709 -278546 -129169 106630 344857 512186 536060 423313 265457 183727
10632 183727 229420 308888 334304 271740 133034 10578 -23452 17441 120671 292816 478693
10621 478693 587213 574554 437583 251454 160559 149777 73808 -110189 -300427 -388658
10611c88658K8401O3187J0601m6961m9903j9579j3373k695L4591N8304R131q5851
10599d02805j01823m9840M975O5455J38828J79934J81331J42172L2093j12455
10589G7865j66537q8751K8620J12308J52412J67173J49144J06810N3173l063j8611
10578E70543K2383L0499m1637j49367k72657l28962k11321o3598P65K0657M2055
10567c80640Q5448R2043P8383M5439p636k0029K1904O6915R7774J16893P5597
10556B72091j3046q5189p1332o911K3825N6991Q7043Q1826M2858J8483L0836J7456
10544D54931k7945l6920P481K4568k1589l7668q183j6978l4478j9637o524k1603
10532B55455m3634n5382j9836K7706l914r6699j83400j92962r1375K4146O5558
$$ plain form
10611 -388658 -360257 -297070 -286469 -333430 -383333 -402912 -416285 -418980 -384389 -326085 -316954 -402805
10599 -402805 -504628 -554468 -549493 -484038 -345210 -165276 16055 158227 190320 77865
10589 77865 -88672 -177423 -148803 -36495 115917 283090 432234 539044 592217 589154 570543
10578 570543 592926 623425 581788 432421 159764 -169198 -380519 -444117 -443352 -422695 -380640
10567 -380640 -295192 -203149 -124766 -79327 -86963 -106992 -85088 -18173 79601 196494 272091
10556 272091 259045 173856 102524 95613 119438 176429 263472 345298 388156 406639 437475 454931
10544 454931 426986 390066 397547 422115 400526 362858 354675 337697 303219 283582 277058 255455
10532 255455 211821 156439 136603 164309 160395 63696 -119704 -312666 -404041 -379895 -314337
10521c14337L4295n9703j42799j39569k4212J17982J56977J02177L8187J8561
10511b12441N5435J00773N0512n9108j09304j07344j05667j35393j61235j32444
10501h16216p7167m4169p233M3986P1593N7045L4436P9588J35641J09067L4639
10490c78790j927K9699R9113J46334J09540M6368K84k4160p932L1132P1355Q5149
10478B06165M9061j3543n6589o4493p0759p7616p9958j09900j39346r2123n003
10467d54104N0145N6870K9006M8744R3626Q9812r520j16340j19187o9098l1226
10456d31272J5551K5284J683K3829M2036j9631r6445p4786N8009J72848J73239
10445a09655J50010J63644J56071J01598P6836J30797J90324J78547R9017j4235
$$ plain form
10521 -314337 -280042 -339745 -482544 -622113 -646325 -528343 -371366 -269189 -231002 -212441
10511 -212441 -157006 -56233 -5721 -64829 -174133 -281477 -387144 -522537 -683772 -816216
10501 -816216 -893383 -937552 -944785 -900799 -829206 -772161 -737725 -658137 -522496 -413429 -378790
10490 -378790 -380717 -351018 -251905 -105571 3969 50337 50621 26461 18529 49661 121016 206165
10478 206165 255226 241683 185094 120601 49842 -27774 -107732 -217632 -356978 -449101 -454104
10467 -454104 -403959 -347089 -318083 -269339 -175713 -85901 -95421 -211761 -330948 -400046 -431272
10456 -431272 -415721 -390437 -388754 -364925 -322889 -342520 -438965 -513751 -455742 -282894 -109655
10445 -109655 40355 203999 360070 461668 538504 669301 859625 1038172 1137189 1122954
10435A122954j12342j58044j60162j84621k29821k15423j62413j39198j39500
10426c78570q7230k9745J3107J01625J88267K03500J10441m5940j38812j12073
10416a75430m3006k1992o4362r9497k9427J08852K00182J76007R6769N2843K1275
10405B22214J444K4761O623j14405k26341k55547k27027j62303q9519l7011P870
10394h49241L2983N6803Q2816M9120J2929L5191L8391k7616q7322o0794m357N74
10382g20523M633P4991J50278J82734J77843J27902M0618K8870P9914J0433j18007
10371C9686j08761l5054j2677L3163R2233O6748k0596p1862p2665l1887J6419
10360a05253K0031P421L6793P7378N1819k8149n2001Q810N5196J0054m5844k2149
$$ plain form
10435 1122954 1010612 852568 692406 507785 277964 62541 -99872 -239070 -378570
10426 -378570 -465800 -495545 -482438 -380813 -192546 10954 121395 75455 -63357 -175430
10416 -175430 -218436 -240428 -304790 -404287 -433714 -324862 -124680 51327 148096 200939 222214
10405 222214 223658 248419 255042 140637 -85704 -341251 -568278 -730581 -820100 -857111 -849241
10394 -849241 -816258 -759455 -676639 -627519 -614590 -579399 -541008 -568624 -655946 -716740 -721097 -720523
10382 -720523 -715890 -640899 -490621 -307887 -130044 -2142 38476 67346 147260 157693 39686
10371 39686 -69075 -104129 -116806 -83643 8590 75338 54742 -17120 -89785 -121672 -105253
10360 -105253 -85222 -77801 -41008 36370 88189 60040 8039 16849 72045 82099 36255 14106
10348A4106J2029Q939k1352r9193k23623l05227k36923p1682P9800J71748K06140
10337d65238J74459J13372O9625K7425J4616O7236J28849J29266J13497J16013
10327D89120J00584M8100J2944k4131j13394j91439k07364j88772j41086n7220
10317b72658K5703J10648J31808O0030j7041r7055j85979k15843j86075j11376
10307g57838j5377P6713J28721J11257K3235p5188p8806p774N9750R3545J36385
10296c05377K01602K22603J34439K3830n573K059K0612O3314L5830o6008j01805
10285B25526n0083q601L3924J26528J82385J24303j8954j71571k53645k29935
10275d0123j39926o5476n4720l6151M0626R8896Q0412J7490k2032k9565j6792
$$ plain form
10348 14106 26135 35074 13722 -85471 -309094 -614321 -851244 -922926 -843126 -671378 -465238
10337 -465238 -290779 -177407 -107782 -80357 -65741 1495 130344 259610 373107 489120
10327 489120 589704 637804 650748 626617 513223 321784 114420 -74352 -215438 -272658
10317 -272658 -246955 -136307 -4499 55531 38490 -58565 -244544 -460387 -646462 -757838
10307 -757838 -773215 -696502 -567781 -456524 -433289 -508477 -587283 -595057 -535307 -441762 -305377
10296 -305377 -103775 118828 253267 277097 271524 273583 294195 357509 393339 327331 225526
10285 225526 175443 166842 200766 327294 509679 633982 615028 443457 189812 -40123
10275 -40123 -180049 -245525 -300245 -336396 -295770 -196874 -116462 -98972 -121004 -150569 -167361
10264a67361J6976L1810L958j3783R032M8336M2894n1851j58620j69082j25147
10253e32838q4762j4340O6263J00572P5018N9306J11942J30385J10392P9006K2489
10242A23433M53Q836J6577n065n3758n8791m5636l4986J579M2381J02778J46217
10230B44018J19515N0154j3387m5189j822K8256q5752k07435k04769j16364j6505
10219b49280J2477n3187j17916j10602o7292j7006K5960N2103K2173j9608n9368
10208e81546q5541q7544o9558J6698J49734K46713K80945K90613K36502P4949
10198D71965m6244k3397J9500K6264M1589J3599o9356j27489j37797j24706j07008
10187f3080q8889q5078r0314j30723j46777o0750J5464k0077o9688J0217J21080
$$ plain form
10264 -167361 -150385 -118575 -114617 -128400 -119368 -71032 -28138 -79989 -238609 -407691 -532838
10253 -532838 -617600 -631940 -565677 -465105 -390087 -330781 -218839 -88454 21938 100944 123433
10242 123433 123886 132722 149299 144234 90476 31685 -13951 -48937 -47358 -4977 97801 244018
10230 244018 363533 413687 400300 355111 353289 381545 295793 88358 -116411 -232775 -249280
10219 -249280 -236803 -289990 -407906 -518508 -585800 -602806 -576846 -524743 -502570 -522178 -581546
10208 -581546 -667087 -754631 -824189 -807491 -657757 -411044 -130099 160514 397016 471965
10198 471965 425721 402324 421824 448088 489677 503276 433920 306431 168634 43928 -63080
10187 -63080 -151969 -237047 -327361 -458084 -604861 -665611 -650147 -670224 -739912 -729695 -608615
10176f08615J78302K45422K59074J93917J24615L5963o6776j03547l6187M3725
10166B65893M967j04093j54795p6320M7852P5941O355m9337p9108j37565j62419
10155c62629j14164Q198J20421J15943R845j11669j57592j21063k6093N3585O6542
10144e18676L4867l3668j11361j04290L4954J62075J50019R419j14988j19827
10134f11476k2171J19525J64490J12709P4248O5590O4076L2822m2275p9228l4780
10123a56470L5559O2277J5933p4417j08602l9580L8073K2306p6921j27392m7562
10112d56796L9367K8334j1183j0397k0299k3112K1652P4679J44424K15392K13368
10101B15429J26775m4174k19352k72030k44088j74608p7721j9227k5315j02630
$$ plain form
10176 -608615 -430313 -184891 74183 268100 392715 428678 361902 258355 222168 265893
10166 265893 270860 166767 11972 -64348 -16496 59445 65800 16463 -62645 -200210 -362629
10155 -362629 -476793 -468595 -348174 -232231 -222386 -334055 -491647 -612710 -638803 -585218 -518676
10144 -518676 -483809 -517477 -628838 -733128 -698174 -536099 -386080 -376661 -491649 -611476
10134 -611476 -633647 -514122 -349632 -236923 -162675 -97085 -33009 -187 -42462 -121690 -156470
10123 -156470 -120911 -58634 -42701 -117118 -225720 -265300 -227227 -204921 -281842 -409234 -456796
10112 -456796 -417429 -389095 -400278 -410675 -430974 -454086 -432434 -357755 -213331 2061 215429
10101 215429 342204 298030 78678 -193352 -437440 -612048 -689769 -708996 -734311 -836941
10091h36941j71485j32916j1815J11249J77524J55422P1987L8118O7949M6073
10081d84835m2458p3687k8732J8395K8105k4443k2999P1326J56418J84116J90223
10070b8571K08142J81719N9621q5260j27121o6158k5840m6249j07727j88198k25963
10059d51605j60578J6901J76514J82751P0740m4258r1272j16440j34520o8044
10049f19811N3938J03078O6234M1017L0744k340J2479R1732J37153P9440k760
10038i096j3959r165k2718l1302m4101q5895q3633J8844Q9349P6502L7784K504
10026g4886m2443j43029k28316k27810k23139k36376k12748j01663R0444J99791
10016a200175J45708M2911M092K8533P6962R8031P4115L0607m1262r2203m3581
$$ plain form
10091 -836941 -1008426 -1141342 -1153157 -1041908 -864384 -708962 -636975 -598857 -530908 -484835
10081 -484835 -527293 -600980 -629712 -611317 -583212 -607655 -630654 -559328 -402910 -218794 -28571
10070 -28571 179571 361290 420911 335651 208530 142372 116532 70283 -37444 -225642 -451605
10059 -451605 -612183 -595282 -418768 -236017 -165277 -209535 -300807 -417247 -551767 -619811
10049 -619811 -565873 -462795 -396561 -355544 -324800 -327140 -314661 -222929 -85776 -6336 -9096
10038 -9096 -23055 -32220 -54938 -86240 -130341 -216236 -299869 -281025 -191676 -115174 -77390 -74886
10026 -74886 -117329 -260358 -488674 -716484 -939623 -1175999 -1388747 -1490410 -1399966 -1200175
10016 -1200175 -1054467 -1011556 -1007464 -978931 -901969 -803938 -729823 -699216 -740478 -832681 -876262
10005h76262Q6966J66266J33574O7023M9212J8053p9874j01157J2738J37070J54805
9994b31586J11747R4217R8225Q5052L4777R278O1734Q7293L2511j6193l0450p2950
9982B63655r5350j5258R4853J40824J20501Q0342J2320q7222j63592j43057k5518
9971A82498Q7689J45597J36810M1242r2208j50219j21906m8254N4967J00230Q6246
9960D22692P2666O3253R9782J00879m1805j78035j76123r8723M8435J52631J14418
9949E80070J4808n2037j12083j70471j54448j20273j34960r0675L7648R3271N9961
9938d9189M4348P0956N6999Q989j1606l293L3094R0896J24695J13269P8503L5655
9926E93316l076n2584j01286j33884j60242k19662l04512l06857j58725O0871
$$ plain form
10005 -876262 -789296 -623030 -489456 -422433 -373221 -355168 -435042 -536199 -523461 -386391 -231586
9994 -231586 -119839 -25622 72603 157655 192432 201710 263444 350737 383248 367055 336605 263655
9982 263655 168305 153047 247900 388724 509225 589567 601887 514665 351073 208016 182498
9971 182498 270187 415784 552594 593836 501628 351409 229503 181249 236216 336446 422692
9960 422692 495358 558611 658393 759272 717467 539432 363309 264586 313021 465652 580070
9949 580070 594878 542841 430758 260287 105839 -14434 -149394 -240069 -202421 -109150 -49189
9938 -49189 -4841 66115 123114 132103 120497 117204 150298 241194 365889 479158 557661 593316
9926 593316 590240 537656 436370 302486 142244 -77418 -381930 -688787 -847512 -786641
9916g86641K20489K15595J14978R6558J60898J91709J69396Q0973m7005o5954
9906C50996k7449p3491j63804k33945k68966k41702j42400k8119M4436M6482M4961
9895f93001J61105K93874L16667K59507J16320p1733j70564j50283j33627j20534
9885a92269m1533M5292P8690R1050J13921R5213L4290Q969k4032o6085l8396L0607
9873A35717L6077j9835r6535j53831j60103j28607n8035N6435J72415J98474J45488
9862A27660J20829J44823J21147j006j29664k05215k31475j94388j02240p609
9852c57138N0026P0122Q0763O4849l2303j46360j58833p8434k9142n9946o2901
9841f59297M574P9083Q3777L7112K1514L5671J1325m1782m2954r087K2819O5537
$$ plain form
9916 -786641 -566152 -350557 -235579 -139021 21877 213586 382982 463955 416950 350996
9906 350996 323547 250056 86252 -147693 -416659 -658361 -800761 -828880 -784444 -737962 -693001
9895 -693001 -531896 -238022 78645 338152 454472 382739 212175 61892 -71735 -192269
9885 -192269 -233802 -188510 -109820 -18770 95151 190364 224654 233623 209591 143506 105110 135717
9873 135717 171794 151959 55424 -98407 -258510 -387117 -445152 -388717 -216302 -17828 127660
9862 127660 248489 393312 514459 513453 383789 178574 -52901 -247289 -349529 -357138
9852 -357138 -307112 -236990 -156227 -91378 -123681 -270041 -428874 -507308 -536450 -596396 -659297
9841 -659297 -654723 -575640 -491863 -454751 -433237 -397566 -386241 -428023 -470977 -480064 -457245 -391708
9829c91708J32508K11918K90779L29315L00644J77483O3715O0303J18785J47013
9819A440755J40243J38016J09547N0635O5335J35890J52522J42333J67036K11662
9809B753974K35661K76027L63131M49381M81744M91311O02601P93682Q78088Q23891
9799H149491P83401Q15465Q52046P56053N20687K49512n5346l63398n92436p04876
$$ plain form
9829 -391708 -259200 -47282 243497 572812 873456 1050939 1114654 1174957 1293742 1440755
9819 1440755 1580998 1719014 1828561 1879196 1944531 2080421 2232943 2375276 2542312 2753974
9809 2753974 2989635 3265662 3628793 4078174 4559918 5051229 5653830 6447512 7325600 8149491
9799 8149491 8932892 9748357 10600403 11356456 11877143 12126655 12071309 11707911 11115475 10410599
$$ [...]
##END NTUPLES=NMR SPECTRUM
##END=
