##TITLE=C13_DE-80nm
 D2O, 22100sc

 30.1.2025
##JCAMPDX= 6.0         $$ Bruker NMR JCAMP-DX V2.0
##DATA TYPE= NMR SPECTRUM
##DATA CLASS= NTUPLES
##ORIGIN= UXNMR, Bruker Analytische Messtechnik GmbH
##OWNER= root
$$ XWIN-NMR		Version 3.5
$$ Fri Jan 31 13:39:01 2025 Russian Standard Time (UT+4h)  she@DPX200
##.OBSERVE FREQUENCY= 50.327896
##.OBSERVE NUCLEUS= ^13C
##.ACQUISITION MODE= SIMULTANEOUS
##.ACQUISITION SCHEME= undefined
##.AVERAGES= 18298
##.DIGITISER RES= 17
##SPECTROMETER/DATA SYSTEM= spect
##.PULSE SEQUENCE= zgpg30
##.SOLVENT NAME= D2O
##.SHIFT REFERENCE= (INTERNAL, D2O, 0, 222.646)
##AUDIT TRAIL= $$ (NUMBER, WHEN, WHO, WHERE, WHAT)
$$ ##TITLE= Audit trail, XWIN-NMR		Version 3.5
$$ ##JCAMPDX= 5.01
$$ ##ORIGIN= Bruker BioSpin GmbH
$$ ##OWNER= she
$$ F:/spectra/data/she/nmr/c13/1/pdata/1/auditp.txt
$$ ##AUDIT TRAIL=  $$ (NUMBER, WHEN, WHO, WHERE, WHAT)
(   1,<2025-01-31 10:42:41.96 +0400>,<she>,<DPX200>,
      <created by zg, POWCHK disabled, PULCHK disabled
       terminated by command 'halt'
       configuration hash MD5:
       00 E9 B6 7A A2 85 ED C7 34 08 36 98 17 FE 4E 26
       data hash MD5: 32K
       44 A0 98 42 EC 36 CB E2 73 9A DF A4 DC BF DD 9B>)
(   2,<2025-01-31 13:37:51.26 +0400>,<she>,<DPX200>,
      <Start of raw data processing
       efp BC_mod = 2 LB = 2 FT_mod = 6 PKNL = 1 PHC0 = -405.2336 PHC1 = 26.48833 SI = 32K 
       data hash MD5: 32K
       E6 F2 6E 8D CB 9D 12 D8 66 A1 F5 1C 3B 9E 9F 2B>)
(   3,<2025-01-31 13:37:56.01 +0400>,<she>,<DPX200>,
      <abs ABSG = 5 
       data hash MD5: 32K
       56 EE 5E 0D FD 3D BC 67 FA A8 9B 57 93 C7 86 CA>)
(   4,<2025-01-31 13:38:25.31 +0400>,<she>,<DPX200>,
      <pk PHC0 = -11.9685 PHC1 = 12.2 
       data hash MD5: 32K
       15 7D 85 A1 2D FB B7 CB 10 45 77 78 FA DA 25 B4>)
(   5,<2025-01-31 13:38:28.82 +0400>,<she>,<DPX200>,
      <abs ABSG = 5 
       data hash MD5: 32K
       24 A4 A9 EE D3 28 CB 50 BF FB ED D2 2D CE F8 ED>)
$$ ##END=
$$ 
$$ hash MD5
$$ D0 6A DE DB 31 28 58 7B 15 67 A9 8D 28 DF A5 88
##$RELAX= 
##$RELAX= 
##$RELAX= 
##$RELAX= 
##$RELAX= 
##$RELAX= 
##$RELAX= 
##$RELAX= 
$$ Bruker specific parameters
$$ --------------------------
##$DU= <F:/spectra>
##$EXPNO= 1
##$NAME= <c13>
##$PROCNO= 1
##$TYPE= <nmr>
##$USER= <she>
##$AMP= (0..31)
100 100 100 100 100 100 100 100 100 100 100 100 100 100 100 100 100 100 
100 100 100 100 100 100 100 100 100 100 100 100 100 100 
##$AQSEQ= 0
##$AQ_mod= 1
##$AUNM= <au_zg>
##$AUTOPOS= <>
##$BF1= 50.322709
##$BF2= 200.13
##$BF3= 50.322709
##$BF4= 500.13
##$BF5= 500.13
##$BF6= 500.13
##$BF7= 500.13
##$BF8= 500.13
##$BYTORDA= 1
##$CFDGTYP= 0
##$CFRGTYP= 5
##$CHEMSTR= <none>
##$CNST= (0..31)
1 1 145 1 1 1 1 1 1 1 1 1 1 1 1 1 1 1 1 1 1 1 1 1 1 1 1 1 1 1 1 1 
##$CPDPRG= <waltz16>
##$CPDPRG1= <>
##$CPDPRG2= <waltz16>
##$CPDPRG3= <>
##$CPDPRG4= <mlev>
##$CPDPRG5= <mlev>
##$CPDPRG6= <mlev>
##$CPDPRG7= <mlev>
##$CPDPRG8= <mlev>
##$CPDPRGB= <>
##$CPDPRGT= <>
##$D= (0..31)
$$ [...]
##$SUBNAM4= <"">
##$SUBNAM5= <"">
##$SUBNAM6= <"">
##$SUBNAM7= <"">
##$SUBNAM8= <"">
##$SUBNAM9= <"">
##$SW= 239.972175391363
##$SWIBOX= (0..15)
0 1 3 0 0 0 0 0 0 0 0 0 0 0 0 0 
##$SW_h= 12077.2946859903
##$TD= 32768
##$TD0= 1
##$TE= 0
##$TE2= 300
##$TE3= 300
##$TEG= 300
##$TL= (0..7)
120 120 120 120 120 120 120 120 
##$TP= (0..7)
150 150 150 150 150 150 150 150 
##$TP07= 0
##$TPNAME0= <>
##$TPNAME1= <>
##$TPNAME2= <>
##$TPNAME3= <>
##$TPNAME4= <>
##$TPNAME5= <>
##$TPNAME6= <>
##$TPNAME7= <>
##$TPOAL= (0..7)
0.5 0.5 0.5 0.5 0.5 0.5 0.5 0.5 
##$TPOFFS= (0..7)
0 0 0 0 0 0 0 0 
##$TUNHIN= 0
##$TUNHOUT= 0
##$TUNXOUT= 0
##$USERA1= <user>
##$USERA2= <user>
##$USERA3= <user>
##$USERA4= <user>
##$USERA5= <user>
##$V9= 5
##$VALIST= <valist>
##$VCLIST= <CCCCCCCCCCCCCCC>
##$VD= 0
##$VDLIST= <DDDDDDDDDDDDDDD>
##$VPLIST= <PPPPPPPPPPPPPPP>
##$VTLIST= <TTTTTTTTTTTTTTT>
##$WBST= 1024
##$WBSW= 4
##$XGAIN= (0..3)
0 0 0 0 
##$XL= 0
##$YL= 0
##$YMAX_a= 77761719
##$YMIN_a= -24120031
##$ZGOPTNS= <>
##$ZL1= 120
##$ZL2= 120
##$ZL3= 120
##$ZL4= 120
##$ABSF1= 222.646
##$ABSF2= -17.35081
##$ABSG= 5
##$ABSL= 3
##$ALPHA= 0
##$AQORDER= 0
##$ASSFAC= 0
##$ASSFACI= 0
##$ASSFACX= 0
##$ASSWID= 0
##$AUNMP= <proc_1d>
##$AZFE= 0.1
##$AZFW= 0.5
##$BCFW= 0
##$BC_mod= 2
##$BYTORDP= 0
##$COROFFS= 0
##$CY= -3
##$DATMOD= 1
##$DC= 0
##$DFILT= <>
##$DTYPP= 0
##$F1P= 0
##$F2P= 0
##$FCOR= 0.5
##$FTSIZE= 32768
##$FT_mod= 6
##$GAMMA= 0
##$GB= 0
##$INTBC= 1
##$INTSCL= 4.134877e-10
##$ISEN= 128
##$LB= 2
##$LEV0= 0
##$LPBIN= 0
##$MAXI= 10000
##$MC2= 0
##$MEAN= 0
##$ME_mod= 0
##$MI= 0.1934396
##$NCOEF= 0
##$NC_proc= 0
##$NLEV= 6
##$NOISF1= 120.0001
##$NOISF2= 80.00006
##$NSP= 0
##$NTH_PI= 0
##$NZP= 0
##$OFFSET= 222.646
##$PC= 1.4
##$PHC0= -417.2021
##$PHC1= 38.68833
##$PH_mod= 1
##$PKNL= yes
##$PPARMOD= 0
##$PSCAL= 0
##$PSIGN= 0
##$REVERSE= no
##$SF= 50.3227304950709
##$SI= 32768
##$SIGF1= 140
##$SIGF2= 120
##$SINO= 11.81781
##$SIOLD= 32768
##$SREGLST= <13C.CDCl3>
##$SSB= 0
##$STSI= 32768
##$STSR= 0
##$SW_p= 12077.2946859903
##$SYMM= 0
##$S_DEV= 0
##$TDeff= 32768
##$TDoff= 0
##$TI= <>
##$TILT= no
##$TM1= 0
##$TM2= 0
##$TOPLEV= 0
##$USERP1= <user>
##$USERP2= <user>
##$USERP3= <user>
##$USERP4= <user>
##$USERP5= <user>
##$WDW= 1
##$XDIM= 32768
##$YMAX_p= 261750874
##$YMIN_p= -6999482
$$ End of Bruker specific parameters
$$ ---------------------------------
##NTUPLES= NMR SPECTRUM
##VAR_NAME=  FREQUENCY,     SPECTRUM/REAL,   SPECTRUM/IMAG
##SYMBOL=    X,             R,               I
##VAR_TYPE=  INDEPENDENT,   DEPENDENT,       DEPENDENT
##VAR_FORM=  AFFN,          ASDF,            ASDF
##VAR_DIM=   32768,         32768,           32768
##UNITS=     HZ,            ARBITRARY UNITS, ARBITRARY UNITS
##FACTOR=    0.368581032318806, 1,           1
##FIRST=     11204.1544572324, 0,            0
##LAST=      -873.140228757911, 0,           0
##MIN=       -873.140228757911, -6999482,    0
##MAX=       11204.1544572324, 261750874,    0
$$ Real data points
##PAGE= N=1
##DATA TABLE= (X++(R..R)), XYDATA
$$ [...]
$$ plain form
7078 -1876198 -1243033 -490171 261506 809907 996256 865367 502823 -179660 -1138347 -1986518
7068 -1986518 -2297847 -2079708 -1622373 -993694 -332393 -60911 -145306 -53523 257603 307070
7058 307070 -70885 -591798 -957742 -1087954 -1040728 -1006817 -1127535 -1605133 -2369789 -2989557
7048 -2989557 -3285347 -3317280 -3329373 -3533381 -3906797 -4206882 -3937117 -2974408 -1820114 -1045017
7038 -1045017 -878162 -1116736 -1555274 -1901526 -1842986 -1330469 -548076 154702 537591 573695
7028 573695 332425 -212508 -938459 -1477214 -1767762 -2062939 -2406712 -2664189 -2669592 -2400248
7018 -2400248 -1956377 -1485508 -1270058 -1334527 -1343815 -997577 -345450 247360 270251 -412742
7008 -412742 -1312895 -1769092 -1483494 -637723 416876 1180072 1302453 926059 297340 -520721
$$ packed form
7078a876198O33165P52862P51677N48401J86349j30889l62544o82483r58687q48171
7068a986518l11329K18139M57335O28679O61301K71482q4395R1783L11126M9467
7058C07070l77955n20913l65944j30212M7226L3911j20718m77598p64656o19768
7048b989557k95790l1933j2093k04008l73416l00085K69765R62709J154294P75097
7038a045017J66855k38574m38538l46252N8540N12517P82393P02778L82889L6104
7028E73695k41270n44933p25951n38755k90548k95177l43773k57477n403K69344
7018b400248M43871M70869K15450o4469r288L46238O52127N92810K2891o82993
7008d12742r00153m56197K85598Q45771J054599P63196J22381l76394o28719q18061
$$ plain form
6998 -520721 -1213510 -1489262 -1523218 -1398821 -1035045 -458737 272139 1007757 1556483 1707893
6988 1707893 1427427 1070390 770370 484667 303740 345427 535765 524117 253965 -159887
6978 -159887 -586832 -865294 -913766 -673549 -284649 -52569 -29406 -41107 -10451 -37246 -161499
6967 -161499 -156183 140226 419445 187071 -739429 -1798151 -2300171 -2176861 -1848229 -1799316
6957 -1799316 -1929437 -1898169 -1744817 -1629708 -1351371 -681552 174501 823040 1158733 1352367
6947 1352367 1471954 1670515 2006030 2364570 2577921 2528191 2401527 2475475 2576184 2435509
6937 2435509 2146812 1874148 1615672 1302954 775624 -241798 -1547437 -2702099 -3504177
6928 -3504177 -3821145 -3737056 -3515658 -3363307 -3283559 -3045363 -2689970 -2364809 -2063630 -1783578
$$ packed form
6998e20721o92789k75752l3956J24397L63776N76308P30876P35618N48726J51410
6988A707893k80466l57037l00020k85703j80927M1687J90338j1648k70152m13852
6978a59887m26945k78462m8472K40217L88900K32080K3163j1701L0656k6795j24253
6967a61499N316K96409K79219k32374r26500j058722n02020J23310L28632M8913
6957a799316j30121L1268J53352J15109K78337O69819Q56053O48539L35693J93634
6947A352367J19587J98561L35515L58540K13351m9730j26664P3948J00709j40675
6937B435509k88697k72664k58476l12718n27330j017422j305639j154662q02078
6928c504177l16968Q4089K21398J52351P9748K38196L55393L25161L01179K80052
$$ plain form
6918 -1783578 -1464141 -993188 -425283 8421 131450 -225895 -873915 -1427020 -1872349 -2261390
6908 -2261390 -2383132 -2244296 -1962514 -1593959 -1349557 -1441493 -1828399 -1882650 -1337005 -655531
6898 -655531 -258836 -372614 -839516 -1106942 -931258 -510182 -233683 -196554 -149879 76664
6888 76664 453694 639249 439967 265355 667030 1503962 2256555 2554277 2205155 1290008
6878 1290008 182297 -708782 -1224346 -1471820 -1698834 -2075507 -2471146 -2685711 -2708518 -2634586
6868 -2634586 -2354144 -1826150 -1457672 -1500706 -1845887 -2397012 -3061297 -3548335 -3669913 -3489321
6858 -3489321 -3071241 -2642708 -2414090 -2361446 -2514367 -2891367 -3346821 -3660941 -3838258 -3945248
6848 -3945248 -4021114 -4157044 -4254432 -4078476 -3565084 -2865991 -2047748 -1268072 -660060 -162388
$$ packed form
6918a783578L19437M70953N67905M33704J23029l57345o48020n53105m45329l89041
6908b261390j21742J38836K81782L68555K44402r1936l86906n4251N45645O81474
6898f55531L96695j13778m66902k67426J75684M21076K76499L7129M6675K26543
6888G6664L77030J85555j99282j74612M01675Q36932P52593K97722l49122r15147
6878A290008j107711q91079n15564k47474k27014l76673l95639k14565k2807P3932
6868b634586K80442N27994L68478m3034l45181n51125o64285m87038j21578J80592
6858c489321M18080M28533K28618N2644j52921l77000m55454l14120j77317j06990
6848c945248p5866j35930r7388J75956N13392O99093Q18243P79676O08012M97672
$$ plain form
6838 -162388 30941 -153067 -286396 -94909 244457 480495 426149 68509 -260800 -173629
6828 -173629 233520 597166 738817 794803 1013356 1473446 2071028 2783464 3507362 4064199
6818 4064199 4266618 3996345 3368176 2535080 1600917 741841 55074 -527173 -1022830 -1264810
6808 -1264810 -1290229 -1498134 -2035939 -2487941 -2572113 -2153655 -1565737 -1503976 -1965048 -2364563
6798 -2364563 -2245909 -1661147 -979188 -517884 -238528 28701 174183 -45133 -548641 -1118778
6788 -1118778 -1797528 -2543416 -3039332 -3124875 -2910387 -2689974 -2623396 -2608081 -2607847 -2645582 -2735563
6777 -2735563 -2851844 -2724694 -2381180 -2162505 -2225114 -2517804 -2659453 -2377157 -1880363 -1305128
6767 -1305128 -630536 110157 729497 993814 847396 491205 149945 -4641 231758 787824
$$ packed form
6838a62388J93329j84008j33329J91487L39366K36038n4346l57640l29309Q7171
6828a73629M07149L63646J41651N5986K18553M60090N97582P12436P23898N56837
6818D064199K02419k70273o28169q33096r34163q59076o86767n82247m95657k41980
6808a264810k5419k07905n37805m52002q4172M18458N87918O1761m61072l99515
6798b364563J18654N84762O81959M61304K79356K67229J45482k19316n03508n70137
6788a118778o78750p45888m95916q5543K14488K20413O6578J5315K34l7735q9981
6777b735563j16281J27150L43514K18675o2609k92690j41649K82296M96794N75235
6767a305128O74592P40693O19340K64317j46418l56191l41260j54586K36399N56066
$$ plain form
6757 787824 1209609 1078628 453485 -291132 -994402 -1544510 -1787712 -1821366 -1805279 -1698017
6747 -1698017 -1361374 -1004942 -991357 -1188184 -1475322 -1912111 -2398193 -2907880 -3333135 -3327286
6737 -3327286 -2812957 -2110916 -1615771 -1558215 -1841938 -2095233 -2077727 -1816749 -1423898 -969747
6727 -969747 -582705 -379360 -314205 -387187 -658197 -1118408 -1426898 -1258532 -749397 -335721
6717 -335721 -340326 -596815 -840751 -954802 -738440 -216588 336193 715305 910805 881347
6707 881347 550259 24968 -378350 -406649 102856 768185 1063005 1100083 1224359 1417468
6697 1417468 1454851 1505985 1803445 2246608 2591180 2553566 2250397 2205175 2518837 2872393
6687 2872393 2948335 2571372 1803028 902256 149315 -246884 -353945 -343285 -385712 -402265
$$ packed form
6757G87824M21785j30981o25143p44617p03270n50108k43202l3654J6087J07262
6747a698017L36643L56432J3585j96827k87138m36789m86082n09687m25255N849
6737c327286N14329P02041M95145N7556k83723k53295J7506K60978L92851M54151
6727i69747L87042K03345O5155p2982k71010m60211l08490J68366N09135M13676
6717c35721m605k56489k43936j14051K16362N21852N52781L79112J95500k9458
6707H81347l31088n25291m03318k8299N09505O65329K94820L7078J24276J93109
6697A417468L7383N1134K97460M43163L44572l7614l03169m5222L13662L53556
6687B872393P5942l76963p68344r00772p52941l96199j07061J0660m2427j6553
$$ plain form
6677 -402265 -118627 147571 -88350 -580063 -741214 -487662 -130995 -51956 -359969 -721594
6667 -721594 -915962 -1003119 -961855 -869502 -836821 -778420 -653015 -408283 -12058 459538 868836
6656 868836 1092099 1026275 587884 -270821 -1207370 -1837553 -2200532 -2370579 -2241631 -1741841
6646 -1741841 -966625 -364126 -322208 -781428 -1583886 -2606189 -3617503 -4233467 -4352117
6637 -4352117 -4203456 -3945159 -3516372 -2987656 -2458884 -1954619 -1514573 -1160278 -906347 -748315
6627 -748315 -615607 -408930 -312163 -503114 -719838 -792737 -832551 -860647 -830028 -728920 -546876
6616 -546876 -391219 -203764 255185 787421 1046267 857286 10823 -1368996 -2635702
6607 -2635702 -3264266 -3327498 -3156011 -2876742 -2525525 -1993243 -1383276 -1142987 -1544473 -2221073
$$ packed form
6677d02265K83638K66198k35921m91713j61151K53552L56667P9039l08013l61625
6667g21594j94368q7157M1264R2353L2681N8401J25405K44732L96225M71596M09298
6656H68836K23263o5824m38391q58705r36549o30183l62979j70047J28948M99790
6646a741841P75216O02499M1918m59220q02458j022303j011314o15964j18650
6637d352117J48661K58297M28787N28716N28772N04265M40046L54295K53931J58032
6627g48315J32708K06677R6767j90951k16724p2899l9814k8096L0619J01108J82044
6616e46876J55657J87455M58949N32236K58846j88981q46463j379819j266706
6607b635702o28564o3232J71487K79269L51217N32282O09967K40289m01486o76600
$$ plain form
6597 -2221073 -2544703 -2287697 -1551602 -629541 137394 643657 1083394 1602852 2076484 2296427
6587 2296427 2305407 2274730 2066529 1554030 926731 402177 25116 -164592 -114246 197411
6577 197411 441938 401232 424701 601799 607464 294819 -109104 -315242 -301694 -107702 233618
6566 233618 576495 798535 729833 377423 -7790 -110205 -29226 -86785 -358139 -827360
6556 -827360 -1458155 -1988110 -2231474 -2276455 -2287103 -2343699 -2232692 -1837207 -1417199 -1105752
6546 -1105752 -933596 -984095 -1129884 -1065599 -719599 -261668 180923 517307 586549 420356
6536 420356 181021 -613 88274 393531 611868 661956 573819 467723 630731 1081052
6526 1081052 1583740 1952592 2377535 3000791 3587493 3994724 4148104 4030677 3870733 3754536
$$ packed form
6597b221073l23630K57006P36095R22061P66935N06263M39737N19458M73632K19943
6587B296427Q980l0677k08201n12499o27299n24554l77061j89708N0346L11657
6577A97411K44527m0706K3469J77098N665l12645m03923k06138J3548J93992L41320
6566B33618L42877K22040o8702l52410l85213j02415Q0979n7559k71354m69221
6556h27360o30795n29955k43364m4981j0648n6596J11007L95485M20008L11447
6546a105752J72156n0499j45789O4285L46000M57931M42591L36384O9242j66193
6536D20356k39335j81634Q8887L05257K18337N0088q8137j06096J63008M50321
6526A081052N02688L68852M24943O23256N86702M07231J53380j17427j59944j16197
$$ plain form
6516 3754536 3623087 3534162 3597377 3878365 4415141 5033404 5484073 5762490 6041874 6334878
6506 6334878 6564217 6636099 6420209 5984427 5594915 5327351 5031972 4723227 4627715 4905116
6496 4905116 5462397 6117862 6494152 6202378 5445072 4927698 4900453 4973260 4706022 3999885
6486 3999885 2982929 1840476 991101 609469 498192 476036 555700 612267 364910 -40917
6476 -40917 -232538 -16829 635506 1672933 2706243 3420992 3924566 4273953 4375056 4281942
6466 4281942 4049479 3652057 3132414 2658318 2380563 2284416 2262346 2147895 1811555 1376713
6456 1376713 999511 704574 771156 1361513 2083119 2507732 2452400 2003386 1344918 789472
6446 789472 714409 1184094 2007086 2848701 3273378 3089204 2338752 1229462 64978 -921385
$$ packed form
6516C754536j31449q8925O3215K80988N36776O18263M50669K78417K79384K93004
6506F334878K29339P1882k15890m35782l89512k67564k95379l08745r5512K77401
6496D905116N57281O55465L76290k91774p57306n17374k7245P2807k67238p06137
6486C999885j016956j142453q49375l81632j11277k2156P9664N6567k47357m05827
6476d0917j91621K15709O52335J037427J033310P14749N03574L49387J01103r3114
6466D281942k32463l97422n19643m74096k77755r6147k2070j14451l36340m34842
6456A376713l77202k94937O6582N90357P21606M24613n5332m49014o58468n55446
6446G89472p5063M69685Q22992Q41615M24677j84174p50452j109290j164484r86363
$$ plain form
6436 -921385 -1524804 -1712977 -1581909 -1203308 -557944 239994 967508 1425346 1587556 1709441
6426 1709441 1950393 2181199 2385245 2697473 2935407 2780963 2234096 1565340 1179769 1273650
6416 1273650 1752175 2487934 3160428 3388188 3271984 3087612 2951177 2973017 3141270 3342361
6406 3342361 3671745 4181824 4602782 4856058 5073737 5192791 5194573 5317549 5663995 6204357
6396 6204357 6996200 7923075 8804396 9588362 10324674 10926512 11257062 11482052 11947273 12776869
6386 12776869 13877792 14979117 15694553 16080443 16732652 18019283 19702790 21196010 22361494
6377 22361494 23750306 25655604 27766664 29589250 30960096 31957104 32369757 31801486 30276198
6368 30276198 28227983 25808559 23088951 20436391 18184107 16354200 14850663 13523921
$$ packed form
6436i21385o03419j88173J31068L78601O45364P97938P27514M57838J62210J21885
6426A709441K40952K30806K04046L12228K37934j54444n46867o68756l85571R3881
6416A273650M78525P35759O72494K27760j16204j84372j36435K1840J68253K01091
6406C342361L29384N10079M20958K53276K17679J19054J782J22976L46446N40362
6396F204357P91843R26875Q81321P83966P36312O01838L30550K24990M65221Q29596
6386A2776869J100923J101325P15436L85890O52209J286631J683507J493220J165484
6377B2361494J388812J905298K111060J822586J370846R97008M12653n68271j525288
6368C0276198k048215k419424k719608k652560k252284j829907j503537j326742
$$ plain form
6360 13523921 12377390 11713154 11598861 11631895 11338213 10575827 9762102 9367908 9492629
6351 9492629 9731833 9673534 9274612 8812997 8485311 8149227 7568001 6553157 5399884
6342 5399884 4928259 5461990 6358165 6848123 6735377 6397678 6070984 5794833 5552509 5049470
6332 5049470 4156469 3305388 2870734 2759695 2684968 2530139 2308094 1961660 1391547 650575
6322 650575 28363 -216225 -74521 245876 555914 916792 1443144 1905350 2160973 2381295
6312 2381295 2598371 2772086 2584436 1976019 1498509 1549007 1921168 2152958 2106655 2008132
6302 2008132 1979214 1905235 1933930 2164109 2432915 2613241 2809993 3242053 3986462 4830210
6292 4830210 5391213 5618681 5550670 5368708 5225056 5147456 5229838 5424141 5649617 5850107
$$ packed form
6360A3523921j146531o64236j14293L3034k93682p62386q13725l94194J24721
6351I492629K39204n8299l98922m61615l27686l36084n81226j014844j153273
6342E399884m71625N33731Q96175M89958j12746l37699l26694k76151k42324n03039
6332E049470q93001q51081m34654j11039p4727j54829k22045l46434n70113p40972
6322F50575o22212k44588J41704L20397L10038L60878N26352M62206K55623K20322
6312B381295K17076J73715j87650o08417m77510N0498L72161K31790m6303r8523
6302B008132k8918p3979K8695K30179K68806J80326J96752M32060P44409Q43748
6292D830210N61003K27468o8011j81962j43652p7600Q2382J94303K25476K00490
$$ plain form
6282 5850107 5940206 6086351 6441511 6981671 7825412 8872638 9656062 9850012 9529605 9230637
6272 9230637 9438056 10110214 10793326 11011323 10757031 10448951 10155314 9844060 9675738 9685514
6262 9685514 9328960 8190144 6941753 6251794 6211974 6478764 6617960 6544676 6461587 6504611
6252 6504611 6546696 6368359 5986311 5595705 5417819 5346409 4966338 4285095 3619547 3237135
6242 3237135 3317773 3864806 4548999 4903398 4872927 4823769 4872466 4819291 4616301 4415010
6232 4415010 4353980 4415964 4536919 4600479 4537618 4273135 3815291 3327099 2997483 2836892
6222 2836892 2632341 2122060 1291941 451820 -289986 -1060129 -1668415 -2111723 -2628042 -3159588
6212 -3159588 -3361655 -3084172 -2546459 -1933732 -1363273 -1106097 -1153651 -1252172 -1361203 -1516374
$$ packed form
6282E850107R0099J46145L55160N40160Q43741J047226P83424J93950l20407k98968
6272I230637K07419O72158O83112K17997k54292l08080k93637l11254j68322R776
6262I685514l56554j138816j248391o89959l9820K66790J39196p3284q3089M3024
6252F504611M2085j78337l82048l90606j77886p1410l80071o81243o65548l82412
6242C237135Q0638N47033O84193L54399l0471m9158M8697n3175k02990k01291
6232D415010o1030O1984J20955O3560o2861k64483m57844m88192l29616j60591
6222B836892k04551n10281q30119q40121p41806p70143o08286m43308n16319n31546
6212c159588k02067K77483N37713O12727N70459K57176m7554r8521j09031j55171
$$ plain form
6202 -1516374 -1886829 -2392580 -2536526 -2140342 -1544384 -975904 -535062 -403662 -352371 83349
6192 83349 710964 1051482 969050 790182 854271 1113859 1384209 1636992 2044367 2686543
6182 2686543 3179475 3209029 3067230 3106604 3154210 3105086 3176279 3237746 3043479 2661510 2370118
6171 2370118 2606654 3433921 4458632 5356497 6002993 6337766 6334750 6067485 5602040 5101345
6161 5101345 4855706 4906928 4979734 4822612 4316657 3612509 2977789 2618010 2886227 3780646
6151 3780646 4714687 5359567 5931737 6548520 7069911 7554007 8205581 9108333 10175794
6142 10175794 11164561 11817136 12097773 12282083 12662269 13383976 14384646 15480392 16808151
6133 16808151 18560734 20580197 22632572 24774450 26822631 28112384 28272161 27498621
$$ packed form
6202a516374l70455n05751j43946L96184N95958N68480M40842J31400N1291M35720
6192H3349O27615L40518q2432j78868O4089K59588K70350K52783M07375O42176
6182B686543M92932K9554j41799L9374M7606m9124P1193O1467j94267l81969k91392
6171B370118K36536Q27267J024711Q97865O46496L34773l016k67265m65445n00695
6161E101345k45639N1222P2806j57122n05955p04148o34720l59779K68217Q94419
6151C780646R34041O44880N72170O16783N21391M84096O51574R02752J067461
6142A0175794R88767O52575K80637J84310L80186P21707J000670J095746J327759
6133A6808151J752583K019463K052375K141878K048181J289753J59777p73540
$$ plain form
6125 27498621 26292805 25063121 23721470 22174075 20781795 19560495 18041004 16069197
6117 16069197 14100711 12766498 12116803 11660787 10830225 9705605 8800752 8173139 7587240
6108 7587240 7145575 6936358 6871831 6792087 6588832 6268378 5888955 5472357 4812773 3780497
6098 3780497 2388416 930155 -89278 -384133 40954 819658 1479328 1834988 2012172
6089 2012172 2287349 2608460 2829217 2953004 2962350 2952301 3048311 3243856 3529664 3880384
6079 3880384 4297426 4884743 5648143 6382916 6860693 7037931 7061985 6988734 6721780 6288258
6069 6288258 5748447 5246346 5024876 5078920 5146378 5031028 4716920 4110867 3187038 2295186
6059 2295186 1789074 1777302 2260251 2901014 3229180 3092243 2777028 2529344 2519285 2899510
$$ packed form
6125B7498621j205816j229684j341651j547395j392280j221300j519491j971807
6117A6069197j968486j334213o49695m56016q30562j124620r04853o27613n85899
6108G587240m41665k09217o4527p9744k03255l20454l79423m16598o59584j032276
6098C780497j392081j458261j019433k94855M25087P78704O59670L55660J77184
6089B012172K75177L21111K20757J23787R346j0049R6010J95545K85808L50720
6079C880384M17042N87317P63400P34773M77777J77238K4054p3251k66954m33522
6069F288258n39811n02101k21470N4044O7458j15350l14108o06053r23829q91852
6059B295186n06112j1772M82949O40763L28166j36937l15215k47684j0059L80225
$$ plain form
6049 2899510 3457638 3775505 3572151 2969770 2440395 2277431 2356725 2511296 2925584 3876319
6039 3876319 5223810 6513908 7483059 8195619 8786047 9327346 9793685 10044668 9956664
6030 9956664 9534040 9054239 8763847 8478021 7991044 7492768 7076879 6857759 7276605 8237572
6020 8237572 9032684 9380555 9426589 9285632 8977707 8578536 8439144 8697129 9067596 9263458
6010 9263458 9222209 8834790 7960171 6853796 5833791 5053763 4516408 3978224 3320697
6001 3320697 2686885 2181725 1598137 780059 -7126 -501412 -829205 -1060204 -979980 -530680
5991 -530680 18175 449820 808860 1257261 1955087 2905452 3812750 4195365 3850261 3118334
5981 3118334 2339417 1566811 964503 636701 654918 1024500 1437854 1690900 1817586 1961851
$$ packed form
6049B899510N58128L17867k03354o02381n29375j62964P9294J54571M14288R50735
6039C876319J347491J290098R69151P12560N90428N41299M66339K50983q8004
6030I956664m22624m79801k90392k85826m86977m98276m15889k19120M18846R60967
6020H237572P95112L47871M6034j40957l07925l99171j39392K57985L70467J95862
6010I263458m1249l87419q74619j106375j020005p80028n37355n38184o57527
6001C320697o33812n05160n83588q18078p87185m94286l27793k30999Q0224M49300
5991e30680N48855M31645L59040M48401O97826R50365R07298L82615l45104p31927
5981C118334p78917p72606o02308l27802J8217L69582M13354K53046J26686J44265
$$ plain form
5971 1961851 2182323 2413316 2507966 2397005 2136558 1959212 2145456 2701497 3279856 3382378
5961 3382378 2761476 1736832 869516 587039 835210 1213441 1611082 2082614 2514058
5952 2514058 2607364 2302122 1859576 1316723 467505 -500412 -1075167 -1093781 -777070 -520888
5942 -520888 -697580 -1206095 -1724337 -2185202 -2558077 -2752925 -2767396 -2631534 -2304934 -1806585
5932 -1806585 -1232104 -795408 -638932 -685445 -805697 -978300 -1068547 -984047 -752763 -539782
5922 -539782 -415432 -142081 297785 463484 93858 -523363 -777296 -521592 -246753 -40542
5912 -40542 427967 1028003 1284731 941598 231858 -318129 -501208 -418489 -112048 311462
5902 311462 545345 450856 365384 507518 692975 707020 353982 -329607 -833726 -769827
$$ packed form
5971A961851K20472K30993R4650j10961k60447j77346J86244N56041N78359J02522
5961C382378o20902j024644q67316k82477K48171L78231L97641M71532M31444
5952B514058R3306l05242m42546n42853q49218r67917n74755j8614L16711K56182
5942e20888j76692n08515n18242m60865l72875j94848j4471J35862L26600M98349
5932a806585N74481M36696J56476m6513j20252j72603r0247Q4500K31284K12981
5922e39782J24350K73351M39866J65699l69626o17221k53933K55704K74839K06211
5912d0542M68509O00036K56728l43133p09740n49987j83079Q2719L06441M23510
5902C11462K33883r4489q5472J42134J85457J4045l53038o83589n04119O3899
$$ plain form
5892 -769827 -288808 342688 791998 1001236 1347404 1814719 1855225 1382108 739906 89249
5882 89249 -432155 -753498 -899233 -743511 -249750 428406 910212 877177 622383 513450
5872 513450 329216 -176006 -812069 -1362983 -1705811 -1804637 -1849083 -1921964 -1877577 -1620193
5862 -1620193 -1069670 -155057 862060 1673699 2115760 2061355 1717855 1553509 1838533 2526196
5852 2526196 3348717 3971624 4269200 4147968 3531372 2688947 2178147 2351042 3043089 3901615
5842 3901615 4604018 4792399 4406458 3747508 3154198 2588397 1860100 1185125 882728 969920
5832 969920 986310 703267 492276 563450 593174 255924 -317831 -833240 -1265778 -1825321
5822 -1825321 -2503961 -2938240 -2745629 -2063898 -1463026 -1181109 -1160315 -1396043 -1710058 -1574490
$$ packed form
5892g69827M81019O31496M49310K09238L46168M67315M0506m73117o42202o50657
5882H9249n21404l21343j45735J55722M93761O78156M81806l3035k54794j08933
5872E13450j84234n05222o36063n50914l42828r8826m4446p2881M4387K57384
5862a620193N50523R14613J017117Q11639M42061n4405l43500j64346K85024O87663
5852B526196Q22521O22907K97576j21232o16596q42425n10800J72895O92047Q58526
5842C901615P02403J88381l85941o58950n93310n65801p28297o74975l02397Q7192
5832I69920J6390k83043k10991P1174K9724l37250n73755n15409m32538n59543
5822a825321o78640m34279J92611O81731O00872K81917K0794k35728l14015J35568
$$ plain form
5812 -1574490 -757760 227985 629575 299147 -196632 -314593 -17180 538345 1183920 1698944
5802 1698944 1898754 1688346 1228868 813419 568743 463551 433236 440509 355363 63260
5792 63260 -248442 -423081 -459195 -224198 517137 1461340 1970628 1952899 1805419 1692906
5782 1692906 1508802 1401187 1366363 1230196 944493 763527 863669 972125 1029144 1210127
5772 1210127 1474857 1601285 1361610 772206 109833 -411768 -834526 -1108644 -1106517 -1142618
5762 -1142618 -1500889 -1924445 -2120474 -2050217 -2001358 -2157700 -2263194 -2066003 -1558087 -900883
5752 -900883 -457131 -466612 -725759 -732968 -227422 444900 815692 744107 463081 187391 -57589
5741 -57589 -287659 -588590 -941578 -1127290 -1017430 -953064 -1342508 -1880232 -2125004 -2275020
$$ packed form
5812a574490Q16730R85745M01590l30428m95779j17961K97413N55525O45575N15024
5802A698944J99810k10408m59478m15449k44676j05192l0315P273q5146k92103
5792F3260l11702j74639l6114K34997P41335R44203N09288j7729j47480j12513
5782A692906j84104j07615l4824j36167k85703j80966J00142J08456N7019J80983
5772A210127K64730J26428k39675n89404o62373n21601m22758k74118K127l6101
5762a142618l58271m23556j96029P0257M8859j56342j05494J97191N07916O57204
5752i00883M43752r481k59147p209N05546O72322L70792p1585k81026k75690k44980
5741e7589k30070l00931l52988j85712J09860O4366l89444n37724k44772j50016
$$ plain form
5731 -2275020 -2636046 -3053861 -3077606 -2577231 -1931746 -1403112 -881663 -288832 392297 977559
5721 977559 1192918 995920 599169 260071 -82985 -493991 -772160 -794264 -708160 -584169
5711 -584169 -454586 -570475 -975104 -1245054 -1149516 -821647 -410593 76446 586044 918375
5701 918375 993928 935012 1031118 1311603 1446085 1208568 833268 653091 536669 86908
5691 86908 -762885 -1620590 -1994264 -1826894 -1657647 -1863095 -2436901 -3093038 -3344088 -3104042
5681 -3104042 -2643645 -2193288 -1935828 -1859438 -1835937 -1633270 -1079863 -244726 439081 590061
5671 590061 254183 -331044 -738302 -697640 -412854 -86575 345863 879805 1250118 1349346
5661 1349346 1248175 911008 596252 757400 1486061 2297385 2539351 2245839 1832964 1265762
$$ packed form
5731b275020l61026m17815k3745N00375O45485N28634N21449N92831O81129N85262
5721I77559K15359j96998l96751l39098l43056m11006k78169k2104Q6104J23991
5711e84169J29583j15889m04629k69950R5538L27869M11054M87039N09598L32331
5701I18375P5553n8916R6106K80485J34482k37517l75300j80177j16422m49761
5691H6908q49793q57705l73674J67370J69247k05448n73806o56137k51050K40046
5681c104042M60397M50357K57460P6390K3501K02667N53407Q35137O83807J50980
5671E90061l35878n85227m07258M0662K84786L26279M32438N33942L70313R9228
5661A349346j01171l37167l14756J61148P28661Q11324K41966k93512m12875n67202
$$ plain form
5651 1265762 472221 -345285 -1020357 -1408182 -1389920 -1032508 -530975 -195341 -100055 -35838
5641 -35838 39243 -61609 -251166 -255251 -4577 296515 320725 232971 385038 609494 726569
5630 726569 668562 329521 -126123 -245545 149984 741265 1177006 1459240 1642140 1757250
5620 1757250 1835454 1820502 1642473 1302670 834715 323346 -72472 -386549 -696943 -785123
5610 -785123 -525707 -177323 54137 804 -400674 -989753 -1431902 -1632930 -1847529 -2171766
5600 -2171766 -2505013 -2762631 -2937141 -3084021 -3197836 -3268691 -3236219 -3133498 -2993247 -2850206
5590 -2850206 -2786594 -2660693 -2362992 -1919048 -1348211 -656723 108730 834137 1260035 1327494
5580 1327494 1269318 1318480 1431651 1438961 1326143 1120916 881991 687334 663503 805799
$$ packed form
5651A265762p93541q17506o75072l87825J8262L57412N01533L35634R5286O4217
5641c5838P5081j00852j89557m085K50674L01092K4210q7754J52067K24456J17075
5630G26569n8007l39041m55644j19422L95529N91281M35741K82234J82900J15110
5620A757250P8204j4952j78029l39803m67955n11369l95818l14077l10394q8180
5610g85123K59416L48384K31460n3333m01478n89079m42149k01028k14599l24237
5600b171766l33247k57618j74510j46880j13815p0855L2472J02721J40251J43041
5590b850206O3612J25901K97701M43944N70837O91488P65453P25407M25898O7459
5580A327494n8176M9162J13171P310j12818k05227k38925j94657k3831J42296
$$ plain form
5570 805799 892548 632047 -20411 -682441 -989352 -969651 -931113 -1060089 -1249966 -1407320
5560 -1407320 -1415727 -1179982 -867360 -790170 -873097 -831059 -688917 -438931 -18589 339732
5550 339732 339579 173106 132628 186591 198181 126508 33314 8411 -257 -11704 -15766 58627
5538 58627 307760 479022 359589 100474 -7067 187520 444214 437062 104569 -402097
5528 -402097 -886199 -1259968 -1357833 -993041 -164555 895873 1780645 2148404 2143167 2236445
5518 2236445 2661569 3223930 3631307 3688305 3368049 2680770 1726033 813172 259206 133433
5508 133433 175571 169049 85275 -197818 -553208 -741312 -627974 -171368 377918 605887
5498 605887 509018 531980 828112 1304664 1928656 2436805 2341891 1584881 655228 22630
$$ packed form
5570H05799Q6749k60501o52458o62030l06911J9701L8538j28976j89877j57354
5560a407320q407K35745L12622P7190q2927M2038J42142K49986M20342L58321
5550C39732j53j66473m0478N3963J1590p1673r3194k4903q668j1447m062P4393
5538E8627K49133J71262j19433k59115j07541J94587K56694p152l32493n06666
5528d02097m84102l73769r7865L64792Q28486J060428Q84772L67759n237R3278
5518B236445M25124N62361M07377N6998l20256o87279r54737r12861n53966j25773
5508A33433M2138o522q3774k83093l55390j88104J13338M56606N49286K27969
5498F05887r6869K2962K96132M76552O23992N08149r4914p57010r29653o32598
$$ plain form
5488 22630 -253808 -473490 -893355 -1399577 -1747084 -1949881 -2038006 -1876710 -1430621 -808464
5478 -808464 -262060 -167965 -430415 -576415 -343222 319622 1092763 1464135 1440262 1429548
5468 1429548 1598306 1674299 1327902 614291 -68015 -463377 -650649 -680957 -524694 -349873
5458 -349873 -404720 -665160 -818774 -793665 -699355 -348381 419897 1439622 2507223 3278224
5448 3278224 3485241 3198709 2638305 2019802 1534720 1351875 1347380 1419813 1495718 1400099
5438 1400099 1006298 542423 320580 321213 315677 145124 -128789 -370951 -649572 -1162193
5428 -1162193 -1777045 -2155518 -2311815 -2477845 -2650499 -2601240 -2301739 -1965868 -1702354 -1331775
5418 -1331775 -727178 -144186 169424 206153 165788 257730 602939 1124005 1557119 1985371
$$ packed form
5488B2630k76438k19682m19865n06222l47507k02797q8125J61296M46089O22157
5478h08464N46404R4095k62450j46000K33193O62844P73141L71372k3873j0714
5468A429548J68758P5993l46397p13611o82306l95362j87272l0308J56263J74821
5458c49873n4847k60440j53614K5109R4310L50974P68278J019725J067601P71001
5448C278224K07017k86532n60404o18503m85082j82845m495P2433P5905r5619
5438A400099l93801m63875k21843O33n536j70553k73913k42162k78621n12621
5428a162193o14852l78473j56297j66030j72654M9259K99501L35871K63514L70579
5418a331775O04597N82992L13610L6729m0365R1942L45209N21066M33114M28252
$$ plain form
5408 1985371 2374879 2291466 1695816 1075192 650480 293632 29102 -125820 -285613 -618803
5398 -618803 -1142910 -1788515 -2401739 -2718552 -2497700 -1823943 -1033853 -447302 -152053 -90937
5388 -90937 -110697 -66531 22959 216319 645364 1388650 2220154 2876295 3287297 3189969 2506039
5377 2506039 1650605 855141 260881 -4922 19523 196524 295606 86006 -446518 -956946
5367 -956946 -1112589 -876502 -359049 381634 1221852 1792487 1705490 1132825 823720 1185370
5357 1185370 2086891 3243578 4280900 5034071 5553173 5976267 6584466 7473800 8281348
5348 8281348 8733002 9107595 9708801 10568594 11633273 12753581 13574469 13913704 14074095
5339 14074095 14707023 15868012 17189864 18831589 20865194 22915339 24746539 26937584
$$ packed form
5408A985371L89508q3413n95650o20624m24712l56848k64530j54922j59793l33190
5398f18803n24107o45605o13224l16813K20852O73757P90090N86551K95249O1116
5388i0937j9760M4166Q9490J93360M29045P43286Q31504O56141M11002r7328o83930
5377B506039q55434p95464n94260k65803K4445J77001R9082k09600n32524n10428
5367i56946j55643K36087N17453P40683Q40218N70635q6997n72665l09105L61650
5357A185370R01521J156687J037322P53171N19102M23094O08199Q89334Q07548
5348H281348M51654L74593O01206Q59793J064679J120308Q20888L39235J60391
5339A4074095O32928J160989J321852J641725K033605K050145J831200K191045
$$ plain form
5331 26937584 30387723 35532928 42359623 50814511 61534006 75164248 90674510 104876201
5323 104876201 113205131 112709815 104583913 92674640 80392459 69197897 59244206 50539400
5315 50539400 43241810 37383080 32758700 29181247 26480484 24421328 22651632 20824309
5307 20824309 18767456 16597865 14673165 13296246 12444045 11798407 11142440 10482555 9814621
5298 9814621 8962057 7910564 6752475 5707781 5012699 4666357 4478590 4227635 3812944
5289 3812944 3269336 2704631 2315834 2196893 2120020 1776300 1086490 378917 35791 49124
5279 49124 248246 480624 583323 661014 925342 1320570 1801609 2345025 2739487 2786394
5269 2786394 2572762 2248739 1854461 1554067 1504997 1676454 1863830 2013977 2094743 2080222
$$ packed form
5331B6937584L450139N145205O826695Q454888J0719495J3630242J5510262J4201691
5323A04876201Q328930m95316q125902j1909273j2282181j1194562r953691q704806
5315E0539400p297590n858730m624380l577453k700763k059156j769696j827323
5307B0824309k056853k169591j924700j376919q52201o45638o55967o59885o67934
5298I814621q52564j051493j158089j044694o95082l46342j87767k50955m14691
5289C812944n43608n64705l88797j18941p6873l43720o89810p07573l43126J3333
5279D9124J99122K32378J02699P7691K64328L95228M81039N43416L94462M6907
5269B786394k13632l24023l94278l00394m9070J71457J87376J50147Q0766j4521
$$ plain form
5259 2080222 1949421 1555043 918429 346571 217652 497168 763514 821512 850872 961007
5249 961007 1061019 1156325 1304321 1351443 1141815 806487 406703 72430 69031 338246
5239 338246 558278 634906 517118 158941 -1188 287018 691924 945303 942190 603746
5229 603746 59735 -550037 -994523 -895469 -375747 62018 307769 542598 814876 1095536
5219 1095536 1586043 2196284 2667571 2956050 3069393 3236252 3632639 4170295 4641742 4981968
5209 4981968 5069146 4802365 4524008 4388462 4210476 3904882 3580277 3454338 3427749 3221263
5199 3221263 2876044 2497092 2111046 1833274 1634446 1140771 329763 -314511 -400577 -20210
5189 -20210 524321 925562 1005155 991801 1149852 1232966 1102850 949410 806663 628818
$$ packed form
5259B080222j30801l94378o36614n71858j28919K79516K66346N7998K9360J10135
5249I61007J00012R5306J47996M7122k09628l35328l99784l34273l399K69215
5239C38246K20032P6628j17788l58177j60129K88206M04906K53379l113l38444
5229F03746n44011o09772m44486R9054N19722M37765K45751K34829K72278K80660
5219A095536M90507O10241M71287K88479J13343J66859L96387N37656M71447L40226
5209D981968Q7178k66781k78357j35546j77986l05594l24605j25939k6589k06486
5199C221263l45219l78952l86046k77772j98828m93675q11008o44274q6066L80367
5189b0210N44531M01241P9593j3354J58051Q3114j30116j53440j42747j77845
$$ plain form
5179 628818 335572 4602 -166285 -330472 -786676 -1496567 -2222325 -2916372 -3481626 -3669958
5169 -3669958 -3519804 -3174710 -2704711 -2116540 -1445757 -923504 -640157 -559620 -666638 -945431
5159 -945431 -1121021 -827341 -301945 28929 100789 132335 278006 562103 885818 1141641
5149 1141641 1253681 1326153 1375993 1368545 1331418 1248179 1051598 821174 804703 1231178 2022892
5138 2022892 2785413 3116427 3103294 3031721 2781318 2057674 1053159 274042 -31921 -122200
5128 -122200 -214523 -161664 3559 124798 144589 91171 50572 108404 321308 593940 637410
5117 637410 383582 67809 150345 678372 1155995 1513806 1806573 1979260 2196659 2512888
5107 2512888 2642373 2509768 2205128 1702773 1303438 1203082 1146235 923835 687567 797941
$$ packed form
5179F28818k93246l30970j70887j64187m56204p09891p25758o94047n65254j88332
5169c669958J50154L45094M69999N88171O70783N22253K83347Q0537j07018k78793
5159i45431j75590K93680N25396L30874P1860L1546J45671K84097L23715K55823
5149A141641J12040P2472M9840p448l7127q3239j96581k30424j6471M26475P91714
5138B022892P62521L31014j3133p1573k50403p23644j004515p79117l05963r0279
5128a22200r2323N2859J65223J21239J9791n3418m0599N7832K12904K72632M3470
5117F37410k53828l15773Q2536N28027M77623L57811K92767J72687K17399L16229
5107B512888J29485j32605l04640n02355l99335j00356n6847k22400k36268J10374
$$ plain form
5097 797941 1229308 1810555 2593623 3539619 4304168 4516511 4131192 3177620 1990537 1150565
5087 1150565 829172 693286 505364 454363 833159 1529769 2067877 2041247 1662218 1401957
5077 1401957 1263234 961687 394672 -256334 -751312 -908432 -684200 -125485 599931 1200112
5067 1200112 1633682 1940815 2184005 2492707 2712780 2459136 1716994 1047499 735705 418262
5057 418262 -129293 -698853 -1002879 -920249 -574405 -291450 -194688 -137689 21153 317499
5047 317499 745859 1256315 1586839 1566931 1212471 646608 69845 -525242 -1278403 -2142032
5037 -2142032 -2891530 -3535921 -4123945 -4352799 -3674197 -2155801 -510183 852472 1745930
5028 1745930 2007986 1837934 1586045 1262634 902687 652489 406808 13010 -430161 -828844
$$ packed form
5097G97941M31367N81247P83068R45996P64549K12343l85319r53572j187083q39972
5087A150565l21393j35886j87922n1001L78796O96610N38108k6630l79029k60261
5077A401957j38723l01547n67015o51006m94978j57120K24232N58715P25416O00181
5067A200112M33570L07133K43190L08702K20073k53644p42142o69495l11794l17443
5057D18262n47555n69560l04026Q2630L45844K82955R6762N6999J58842K96346
5047C17499M28360N10456L30524j9908l54460n65863n76763n95087p53161q63629
5037b142032p49498o44391n88024k28854O78602J518396J645618J362655Q93458
5028A745930K62056j70052k51889l23411l59947k50198k45681l93798m43171l98683
$$ plain form
5018 -828844 -1151656 -1267383 -1086860 -774641 -502957 -240704 12125 92606 -252171 -940921
5008 -940921 -1496140 -1640244 -1443285 -1063789 -634454 -100419 591869 1210841 1453642 1398710
4998 1398710 1395460 1504200 1454449 1050506 363263 -189423 -227631 4132 3043 -402532 -839170
4987 -839170 -722335 -152785 254934 77122 -490438 -1089689 -1647686 -2045614 -2257100 -2464346
4977 -2464346 -2779868 -3078598 -3207524 -3038154 -2588763 -1961588 -1208700 -510790 -109684 845
4967 845 91579 128110 93240 267187 773792 1414587 1839459 2051813 2333077 2776235 3254987
4956 3254987 3470085 3153029 2337543 1334090 455597 -207712 -643794 -900077 -1134099
4947 -1134099 -1454107 -1895375 -2230922 -2150456 -1891706 -1875980 -2154533 -2642865 -3253444 -3748192
$$ packed form
5018h28844l22812j15727J80523L12219K71684K62253K52829Q0481l44777o88750
5008i40921n55219j44104J96959L79496M29335N34035O92288O18972K42801n4932
4998A398710l250J08740m9751m03943o87243n52686l8208K31763j089m05575m36638
4987h39170J16835N69550M07719j77812n67560n99251n57997l97928k11486k07246
4977b464346l15522k98730j28926J69370M49391O27175P52888O97910M01106J10529
4967H45R0734L6531l4870J73947N06605O40795M24872K12354K81264M43158M78752
4956C254987K15098l17056q15486j003453q78493o63309m36082k56283k34022
4947a134099l20008m41268l35547Q0466K58750J5726k78553m88332o10579m94748
$$ plain form
4937 -3748192 -3875529 -3634213 -3170461 -2694154 -2436431 -2315302 -2031005 -1593925 -1211498 -942087
4927 -942087 -715658 -437467 -218048 -291917 -621974 -851027 -808742 -621672 -370376 -238908
4917 -238908 -367867 -473276 -452762 -566841 -861143 -1209896 -1517460 -1670004 -1633417 -1475586
4907 -1475586 -1215940 -912007 -647553 -540624 -757022 -1340767 -2159873 -2829017 -3122973 -3147553
4897 -3147553 -3133781 -3077540 -2749135 -2166735 -1682029 -1501669 -1499340 -1465800 -1250792 -917215
4887 -917215 -652828 -493036 -384117 -260497 -141916 -62489 43735 215642 315811 170954
4877 170954 -342310 -1022290 -1436510 -1565793 -1543375 -1367015 -1089292 -822853 -643756 -413924
4867 -413924 -163585 132482 619209 1137273 1577436 2005010 2205783 1813806 1019023 299621
$$ packed form
4937c748192j27337K41316M63752M76307K57723J21129K84297M37080L82427K69411
4927i42087K26429K78191K19419p3869l30057k29053M2285J87070K51296J31468
4917b38908j28959j05409K0514j14079k94302l48753l07564j52544L6587J57831
4907a475586K59646L03933K64454J06929k16398n83745q19106o69144k93956k4580
4897c147553J3772N6241L28405N82400M84706J80360K329L3540K15008L33577
4887i17215K64387J59792J08919J23620J18581P9427J06224J71907J00169j44857
4877A70954n13264o79980m14220j29283K2418J76360K77723K66439J79097K29832
4867d13924K50339K96067M86727N18064M40163M27574K00773l91977p94783p19402
$$ plain form
4857 299621 -408322 -1342328 -2201362 -2697537 -2930609 -2947887 -2851950 -2874223 -3088275 -3316999
4847 -3316999 -3425371 -3362099 -3091600 -2750286 -2520423 -2191569 -1692752 -1044011 -182777 708328
4837 708328 1295444 1503439 1467985 1318602 1105183 730250 -28582 -1072958 -1844014 -2067497
4827 -2067497 -1868806 -1507109 -1161933 -881270 -490028 45791 528574 807834 812702 687919
4817 687919 673781 708358 607722 455387 518939 772293 832629 674209 684781 840658 862388
4806 862388 573352 -132770 -1101159 -1957863 -2464229 -2562103 -2293715 -1753378 -1102185 -385810
4796 -385810 354277 900331 1106682 1024868 783090 373099 -66189 -175067 113324 720821
4786 720821 1616703 2529102 2958039 2749614 2181262 1684655 1461545 1453196 1638878 2024548
$$ packed form
4857B99621p07943r34006q59034m96175k33072j7278R5937k2273k14052k28724
4847c316999j08372O3272K70499L41314K29863L28854M98817O48741Q61234Q91105
4837G08328N87116K07995l5454j49383k13419l74933p58832j044376p71056k23483
4827b067497J98691L61697L45176K80663L91242N35819M82783K79260M868j24783
4817F87919j4138L4577j00636j52335O3552K53354O0336j58420J0572J55877K1730
4806H62388k89036p06122r68389q56704n06366r7874K68388N40337O51193P16375
4796c85810P40087N46054K06351q1814k41778m09991m39288j08878K88391O07497
4786G20821Q95882R12399M28937k08425n68352m96607k23110q349J85682L85670
$$ plain form
4776 2024548 2397878 2549624 2331190 1664759 894173 329077 -222970 -824252 -1321532 -1686567
4766 -1686567 -1915217 -1988947 -1745027 -1135554 -441793 54188 178987 -162757 -703066 -992524
4756 -992524 -902489 -618872 -313628 -60355 26969 -15649 -170583 -453932 -675312 -749411
4746 -749411 -753013 -740577 -711129 -626220 -497724 -393870 -427832 -582912 -733864 -852469 -814894
4735 -814894 -564304 -245184 -95819 -293245 -683513 -912187 -853533 -731423 -719843 -815673
4725 -815673 -903156 -940041 -1125099 -1557872 -1995376 -2347967 -2908966 -3753057 -4421705 -4441479
4715 -4441479 -3778619 -2919394 -2379468 -2228631 -2360547 -2587182 -2605971 -2391541 -2113198 -1708799
4705 -1708799 -1059194 -300561 316098 695444 893847 848264 511981 67026 -164850 -172458
$$ packed form
4776B024548L73330J51746k18434o66431p70586n65096n52047o01282m97280l65035
4766a686567k28650p3730K43920O09473O93761M95981J24799l41744n40309k89458
4756i92524R0035K83617L05244K53273Q7324m2618j54934k83349k21380p4099
4746g49411l602J2436K9448Q4909J28496J03854l3962j55080j50952j18605L7575
4735h14894K50590L19120J49365j97426l90268k28674N8654J22110J1580r5830
4725h15673q7483l6885j85058m32773m37504l52591n60999q44091o68648j9774
4715d441479O62860Q59225N39926J50837j31916k26635j8789K14430K78343M04399
4705a708799O49605P58633O16659L79346J98403m5583l36283m44955k31876p608
$$ plain form
4695 -172458 -202026 -400484 -838343 -1378647 -1835947 -2135465 -2190835 -1892949 -1347263 -738608
4685 -738608 -241860 130526 444994 804065 1136121 1196041 967693 630102 242213 -247673
4675 -247673 -916909 -1686274 -2138881 -1876222 -1051819 -278789 -61539 -300621 -647422 -973309
4665 -973309 -1103652 -960454 -578662 -26690 582070 1143391 1526073 1629248 1444430 957302
4655 957302 210992 -681614 -1322602 -1571346 -1594802 -1422617 -998613 -500164 -303055 -441624
4645 -441624 -759380 -1059778 -1064884 -837895 -572288 -280707 63173 528473 1078531 1564436
4635 1564436 1910063 2010777 1909216 1827526 1945880 2211297 2332897 2167276 1906304 1707673
4625 1707673 1650838 1584801 1101536 282063 -456585 -830972 -815602 -633661 -626967 -909114
$$ packed form
4695a72458k9568j98458m37859n40304m57300k99518n5370K97886N45686O08655
4685g38608M96748L72386L14468L59071L32056N9920k28348l37591l87889m89886
4675b47673o69236p69365m52607K62659Q24403P73030K17250k39082l46801l25887
4665i73309j30343J43198L81792N51972O08760N61321L82682J03175j84818m87128
4655I57302p46310q92606o40988k48744k3456J72185M24004M98449J97109j38569
4645d41624l17756l00398n106K26989K65607K91581L43880M65300N50058M85905
4635A564436L45627J00714j01561q1690J18354K65417J21600j65621k60972j98631
4625A707673n6835o6037m83265q19473p38648l74387J5370J81941O694k82147
$$ plain form
4615 -909114 -1195874 -1402699 -1832519 -2368075 -2449803 -1964149 -1125790 -246079 282277 175477
4605 175477 -534067 -1593884 -2611863 -3187168 -3311243 -3158579 -2884352 -2643601 -2402393
4596 -2402393 -2163570 -2050980 -1914228 -1557915 -930337 -217474 253475 507656 903134 1536685
4586 1536685 2210174 2704340 2948432 2939500 2544408 1961422 1710992 1694877 1486054 836112
4576 836112 -70226 -951973 -1782559 -2513701 -2937473 -2881201 -2306560 -1412463 -597198 -135109
4566 -135109 -241681 -749112 -1093118 -1093778 -978434 -930864 -985615 -1220770 -1585917 -1624850 -1160738
4555 -1160738 -588396 -298192 -329602 -337584 -102081 219936 497835 651695 547054 175154
4545 175154 -307472 -651969 -660496 -361672 69676 533964 881897 853163 427698 -128106
$$ packed form
4615i09114k86760k06825m29820n35556q1728M85654Q38359Q79711N28356j06800
4605A75477p09544j059817j017979n75305j24075J52664K74227K40751K41208
4596b402393K38823J12590J36752L56313O27578P12863M70949K54181L95478O33551
4586A536685O73489M94166K44092q932l95092n82986k50430j6115k08823o49942
4576H36112r06338q81747q30586p31142m23772N6272N74641Q94097Q15265M62089
4566a35109j06572n07431l44006o60J15344M7570n4751k35155l65147l8933M64112
4555a160738N72342K90204l1410p982K35503L22017K77899J53860j04641l71900
4545A75154m82626l44497q527K98824M31348M64288L47933k8734m25465n55804
$$ plain form
4535 -128106 -553535 -805814 -1014287 -1313242 -1521562 -1282968 -576994 368792 1057360 1071723
4525 1071723 611018 169082 -75581 -283028 -388373 -283251 -159034 -153786 -294705 -423254
4515 -423254 -361357 -206729 -137925 -120225 -40720 68832 176387 347293 634425 845019
4505 845019 756576 318976 -195768 -572131 -750805 -532829 42095 531324 645870 569331
4495 569331 445568 327961 218624 122318 8682 -284388 -752221 -1276009 -1729578 -1810755
4485 -1810755 -1477038 -1070212 -829136 -801957 -756369 -726349 -1021912 -1572529 -2051445 -2312614
4475 -2312614 -2449872 -2532859 -2478079 -2358700 -2214587 -2021596 -1934465 -1892213 -1757560 -1477598
4465 -1477598 -939462 -206392 385582 434278 -25265 -551727 -921628 -1217721 -1585850 -1886624
$$ packed form
4535a28106m25429k52279k08473k98955k08320K38594P05974R45786O88568J4363
4525A071723m60705m41936k44663k07447j05345J05122J24217N248j40919j28549
4515d23254O1897J54628O8804J7700P9505J09552J07555J70906K87132K10594
4505H45019q8443m37600n14744l76363j78674K17976N74924M89229J14546p6539
4495E69331j23763j17607j09337r6306j13636k93070m67833n23788m53569q1177
4485a810755L33717M06826K41076K7179M5588L0020k95563n50617m78916k61169
4475b312614j37258q2987N4780J19379J44113J92991Q7131M2252J34653K79962
4465a477598N38136P33070N91974M8696m59543n26462l69901k96093l68129l00774
$$ plain form
4455 -1886624 -1961511 -1964946 -2107098 -2416759 -2701428 -2660643 -2212084 -1694125 -1494815 -1509629
4445 -1509629 -1534634 -1594184 -1705637 -1985494 -2456443 -2911498 -3063428 -2836737 -2529157 -2293421
4435 -2293421 -2007501 -1589606 -1207451 -1072416 -1256643 -1710869 -2317206 -2782030 -2740384 -2194696
4425 -2194696 -1555512 -1147936 -776503 -205967 378394 637746 473492 80069 -218545 -134509
4415 -134509 283536 724872 891059 609212 -81461 -1044189 -2009642 -2613216 -2775272 -2642072
4405 -2642072 -2191000 -1391476 -428211 457503 1175572 1783626 2219906 2323679 2178779 1969319
4395 1969319 1665835 1184020 422142 -699460 -1953349 -2909829 -3363997 -3437629 -3233144
4386 -3233144 -2846254 -2439829 -2024564 -1646291 -1559174 -1847178 -2340701 -2761544 -2911286 -2812031
$$ packed form
4455a886624p4887l435j42152l09661k84669M0785M48559N17959J99310j4814
4445a509629k5005n9550j11453k79857m70949m55055j51930K26691L07580K35736
4435b293421K85920M17895L82155J35035j84227m54226o06337m64824M1646N45688
4425b194696O39184M07576L71433N70536N84361K59352j64254l93423k98614Q4036
4415a34509M18045M41336J66187k81847o90673r62728r65453o03574j62056J33200
4405b642072M51072P99524R63265Q85714P18069O08054M36280J03773j44900k09460
4395A969319l03484m81815p61878j121602j253889r56480m54168p3632K04485
4386c233144L86890M06425M15265L78273Q7117k88004m93523m20843j49742R9255
$$ plain form
4376 -2812031 -2483853 -1937756 -1478314 -1374311 -1465775 -1503392 -1343905 -1048055 -960433 -1261178
4366 -1261178 -1771336 -2172479 -2307822 -2417012 -2720235 -2976830 -3000875 -2888573 -2726988 -2536497
4356 -2536497 -2249729 -1928043 -1880755 -2095030 -2163552 -2078283 -1932087 -1522241 -877644 -402911
4346 -402911 -414302 -662374 -625609 -234185 484109 1479122 2207702 2157047 1547340 825134
4336 825134 180592 -148762 36859 267878 -34307 -716293 -1312120 -1567710 -1497778 -1300770
4326 -1300770 -1346721 -1811298 -2249707 -2120908 -1404452 -549131 -118163 -246254 -558741 -514825
4316 -514825 -56254 460107 735337 608509 215320 -20041 174009 709408 1196978 1315772
4306 1315772 951625 260623 -412786 -862188 -1031048 -939135 -775347 -711492 -617714 -420527
$$ packed form
4376b812031L28178N46097M59442J04003r1464l7617J59487K95850Q7622l00745
4366a261178n10158m01143j35343j09190l03223k56595k4045J12302J61585J90491
4356b536497K86768L21686M7288k14275o8522Q5269J46196M09846O44597M74733
4346d02911j1391k48072L6765L91424P18294R95013P28580n0655o09707p22206
4336H25134o44542l29354J85621K31019l02185o81986n95827k55590O9932J97008
4326a300770m5951m64577m38409J28799P16456Q55321M30968j28091l12487M3916
4316e14825M58571N16361K75230j26828l93189k35361J94050N35399M87570J18794
4306A315772l64147o91002o73409m49402j68860R1913J63788O3855R3778J97187
$$ plain form
4296 -420527 -308816 -296037 -174965 197859 830037 1455139 1749673 1707343 1510002 1317473
4286 1317473 1373094 1874811 2635654 3304185 3714353 3940681 4148964 4512727 5091401 5731024
4276 5731024 5969171 5285394 3864824 2635264 2207542 2451649 2881562 3068014 2903076
4267 2903076 2574213 2385038 2308166 1962217 1350787 793755 605641 933027 1762305 2948774
4257 2948774 4244178 5476811 6530587 7398958 8178860 9185621 10712031 12837314 15348796
4248 15348796 18233293 21737959 25957480 31036643 37109081 44067385 51988879 61336543
4240 61336543 72898927 87414742 105247645 126293759 149904536 174726583 198644623
4233 198644623 219231351 235145707 246902096 255464645 260869002 261750874 256155311 244076249
$$ packed form
4296d20527J11711J2779J21072L72824O32178O25102K94534m2330j97341j92529
4286A317473N5621N01717P60843O68531M10168K26328K08283L63763N78674O39623
4276E731024K38147o83777j420570j229560m27722K44107M29913J86452j64938
4267B903076l28863j89175p6872l45949o11430n57032j88114L27386Q29278J186469
4257B948774J295404J232633J053776Q68371P79902J006761J526410K125283K511482
4248A5348796K884497L504666M219521N079163O072438O958304P921494R347664
4240F1336543J1562384J4515815J7832903K1046114K3610777K4822047K3918040
4233A98644623K0586728J5914356J1756389Q562549N404357Q81872n595563j2079062
$$ plain form
4225 244076249 228055134 210912731 194295861 178496377 162926634 147124870 131348423
4218 131348423 116121851 101831012 88876666 77572908 67883793 59620464 52716142
4211 52716142 47211917 42849467 39097522 35556692 32202544 29369960 27165594 25326414
4203 25326414 23648332 22155644 20952592 19826801 18528388 17298788 16404144 15714125
4195 15714125 15035596 14254781 13351924 12382727 11518069 10894603 10240669 9425897 8666594
4186 8666594 8127565 7926715 7993016 8195692 8617666 9190592 9706290 9988406 9928987 9545885
4176 9545885 8985542 8605050 8545720 8668193 8711085 8392261 7894996 7520362 7314619 7192844
4166 7192844 7037542 6778110 6486685 6290168 6220122 6211905 6110900 5875771 5499430 4869670
$$ packed form
4225B44076249j6021115j7142403j6616870j5799484j5569743j5801764j5776447
4218A31348423j5226572j4290839j2954346j1303758r689115q263329o904322
4211E2716142n504225m362450l751945l540830l354148k832584k204366j839180
4203B5326414j678082j492688j203052j125791j298413j229600q94644o90019
4195A5714125o78529p80815r02857r69197q64658o23466o53934q14772p59303
4186H666594n39029k00850O6301K02676M21974N72926N15698K82116n9419l83102
4176I545885n60343l80492n9330J22473M2892l18824m97265l74634k05743j21775
4166G192844j55302k59432k91425j96517p0046q217j01005k35129l76341o29760
$$ plain form
4156 4869670 4119667 3590101 3532630 3700497 3644865 3384961 3012113 2535631 2008496 1455263
4146 1455263 906104 501872 500787 962014 1607542 2204262 2688234 3121681 3519317 3743510
4136 3743510 3502244 2707866 1604597 428723 -415604 -547811 32578 1034604 1882015
4127 1882015 2209742 2081279 1649348 1020665 245403 -515183 -1016171 -1150980 -1032849 -653274
4117 -653274 -48397 504113 851360 1093285 1358042 1639160 1870866 1905612 1612975 1091162
4107 1091162 658082 459904 410293 410991 307234 262345 449673 658374 833278 1091777
4097 1091777 1492274 2023587 2455884 2532465 2347164 1941527 1335984 811801 442363 179318
4087 179318 -99662 -538312 -1016468 -1339366 -1490685 -1657324 -2012344 -2577814 -3149057 -3517940
$$ packed form
4156D869670p50003n29566n7471J67867n5632k59904l72848m76482n27135n53233
4146A455263n49159m04232j085M61227O45528N96720M83972M33447L97636K24193
4136C743510k41266p94378j103269j175874q44327j32207N80389J002026Q47411
4127A882015L27727j28463m31931o28683p75262p60586n00988j34809J18131L79575
4117f53274O04877N52510L47247K41925K64757K81118K31706L4746k92637n21813
4107A091162m33080j98178m9611O98j03757m4889J87328K08701J74904K58499
4097A091777M00497N31313M32297P6581j85301m05637o05543n24183l69438k63045
4087A79318k78980m38650m78156l22898j51319j66639l55020n65470n71243l68883
$$ plain form
4077 -3517940 -3406983 -2628745 -1639959 -1001211 -656911 -351218 -83153 77066 179080 405114
4067 405114 747366 851753 453134 -353644 -1153753 -1446244 -1048529 -175889 868430 1652658
4057 1652658 1877865 1817168 1903017 2087744 2206242 2252077 2128707 1804892 1283515 593892
4047 593892 12771 -371631 -607584 -548667 -187622 286043 699831 809228 629790 346168
4037 346168 54212 -95931 -144244 -161239 -113253 13898 63418 -147070 -599236 -1001796
4027 -1001796 -914100 -366886 133219 272443 54989 -167829 -54828 213787 234210 -25017
4017 -25017 -173148 -12793 127268 -136806 -625676 -898664 -993387 -1184347 -1367552 -1265783
4007 -1265783 -890136 -548187 -484527 -902366 -1792354 -2733727 -3199880 -2864567 -1743066 -234374
$$ packed form
4077c517940J10957P78238R88786O38748L44300L05693K68065J60219J02014K26034
4067D05114L42252J04387l98619q06778q00109k92491L97715Q72640J044319P84228
4057A652658K25207o0697Q5849J84727J18498M5835j23370l23815n21377o89623
4047E93892n81121l84402k35953N8917L61045M73665M13788J09397j79438k83622
4037C46168k91956j50143m8313j6995M7986J27151M9520k10488m52166m02560
4027a001796Q7696N47214N00105J39224k17454k22818J13001K68615K0423k59227
4017b5017j48131J60355J40061k64074m88870k72988r4723j90960j83205J01769
4007a265783L75647L41949O3660m17839q89988r41373m66153L35313J121501J508692
$$ plain form
3997 -234374 1148204 2014379 2237918 2145027 2091787 2036823 1981917 2007995 2035813 1912112 1579580
3986 1579580 1256604 1073701 827286 449972 318912 621219 938692 696540 57775 -558960
3976 -558960 -1106375 -1501237 -1622201 -1440628 -1093234 -762322 -424723 104178 798943 1535466
3966 1535466 2172291 2417250 2196228 1788149 1480203 1175814 690212 68971 -400860 -401110
3956 -401110 -114690 57189 35893 103843 396156 501103 183320 -440544 -1382557 -2543746
3946 -2543746 -3476109 -3757625 -3160958 -1863181 -581676 -50367 -343971 -958883 -1481161
3937 -1481161 -1726362 -1548601 -1119652 -774478 -646177 -803801 -1224648 -1764147 -2407756 -3099076
3927 -3099076 -3655904 -3980835 -4012449 -3755570 -3285942 -2670184 -2044819 -1502143 -1205694 -1077083
$$ packed form
3997b34374J382578Q66175K23539r2891n3240n4964n4906K6078K7818j23701l32532
3986A579580l22976j82903k46415l77314j31060L02307L17473k42152o38765o16735
3976e58960n47415l94862j20964J81573L47394L30912L37599N28901O94765P36523
3966A535466O36825K44959k21022m08079l07946l04389m85602o21241m69831k50
3956d01110K86420J71879k1296O7950K92313J04947l17783o23864r42013j161189
3946b543746r32363k81516N96667J297777J281505N31309k93604o14912n22278
3937a481161k45201J77761M28949L45174J28301j57624m20847n39499o43609o91320
3927c099076n56828l24931l1614K56879M69628O15758O25365N42676K96449J28611
$$ plain form
3917 -1077083 -802253 -414017 -125557 -52591 -78540 7505 132550 59953 -78028 28002
3907 28002 400338 739564 596463 -71164 -836252 -1380099 -1491118 -1186804 -916731 -1037558
3897 -1037558 -1535720 -2010624 -1963937 -1390288 -823780 -580880 -686743 -1149429 -1854960 -2307503
3887 -2307503 -2193931 -1639424 -845975 -155545 -20519 -484514 -1137175 -1797296 -2359542 -2705445
3877 -2705445 -2851139 -2921963 -3073780 -3253326 -3364415 -3371324 -3320243 -3455993 -3805109 -4131215
3867 -4131215 -4184444 -3852544 -3273430 -2657936 -2096114 -1526293 -1073475 -947925 -1211813 -1733634
3857 -1733634 -2313511 -2818105 -3182605 -3379173 -3362729 -3224863 -3071149 -2873012 -2637748 -2260267
3847 -2260267 -1771302 -1412721 -1220232 -1036762 -684020 -67894 667663 1273037 1848672 2622583
$$ packed form
3917a077083K74830L88236K88460P2966k5949Q6045J25045p2597j37981J06030
3907B8002L72336L39226j43101o67627p65088n43847j11019L04314K70073j20827
3897a037558m98162m74904M6687N73649N66508K42900j05863m62686p05531m52543
3887b307503J13572N54507P93449O90430J35026m63995o52661o60121n62246l45903
3877b705445j45694p0824j51817j79546j11089o909N1081j35750l49116l26106
3867d131215n3229L31900N79114O15494N61822N69821M52818J25550k63888n21821
3857a733634n79877n04594l64500j96568J6444J37866J53714J98137K35264L77481
3847b260267M88965L58581J92489J83470L52742O16126P35557O05374N75635P73911
$$ plain form
3837 2622583 3358523 3708779 3522655 2804438 1949551 1415057 1167137 867944 496045 278824
3827 278824 272884 171155 -54555 -212367 -204689 -99579 -77386 -77166 -31798 78983 297016
3816 297016 531942 686764 733851 696263 476079 -182809 -1076601 -1653446 -1787969 -1846031
3806 -1846031 -1984522 -2081518 -2153964 -2207866 -2081903 -1714997 -1377177 -1261620 -1137537 -766973
3796 -766973 -190878 332010 495640 156062 -679956 -1631260 -2290081 -2544717 -2460043 -2145079
3786 -2145079 -1600815 -887097 -287693 -92718 -164529 -191945 -26714 325625 554048 457955
3776 457955 259133 86583 27037 268902 802310 1349732 1661585 1710649 1557972 1535183
3766 1535183 1890368 2124651 1792995 1184244 605168 259752 193454 183815 127748 123190 182235
$$ packed form
3837B622583P35940L50256j86124p18217q54887n34494k47920k99193l71899k17221
3827B78824n940j01729k25710j57812P678J05110K2193K20M5368J10781K18033
3816B97016K34926J54822M7087l7588k20184o58888q93792n76845j34523n8062
3806a846031j38491r6996p2446n3902J25963L66906L37820J15557J24083L70564
3796g66973N76095N22888J63630l39578q36018r51304o58821k54636Q4674L14964
3786b145079N44264P13718N99404J94975p1811k7416J65231L52339K28423r6093
3776D57955j98822j72550n9546K41865N33408N47422L11853M9064j52677k2789
3766A535183L55185K34283l31656o08751n79076l45416o6298r639n6067m558N9045
$$ plain form
3755 182235 295145 415647 374329 139503 7783 105757 373344 894042 1729690 2631133
3745 2631133 3189866 3264571 3015992 2581814 1904117 915419 57858 -307228 -435276 -360449
3735 -360449 273532 1214876 1748480 1644029 1150416 490320 -201911 -885902 -1455298 -1827373
3725 -1827373 -2024724 -2098695 -2112254 -2098046 -2003691 -1821023 -1598628 -1258925 -788604 -243832
3715 -243832 214013 390158 221810 -24976 -118645 -99542 -29181 -77499 -228007 -299054 -228343
3704 -228343 26669 286924 431464 588289 953282 1548508 2112367 2378579 2288603 1878670
3694 1878670 1224053 509400 2056 -282848 -369397 -245187 -82886 39764 111074 -33839
3684 -33839 -527877 -1169775 -1606961 -1739405 -1692686 -1608550 -1631819 -1833644 -2038939 -2066946 -2025883
$$ packed form
3755A82235J12910J20502m1318k34826j31720R7974K67587N20698Q35648R01443
3745B631133N58733P4705k48579m34178o77697r88698q57561l65086j28048P4827
3735c60449O33981R41344N33604j04451m93613o60096o92231o83991n69396l72075
3725a827373j97351p3971j3559J4208R4355J82668K22395L39703M70321N44772
3715b43832M57845J76145j68348k46786r3669J9103P0361m8318j50508p1047P0711
3704b28343K55012K60255J44540J56825L64993N95226N63859K66212q9976m09933
3694A878670o54617p14653n07344k84904q6549J24210J62301J22650P1310j44913
3684c3839m94038o41898m37186j32444M6719Q4136k3269k01825k05295k8007M1063
$$ plain form
3673 -2025883 -1953534 -1593916 -910086 -209864 317952 643528 722014 707177 880489 1125771
3663 1125771 998917 473229 62138 -127348 -267163 -385169 -452295 -261330 174770 591977
3653 591977 706598 454071 201326 217171 380751 610856 904817 1032946 815352 341607
3643 341607 -298760 -1003698 -1581255 -1936607 -2171410 -2277220 -2074438 -1621920 -1226528 -970696
3633 -970696 -916633 -1237046 -1686964 -1924429 -1825299 -1450564 -988244 -566521 -212662 -86441
3623 -86441 -362588 -860807 -1316666 -1540614 -1399361 -1119115 -1156523 -1561230 -1992234 -2123023
3613 -2123023 -1953754 -1773534 -1683643 -1536915 -1301703 -1105543 -1040950 -1292133 -1911002 -2324138
3603 -2324138 -2002709 -1111721 -173048 505545 904598 1179770 1486000 1667935 1487848 1103644
$$ packed form
3673b025883P2349L59618O83830P00222N27816L25576P8486j4837J73312K45282
3663A125771j26854n25688m11091j89486j39815j18006o7126J90965M36100M17207
3653E91977J14621k52527k52745J5845J63580K30105K93961J28129k17594m73745
3643C41607o40367p04938n77557l55352k34803j05810K02782M52518L95392K55832
3633i70696N4063l20413m49918k37465R9130L74735M62320M21723L53859J26221
3623h6441k76147m98219m55859k23948J41253K80246l7408m04707m31004j30789
3613b123023J69269J80220Q9891J46728K35212J96160O4593k51183o18869m13136
3603b324138L21429Q90988R38673O78593L99053K75172L06230J81935j80087l84204
$$ plain form
3593 1103644 934972 985913 818813 217777 -611766 -1440567 -2331585 -3165720 -3551342 -3325311
3583 -3325311 -2734401 -2094776 -1647883 -1488249 -1383504 -1013589 -451704 -39558 49970 -122289
3573 -122289 -544938 -1279052 -2094122 -2563756 -2508378 -2149847 -1730817 -1496543 -1514909 -1566344
3563 -1566344 -1715382 -2170435 -2688948 -2880848 -2747104 -2390028 -1910857 -1359454 -874670 -679385
3553 -679385 -847726 -1079101 -1083053 -873188 -660418 -707711 -923124 -1202074 -1565640 -1871752
3543 -1871752 -2057464 -2196659 -2276589 -2396766 -2861570 -3655563 -4178922 -4041756 -3451466 -2751600
3533 -2751600 -2104481 -1570439 -1118006 -675495 -346876 -120610 185716 419193 270446 -117277
3523 -117277 -452277 -920021 -1720908 -2652451 -3425489 -3813760 -3842517 -3574648 -2997182 -2166405
$$ packed form
3593A103644j68672N0941j67100o01036q29543q28801q91018q34135l85622K26031
3583c325311N90910O39625M46893J59634J04745L69915N61885M12146Q9528j72259
3573a22289m22649p34114q15070m69634N5378L58531M19030K34274j8366n1435
3563a566344j49038m55053n18513j91900J33744L57076M79171N51403M84784J95285
3553f79385j68341k31375l952K09865K12770m7293k15413k78950l63566l06112
3543a871752j85712j39195p9930j20177m64804p93993n23359J37166N90290O99866
3533b751600O47119N34042M52433M42511L28619K26266L06326K33477j48747l87723
3523a17277l35000m67744q00887r31543p73038l88271k8757K67869N77466Q30777
$$ plain form
3513 -2166405 -1222979 -416827 -31166 -338180 -1200751 -1975020 -2113692 -1485506 -464702
3504 -464702 448709 1076855 1381981 1204042 648402 198611 112933 220482 294650 246584
3494 246584 -106669 -605603 -898869 -1034339 -954731 -513174 -150026 -457710 -1391444 -2291140
3484 -2291140 -2673751 -2493151 -1906246 -1243711 -765017 -523843 -569006 -811749 -1015346 -1197589
3474 -1197589 -1385874 -1231161 -663007 -118942 208872 544525 1040580 1395976 1355227 1153030
3464 1153030 1242713 1798778 2574861 3057023 2905815 2455257 2045030 1803119 1871920 2099377
3454 2099377 1976207 1226969 186253 -602597 -868261 -740702 -580055 -604896 -680343 -626126
3444 -626126 -495579 -360157 14837 643359 1026779 819735 147915 -667955 -1359092 -1695196
$$ packed form
3513b166405R43426Q06152L85661l07014q62571p74269j38672O28186J020804
3504d64702R13411O28146L05126j77939n55640m49791q5678J07549P4168m8066
3494B46584l53253m98934k93266j35470P9608M41557L63148l07684r33734q99696
3484b291140l82611J80600N86905O62535M78694K41174m5163k42743k03597j82243
3474a197589j88285J54713N68154N44065L27814L35653M96055L55396m0749k02197
3464A153030Q9683N56065P76083M82162j51208m50558m10227k41911O8801K27457
3454B099377j23170p49238j040716p88850k65664J27559J60647k4841p5447N4217
3444f26126J30547J35422L74994O28522L83420k07044o71820q15870o91137l36104
$$ plain form
3434 -1695196 -1526399 -1020926 -637047 -584887 -636826 -433211 -73946 112418 274681 475268
3424 475268 402339 146247 -22247 -238477 -533755 -504807 -126422 226517 536589 957435
3414 957435 1334432 1245431 620413 18226 -234194 -486792 -938301 -1264982 -1129194 -705049
3404 -705049 -310865 18217 271955 499374 828343 1336148 1864355 2052296 1797339 1439310
3394 1439310 1270942 1341348 1640206 2039232 2300020 2104765 1437212 778918 651216 1057938
3384 1057938 1529413 1592881 1240923 956902 912787 774925 464254 334832 604356 1090847
3374 1090847 1422811 1342719 860177 55122 -838282 -1350708 -1358727 -1003946 -549963 -237411
3364 -237411 470 184141 251748 256502 -108498 -1305939 -2857880 -3863617 -4115544 -3956322
$$ packed form
3434a695196J68797N05473L83879N2160n1939K03615L59265J86364J62263K00587
3424D75268p2929k56092j68494k16230k95278K8948L78385L52939L10072M20846
3414I57435L76997q9001o25018o02187k52420k52598m51509l26681J35788M24145
3404g05049L94184L29082K53738K27419L28969N07805N28207J87941k54957l58029
3394A439310j68368P0406K98858L99026K60788j95255o67553o58294j27702M06722
3384A057938M71475O3468l51958k84021m4115j37862l10671j29422K69524M86491
3374A090847L31964q0092m82542q05055q93404n12426q019L54781M53983L12552
3364b37411K37881J83671O7607M754l65000j197441j551941j005737k51927J59222
$$ plain form
3354 -3956322 -3775960 -3690676 -3489826 -3182229 -2883632 -2616274 -2397657 -2182549 -1973312 -1815472
3344 -1815472 -1904394 -2285284 -2391325 -1805680 -872662 -205314 -30978 -131573 -479789 -1205272
3334 -1205272 -2027490 -2447961 -2478090 -2552946 -2769041 -2830119 -2594874 -2214590 -2074134 -2356456
3324 -2356456 -2738662 -2796809 -2300022 -1436255 -829243 -894333 -1447675 -2041449 -2242144 -1972837
3314 -1972837 -1514950 -901753 27810 1075580 1757455 1922140 1804201 1549321 1072644
3305 1072644 447065 -113371 -338770 -181556 136781 311572 176408 -126060 -571682 -1248393
3295 -1248393 -1863395 -2035032 -1850917 -1586497 -1291239 -909646 -523891 -248510 -272948 -650913
3285 -650913 -1121587 -1371593 -1211301 -775751 -294731 -31459 -4404 34738 191164 459723
$$ packed form
3354c956322J80362Q5284K00850L07597K98597K67358K18617K15108K09237J57840
3344a815472q8922l80890j06041N85645R33018O67348J74336j00595l48216p25483
3334a205272q22218m20471l0129p4856k16095o1078K35245L80284J40456k82322
3324b356456l82206n8147M96787Q63767O07012o5090n53342n93774k00695K69307
3314a972837M57887O13197R29563J047770O81875J64685j17939k54880m76677
3305A072644o25579n60436k25399J57214L18337J74791j35164l02468m45622o76711
3295a248393o15002j71637J84115K64420K95258L81593L85755K75381k4438l77965
3285f50913m70674k50006J60292M35550M81020K63272K7055L9142J56426K68559
$$ plain form
3275 459723 801824 1068454 1084697 874744 292345 -785805 -2088382 -3235035 -3830111
3266 -3830111 -3794272 -3526053 -3285713 -2791172 -1719468 -474034 233346 184517 -342088 -788358
3256 -788358 -800022 -457609 76821 621630 1005909 1189560 1241058 1076601 657496 122682
3246 122682 -395261 -848415 -1205569 -1411959 -1268308 -879645 -592267 -461302 -490453 -617191
3236 -617191 -719985 -815243 -908236 -1019804 -1118748 -1199802 -1358617 -1563896 -1671106 -1592200 -1488823
3225 -1488823 -1755184 -2390293 -2921532 -3056680 -2923093 -2752183 -2645702 -2531960 -2298258 -2067073
3215 -2067073 -1952733 -1769584 -1428031 -1046148 -757032 -578343 -495358 -390235 -190824 -155211
3205 -155211 -437997 -867926 -1344265 -1935230 -2549547 -2948570 -3019208 -2883254 -2891962 -3154603
$$ packed form
3275D59723L42101K66630J6243k09953n82399j078150j302577j146653n95076
3266c830111L5839K68219K40340M94541J071704J245434P07380m8829n26605m46270
3256g88358j1664L42413N34430N44809L84279J83651N1498j64457m19105n34814
3246A22682n17943m53154l57154k06390J43651L88663K87378J30965k9151j26738
3236f17191j02794r5258r2993j11568r8944q1054j58815k05279j07210P8906J03377
3225a488823k66361o35109n31239j35148J33587J70910J06481J13742K33702K31185
3215b067073J14340J83149L41553L81883K89116J78689Q2985J05123J99411L5613
3205a55211k82786m29929m76339n90965o14317l99023p0638J35954q708k62641
$$ plain form
3195 -3154603 -3334021 -3215168 -2770386 -2043490 -1262063 -707826 -387522 -198693 -228783 -280138
3185 -280138 -108110 330595 1143422 2250952 3242799 3785098 3903678 3572264 2794620 1702955
3175 1702955 433883 -806059 -1773142 -2366371 -2529292 -2163797 -1396089 -657288 -311572
3166 -311572 -362464 -459763 -274284 187424 765285 1283756 1560579 1453470 1053649 565843
3156 565843 -60108 -925055 -1777373 -2371288 -2696831 -2785406 -2630837 -2316301 -2010667 -1735712
3146 -1735712 -1576133 -1585138 -1648514 -1690069 -1687538 -1597833 -1435605 -1159991 -631580 62973 627151
3135 627151 880947 790056 611986 585147 716840 798516 579367 183681 -11523 -10264 41131
3124 41131 130639 80049 -61347 -275640 -767899 -1465695 -2270530 -3002012 -3232048 -2900587
$$ packed form
3195c154603j79418J18853M44782P26896P81427N54237L20304J88829l0090n1355
3185b80138J72028M38705Q12827J107530R91847N42299J18580l31414p77644j091665
3175A702955j269072j239942r67083n93229j62921L65495P67708P38801L45716
3166c11572n0892r7299J85479M61708N77861N18471K76823j07109l99821m87806
3156E65843o25951q64947q52318n93915l25543q8575J54569L14536L05634K74955
3146a735712J59579r005o3376m1555K531Q9705J62228K75614N28411O94553N64178
3135F27151K53796r0891j78070k6839J31693Q1676k19149l95686j95204J259N1395
3124D1131Q9508n0590j41396k14293m92259o97796q04835p31482k30036L31461
$$ plain form
3114 -2900587 -2457567 -2411697 -2888196 -3467740 -3747370 -3711199 -3448995 -3126708 -2919616 -2812763
3104 -2812763 -2691336 -2552989 -2449188 -2267428 -1990699 -1681819 -1303382 -788765 -245056 210844
3094 210844 603083 904616 878053 384541 -451464 -1328783 -1884848 -2106442 -2219748 -2388425
3084 -2388425 -2598499 -2584622 -2150774 -1398317 -631667 2148 614246 1144099 1367468 1214504
3074 1214504 819784 436946 313199 372036 347660 195647 -137033 -586224 -912862 -960690
3064 -960690 -759842 -658676 -1157902 -2321439 -3636099 -4429943 -4270018 -3411197 -2458093
3055 -2458093 -1723632 -1262862 -994920 -896712 -1170957 -1862140 -2684909 -3124292 -3018511 -3018018
3045 -3018018 -3650120 -4521743 -5012821 -4971683 -4573590 -3948378 -3226648 -2767445 -2730924 -2696754
$$ packed form
3114b900587M43020M5870m76499n79544k79630L6171K62204L22287K07092J06853
3104b812763J21427J38347J03801J81760K76729L08880L78437N14617N43709M55900
3094B10844L92239L01533k6563m93512q36005q77319n56065k21594j13306j68677
3084b388425k10074J3877M33848P52457P66650O33815O12098N29853K23369j52964
3074A214504l94720l82838j23747N8837k4376j52013l32680m49191l26638m7828
3064i60690K00848J01166m99226j163537j314660p93844J59925Q58821R53104
3055b458093P34461M60770K67942R8208k74245o91183q22769m39383J05781M93
3045c018018o32102q71623m91078M1138L98093O25212P21730M59203L6521L4170
$$ plain form
3035 -2696754 -2389855 -1909491 -1433686 -1124355 -972534 -808235 -541415 -65239 425055 691343
3025 691343 1054955 1645330 2121721 2389086 2556835 2616630 2510778 2224083 1741776 1075980
3015 1075980 486686 65635 -223674 -262859 -60048 175592 444986 916801 1408499 1625219
3005 1625219 1641068 1471162 1122272 942313 1100914 1269629 1102164 586439 126835 16028
2995 16028 49366 -155752 -516062 -667538 -684217 -726727 -665593 -503959 -445248 -474629 -315526
2984 -315526 71322 331795 273628 -40713 -557056 -1099659 -1391422 -1461556 -1448925 -1327054
2974 -1327054 -1066035 -685762 -190615 395241 995430 1360870 1474402 1657381 1864699 1667654
2964 1667654 1046483 310277 -242429 -339732 87990 683320 972001 882069 602567 205830
$$ packed form
3035b696754L06899M80364M75805L09331J51821J64299K66820M76176M90294K66288
3025F91343L63612N90375M76391K67365J67749N9795j05852k86695m82307o65796
3015A075980n89294m21051k89309l9185K02811K35640K69394M71815M91698K16720
3005A625219J5849j69906l48890j79959J58601J68715j67465n15725m59604j10807
2995A6028L3338k05118l60310j51476j6679m2510O1134J61634N8711k9381J59103
2984c15526L86848K60473n8167l14341n16343n42603k91763p0134J2631J21871
2974a327054K61019L80273M95147N85856O00189L65440J13532J82979K07318j97045
2964A667654o21171p36206n52706r7303M27722N95330K88681q9932k79502l96737
$$ plain form
2954 205830 -163012 -407348 -534230 -621858 -647261 -442713 -80611 262209 623032 952598
2944 952598 871519 85992 -1086023 -1889229 -1956558 -1577652 -1261551 -1203698 -1211476 -1141502 -958478
2933 -958478 -604727 -149253 222843 283202 -84874 -777524 -1495952 -2029474 -2240538 -1965833
2923 -1965833 -1498972 -1370264 -1534843 -1622819 -1557960 -1365985 -1066048 -658871 -105816 668589
2913 668589 1585526 2488462 3184565 3478899 3441387 3316310 3200683 2924318 2395856 1833456
2903 1833456 1523371 1554609 1782041 1865596 1677775 1418879 1325987 1595296 2295950 3087903
2893 3087903 3447753 3358340 3111585 2693296 2174991 1736939 1369114 997608 644087 429284
2883 429284 363079 259866 86794 -157653 -507115 -897062 -1267866 -1774477 -2452643 -3012564
$$ packed form
2954B05830l68842k44336j26882q7628k5403K04548L62102L42820L60823L29566
2944I52598q1079p85527j172015q03206o7329L78906L16101N7853p778O9974J83024
2933i58478L53751M55474L72096O0359l68076o92650p18428n33522k11064K74705
2923a965833M66861J28708j64579q7976O4859J91975K99937M07177N53055P74405
2913F68589R16937R02936O96103K94334l7512j25077j15627k76365n28462n62400
2903A833456l10085L1238K27432Q3555j87821k58896r2892K69309P00654P91953
2893C087903L59850q9413k46755m18289n18305m38052l67825l71506l53521k14803
2883D29284o6205j03213j73072k44447l49462l89947l70804n06611o78166n59921
$$ plain form
2873 -3012564 -3322547 -3379133 -3174036 -2809471 -2439727 -2145851 -2072863 -2259278 -2627479 -3000902
2863 -3000902 -3051349 -2807265 -2746682 -2987316 -3209844 -3242195 -2952705 -2355344 -1739165 -1355700
2853 -1355700 -1175029 -967785 -663133 -399104 -170966 6919 28844 13093 71610 7446
2843 7446 -248170 -531267 -831300 -1011541 -947845 -806329 -826448 -1013181 -1091062 -1115919 -1352117
2832 -1352117 -1663180 -1764244 -1577197 -1146875 -796775 -843205 -1088047 -1102116 -1014762 -1177971
2822 -1177971 -1449184 -1443727 -933218 -163223 420058 591335 549944 556338 530674 270561 -204070
2811 -204070 -797115 -1471421 -1866261 -1784498 -1723156 -2105190 -2573843 -2685575 -2614930 -2552656
2801 -2552656 -2257171 -1691329 -1057588 -419060 222644 801120 1186339 1246364 850847 78756
$$ packed form
2873c012564l09983n6586K05097L64565L69744K93876P2988j86415l68201l73423
2863c000902n0447K44084O0583k40634k22528l2351K89490N97361O16179L83465
2853a355700J80671K07244L04652K64029K28138J77885K1925j5751N8517o4164
2843G446k55616k83097l00033j80241O3696J41516k0119j86733p7881k4857k36198
2832a352117l11063j01064J87047M30322L50100m6430k44842j4069Q7354j63209
2822a177971k71213N457N10509P69995N83281J71277m1391O394k5664k60113m74631
2811b04070n93045o74306l94840Q1763O1342l82034m68653j11732P0645O2274
2801b552656K95485N65842O33741O38528O41704N78476L85219O0025l95517p72091
$$ plain form
2791 78756 -841348 -1695368 -2315274 -2633151 -2707371 -2628996 -2417782 -2028836 -1435815 -843328
2781 -843328 -559282 -657829 -970893 -1169736 -1309032 -1523377 -1747138 -1790652 -1475203 -1027022
2771 -1027022 -818966 -839203 -806114 -488472 171711 856145 1155144 1011709 652803 268608
2761 268608 -46245 -234661 -322160 -536733 -880317 -1023740 -954620 -833715 -661942 -393408
2751 -393408 -6181 462899 919557 1139006 1081699 917845 748455 694483 701554 541704
2741 541704 276422 -2618 -254988 -265808 28170 459073 783553 798715 679127 616514
2731 616514 444907 156479 -22266 34259 296845 600968 827739 1016996 1169745 1223422
2721 1223422 1203240 1087600 949582 1001388 1257728 1443716 1554237 1732120 2057722 2503960
$$ packed form
2791G8756r20104q54020o19906l17877p4220P8375K11214L88946N93021N92487
2781h43328K84046r8547l13064j98843j39296k14345k23761m3514L15449M48181
2771a027022K08056k0237L3089L17642O60183O84434K98999j43435l58906l84195
2761B68608l14853j88416q7499k14573l43584j43423O9120J20905J71773K68534
2751c93408L87227M69080M56658K19449n7307j63854j69390n3972P071j59850
2741E41704k65282k79040k52370j0820K93978M30903L24480J5162j19588o2613
2731F16514j71607k88428j78745N6525K62586L04123K26771J89257J52749N3677
2721A223422k0182j15640j38018N1806K56340J85988J10521J77883L25602M46238
$$ plain form
2711 2503960 2915727 3139511 2923541 2180287 1080416 -17884 -655095 -880108 -979094
2702 -979094 -1048551 -1045851 -726234 22679 1190501 2511948 3388885 3567066 3265211 2703558
2692 2703558 2226397 2077375 2068190 1963609 1779281 1574785 1554196 1689027 1563436 1069662
2682 1069662 557900 344268 284543 29544 -394436 -751597 -833890 -639295 -366431 -270591
2672 -270591 -272651 -120948 79769 173636 239150 375300 467360 532106 615323 542832 250295
2661 250295 -123841 -400876 -607216 -903994 -1316651 -1627900 -1600448 -1275714 -698371 154477
2651 154477 847202 937731 675901 542332 642852 789029 947455 1069081 962879 604813
2641 604813 196426 -9690 61326 180480 113361 -173342 -725626 -1333922 -1565360 -1238858
$$ packed form
2711B503960M11767K23784k15970p43254j099871j098300o37211k25013r8986
2702i79094o9457K700L19617P48913J167822J321447Q76937J78181l01855n61653
2692B703558m77161j49022r185j04581j84328k04496k0589J34831j25591m93774
2682A069662n11762k13632n9725k54999m23980l57161q2293J94595K72864R5840
2672b70591k060J51703K00717R3867O5514J36150R2060O4746Q3217p2491k92537
2661B50295l74136k77035k06340k96778m12657l11249K7452L24734N77343Q52848
2651A54477O92725R0529k61830j33569J00520J46177J58426J21626j06202l58066
2641F04813m08387k06116P1016J19154o7119k86703n52284o08296k31438L26502
$$ plain form
2631 -1238858 -561617 80731 470769 524992 422662 332310 81811 -381864 -868888 -1136428
2621 -1136428 -1113267 -1008995 -770363 -278443 161049 159651 -380607 -1098621 -1484486 -1361061
2611 -1361061 -810863 -34818 764667 1416752 1713240 1567451 1072175 623412 690461 1181707
2601 1181707 1531808 1390823 999183 810149 927725 1198877 1423010 1525267 1616763 1592858
2591 1592858 1310670 1053694 1047387 1013750 888450 911622 1011585 996357 852858 734271 736810
2580 736810 912786 1247517 1654070 1966463 1952445 1570786 975711 327651 -324723 -788063
2570 -788063 -929209 -922081 -1042909 -1296860 -1555739 -1634953 -1499362 -1404517 -1423555 -1403609 -1246180
2559 -1246180 -1021000 -916866 -1042612 -1337331 -1783656 -2205345 -2396857 -2383894 -2344861 -2437261
$$ packed form
2631a238858O77241O42348L90038N4223j02330r0352k50499m63675m87024k67540
2621a136428K3161J04272K38632M91920M39492j398n40258p18014l85865J23425
2611a361061N50198P76045P99485O52085K96488j45789m95276m48763O7049M91246
2601A181707L50101j40985l91640j89034J17576K71152K24133J02257R1496k3905
2591A592858k82188k56976o307l3637j25300K3172R9963j5228j43499j18587K539
2580G36810J75976L34731M06553L12393j4018l81659n95075o48060o52374m63340
2570g88063j41146P128j20828k53951k58879p9214J35591R4845j9038J9946J57429
2559a246180K25180J04134j25746k94719m46325m21689j91512J2963L9033r2400
$$ plain form
2549 -2437261 -2516743 -2383724 -2095237 -1708565 -1206951 -697071 -313492 -103556 146684 425360
2539 425360 492695 295679 -278800 -1206762 -2069547 -2425406 -1979877 -830232 582602 1780414
2529 1780414 2376465 2317357 1858599 1438036 1315707 1655772 2337484 2933092 3321155 3518276
2519 3518276 3557063 3613298 3839917 3954254 3501885 2508358 1470550 803891 507190 433773
2509 433773 465115 456630 381160 350165 266898 -16618 -290153 -281547 -25714 341181 435365
2498 435365 21445 -523208 -702974 -509092 -381499 -654520 -1209017 -1798514 -2175639 -2331623
2488 -2331623 -2342567 -2181886 -1901826 -1669554 -1471897 -1308724 -1347191 -1485857 -1486364 -1456381 -1504667
2477 -1504667 -1529167 -1504475 -1230190 -469745 607983 1705280 2604052 3210727 3576727 3632780
$$ packed form
2549b437261p9482J33019K88487L86672N01614N09880L83579K09936K50240K78676
2539D25360O7335j97016n74479r27962q62785l55859M45529J149645J412834J197812
2529A780414N96051n9108m58758m20563j22329L40065O81712N95608L88063J97121
2519C518276L8787N6235K26619J14337m52369r93527j037808o66659k96701p3417
2509D33773L1342q485p5470l0995q3267k83516k73535Q606K55833L66895R4184
2498D35365m13920n44653j79766J93882J27593k73021n54497n89497l77125j55984
2488b331623j0944J60681K80060K32272J97657J63173l8467j38666n07K9983m8286
2477a504667k4500K4692K74285P60445J077728J097297Q98772O06675L66000N6053
$$ plain form
2467 3632780 3364629 2987944 2756301 2641929 2473070 2239715 2122128 2007119 1500616 789070
2457 789070 434224 561575 982984 1567181 2166806 2555832 2630188 2419039 1924877 1306213
2447 1306213 792973 325736 -274103 -943065 -1237813 -1096489 -998701 -1027973 -893726 -400864
2437 -400864 216675 640195 813549 724707 456122 255592 322630 657299 891853 775495
2427 775495 332704 -327647 -874040 -1176971 -1254730 -1249660 -1349100 -1518188 -1701111 -1755750 -1435997
2416 -1435997 -650551 328172 1176899 1861404 2318654 2301411 1935047 1741118 1832469 1909366
2406 1909366 1690188 1095131 289063 -406041 -891621 -1282028 -1487240 -1386543 -1044753 -619578
2396 -619578 -132578 497678 1240535 1774272 1738601 1271417 789474 498253 459845 967571
$$ packed form
2467C632780k68151l76685k31643j14372j68859k33355j17587j15009n06503p11546
2457G89070l54846J27351M21409N84197N99625L89026P4356k11149m94162o18664
2447A306213n13240m67237n99839o68962k94748J41324R7788k9272J34247M92862
2437d00864O17539M23520J73354q8842k68585k00530O7038L34669K34554j16358
2427G75495m42791o60351n46393l02931p7759N070r9440j69088j82923n4639L19753
2416a435997P85446R78723Q48727O84505M57250j7243l66364j93929R1351P6897
2406A909366k19178n95057q06068o95104m85580l90407k05212J00697L41790M25175
2396f19578M87000O30256P42857N33737l5671m67184m81943k91221l8408N07726
$$ plain form
2386 967571 2047629 3324538 4276539 4442153 3843675 2971929 2156260 1307608 488800
2377 488800 -61492 -335136 -465029 -503807 -471436 -474899 -714448 -1274969 -1939721 -2468287
2367 -2468287 -2737097 -2759697 -2571488 -2155385 -1885292 -2064800 -2397444 -2479330 -2278540 -1903126
2357 -1903126 -1390348 -911323 -728366 -747043 -722513 -657630 -541502 -171515 529526 1122039
2347 1122039 1112550 574423 -156194 -844310 -1139839 -797857 -78521 403100 545393 585409
2337 585409 635484 734471 1032639 1548762 2120798 2651586 3030781 3177874 3122790 2897628
2327 2897628 2719095 2818930 2860559 2465731 1800919 1157965 722354 526611 486499 396517
2317 396517 96928 -265361 -363210 -162124 -97605 -517313 -1145227 -1570418 -1722792 -1752048
$$ packed form
2386I67571J080058J276909R52001J65614n98478q71746q15669q48652q18808
2377D88800n50292k73644j29893l8778L2371l463k39549n60521o64752n28566
2367b468287k68810k2600J88209M16103K70093j79508l32644q1886K00790L75414
2357a903126N12778M79025J82957j8677K4530O4883J16128L69987P01041N92513
2347A122039r489n38127p30617o88116k95529L41982P19336M81621J42293M0016
2337E85409N0075R8987K98168N16123N72036N30788L79195J47093n5084k25162
2327B897628j78533R9835M1629l94828o64812o42954m35611j95743m0112q9982
2317C96517k99589l62289r7849K01086O4519m19708o27914m25191j52374k9256
$$ plain form
2307 -1752048 -1784181 -1790063 -1761391 -1731119 -1772279 -1788983 -1593812 -1190925 -697218 -344175 -406803
2296 -406803 -799808 -1196118 -1420234 -1663536 -2092701 -2490203 -2716724 -2688984 -2405856 -2130837
2286 -2130837 -1905387 -1661546 -1607905 -1708833 -1739524 -1844831 -2021985 -2046943 -1968139 -2023102
2276 -2023102 -2229167 -2235712 -1858732 -1425512 -1118993 -891652 -798943 -753890 -576239 -147910
2266 -147910 558685 1347900 1947786 2377735 2661253 2668855 2375848 1795815 1192896 961919
2256 961919 1101019 1379560 1751286 2083316 2128703 2038051 2083731 2056894 1729929 1212063
2246 1212063 807789 726949 1034251 1559843 2008212 2214164 2357603 2521350 2538113 2411657
2236 2411657 2162514 1872882 1510355 942505 198234 -460905 -878407 -1182882 -1579865 -2005281
$$ packed form
2307a752048l2133n882K8672L0272m1160j6704J95171M02887M93707L53043o2628
2296d06803l93005l96310k24116k43302m29165l97502k26521K7740K83128K75019
2286b130837K25450K43841N3641j00928l0691j05307j77154k4958P8804n4963
2276b023102k06065o545L76980M33220L06519K27341R2709M5053J77651M28329
2266a47910P06595P89215N99886M29949K83518P602k93007n80033o02919k30977
2256I61919J39100K78541L71726L32030M5387r0652M5680k6837l26965n17866
2246A212063m04274q0840L07302N25592M48369K05952J43439J63747J6763j26456
2236B411657k49143k89632l62527n67850p44271o59139m17502l04475l96983m25416
$$ plain form
2226 -2005281 -2123465 -1939091 -1773817 -1682110 -1462935 -1035012 -630966 -377316 -86730 242031
2216 242031 361224 238111 53419 -148839 -421434 -795644 -1167367 -1521691 -1833264 -1897854
2206 -1897854 -1798395 -1883911 -2191332 -2376210 -2231219 -1948953 -1632778 -1208566 -749888 -251703
2196 -251703 330861 761716 739843 320245 65593 256887 570297 731805 935425 1307511
2186 1307511 1580719 1545480 1263582 1066675 1022320 992173 1081729 1201615 1261746 1539238
2176 1539238 1974443 2294156 2619179 3180043 3935814 4850055 5791957 6226015 5698591 4472189
2166 4472189 3161355 1973068 789661 -355802 -1246196 -1888619 -2436313 -2751569 -2844101
2157 -2844101 -2976369 -3141779 -3225903 -3333200 -3499233 -3524903 -3276719 -2781370 -2233532 -1655794
$$ packed form
2226b005281j18184J84374J65274R1707K19175M27923M04046K53650K90586L28761
2216B42031J19193j23113j84692k02258k72595l74210l71723l54324l11573o4590
2206a897854R9459q5516l07421j84878J44991K82266L16175M24212M58678M98185
2196b51703N82564M30855k1873m19598k54652J91294L13410J61508K03620L72086
2186A307511K73208l5239k81898j96907m4355l0147Q9556J19886O0131K77492
2176A539238M35205L19713L25023N60864P55771R14241R41902M34058n27424j226402
2166D472189j310834j188287j183407j145463q90394o42423n47694l15256r2532
2157b844101j32268j65410q4124j07297j66033k5670K48184M95349N47838N77738
$$ plain form
2147 -1655794 -864169 43725 663078 910033 1157328 1608250 2014987 1934212 1436683 950442
2137 950442 562812 352948 413106 610947 864379 1305625 1800917 2046671 2127480 2236246
2127 2236246 2489251 2849649 3038612 3038338 3151289 3692314 4535692 5322152 5907627 6142475
2117 6142475 5941662 5411246 4735171 4105757 3635704 3371744 3175732 2996443 3029512 3160771
2107 3160771 3045440 2565322 1877001 1312314 1106815 1122652 1150556 1329680 1764642 2194755
2097 2194755 2257671 2011961 1883429 2040652 2171243 2038868 1760505 1508191 1369493 1307150
2087 1307150 1344819 1502267 1722669 1953176 1951228 1709822 1504979 1367074 1208133 1105127
2077 1105127 1100419 1002210 630197 185128 131492 442576 698851 639044 313389 -138150
$$ packed form
2147a655794P91625R07894O19353K46955K47295M50922M06737q0775m97529m86241
2137I50442l87630k09864O0158J97841K53432M41246M95292K45754Q0809J08766
2127B236246K53005L60398J88963k74J12951N41025Q43378P86460N85475K34848
2117F142475k00813n30416o76075o29414m70053k63960j96012j79289L3069J31259
2107C160771j15331m80118o88321n64687k05499J5837K7904J79124M34962M30113
2097B194755O2916k45710j28532J57223J30591j32375k78363k52314j38698o2343
2087A307150L7669J57448K20402K30507j948k41406k04843j37905j58941j03006
2077A105127m708r8209l72013m45069n3636L11084K56275n9807l25655m51539
$$ plain form
2067 -138150 -583926 -971807 -1323898 -1595296 -1681284 -1545918 -1388793 -1420894 -1593426 -1677497
2057 -1677497 -1567595 -1330752 -1099843 -949945 -979694 -1095071 -1129745 -1251584 -1442911 -1548612
2047 -1548612 -1720537 -1947085 -2040974 -2001412 -1907115 -1778714 -1609183 -1379107 -1138258 -1113072
2037 -1113072 -1355850 -1632598 -1762028 -2009873 -2456316 -2744297 -2610520 -2122984 -1660697 -1428200
2027 -1428200 -1228641 -889767 -427556 93040 578227 1002230 1371896 1674454 1715414 1428669
2017 1428669 1097877 1067741 1306385 1491317 1510605 1490661 1775196 2514703 3300003 3841584
2007 3841584 4269485 4484741 4120918 3211321 2184569 1474318 1298835 1557688 2018094
1998 2018094 2439123 2784777 2894064 2677930 2343882 2143847 2069179 1903621 1612092 1393453
$$ packed form
2067a38150m45776l87881l52091k71398q5988J35366J57125l2101j72532q4071
2057a677497J09902K36843K30909J49898k9749j15377l4674j21839j91327j05701
2047a548612j71925k26548r3889L9562R4297J28401J69531K30076K40849K5186
2037a113072k42778k76748j29430k47845m46443k87981J33777M87536M62287K32497
2027a428200J99559L38874M62211N20596M85187M24003L69666L02558M0960k86745
2017A428669l30792l0136K38644J84932J9288j9944K84535P39507P85300N41581
2007C841584M27901K15256l63823r09597j026752p10251j75483K58853M60406
1998B018094M21029L45654J09287k16134l34048k00035p4668j65558k91529k18639
$$ plain form
1988 1393453 1219903 1020696 988365 1121352 1175625 952437 347346 -402660 -992662 -1475994
1978 -1475994 -1954919 -2501586 -2924365 -2977197 -2824080 -2556787 -2243939 -2022892 -1703147 -998150
1968 -998150 -126450 428648 602211 644323 604285 476637 412544 425442 459793 611274 901646
1957 901646 1043945 892698 738503 726183 704787 646912 558913 345726 180875 270313 432999
1946 432999 307374 -151826 -502616 -437743 -178129 15254 167288 354950 405301 220822
1936 220822 92698 342448 923865 1403063 1535081 1454464 1296756 1027051 440117 -442969
1926 -442969 -1183496 -1273251 -810904 -430022 -375045 -412132 -317180 -190258 -139815 -271248 -540930
1915 -540930 -621108 -470385 -420963 -558382 -872047 -1495138 -2090284 -2245330 -1973527 -1366481
$$ packed form
1988A393453j73550j99207l2331J32987N4273k23188o05091p50006n90002m83332
1978a475994m78925n46667m22779n2832J53117K67293L12848K21047L19745P04997
1968i98150Q71700N55098J73563M2112m0038j27648o4093J2898L4351J51481K90372
1957I01646J42299j51247j54195j2320k1396n7875q7999k13187j64851Q9438J62686
1946D32999j25625m59200l50790O4873K59614J93383J52034J87662N0351j84479
1936B20822j28124K49750N81417M79198J32018q0617j57708k69705n86934q83086
1926d42969p40527q9755M62347L80882N4977l7087R4952J26922N0443j31433k69682
1915e40930q0178J50723M9422j37419l13665o23091n95146j55046K71803O07046
$$ plain form
1905 -1366481 -584634 83130 453338 594622 858611 1303274 1638189 1812733 1866960 1825294
1895 1825294 1720205 1602198 1571639 1453826 1152919 815995 507682 106385 -205081 -5607
1885 -5607 484686 641086 340127 -193857 -781758 -1082758 -850077 -350796 -50790 -112107
1875 -112107 -357202 -531323 -640918 -632345 -345191 290919 1185393 2043740 2611125 2886730
1865 2886730 2914174 2773443 2537394 2146161 1710126 1635715 1785702 1559064 941848 300043
1855 300043 -75926 -26026 323606 745894 975763 915542 790146 662824 569257 691787
1845 691787 828658 603446 48437 -415491 -531175 -438344 -198259 198359 729641 1364310
1835 1364310 1977998 2455223 2659488 2561110 2342374 2205875 1887967 1158345 458038 123017
$$ packed form
1905a366481P81847O67764L70208J41284K63989M44663L34915J74544N4227m1666
1895A825294j05089j18007l0559j17813l00907l36924l08313m01297l11466J99474
1885e607M90293J56400l00959n33984n87901l01000K32681M99281L00006o1317
1875a12107k45095j74121j09595Q573K87154O36110Q94474Q58347N67385K75605
1865B886730K7444j40731k36049l91233m36035p4411J49987k26638o17216o41805
1855C00043l75969M9900L49632M22288K29869o0221j25396j27322r3567J22530
1845F91787J36871k25212n55009m63928j15684R2831K40085L96618N31282O34669
1835A364310O13688M77225K04265r8378k18736j36499l17908p29622p00307l35021
$$ plain form
1825 123017 2702 -745 258927 804283 1372642 1746033 1762090 1347866 763394 308456
1815 308456 80120 278890 1020546 1890603 2380423 2503132 2343742 1780599 855015 -238467
1805 -238467 -1051685 -1320432 -1192769 -956699 -811664 -547383 100125 1101865 2127281
1796 2127281 2849929 3248330 3359638 3095053 2602266 2145355 1871291 1780772 1755074 1851747
1786 1851747 2181738 2740535 3327876 3633702 3600478 3391901 3069965 2587101 1954710 1249752
1776 1249752 481314 -200539 -519132 -586916 -673605 -1000278 -1564562 -2077986 -2386836 -2542482
1766 -2542482 -2393521 -1753991 -717500 334494 967954 1121307 1018989 770279 330552
1757 330552 -129351 -306471 -294253 -435319 -732445 -960834 -1048644 -1047152 -1162849 -1434164
$$ packed form
1825A23017j20315l447K59672N45356N68359L73391J6057m14224n84472m54938
1815C08456k28336J98770P41656Q70057M89820J22709j59390n63143r25584j093482
1805b38467q13218k68747J27663K36070J45035K64281O47508J001740J025416
1796B127281P22648L98401J11308k64585m92787m56911k74064r0519k5698R6673
1786A851747L29991N58797N87341L05826l3224k08577l21936m82864o32391p04958
1776A249752p68438o81853l18593o7784q6689l26673n64284n13424l08850j55646
1766b542482J48961O39530J036491J051994O33460J53353j02318k48710m39727
1757C30552m59903j77120J2218j41066k97126k28389q7810J492j15697k71315
$$ plain form
1747 -1434164 -1700891 -1787178 -1322755 -344489 521429 952114 1215010 1564081 1880578 1791272
1737 1791272 1281759 673980 77057 -619023 -1315983 -1743661 -1859125 -1648926 -956884 117885
1727 117885 1163602 1872848 2079609 1865331 1583178 1621722 2001279 2385862 2380842 1890080
1717 1890080 1293144 977658 1013309 1089084 850404 401565 55917 -130022 -118134 138880
1707 138880 372083 40763 -891915 -1797187 -2088674 -1856147 -1490856 -1106511 -810846 -694852
1697 -694852 -592429 -430545 -377263 -584448 -1023601 -1527588 -1795243 -1633479 -1215542 -626304
1687 -626304 131303 887083 1364452 1394337 1094811 767750 667591 798948 1006783 1187676
1677 1187676 1110774 622977 78266 -109597 -78850 -252780 -500532 -490091 -150064 442994
$$ packed form
1747a434164k66727q6287M64423R78266Q65918M30685K62896L49071L16497q9306
1737A791272n09513o07779n96923o96080o96960m27678j15464K10199O92042J074769
1727A17885J045717P09246K06761k14278k82153L8544L79557L84583n020m90762
1717A890080n96936l15486L5651P5775k38680m48839l45648j85939J1888K57014
1707A38880K33203l31320r32678r05272k91487K32527L65291L84345K95665J15994
1697f94852J02423J61884N3282k07185m39153n03987k67655J61764M17937N89238
1687f26304P57607P55780M77369K9885k99526l27061j00159J31357K07835J80893
1677A187676p6902m87797n44711j87863L0747j73930k47752J0441L40027N93058
$$ plain form
1667 442994 984089 1197461 1097756 792987 499037 521725 851159 1300834 1727073 1989573
1657 1989573 2154894 2190232 2028786 1830354 1644078 1443365 1277792 1231708 1228757 1113694
1647 1113694 1065402 1277955 1387692 1014205 518283 279705 190882 61502 -285150 -774346
1637 -774346 -1157603 -1254345 -887426 -34939 1036580 1950700 2360361 2120468 1402491 703386
1627 703386 456585 599781 887839 1033299 838735 522632 411127 531137 736350 899830
1617 899830 970886 954343 911012 744191 297678 -338172 -865308 -1001855 -769812 -406776
1607 -406776 -65112 319748 890780 1548508 1993802 2135813 2117280 1955933 1555981 992952
1597 992952 351008 -343842 -944861 -1135024 -758238 -182983 99672 77242 -7466 -140926
$$ packed form
1667D42994N41095K13372r9705l04769k93950K2688L29434M49675M26239K62500
1657A989573J65321L5338j61446j98432j86276k00713j65573m6084k951j15063
1647A113694m8292K12553J09737l73487m95922k38578q8823j29380l46652m89196
1637g74346l83257r6742L66919Q52487J071519R14120M09661k39893p17977o99105
1627G03386k46801J43196K88058J45460j94564l16103j11505J20010K05213J63480
1617H99830P1056j6543m3331j66821m46513o35850n27136j36547K32043L63036
1607d06776L41664L84860N71032O57728M45294J42011j8533j61347l99952n63029
1597I92952o41944o94850o01019j90163L76786N75255K82655k2430q4708j33460
$$ plain form
1587 -140926 -473631 -944641 -1410060 -1810874 -1869438 -1363468 -679793 -334007 -296897 -177015
1577 -177015 149295 470855 634024 716933 806823 973077 1258624 1555974 1768362 1945681
1567 1945681 1990196 1601022 758959 -163845 -841771 -1166999 -1126027 -670484 128916 847042
1557 847042 1118504 931429 375770 -253072 -622154 -922394 -1370137 -1713949 -1650653 -1243145
1547 -1243145 -827992 -623474 -701543 -1113023 -1557642 -1633864 -1360215 -1047490 -738603 -343629
1537 -343629 200989 770840 1124002 1146617 605736 -277018 -889393 -1123089 -1233782 -1405366
1527 -1405366 -1643409 -1836239 -1890743 -1749402 -1460102 -1086343 -749791 -591814 -727762 -1049189
1517 -1049189 -1218759 -1104614 -810914 -611252 -746040 -1178706 -1673587 -2059898 -2419628 -2767048
$$ packed form
1587a40926l32705m71010m65419m00814n8564N05970O83675L45786L7110J19882
1577a77015L26310L21560J63169Q2909Q9890J66254K85547K97350K12388J77319
1567A945681M4515l89174q42063r22804o77926l25228M0972M55543P99400P18126
1557H47042K71462j87075n55659o28842l69082l00240m47743l43812O3296M07508
1547a243145M15153K04518p8069m11480m44619p6222K73649L12725L08887L94974
1537c43629N44618N69851L53162K2615n40881q82754o12375k33696j10693j71584
1527a405366k38043j92830n4504J41341K89300L73759L36552J57977j35948l21427
1517a049189j69570J14145K93700J99662j34788m32666m94881l86311l59730l47420
$$ plain form
1507 -2767048 -2816998 -2431001 -1952237 -1675276 -1597733 -1783556 -2030521 -1945386 -1562850 -1239471
1497 -1239471 -1189514 -1323147 -1408567 -1388088 -1451103 -1582694 -1722032 -1718231 -1464452 -1090587 -691793
1486 -691793 -409978 -331465 -330022 -397204 -792824 -1566998 -2339561 -2743802 -2848585 -2987869
1476 -2987869 -3174519 -3140282 -2829126 -2496649 -2408875 -2434995 -2296278 -1953961 -1506979 -910747
1466 -910747 -134676 565582 969392 1234739 1672085 2357319 3006404 3201795 2874313 2407435
1456 2407435 2115063 2055179 2063024 1878699 1384602 827876 442195 95272 -339869 -680788
1446 -680788 -719226 -492474 -274246 -375921 -821301 -1322870 -1572102 -1332709 -718511 43407
1436 43407 900871 1764479 2532323 3035645 3067052 2581800 1644358 479889 -567532 -1316799
$$ packed form
1507b767048m9950L85997M78764K76961P7543j85823k46965Q5135L82536L23379
1497a239471M9957j33633q5420K0479o3015j31591j39338L801K53779L73865L98794
1486f91793K81815P8513J443o7182l95620p74174p72563m04241j04783j39284
1476b987869j86650L4237L11156L32477Q7774k6120J38717L42317M46982N96232
1466i10747P76071P00258M03810K65347M37346O85234O49085J95391l27482m66878
1456B407435k92372n9884P845j84325m94097n56726l85681l46923m35141l40919
1446f80788l8438K26752K18228j01675m45380n01569k49232K39393O14198P61918
1436D3407Q57464Q63608P67844N03322L1407m85252r37442j164469j047421p49267
$$ plain form
1426 -1316799 -1831799 -2133729 -2090256 -1795043 -1273559 -562590 54641 408089 623436 806671
1416 806671 892946 1187707 1984374 2872300 3306862 3365400 3355103 3087048 2299928 1205940
1406 1205940 222701 -392529 -680638 -891615 -1137976 -1321577 -1353663 -1239494 -1105803 -1233504
1396 -1233504 -1621058 -1877729 -1914619 -1975811 -2130853 -2114241 -1688889 -1001245 -445002 -264699
1386 -264699 -358780 -524553 -717491 -804496 -556678 35705 712764 1098957 985375 553315
1376 553315 239002 308398 736877 1246070 1494819 1363388 947796 325824 -378043 -789440
1366 -789440 -662786 -76885 743257 1460753 1851877 1806162 1409265 933084 618449 457338
1356 457338 158439 -606479 -1797525 -2919570 -3576205 -3733430 -3614885 -3509775 -3575241 -3734583
$$ packed form
1426a316799n15000l01930M3473K95213N21484P10969O17231L53448K15347J83235
1416H06671Q6275K94761P96667Q87926M34562N8538j0297k68055p87120j093988
1406A205940r83239o15230k88109k10977k46361j83601l2086J14169J33691j27701
1396a233504l87554k56671l6890o1192j55042J6612M25352O87644N56243J80303
1386b64699r4081j65773j92938q7005K47818N92383O77059L86193j13582m32060
1376E53315l14313O9396M28479N09193K48749j31431m15592o21972p03867m11397
1366g89440J26654N85901Q20142P17496L91124m5715l96897m76181l14635j61111
1356D57338k98899p64918j191046j122045o56635j57225J18545J05110o5466j59342
$$ plain form
1346 -3734583 -3732512 -3272920 -2463147 -1642057 -809128 15184 647325 840337 317614 -657878
$$ packed form
1346c734583K071M59592Q09773Q21090Q32929Q24312O32141J93012n22723r75492
$$ [...]
##END NTUPLES=NMR SPECTRUM
##END=
