##TITLE=C13_DE-75K3 TFA
 CDCl3, 22100sc

 24.12.2024
##JCAMPDX= 6.0         $$ Bruker NMR JCAMP-DX V2.0
##DATA TYPE= NMR SPECTRUM
##DATA CLASS= NTUPLES
##ORIGIN= UXNMR, Bruker Analytische Messtechnik GmbH
##OWNER= root
$$ XWIN-NMR		Version 3.5
$$ Fri Dec 27 13:43:59 2024 Russian Standard Time (UT+4h)  she@DPX200
##.OBSERVE FREQUENCY= 50.327896
##.OBSERVE NUCLEUS= ^13C
##.ACQUISITION MODE= SIMULTANEOUS
##.ACQUISITION SCHEME= undefined
##.AVERAGES= 22101
##.DIGITISER RES= 17
##SPECTROMETER/DATA SYSTEM= spect
##.PULSE SEQUENCE= zgpg30
##.SOLVENT NAME= D2O
##.SHIFT REFERENCE= (INTERNAL, D2O, 0, 222.565)
##AUDIT TRAIL= $$ (NUMBER, WHEN, WHO, WHERE, WHAT)
$$ ##TITLE= Audit trail, XWIN-NMR		Version 3.5
$$ ##JCAMPDX= 5.01
$$ ##ORIGIN= Bruker BioSpin GmbH
$$ ##OWNER= she
$$ F:/spectra/data/she/nmr/c13/1/pdata/1/auditp.txt
$$ ##AUDIT TRAIL=  $$ (NUMBER, WHEN, WHO, WHERE, WHAT)
(   1,<2024-12-27 13:41:23.43 +0400>,<she>,<DPX200>,
      <created by zg, POWCHK disabled, PULCHK disabled
       terminated by command 'halt'
       configuration hash MD5:
       00 E9 B6 7A A2 85 ED C7 34 08 36 98 17 FE 4E 26
       data hash MD5: 32K
       3A D6 DF D2 D9 91 0E 39 00 D8 F4 52 33 D7 D0 7B>)
(   2,<2024-12-27 13:41:30.17 +0400>,<she>,<DPX200>,
      <Start of raw data processing
       efp BC_mod = 2 LB = 2 FT_mod = 6 PKNL = 1 PHC0 = -397.8742 PHC1 = 23.88833 SI = 32K 
       data hash MD5: 32K
       69 E1 00 59 14 41 00 5E 6A 42 44 71 17 62 D7 88>)
(   3,<2024-12-27 13:41:36.03 +0400>,<she>,<DPX200>,
      <abs ABSG = 5 
       data hash MD5: 32K
       6E 91 E7 67 33 4A D3 C8 B2 47 42 59 99 9A A6 F9>)
(   4,<2024-12-27 13:41:56.21 +0400>,<she>,<DPX200>,
      <pk PHC0 = -8.575172 PHC1 = -8.400004 
       data hash MD5: 32K
       A2 58 5C 1F 98 D9 81 9B 96 A4 8C 49 37 D8 02 A3>)
(   5,<2024-12-27 13:42:00.00 +0400>,<she>,<DPX200>,
      <abs ABSG = 5 
       data hash MD5: 32K
       FC 06 87 EE 08 CD C7 2B 62 B4 7B 1B 16 30 CF DD>)
(   6,<2024-12-27 13:42:28.34 +0400>,<she>,<DPX200>,
      <pk PHC0 = -0.1368331 PHC1 = 7.799998 
       data hash MD5: 32K
       7D AD FD 54 49 A1 CA 92 41 0D 2E D5 B7 86 13 68>)
(   7,<2024-12-27 13:42:31.54 +0400>,<she>,<DPX200>,
      <abs ABSG = 5 
       data hash MD5: 32K
       BA 2C C4 AF 39 7A 93 FE 04 23 56 A3 4F 5F D8 BF>)
$$ ##END=
$$ 
$$ hash MD5
$$ FC BD 90 B1 8E 50 91 66 3C 47 AA 7F 2D 48 2C 7C
##$RELAX= 
##$RELAX= 
##$RELAX= 
##$RELAX= 
##$RELAX= 
##$RELAX= 
##$RELAX= 
##$RELAX= 
$$ Bruker specific parameters
$$ --------------------------
##$DU= <F:/spectra>
##$EXPNO= 1
##$NAME= <c13>
##$PROCNO= 1
##$TYPE= <nmr>
##$USER= <she>
##$AMP= (0..31)
100 100 100 100 100 100 100 100 100 100 100 100 100 100 100 100 100 100 
100 100 100 100 100 100 100 100 100 100 100 100 100 100 
##$AQSEQ= 0
##$AQ_mod= 1
##$AUNM= <au_zg>
##$AUTOPOS= <>
##$BF1= 50.322709
##$BF2= 200.13
##$BF3= 50.322709
##$BF4= 500.13
##$BF5= 500.13
##$BF6= 500.13
##$BF7= 500.13
##$BF8= 500.13
##$BYTORDA= 1
##$CFDGTYP= 0
##$CFRGTYP= 5
##$CHEMSTR= <none>
$$ [...]
##$SUBNAM4= <"">
##$SUBNAM5= <"">
##$SUBNAM6= <"">
##$SUBNAM7= <"">
##$SUBNAM8= <"">
##$SUBNAM9= <"">
##$SW= 239.972175391363
##$SWIBOX= (0..15)
0 1 3 0 0 0 0 0 0 0 0 0 0 0 0 0 
##$SW_h= 12077.2946859903
##$TD= 32768
##$TD0= 1
##$TE= 0
##$TE2= 300
##$TE3= 300
##$TEG= 300
##$TL= (0..7)
120 120 120 120 120 120 120 120 
##$TP= (0..7)
150 150 150 150 150 150 150 150 
##$TP07= 0
##$TPNAME0= <>
##$TPNAME1= <>
##$TPNAME2= <>
##$TPNAME3= <>
##$TPNAME4= <>
##$TPNAME5= <>
##$TPNAME6= <>
##$TPNAME7= <>
##$TPOAL= (0..7)
0.5 0.5 0.5 0.5 0.5 0.5 0.5 0.5 
##$TPOFFS= (0..7)
0 0 0 0 0 0 0 0 
##$TUNHIN= 0
##$TUNHOUT= 0
##$TUNXOUT= 0
##$USERA1= <user>
##$USERA2= <user>
##$USERA3= <user>
##$USERA4= <user>
##$USERA5= <user>
##$V9= 5
##$VALIST= <valist>
##$VCLIST= <CCCCCCCCCCCCCCC>
##$VD= 0
##$VDLIST= <DDDDDDDDDDDDDDD>
##$VPLIST= <PPPPPPPPPPPPPPP>
##$VTLIST= <TTTTTTTTTTTTTTT>
##$WBST= 1024
##$WBSW= 4
##$XGAIN= (0..3)
0 0 0 0 
##$XL= 0
##$YL= 0
##$YMAX_a= 120225200
##$YMIN_a= -36915213
##$ZGOPTNS= <>
##$ZL1= 120
##$ZL2= 120
##$ZL3= 120
##$ZL4= 120
##$ABSF1= 222.5654
##$ABSF2= -17.4314
##$ABSG= 5
##$ABSL= 3
##$ALPHA= 0
##$AQORDER= 0
##$ASSFAC= 0
##$ASSFACI= 0
##$ASSFACX= 0
##$ASSWID= 0
##$AUNMP= <proc_1d>
##$AZFE= 0.1
##$AZFW= 0.5
##$BCFW= 0
##$BC_mod= 2
##$BYTORDP= 0
##$COROFFS= 0
##$CY= -3
##$DATMOD= 1
##$DC= 0
##$DFILT= <>
##$DTYPP= 0
##$F1P= 0
##$F2P= 0
##$FCOR= 0.5
##$FTSIZE= 32768
##$FT_mod= 6
##$GAMMA= 0
##$GB= 0
##$INTBC= 1
##$INTSCL= 4.134877e-10
##$ISEN= 128
##$LB= 2
##$LEV0= 0
##$LPBIN= 0
##$MAXI= 10000
##$MC2= 0
##$MEAN= 0
##$ME_mod= 0
##$MI= 0.1934396
##$NCOEF= 0
##$NC_proc= 0
##$NLEV= 6
##$NOISF1= 120.0001
##$NOISF2= 80.00006
##$NSP= 0
##$NTH_PI= 0
##$NZP= 0
##$OFFSET= 222.5654
##$PC= 1.4
##$PHC0= -406.5862
##$PHC1= 23.28833
##$PH_mod= 1
##$PKNL= yes
##$PPARMOD= 0
##$PSCAL= 0
##$PSIGN= 0
##$REVERSE= no
##$SF= 50.3227345484362
##$SI= 32768
##$SIGF1= 140
##$SIGF2= 120
##$SINO= 11.81781
##$SIOLD= 32768
##$SREGLST= <13C.CDCl3>
##$SSB= 0
##$STSI= 32768
##$STSR= 0
##$SW_p= 12077.2946859903
##$SYMM= 0
##$S_DEV= 0
##$TDeff= 32768
##$TDoff= 0
##$TI= <>
##$TILT= no
##$TM1= 0
##$TM2= 0
##$TOPLEV= 0
##$USERP1= <user>
##$USERP2= <user>
##$USERP3= <user>
##$USERP4= <user>
##$USERP5= <user>
##$WDW= 1
##$XDIM= 32768
##$YMAX_p= 320701359
##$YMIN_p= -9856709
$$ End of Bruker specific parameters
$$ ---------------------------------
##NTUPLES= NMR SPECTRUM
##VAR_NAME=  FREQUENCY,     SPECTRUM/REAL,   SPECTRUM/IMAG
##SYMBOL=    X,             R,               I
##VAR_TYPE=  INDEPENDENT,   DEPENDENT,       DEPENDENT
##VAR_FORM=  AFFN,          ASDF,            ASDF
##VAR_DIM=   32768,         32768,           32768
##UNITS=     HZ,            ARBITRARY UNITS, ARBITRARY UNITS
##FACTOR=    0.368581032318806, 1,           1
##FIRST=     11200.0995020947, 0,            0
##LAST=      -877.195183895579, 0,           0
##MIN=       -877.195183895579, -9856709,    0
##MAX=       11200.0995020947, 320701359,    0
$$ Real data points
##PAGE= N=1
##DATA TABLE= (X++(R..R)), XYDATA
$$ [...]
24860 -1744479 -1261843 -682980 -310468 -403219 -883233 -1765206 -2833343 -3644099 -4064481
24851 -4064481 -4225530 -4285498 -4357924 -4491074 -4722720 -5099441 -5353649 -5225153 -4861472 -4385654
24841 -4385654 -3740946 -3145396 -2894963 -2783487 -2357773 -1505211 -554977 82968 319668
24832 319668 468479 578177 497710 140753 -311706 -590129 -521820 -88263 294123 415439
24822 415439 329679 25562 -399394 -650571 -654823 -710109 -1004611 -1409425 -1520482 -1158516
24812 -1158516 -665477 -275829 70269 285793 249530 119998 231940 931311 1948041
24803 1948041 2593989 2528138 1879750 917737 -196272 -997608 -945303 -248932 410129 720515
24793 720515 876423 954913 924617 932992 1051235 1032967 850368 656661 459632 298595
24783 298595 314737 558079 1086769 1590563 1727940 1575946 1433379 1581649 1910129 2081385
24773 2081385 1873421 1340896 728550 69535 -654899 -1209186 -1252643 -831212 -347182 -108866
24763 -108866 4037 321673 837124 1205370 1105205 709750 372841 337419 579906 842268
24753 842268 1080439 1448522 1838397 1992418 1950018 1922654 1957799 2001852 2003316 2073909 2330189
24742 2330189 2421196 2028364 1167218 125728 -562905 -942116 -1317357 -1478275 -1156790
24733 -1156790 -510258 -91238 -222117 -497959 -481471 -185952 169803 496011 799841 993365
24723 993365 965622 797012 638973 503568 368844 385045 423422 17496 -553560 -730056
24713 -730056 -605845 -591111 -917958 -1566189 -2348455 -2801547 -2736939 -2584359 -2635782 -2784080
24703 -2784080 -2563126 -1739562 -645113 242608 621639 638916 636070 671375 651590 532090
24693 532090 303069 -27330 -368528 -639855 -772985 -500725 144844 596324 479786 -10160
24683 -10160 -548677 -1000972 -1129190 -889925 -552345 -144591 386378 1090105 1851027 2299570
24673 2299570 2252845 1766485 1075510 541368 497751 935304 1438127 1709237 1794286 1661754
24663 1661754 1215492 708818 338095 65878 -334251 -699629 -627831 -221341 110619 156984
24653 156984 -143445 -635739 -984311 -1111950 -1065126 -806684 -204648 719483 1539683 1759725
24643 1759725 1217574 330439 -285271 -396116 -41066 586136 1253519 1867114 2347184
24634 2347184 2436527 2185627 2070347 2186841 2190850 1903284 1451522 1061250 868736 902721
24624 902721 1083468 1482860 2089488 2727544 3326747 3839493 4096147 4077092 3790516 3226302
24614 3226302 2619438 2198732 1904111 1620106 1192584 491945 -185739 -388459 -111932
24605 -111932 367251 775982 983362 1064010 1009210 867215 724742 692266 850519 1273302
24595 1273302 1829980 2454109 3005255 3260782 3091265 2613816 2199846 1964082 1685961
24586 1685961 1271360 886082 485843 -159424 -1034714 -1772762 -2167256 -2155070 -1851857 -1458720
24576 -1458720 -1163430 -893062 -396237 324450 1135391 1903215 2591093 3295950 3834635
24567 3834635 3864684 3658778 3540008 3300675 2533899 1303490 103183 -638014 -873564
24558 -873564 -817711 -618371 -204599 461648 1124501 1644045 2098333 2530804 2899991 3059967
24548 3059967 2598829 1536902 611186 252689 212695 129920 19066 -23181 212356 715125
24538 715125 931633 605376 212119 136912 214437 287410 552888 1072270 1301519 886998
24528 886998 217354 -301326 -627192 -885055 -1215419 -1606638 -1978377 -2294470 -2493194 -2599114
24518 -2599114 -2580023 -2097119 -1315986 -660740 -275017 -302111 -699824 -1200013 -1505487 -1524965
24508 -1524965 -1342381 -1063994 -888566 -998788 -1230277 -1318389 -1344307 -1338523 -1189662 -1106199
24498 -1106199 -1329958 -1640788 -1688550 -1558371 -1501392 -1374747 -976011 -195821 687800 1072590
24488 1072590 957964 897194 1065463 1134455 1030756 1006075 1192993 1377907 1307456 1042894
24478 1042894 790836 598486 407899 213878 247570 588445 955422 1145454 1276843 1575960
24468 1575960 2092171 2634737 2892860 2843390 2737394 2715385 2672573 2596727 2461816 2125872
24458 2125872 1568511 886932 246844 -106755 -77889 48327 -103964 -395886 -500816 -347785
24448 -347785 -178103 -258401 -579982 -986208 -1449074 -2044556 -2533325 -2711033 -2869529 -3166830
24438 -3166830 -3206201 -2756289 -2188108 -1600503 -823506 -19242 671397 1308814 1741256 1498394
24428 1498394 608990 -560638 -1590738 -2071139 -1832203 -1131321 -460025 148796 999866
24419 999866 1893480 2530283 2854752 2846044 2736560 2635726 2526377 2484090 2447355 2362538
24409 2362538 2226648 1987022 1620164 1109579 283104 -685555 -1398933 -1806993 -2046142
24400 -2046142 -2279883 -2505529 -2667153 -2648182 -2339211 -1939267 -1792486 -2071733 -2414314 -2313351
24390 -2313351 -1850673 -1459629 -1085238 -515145 -76849 -153819 -617169 -1071794 -1219575 -978117
24380 -978117 -501119 -135619 -113795 -223179 -297272 -465094 -788649 -1163317 -1490131 -1619490
24370 -1619490 -1471368 -1043615 -543797 -155750 -39672 -327253 -902893 -1530373 -1808962
24361 -1808962 -1593812 -1163203 -913549 -930640 -1077736 -1378571 -1781499 -2085305 -2076070 -1623049
24351 -1623049 -974427 -602082 -529964 -563813 -688915 -1218618 -2318925 -3568187 -4265078
24342 -4265078 -4098910 -3475074 -3113127 -3216820 -3355267 -3308085 -3165453 -2878389 -2351110 -1744360
24332 -1744360 -1325142 -1014548 -547986 188239 944418 1422534 1478400 1050200 293836 -446944
24322 -446944 -1023081 -1510936 -1972014 -2545156 -3310256 -3990018 -4250781 -4145485 -4009536 -3950604
24312 -3950604 -4011214 -4427216 -5116668 -5640105 -5598206 -4893732 -3689997 -2259359 -1040548
24303 -1040548 -468451 -581823 -893907 -983791 -963209 -1053301 -1292353 -1590952 -1810416 -1895520
24293 -1895520 -1654020 -1104580 -528699 -56826 275293 381670 241856 -128680 -612258
24284 -612258 -852957 -792752 -862506 -1166918 -1278709 -988985 -690425 -950801 -1688430 -2414298
24274 -2414298 -2835549 -3238008 -3647141 -3682183 -3237743 -2493194 -1891656 -1807015 -2100478 -2365381
24264 -2365381 -2384979 -2335234 -2281054 -2004617 -1494551 -1174055 -1384260 -2007950 -2623437 -2906929
24254 -2906929 -2720514 -2232291 -1727372 -1419225 -1260248 -1078993 -883856 -715888 -590890
24245 -590890 -521827 -377781 185240 1136601 2036018 2628619 2827046 2592576 2161240 1999424
24235 1999424 2297421 2777440 3146794 3324244 3290308 3018148 2463065 1717363 1155671 1018001
24225 1018001 1162963 1283758 1169981 850779 523947 429310 877795 1867150 2792433 3105356
24215 3105356 2997741 2799350 2494679 2073967 1486322 666281 -104591 -453334 -350292
24206 -350292 39756 636557 1299259 1729912 1697637 1207396 708790 599672 749245 1038521
24196 1038521 1279231 1348853 1559952 2150728 2845003 2966441 2265607 1194562 297341
24187 297341 -110833 -238095 -621875 -1182940 -1582763 -1826500 -1968009 -1752885 -1091889 -240022
24177 -240022 470591 959437 1463084 2040006 2375103 2153568 1457698 490656 -579743
24168 -579743 -1312758 -1433984 -1185419 -883753 -533576 -15815 552725 1150069 1847519 2409009
24158 2409009 2347202 1530784 500800 -188317 -398273 -68895 678144 1558302 2517843
24149 2517843 3584972 4397965 4450317 3761698 2904348 2369957 2227388 2334108 2617908
24140 2617908 3097292 3634483 3887807 3770101 3412764 2942749 2156367 1138681 436917
24131 436917 249831 414103 658655 938425 1397628 1893797 2113766 2166529 2171192 2132219
24121 2132219 2246828 2701042 3312537 3737005 3881448 3817210 3685736 3739576 4049286 4395090
24111 4395090 4718717 4922680 4973838 4899660 4585787 4187465 3890661 3658840 3481741 3321136
24101 3321136 2915623 2183196 1547814 1392808 1753101 2517626 3154063 3180470 2621058 1877222
24091 1877222 1355351 1282302 1653754 2211462 2759898 3152091 3238062 3057663 2840453 2740733
24081 2740733 2746574 2660485 2391325 2144763 2223723 2818344 3642720 4103213 4147108 3976716
24071 3976716 3610629 3310580 3383030 3713518 4166210 4642051 4823683 4531088 3851649 3053759
24061 3053759 2370710 1722833 1044751 393580 -42476 -216627 -125985 518456 1765227
24052 1765227 3142656 4108668 4497906 4363844 3880992 3327575 2918114 2786099 2985352
24043 2985352 3392476 3777598 4072309 4341648 4520949 4608245 4703415 4741657 4623043 4315233
24033 4315233 3946952 3757011 3956225 4566715 5370830 6242489 7095930 7803917 8644662
24024 8644662 9905997 11345494 12797500 14478035 16552394 18853272 21074536 23040743
24016 23040743 24521007 25319152 25549078 25557504 25319348 24511636 23194148 22025897 21511858
24007 21511858 21639397 22233932 23281406 24878652 27126604 29893727 32665611 34900857
23999 34900857 36214121 36685260 36628472 36151967 35393827 34281440 32677263 30948821 29354529
23990 29354529 27709897 26067447 24755419 23945523 23470899 23259087 23413732 23764699 24279094
23981 24279094 25095435 25883363 26208669 26033005 25462077 24614433 23423712 21808559 19927895
23972 19927895 17941239 16053545 14628851 13950802 13661766 13128146 12252284 11297317 10695801
23963 10695801 10741472 11182278 11429164 11395134 11365487 11282341 11010244 10657658 10223653 9493584
23953 9493584 8313885 7024525 6025490 5305098 4761363 4387756 4246302 4251453 4062448
23944 4062448 3570127 3077003 2801067 2591662 2500923 2594217 2492752 1953649 1521784 1523055
23934 1523055 1574871 1508098 1539880 1974570 2854064 3719314 3981736 3765932 3600855 3459230
23924 3459230 3063409 2552339 2340950 2588892 2948833 2999112 2618716 1828459 856024 49657
23914 49657 -556717 -1081006 -1541113 -1897835 -2081122 -2044133 -1726038 -1367803 -1325543 -1438637
23904 -1438637 -1413142 -1333353 -1109994 -417437 566641 1497026 2219193 2686126 2929173 2814898
23894 2814898 2079050 837125 -379279 -1417323 -2404865 -3195859 -3442584 -3093144 -2610772
23885 -2610772 -2451319 -2608528 -2728661 -2658520 -2351820 -1580361 -501790 510049 1313859
23876 1313859 1811056 2030339 2076954 2154485 2481944 3143977 3955874 4671119 5230936 5724388
23866 5724388 6160342 6151588 5583634 4894700 4310240 3995663 4045283 4169560 4204827 4239600
23856 4239600 4280857 4274590 4234185 4133356 3939519 3670318 3455846 3367902 3373537 3439352 3542217
23845 3542217 3741870 4045245 4228493 3996413 3391356 2748757 2279551 1941158 1497434
23836 1497434 835491 212083 -82789 -173321 -284130 -276584 -211656 -472013 -1034255 -1500067
23826 -1500067 -1771139 -1957743 -1990900 -1890342 -1703012 -1238491 -367073 738524 1799926
23817 1799926 2665334 3309080 3486627 3041129 2410856 1997010 1846883 1936216 2116299 2012023
23807 2012023 1584871 1154912 692437 143323 -211712 -274063 -131263 269279 800558 1273669
23797 1273669 1719276 2233703 2876868 3483514 3792931 3786591 3755091 3963194 4313188 4691271
23787 4691271 4813934 4360541 3802262 3618002 3608915 3494286 3058975 2372018 1822002 1386468
23777 1386468 883851 420890 200234 396748 801811 1094181 1164866 1180822 1331677 1421886
23767 1421886 1317432 1252749 1283884 1287666 1245326 1115805 985072 916988 632206 55173
23757 55173 -487611 -939921 -1495241 -2114483 -2501442 -2466654 -2142629 -1838558 -1628183 -1579941
23747 -1579941 -1550386 -1291411 -1067438 -1100361 -1119301 -1098930 -1339089 -1780541 -2113521 -2402357
23737 -2402357 -2775783 -3060658 -3124041 -2907300 -2578243 -2581275 -2934922 -3234471 -3164400 -2782097
23727 -2782097 -2507188 -2428488 -2251463 -1833684 -1075474 -127098 608365 937126 935905 731397
23717 731397 348522 -305311 -1034400 -1388983 -1289362 -1223012 -1422705 -1700817 -2111571 -2547407
23707 -2547407 -2757337 -2665868 -2204723 -1421740 -540647 123845 299838 44606 -426615 -946177
23697 -946177 -1207487 -1116128 -873921 -472823 185406 852642 1299156 1315341 801794 142916
23687 142916 -227730 -324465 -307814 -208011 -91437 35727 312988 807093 1435142 2030910
23677 2030910 2523547 2879280 2977220 2920868 2989490 3208926 3544868 4063852 4574790 4922775
23667 4922775 5139915 5128687 4859661 4475289 4019678 3509385 2769774 1711678 451195
23658 451195 -779885 -1669310 -2044452 -2118191 -2333605 -2930643 -3709518 -4132989 -3918983 -3315613
23648 -3315613 -2602483 -1935870 -1492410 -1349364 -1453562 -1637089 -1790229 -1884063 -1911887 -2118504
23638 -2118504 -2550310 -2959395 -3196116 -3277120 -3114549 -2628105 -1968832 -1253685 -504050 111687
23628 111687 305838 155738 113913 197287 194880 356808 809556 1248639 1548302 2011897
23618 2011897 2740438 3344635 3571066 3594534 3554039 3342502 2848001 2135338 1280932 492042
23608 492042 62824 72376 480886 917549 1049174 914889 664473 485061 490520 571379
23598 571379 464082 19749 -792351 -1720556 -2314020 -2428800 -2231067 -1911897 -1525397 -1377106
23588 -1377106 -1762653 -2421287 -3046733 -3357028 -3280977 -3047272 -2795482 -2622822 -2258422 -1316015
23578 -1316015 -17561 1005394 1403529 1101112 432627 -206570 -568694 -593646 -519007
23569 -519007 -400344 -48508 425672 794755 1123425 1254564 1013060 593162 252233 98128
23559 98128 54637 714 -50528 -36515 16915 -26886 -309545 -769364 -1171475 -1232633 -824029
23548 -824029 -229211 215915 391900 409404 625202 1117852 1470169 1547466 1544222 1394327
23538 1394327 958145 176587 -769357 -1608346 -2317874 -2762029 -2676183 -2313225 -2230116 -2423435
23528 -2423435 -2469778 -2218235 -1923623 -1833627 -1870062 -1901429 -1888632 -1900332 -2019389 -1906104
23518 -1906104 -1359474 -820012 -581589 -718145 -1178319 -1659585 -1864514 -1690848 -1078197
23509 -1078197 -250284 274875 398245 406193 437054 360813 -162629 -1259373 -2261512 -2344325
23499 -2344325 -1475064 -331190 414576 608979 368145 -111428 -477869 -607042 -666486
23490 -666486 -845645 -1142210 -1357833 -1384224 -1292242 -1215263 -1362665 -1921261 -2789913 -3679367
23480 -3679367 -4332881 -4645500 -4817687 -4802588 -4433133 -3931172 -3537804 -3144882 -2763116 -2414505
23470 -2414505 -1967918 -1499515 -1209316 -1097229 -1201199 -1493700 -1926670 -2408911 -2738132
23461 -2738132 -2848500 -2630192 -1981994 -941027 62524 585167 673881 363272 -419917
23452 -419917 -1354163 -2056365 -2461930 -2654760 -2636307 -2504017 -2443358 -2444556 -2261291 -1754774
23442 -1754774 -1103991 -653458 -594216 -784628 -939289 -813947 -505757 -263185 -192281 -467253
23432 -467253 -993261 -1383477 -1582463 -1809611 -2137162 -2425713 -2657464 -2835178 -3033060 -3341887
23422 -3341887 -3723073 -4247622 -4734745 -4765600 -4436253 -4033644 -3603453 -3224377 -2860823 -2249092
23412 -2249092 -1348854 -415597 305961 770010 997708 1029510 789857 114541 -733855 -1231905
23402 -1231905 -1308347 -1116808 -868604 -820905 -944492 -983009 -955508 -937935 -865063 -785128 -823322
23391 -823322 -983679 -1020788 -755066 -344718 -61049 135272 548693 1126131 1564525 1812796
23381 1812796 1893432 1777098 1581119 1448586 1276123 898846 465299 276243 254283 86345
23371 86345 -207111 -357896 -334960 -199565 44655 280038 329674 155465 -50472 -817
23361 -817 214253 358931 401689 417860 469550 477363 226628 -258940 -679089 -1015757 -1569392
23350 -1569392 -2186100 -2290564 -1865899 -1201006 -452693 183514 434937 417763 307069 -39540
23340 -39540 -517627 -809716 -443388 490629 1089894 975678 555239 181116 -38451 4344
23330 4344 225070 363638 292709 -73192 -639738 -1011245 -885844 -416289 175555 580087
23320 580087 563051 193930 -253233 -510926 -461899 -275822 -135994 -54127 -46229 -117729 -42752
23309 -42752 461019 1025915 1374368 1634592 1733250 1607624 1331103 1118512 1064149 1037232
23299 1037232 878503 596570 454596 542369 537446 257463 66698 118077 288629 565576
23289 565576 843710 981140 914275 578086 121317 -540475 -1483734 -2235790 -2506352 -2253235
23279 -2253235 -1694750 -1106250 -732864 -1021893 -1796633 -2363926 -2702281 -3074781 -3428805
23270 -3428805 -3669579 -3728011 -3532495 -3353026 -3491324 -3627246 -3423162 -2827174 -2100672 -1617165
23260 -1617165 -1491306 -1621620 -1835077 -2060824 -2202346 -2059483 -1603712 -1012473 -439455
23251 -439455 -125154 -254327 -734286 -1024401 -761047 -119372 700044 1420031 1663054 1580042
23241 1580042 1391098 999538 648657 551436 257700 -644732 -1704101 -2254751 -2320103 -2218981
23231 -2218981 -2102319 -1880069 -1495546 -1042129 -573571 -90276 445912 918583 993564 570365
23221 570365 50972 -234308 -257084 -181044 -86 237286 312764 123422 -17611 357599
23211 357599 1141189 2017631 2546591 2223376 1062140 -279835 -1295220 -1941820 -2077741
23202 -2077741 -1681666 -1114231 -736546 -595959 -556177 -362630 74592 551262 760926 638727
23192 638727 308647 -203093 -854694 -1346858 -1298257 -643239 378698 1535539 2523680
23183 2523680 2976293 2928822 2790445 2811268 2907942 3122419 3508750 3835137 3937487 3840897
23173 3840897 3614885 3384162 3204227 3159610 3337234 3580752 3670416 3645577 3523428 3324922
23163 3324922 3133507 2787206 2136969 1355227 952951 1053208 1156770 905165 692042
23154 692042 1155733 2068272 2674070 2746278 2449430 1991359 1488556 966575 456324 87608
23144 87608 -116788 -375836 -825473 -1463259 -2026489 -2139274 -1731177 -1147464 -840751 -1059023
23134 -1059023 -1664329 -2215286 -2362670 -2068486 -1446457 -762127 -162025 309452 519257
23125 519257 407052 179108 137217 402101 839528 1294398 1560936 1442196 1104021 826879
23115 826879 569714 257050 -59465 -265713 -336182 -324508 -269868 -131256 7274 -36869
23105 -36869 -321757 -880867 -1606534 -2113650 -2225422 -2230573 -2327091 -2502205 -2727485 -2933139
23095 -2933139 -3102034 -3390797 -3794644 -3833918 -3231697 -2366675 -1609822 -918924 -215741 224627
23085 224627 98125 -368516 -706740 -821668 -792331 -545143 -40043 662727 1340096 1789446
23075 1789446 1764214 1042262 -52284 -1146536 -2221632 -3225598 -4061701 -4673235 -4987075
23066 -4987075 -4958614 -4602874 -3984412 -3214562 -2584729 -2328741 -2364413 -2641801 -3000683 -3027238
23056 -3027238 -2684934 -2291257 -2048099 -1879235 -1669529 -1520684 -1542881 -1536646 -1339046 -1144980
23046 -1144980 -1263852 -1641379 -2122837 -2431634 -2243982 -1658506 -982629 -384248 118548
23037 118548 379817 187082 -311311 -815744 -1339563 -1915520 -2243193 -2076234 -1667302 -1326607
23027 -1326607 -1092564 -1060184 -1136540 -1299025 -1633420 -1775302 -1487558 -1115839 -1074474 -1327465
23017 -1327465 -1588110 -1697054 -1716147 -1741619 -1765809 -1761518 -1759160 -1794968 -1910603 -2258153 -2693139
23006 -2693139 -2727637 -2445699 -2317497 -2150698 -1661197 -984999 -348906 101943 393739 626228
22996 626228 661637 459353 237904 133744 -78407 -603200 -1096553 -1217597 -1052979 -848502
22986 -848502 -710469 -659105 -798114 -1096164 -1212628 -958424 -678684 -343166 474778 1575098
22976 1575098 2492938 2953223 2942072 2712788 2327072 1797007 1264196 666697 16777 -500940
22966 -500940 -706449 -434255 79021 270451 -268951 -1460056 -2724848 -3429195 -3436405 -3275792
22956 -3275792 -3553473 -4226659 -4618658 -4347984 -3572146 -2730071 -2487365 -3091649 -3940242
22947 -3940242 -4288843 -3759687 -2513618 -1159160 -402453 -572767 -1358147 -2229908 -2882777
22938 -2882777 -2917873 -2312213 -1677158 -1264994 -1053188 -1165283 -1447365 -1517165 -1412337 -1201775
22928 -1201775 -812843 -543309 -725881 -1182211 -1546794 -1788834 -2031901 -2185058 -2081119
22919 -2081119 -1883984 -1945550 -2142710 -2048154 -1491580 -569766 264746 663156 827866 861686
22909 861686 765329 620417 465017 121426 -606846 -1509297 -2197658 -2518887 -2534333 -2472868
22899 -2472868 -2351775 -2010117 -1688807 -1701026 -1965835 -2197562 -2152402 -1858837 -1623538 -1432323
22889 -1432323 -1248077 -1212723 -1314426 -1429976 -1596738 -1776649 -1753518 -1589378 -1248345 -588464
22879 -588464 -17256 206692 383090 681330 749163 354523 -317367 -969964 -1644516 -2295785
22869 -2295785 -2498849 -2264271 -1953918 -1791590 -1687967 -1525648 -1388970 -1320446 -1294559 -1298202
22859 -1298202 -1232954 -1102509 -938012 -477093 290687 921137 1155245 1024246 703045 463551
22849 463551 538958 766235 767150 676071 764636 1031818 1421835 1806109 1973473 1841893 1507840
22838 1507840 1105045 838702 792087 809335 661102 262067 -123682 -112879 259149 723923
22828 723923 1099123 1161249 813505 401014 304555 521208 639817 676240 913911 1395314
22818 1395314 2121054 2683032 2661717 2102623 1271991 680501 558258 709534 1092694 1645025
22808 1645025 2175198 2536673 2672825 2515207 2020089 1218527 309205 -307903 -546926
22799 -546926 -685462 -1000345 -1440280 -1784566 -1953378 -1883585 -1665874 -1424044 -938898 -160678
22789 -160678 623973 1217229 1460401 1314047 784839 -6716 -790616 -1479544 -2034434 -2295776
22779 -2295776 -2158913 -1708859 -1257741 -1097360 -1170151 -1121811 -971824 -1152664 -1994992 -3238602
22769 -3238602 -4175399 -4411225 -4196901 -3891198 -3530810 -3119619 -2876145 -2921020 -3219179 -3666476
22759 -3666476 -4099872 -4105842 -3535803 -2814913 -2066880 -1156649 -326977 683 -164443 -401413
22749 -401413 -363623 -217691 -158137 -201169 -460370 -1044946 -1912692 -2770663 -3287844 -3248425
22739 -3248425 -2675093 -2106645 -1858535 -1674819 -1192065 -466140 57559 79950 -384117 -943009
22729 -943009 -1277480 -1236921 -664794 233697 867932 735765 84703 -519960 -1051373 -1617267
22719 -1617267 -2106986 -2393984 -2388277 -2090650 -1657129 -1447531 -1556473 -1808721 -2041538 -2151264
22709 -2151264 -2164128 -2054633 -1788524 -1290632 -603891 5143 208463 -16519 -287008 -312761
22699 -312761 -17058 583351 1162724 1425871 1402356 1157925 845138 544982 76079 -756048
22689 -756048 -1617903 -1933556 -1670677 -1255096 -857579 -402446 -65312 -92225 -417016 -816976
22679 -816976 -1225330 -1527834 -1637988 -1679999 -1739974 -1768904 -1825114 -2106517 -2547665 -2752716
22669 -2752716 -2523649 -2124139 -1840711 -1669123 -1377020 -788353 -141201 152231 -52550
22660 -52550 -299381 -32218 477622 639147 298372 -311794 -925881 -1365199 -1445864 -1052635
22650 -1052635 -243058 661014 1426500 2018640 2400714 2556430 2494007 2130257 1503059 879617
22640 879617 394748 -47223 -407867 -609661 -579132 -333518 -97664 114811 460933 922130
22630 922130 1288295 1322679 1022404 539295 -151931 -898075 -1311155 -1317458 -973969 -502766
22620 -502766 -179779 -44518 -74523 -66351 22332 -144367 -686387 -1388379 -2069858 -2467297
22610 -2467297 -2248408 -1451625 -451351 422329 928720 1031156 944940 759033 664693 861366
22600 861366 1072045 1013015 690571 141177 -619719 -1546530 -2303777 -2402633 -1866754 -1101787
22590 -1101787 -310631 403990 848941 870092 551414 48489 -578780 -1300583 -2028298 -2544798
22580 -2544798 -2700865 -2600853 -2454630 -2416436 -2381370 -2240516 -2058204 -2072107 -2460023 -3157640
22570 -3157640 -3857279 -4320442 -4494487 -4464714 -4386310 -4103305 -3445316 -2840920 -2633013 -2737424
22560 -2737424 -2949003 -3039340 -3051216 -2885802 -2269414 -1435751 -847579 -685715 -692693 -565057
22550 -565057 -440984 -527173 -751201 -759480 -194695 836757 1779811 2405347 3016022 3506430
22540 3506430 3519420 3143828 2768291 2720145 2934768 3144291 3258678 3516515 4135075 4783359
22530 4783359 4980349 4757898 4303493 3658506 2811772 1885332 1188974 716775 294978
22521 294978 -199984 -778617 -1273514 -1628606 -1806964 -1999695 -2644611 -3731851 -4548143
22512 -4548143 -4483940 -3797502 -3056130 -2602409 -2424459 -2237236 -1914154 -1518030 -1084433 -679983
22502 -679983 -390486 -55796 506620 1147471 1436303 1096170 302364 -609002 -1331502 -1559601
22492 -1559601 -1271786 -667011 -68994 203530 128336 -208902 -710581 -1148279 -1410164 -1409556
22482 -1409556 -1259258 -1166552 -1136363 -1141752 -1231126 -1316184 -1438025 -1548522 -1431041 -1078204
22472 -1078204 -481876 388719 1262337 1924400 2289701 2311821 2362307 2668079 2833646 2727362
22462 2727362 2695256 2647931 2385412 2059144 1698617 1171394 416291 -392501 -848458 -882785
22452 -882785 -657274 -147517 550860 1165151 1429363 1310729 1023812 581834 -62417 -586896
22442 -586896 -571742 -100339 334344 455872 33222 -833398 -1493345 -1426993 -691800 259141
22432 259141 1000040 1282557 1167647 968884 911192 887987 515160 -258863 -1076356 -1677957
22422 -1677957 -2134150 -2574589 -2902785 -3008785 -2805763 -2248698 -1565351 -949934 -719477
22413 -719477 -978968 -1205673 -1045057 -655212 -208139 49281 -250049 -1089214 -1923005 -2296929
22403 -2296929 -2135729 -1486756 -498318 546486 1423715 2159276 2670141 2731874 2526225
22394 2526225 2371886 2256714 2002464 1498009 1007659 782862 829708 1059902 1296250 1305946
22384 1305946 1008362 513648 -103273 -671899 -995767 -1114915 -1132923 -1125956 -1132638 -1010480
22374 -1010480 -781140 -747470 -1026993 -1371128 -1451471 -1094063 -375081 322172 896753 1580063
22364 1580063 2221624 2443986 2047233 1137333 26734 -750866 -864231 -550824 -142126
22355 -142126 88947 65843 -244679 -696472 -910052 -757445 -408669 168132 972861 1596651
22345 1596651 1671037 1317257 925798 724654 507798 180695 109358 448029 859068 969113
22335 969113 855661 752621 718051 710464 615442 222954 -451636 -1144962 -1676517 -1885536
22325 -1885536 -1796740 -1775727 -1761808 -1299535 -372333 573893 1300986 1810030 2111961 2178508
22315 2178508 1906456 1303970 447272 -333794 -648136 -577693 -587955 -969673 -1519034 -1925963
22305 -1925963 -2147223 -2231779 -2133878 -1758338 -1120470 -574438 -408180 -586191 -878350 -1124677
22295 -1124677 -1350090 -1540962 -1763135 -1993253 -2123359 -2239338 -2489511 -2778813 -2846435 -2504922
22285 -2504922 -1677241 -652585 -16900 -111666 -571048 -696237 -305960 119902 -40044
22276 -40044 -744816 -1389652 -1661938 -1727884 -1687242 -1760789 -2149402 -2498048 -2503402 -2194308 -1634045
22265 -1634045 -934533 -373378 -227121 -449568 -706750 -858809 -1078115 -1397056 -1459990 -1119837
22255 -1119837 -734583 -477794 -312766 -206875 -266558 -616216 -1238411 -1939394 -2613297 -3062427
22245 -3062427 -3032936 -2495942 -1471571 -327939 565456 1215764 1611374 1658716 1442739
22236 1442739 1032062 395494 -403445 -1066207 -1256031 -1283094 -1622278 -2162591 -2287611 -1686683
22226 -1686683 -926541 -549503 -601336 -884097 -1213371 -1779853 -2869939 -4252921 -5200705
22217 -5200705 -5316276 -4809653 -3885272 -2628227 -1481360 -850391 -824647 -1279603 -1827333
22208 -1827333 -2173687 -2349413 -2499592 -2787161 -3265870 -3693197 -3634380 -3081281 -2371258 -1774315
22198 -1774315 -1357317 -999942 -789172 -799254 -1039546 -1653158 -2670001 -3665852 -4170112
22189 -4170112 -4085877 -3877950 -4178038 -4932519 -5683186 -6238355 -6473025 -6198879 -5575802 -4823004
22179 -4823004 -3853032 -2540502 -1222635 -462809 -281898 -305247 -354099 -473590 -748032
22170 -748032 -1106170 -1340186 -1396551 -1227714 -693523 29034 601116 824276 724870 631550
22160 631550 715070 697476 390574 -84587 -649778 -1221041 -1660286 -1992485 -2298990 -2455266
22150 -2455266 -2446048 -2428053 -2157790 -1385177 -586084 -308599 -244889 46600 381246 536219
22140 536219 546679 387134 51201 -175413 -75551 260531 510741 266517 -440911 -1086751
22130 -1086751 -1369391 -1362938 -1200842 -1129060 -1418950 -1882671 -2028695 -1672068 -1277993 -1401720
22120 -1401720 -2000594 -2438199 -2430424 -2553153 -3019987 -3468187 -3615131 -3520557 -3283823 -2906536
22110 -2906536 -2397240 -1828864 -1175830 -335303 428536 928911 1138200 1071283 1157160 1620660
22100 1620660 2038850 2272876 2526443 2719523 2514003 1881253 1123185 487463 152793
22091 152793 88743 54346 31693 128930 240191 301169 495969 1084269 2039314 2985210
22081 2985210 3451126 3183079 2438897 1638227 1004764 663886 638105 790661 862639 588262
22071 588262 154726 -142269 -366209 -501936 -541130 -675577 -858821 -936120 -1112102 -1506920
22061 -1506920 -1843223 -1784514 -1390513 -951238 -749649 -885105 -1175220 -1355914 -1288911 -1016924
22051 -1016924 -726641 -629506 -688696 -560719 -20796 781348 1509233 1994691 2023828 1530924
22041 1530924 760559 -32391 -704657 -1087505 -949038 -597332 -449918 -565383 -761386
22032 -761386 -802391 -855303 -1180565 -1595961 -1913891 -2076622 -2130629 -1997996 -1655574 -1279768
22022 -1279768 -884799 -370670 229100 604731 570087 353283 71194 -327040 -740267 -974696
22012 -974696 -972643 -1128947 -1696109 -2256594 -2409275 -2228715 -1807603 -1343568 -1133112 -1139481
22002 -1139481 -1151463 -1111062 -1072914 -974270 -500978 518093 1830256 3007260 3709605 4125946
21992 4125946 4532308 4515167 3801430 2828233 1899156 1011150 135047 -580024 -847163 -685491
21982 -685491 -335261 1072 276711 634356 898838 937974 909460 803205 409704 -180054
21972 -180054 -440895 -330425 -218116 -169138 -117782 -126610 -288087 -448189 -375715 -258757
21962 -258757 -312106 -350174 -172161 163205 355655 217658 143482 377960 590182 631137
21952 631137 568674 217873 -359519 -877378 -1232110 -1374345 -1346761 -1284249 -1336950 -1489483
21942 -1489483 -1579219 -1767888 -2454625 -3534025 -4340028 -4378969 -3890692 -3396898 -3226845 -3255218
21932 -3255218 -3327650 -3531744 -3622356 -3352556 -2892355 -2311633 -1642270 -1112495 -822141 -625776
21922 -625776 -469341 -296758 125363 748938 1118876 691390 -469457 -1430673 -1483536 -756375
21912 -756375 345633 1300202 1601152 1213058 494056 -254456 -1149207 -2013311 -2250851
21903 -2250851 -1605093 -338453 928287 1718923 1894213 1641075 1292982 1010449 967633
21894 967633 1190233 1309510 958402 260775 -430677 -979682 -1317637 -1340029 -1068860 -884430
21884 -884430 -1099805 -1494728 -1710810 -1913147 -2533208 -3702592 -4896673 -5546829 -5702717
21875 -5702717 -5628406 -5430544 -4949848 -4385541 -4141427 -4317463 -4825376 -5471493 -5874557 -5805195
21865 -5805195 -5492776 -5231972 -5178440 -5349427 -5656320 -5890492 -5835912 -5373822 -4522356 -3654446
21855 -3654446 -3056600 -2410214 -1612655 -997526 -672236 -419911 -142270 9455 -103250
21846 -103250 -533559 -1212530 -1888923 -2125054 -1686997 -828118 25334 584393 811988 984028
21836 984028 1036781 683823 69760 -472829 -763554 -792655 -856574 -1044111 -1082926 -899239
21826 -899239 -877867 -1280564 -1857692 -2300778 -2525269 -2501503 -2194897 -1715602 -1309218 -1267220
21816 -1267220 -1700088 -2334565 -2819075 -3026763 -2834175 -2211686 -1463569 -1013108 -940628 -907783
21806 -907783 -784660 -554077 -123874 367486 860268 1271638 1498676 1742901 1935344 1846062
21796 1846062 1357347 668933 228429 224251 509108 712328 753225 828800 1038754 1280312
21786 1280312 1152479 416103 -653541 -1631475 -2051986 -1791163 -1057193 -304853 -60603
21777 -60603 -399655 -889265 -1232524 -1401562 -1567871 -1863653 -2276672 -2928533 -3804681 -4356530
21767 -4356530 -4248264 -3867606 -3769507 -4014428 -4315421 -4412178 -4216323 -3720921 -2947054 -2042943
21757 -2042943 -1359927 -941330 -513033 -149882 -180515 -890134 -2161618 -3393071 -4154754
21748 -4154754 -4411861 -4291699 -4099787 -3966536 -3915781 -4041447 -4220460 -4184132 -3815684 -3269146
21738 -3269146 -2851505 -2678351 -2646171 -2852754 -3402625 -4112868 -4558526 -4482916 -4014432 -3563271
21728 -3563271 -3523450 -3940830 -4413618 -4720203 -4749699 -4252266 -3240504 -2102617 -1325696
21719 -1325696 -916383 -444866 144100 493147 377848 -62960 -542217 -755154 -637317
21710 -637317 -407688 -88607 286401 391065 73550 -416703 -816651 -861524 -484664 -169973
21700 -169973 -99070 34469 189212 15450 -484411 -877972 -1086472 -1165152 -1067277 -1181132
21690 -1181132 -1731893 -2251940 -2411345 -2457316 -2625699 -2862651 -3315426 -3801214 -3797417 -3437547
21680 -3437547 -3202006 -3163915 -3102521 -2787497 -2370102 -1984215 -1431215 -699671 -240765 -247821
21670 -247821 -382399 -387652 -217432 59530 468749 825396 1052244 1273695 1317802 1014679
21660 1014679 602914 421599 682290 1312736 1897378 2109157 1909700 1402525 566652
21651 566652 -342035 -810595 -838148 -845477 -1145206 -1695700 -2147917 -2052336 -1366414 -548146
21641 -548146 61858 411140 560571 571662 598716 794957 1135259 1508137 1682659 1543131
21631 1543131 1371695 1272251 1120218 968676 932254 815419 574932 443124 455684 476361
21621 476361 422295 512310 908995 1433011 1735135 1589007 1124479 582155 30783 -299344
21611 -299344 -194194 282806 679181 705520 501765 313372 286984 355461 505447 617494
21601 617494 694620 878079 1154658 1427261 1659821 1664736 1166224 260079 -739671 -1675964
21591 -1675964 -2461600 -2944234 -3246786 -3651747 -4075349 -4348989 -4417273 -4395385 -4370032 -4045108
21581 -4045108 -3212226 -2213647 -1525842 -1400290 -1526377 -1289819 -629504 -142976 -183066 -717538
21571 -717538 -1111709 -661887 413836 1454110 1825625 1461894 812568 263697 -151946
21562 -151946 -426235 -450903 -331169 -329994 -283687 -40195 218449 455610 741402 1042523
21552 1042523 948621 163541 -899714 -1691806 -1932102 -1742423 -1539881 -1461652 -1416974 -1543779
21542 -1543779 -1850681 -1949146 -1698676 -1408049 -1321749 -1522039 -1914107 -2103138 -1867620 -1297665
21532 -1297665 -708405 -140880 681748 1670697 2488074 3073318 3386226 3366791 3127953 2733068
21522 2733068 2264497 1804057 1242000 402403 -503808 -1096298 -1344242 -1507910 -1784766
21513 -1784766 -2017504 -1802618 -976174 140865 894504 937960 659101 381475 49745
21504 49745 -400618 -868540 -1391083 -1938080 -2215740 -1986250 -1366353 -570325 295952 1051572
21494 1051572 1413572 1231641 849118 665214 691294 737930 902937 1290796 1784873 2133673
21484 2133673 2149133 2066669 2070298 1911196 1316681 652262 397234 542654 890667 1167812
21474 1167812 1229959 1100793 887319 442435 -208562 -768687 -1085822 -1128219 -939214 -675271
21464 -675271 -365201 172433 844263 1404606 1871268 2075499 1871929 1274013 270979
21455 270979 -796822 -1445146 -1683434 -1872224 -2079735 -2020137 -1766862 -1535314 -1307812 -1006589
21445 -1006589 -807535 -1000779 -1469420 -1720214 -1464488 -924555 -328957 251334 815397
21436 815397 1218838 1300810 1046186 622197 263565 108105 122753 303393 588379 808213
21426 808213 878175 716451 283046 -283501 -789950 -1104469 -1296553 -1547302 -1952501 -2464956
21416 -2464956 -3061386 -3618851 -3675960 -3018020 -1902115 -841050 -320089 -355831 -537962
21407 -537962 -511095 -226439 76438 120803 57974 102589 290452 548881 631949 196151
21397 196151 -720100 -1631840 -2119692 -2113803 -1785393 -1291345 -778435 -438289 -401743 -462235
21387 -462235 -256910 258409 923145 1338571 1161964 614598 161978 -208561 -723421 -1175478
21377 -1175478 -1396411 -1336281 -907594 -324602 62174 117526 107182 265076 469128 679328
21367 679328 889022 948461 968381 1187194 1563087 1922498 2117993 1998082 1713240 1467673
21357 1467673 1215801 1137759 1437429 2043803 2730478 3243029 3479985 3479349 3413145 3294256
21347 3294256 2891435 2063120 969952 -140114 -1382326 -2724827 -3853823 -4614308 -4766326
21338 -4766326 -4290305 -3603455 -3066619 -2791843 -2774121 -2920704 -3146704 -3332304 -3360827 -3196751
21328 -3196751 -3117213 -3442508 -3934530 -4157120 -4059861 -3969228 -4022437 -3979697 -3613786 -3067184
21318 -3067184 -2561830 -2045183 -1407640 -778149 -409747 -311154 -289856 -335417 -553328 -750369
21308 -750369 -569260 -173804 23410 130200 277843 230834 -170782 -1012074 -2154861 -2910248
21298 -2910248 -2744234 -1917522 -771260 631796 2020583 3079632 3695827 3868656 3523336
21289 3523336 2718060 1814404 989913 407019 102361 -207330 -539928 -605751 -280905 183871
21279 183871 562190 1053722 1691548 2035429 1895010 1596610 1341176 1006117 488955 -117360
21269 -117360 -384509 121763 1287825 2305289 2586954 2327423 1804784 1199558 468513
21260 468513 -279027 -630130 -521730 -188882 273498 934625 1581104 1958069 2098798 2082388
21250 2082388 2064153 2241439 2636161 3125141 3482075 3478672 3263502 3117241 3039103 3090858
21240 3090858 3445716 3875161 4077095 3840896 3147406 2281057 1517441 858830 281544
21231 281544 -189023 -581974 -1107950 -1624728 -1734117 -1582672 -1459108 -1501970 -1896006 -2523035
21221 -2523035 -2872947 -2705143 -2184221 -1543276 -998693 -677514 -476050 -223150 -62681
21212 -62681 -127969 -285374 -395179 -349980 -62799 187301 -23948 -697670 -1453897 -2023563
21202 -2023563 -2422302 -2766482 -2987232 -3116021 -3347466 -3716269 -4256531 -4724324 -4675483 -4082301
21192 -4082301 -3347209 -2667422 -1988833 -1493078 -1520824 -2043057 -2547152 -2656239 -2700274 -2864277
21182 -2864277 -2452321 -1135197 352115 1440245 2161359 2422262 2266085 1961730 1524627
21173 1524627 969256 498946 225849 87313 -172299 -808817 -1748906 -2507127 -2799627
21164 -2799627 -2693221 -2100722 -1178818 -363353 218844 697276 1134585 1405216 1258508
21155 1258508 676736 70047 -254393 -346873 -379616 -346248 -98127 391183 911406 1386897
21145 1386897 1969781 2553547 3014756 3185536 2935473 2668134 2747064 3033974 3372726 3536857
21135 3536857 3150378 2398655 1709984 1138577 759642 533731 303761 61840 -21576 208479
21125 208479 708409 1285566 1873764 2285833 2287183 1881330 1159482 410168 44500 87567
21115 87567 311606 600997 823062 1078763 1451044 1725589 1716383 1702275 1819754 1778207
21105 1778207 1558915 1280231 857252 261780 -240146 -217733 100187 120903 -168173 -398633
21095 -398633 -358112 -89703 271405 678739 1126329 1599671 1844794 1500051 571766 -351202
21085 -351202 -602005 -197951 491364 1188271 1632762 1590380 1320891 1265789 1455958 1715987
21075 1715987 2061523 2362422 2423504 2282843 2153827 2246609 2515853 2647587 2288520 1388385
21065 1388385 411577 -69992 -27112 282837 986881 2000642 2881025 3671750 4654489
21056 4654489 5479676 5621020 5021695 4102359 3214212 2447356 1752193 1287518 1349678 1852903
21046 1852903 2476596 2892565 2817532 2292550 1719196 1491849 1633387 1927244 2209741 2559787
21036 2559787 3117092 3835454 4567629 5265451 5990177 6921053 8088708 9048244 9217387
21027 9217387 8466752 7230893 6000204 5017389 4571185 4837867 5685786 6818354 8018553
21018 8018553 9243232 10441272 11523782 12542536 13696481 15193893 17219515 19751305
21010 19751305 22617550 25878249 29569700 33613863 38086774 43227673 49215964 55634236
21002 55634236 61618537 66359119 69350249 70361115 69161258 65673107 60410352 54362124
20994 54362124 48347638 42836724 38017424 33996277 30778479 27961095 25222551 22676171
20986 22676171 20427394 18458484 16785376 15292712 13983766 13113315 12678809 12288006
20978 12288006 11577730 10509079 9344054 8281642 7382444 6439487 5287676 4210420
20970 4210420 3364326 2735823 2528791 2920540 3675763 4432575 5097459 5491332 5421602 5014959
20960 5014959 4449413 3980474 3645155 3264811 3018185 3120370 3340022 3446099 3583087
20951 3583087 3838936 4270995 4807682 5285427 5715211 6107950 6332673 6339432 6190014 6055601
20941 6055601 6066661 6011862 5653883 5056846 4495304 4256473 4256035 4087485 3570386 2728032
20931 2728032 1786065 1156379 1097659 1443201 1735398 1677164 1086058 209791 -316517 -82109
20921 -82109 813309 1644740 1804245 1630861 1794872 2525956 3748044 5137420 6425415
20912 6425415 7549056 8471028 9145814 9649666 9998007 10057863 9607373 8467028 7019306
20903 7019306 5898018 5164265 4605948 4151894 3590151 2785384 1990997 1473630 1174307
20894 1174307 1158239 1594201 2323825 2921309 3143821 3008440 2829433 2960052 3394399 4133464
20884 4133464 5132464 5907654 6171674 6177081 6017974 5473514 4612699 3876485 3476864 3221463
20874 3221463 3127674 3435635 4018160 4376687 4082087 3214376 2233353 1306248 281117
20865 281117 -622843 -1126625 -1255728 -1148725 -1231443 -1512321 -1635872 -1398209 -742386 183601
20855 183601 1201027 2056329 2661634 3111062 3576117 4119672 4527351 4914356 5472960
20846 5472960 5755058 5554802 5355723 5290936 4898194 3991161 2997642 2486839 2668318 3177206
20836 3177206 3774822 4445942 5023990 5459865 5752250 5820761 5558197 5039455 4403379 3685804
20826 3685804 3030126 2410362 1719544 1166196 1008773 1122192 1291202 1402336 1322491 1306098
20816 1306098 1725692 2253819 2419442 2208566 1807582 1366500 1096461 1049301 1063083 1225581
20806 1225581 1593098 1934134 2114663 2174865 2120793 1947949 1758183 1776081 2042284 2309230
20796 2309230 2310143 2137678 1884288 1298319 309929 -759932 -1768691 -2651082 -3211264 -3158510
20786 -3158510 -2546330 -1686293 -848944 -336017 -69139 158606 502900 1070282 1694074
20777 1694074 2011157 1912221 1735544 1507014 1071975 532962 -92773 -625674 -954043 -1213270
20767 -1213270 -1247379 -827945 -268327 1280 -149447 -529132 -824140 -1027257 -1249895 -1586099
20757 -1586099 -2063151 -2375330 -2478727 -2576221 -2717713 -2721844 -2318555 -1694286 -1259351 -1034531
20747 -1034531 -862365 -767644 -708559 -489997 -151993 17541 17903 177021 681823 1408270
20737 1408270 2017066 2317008 2338433 2090627 1618728 1122809 529102 -264956 -852019 -694890
20727 -694890 307823 1544419 2333645 2587802 2507609 2220031 1853077 1652892 1692230 1980458
20717 1980458 2442212 2760425 2770551 2651973 2705986 3160005 3829872 4293260 4270215 3810788
20707 3810788 3318706 2956111 2617436 2160371 1503540 554707 -343226 -582233 -258224
20698 -258224 -34667 -150154 -440889 -924851 -1503693 -1801434 -1687328 -1473686 -1582534 -1972091
20688 -1972091 -2437923 -2877693 -3064867 -2807256 -2226307 -1754437 -1627147 -1624802 -1490697 -1560272
20678 -1560272 -2225797 -3101782 -3550532 -3423173 -2868948 -2197261 -1808197 -1758690 -1850184 -2007547
20668 -2007547 -2290109 -2567454 -2746259 -2864807 -2718905 -2198448 -1487903 -820683 -305646
20659 -305646 151595 460849 610780 620556 366080 -50824 -274580 31821 760175 1413296
20649 1413296 1717009 1663699 1397117 1100379 936763 983753 1047757 908704 612642 524900
20639 524900 820515 1208028 1598001 2091549 2530786 2671493 2426114 1831484 1026981 444248
20629 444248 444269 877625 1274723 1351088 1270903 1396160 1937637 2732722 3299698 3464877 3446947
20618 3446947 3408635 3203790 2670931 1950137 1253753 727614 488326 504265 683669 1110504
20608 1110504 1715356 2183507 2380812 2152594 1407308 337460 -831086 -1708462 -1732533
20599 -1732533 -877385 124251 538942 213378 -425950 -824767 -720355 -119291 663850
20590 663850 1141760 1105999 769998 502821 514496 554215 393504 44443 -573827 -1392419
20580 -1392419 -2038221 -2220459 -2069329 -1925753 -1963599 -1848529 -1297495 -613586 -201666 -176716
20570 -176716 -347788 -520863 -939847 -1680369 -2452844 -2951867 -2921958 -2480015 -2036462 -1735421
20560 -1735421 -1544123 -1356684 -1015043 -500666 -21936 335841 874779 1852843 2908732
20551 2908732 3630572 3987862 3991511 3743930 3386968 2777074 1938231 1249348 892209 773343
20541 773343 562387 174618 -164438 -479747 -1015045 -1836418 -2636512 -2984426 -2845272 -2545348
20531 -2545348 -1967658 -965097 76944 1006292 1922014 2730200 3268620 3534722 3672304
20522 3672304 3697158 3477258 2918234 2188595 1610253 1515578 1865296 2162253 2110442 1892702
20512 1892702 1698057 1279737 666641 188033 -28571 65668 498297 1186284 1751570 1972410
20502 1972410 2032436 2101595 2492396 3338450 4188663 4635865 4598373 4266917 3844933 3294745
20492 3294745 2587706 1901413 1360446 860693 379402 12808 -110468 -53148 31210 9536
20482 9536 -205914 -610281 -1124574 -1493732 -1382820 -723124 160506 943382 1576194 2014280
20472 2014280 2056359 1586258 925015 524492 377029 252416 171054 185095 142747 48644
20462 48644 144931 434818 530484 153036 -404892 -790989 -992403 -1041999 -1052907 -1039374 -922136
20451 -922136 -768735 -520875 -242734 -178143 -346517 -373941 136329 1037954 1801667 2192964
20441 2192964 2335204 2456335 2671366 2907149 2977302 2828948 2696482 2869664 3312427 3856729
20431 3856729 4330138 4550695 4491115 4151212 3577034 2904365 2433200 2256871 2235325 2517936
20421 2517936 3222149 4043966 4507403 4472593 4070759 3630801 3285531 2829593 2262862 1704610
20411 1704610 1300126 1077889 983064 1187472 1478069 1272896 643911 20748 -553282 -1111706
20401 -1111706 -1462969 -1472972 -1185636 -850654 -598726 -438281 -439223 -394018 -157289 9546
20391 9546 -163870 -630910 -1020898 -940128 -503299 -70099 76988 -139294 -519235 -745803
20381 -745803 -607855 -140298 593849 1386700 1762671 1506776 866619 227322 36014 277603
20371 277603 641492 939486 1016308 901276 763020 686677 774214 983767 1243679 1501362
20361 1501362 1685366 1871244 2033492 2014270 2098411 2371542 2373085 2052640 1741584 1695636
20351 1695636 1763364 1778641 1760249 1603605 1446327 1520032 1644682 1495419 1004581 288859
20341 288859 -506057 -1216167 -1686274 -1869918 -1768171 -1380442 -925210 -606806 -375023 -164371
20331 -164371 19606 110180 145284 282122 552580 926313 1329491 1685405 1928741 2153964
20321 2153964 2411011 2546504 2500306 2327731 2111395 1965734 1909488 1896211 1882114 1850772
20311 1850772 1974297 2219890 2316950 2191082 1878013 1716280 1918462 2214883 2358387 2308776
20301 2308776 1989483 1314081 363842 -646045 -1569279 -2219661 -2349939 -1971816 -1364006
20292 -1364006 -951482 -863102 -721497 -106660 907342 1725237 2019627 1721410 735044
20283 735044 -489073 -1281403 -1394564 -931620 72271 1336183 2266340 2704351 2806353
20274 2806353 2598192 2054646 1248181 416224 -433989 -1424301 -2302948 -2634692 -2267200
20265 -2267200 -1355893 -352938 203751 317451 279955 240913 112627 -206877 -572067 -744941
20255 -744941 -512252 182149 1104593 1927530 2476675 2682059 2589013 2225405 1787120 1457692
20245 1457692 1115186 886921 1073473 1455825 1684375 1818230 2002214 2214312 2455704
20236 2455704 2637831 2661535 2696722 2880994 3058040 2829053 2152649 1470841 888374 388243
20226 388243 258553 480255 483169 -88706 -843532 -1126985 -686410 62504 508606 462345
20216 462345 145664 -322204 -924454 -1419572 -1300096 -528056 227532 460599 207635 -237956
20206 -237956 -717606 -1231453 -1603939 -1665285 -1715653 -2091082 -2693413 -3249143 -3535820 -3632060
20196 -3632060 -3743366 -3762739 -3533238 -2928235 -2185535 -1692333 -1413868 -1152355 -933533 -835306
20186 -835306 -751365 -501517 -266269 -240404 -298167 -269201 -165764 -293360 -752997 -1251704
20176 -1251704 -1566035 -1762921 -1854029 -1839128 -1753603 -1600901 -1264730 -609834 167872 692453
20166 692453 703217 440271 325612 248978 -91075 -534259 -632184 -202896 592476 1455962
20156 1455962 1974690 1988021 1610695 1011126 240452 -521862 -1066686 -1290205 -943351 -214942
20146 -214942 362774 663380 774312 650803 294195 -108054 -410167 -476156 -248516 181256
20136 181256 891219 1865603 2752095 3242022 3339104 3200396 2963395 2488079 1820749 1246606
20126 1246606 923393 863283 960664 1228506 1728028 2184870 2255233 1949295 1669714 1843824
20116 1843824 2269332 2334239 1878838 1275664 908439 838634 960227 1193317 1256443 910249
20106 910249 470991 399992 575739 524312 232068 -47531 -274319 -230993 364215 1233460
20096 1233460 2025264 2710049 3183249 3235740 2859276 2419830 2134434 1987920 1904738 1906755
20086 1906755 2147273 2360577 2048434 1315669 753224 584677 801615 1264373 1738327
20077 1738327 1957009 2025005 2322617 2735882 3144190 3814585 4828089 5738007 6173488
20068 6173488 6215828 5932732 5440549 5191593 5356915 5633398 5701743 5527021 5379343 5503342
20058 5503342 5948070 6650185 7438886 8024124 8336858 8479093 8338686 7824052 7182045
20049 7182045 6698591 6284731 5810049 5494860 5576678 5854173 6025153 6023095 5876497 5541248
20039 5541248 5011058 4528162 4324315 4333109 4601592 5052074 5489378 5767932 6020040 6521860
20029 6521860 7204351 7701200 7861777 7876550 7873596 7870177 7981136 8359644 8842413 9145241
20019 9145241 9092257 8729878 8111282 7329319 6686262 6372978 6340874 6333956 6226050 6253677
20009 6253677 6825498 7861001 8812265 9192406 9116924 9001920 9036921 9318324 9703722 9876045
19999 9876045 9734762 9550343 9546944 9801255 10185047 10302178 9797021 8844664 8359930 8918681
19989 8918681 9883366 10539085 10975094 11760133 12933234 14061917 14943471 15627940 16120228
19980 16120228 16646227 17485432 18459457 19267572 19937588 20472969 20868725 21371050 22332520
19971 22332520 23765695 25264663 26462808 27257488 27783086 28508492 30042793 32547550
19963 32547550 35853800 39438837 42881818 46292964 49790970 53695969 58568693 64581669
19955 64581669 71490721 79107796 87499122 96895793 107611013 120186886 135193264 152889900
19947 152889900 173019946 195421786 219989973 246109304 272333606 295902491 313065778
19940 313065778 320701359 317526770 304338242 283784846 259356570 233843635 208961531
19933 208961531 186008681 165734371 148272555 133267401 120029614 108192625 97776359
19926 97776359 88631984 80812806 74480763 69515101 65604411 62459922 59860751 57643780
19918 57643780 55795177 54397359 53410557 52613058 51920743 51412716 51382117 51960010 52883041
19909 52883041 53769891 54287393 54324792 53961888 53332692 52609686 51838121 50966386 50097578
19900 50097578 49506757 49271430 49290939 49497540 49808763 50282800 51333208 53305802 56018760
19891 56018760 59116690 62396433 66012273 70188752 75022797 80517942 86615805 93300869
19883 93300869 100605957 108592834 117089083 125716099 134081501 141402393 146520554 148342306
19875 148342306 146287070 140887453 133353647 124721055 115831676 107272791 99397945 92048954
19867 92048954 85035079 78610080 72986637 68387427 64785374 61928123 59720589 57925095
19859 57925095 56286765 54593411 52524451 50124418 47699998 45544217 43754270 42008311
19851 42008311 40073715 37867880 35305913 32807084 30685973 28969540 27577763 26299365
19843 26299365 25219613 24308034 23523194 23006145 22661881 22012750 21172254 20926564 21400657
19834 21400657 22025052 22320170 22259018 21903036 21207004 20300052 19476779 18935622 18537748
19825 18537748 18104559 17725068 17685151 17857553 18008077 18248772 18471469 18505878 18299275 17797109
19815 17797109 17374853 17416396 17803679 18201703 18688510 19595931 20677547 21509867 22007462
19806 22007462 22034539 21807485 21749772 22012479 22674513 23596924 24585503 25671413 27127599
19797 27127599 28878577 30703579 32577725 34358031 35915150 37057575 37726307 38117562
19789 38117562 38176623 37800035 37415019 37454870 37951701 38899312 40402318 42442233 44954515
19780 44954515 47981478 51640291 56042010 61225063 67325004 74145296 81075306 87927914
19772 87927914 94903799 102354730 110615276 119932840 130577224 143041925 157790682 174456986
19764 174456986 191927600 208347170 221005457 227260480 225628293 216178262 200668860
19757 200668860 181883525 162539519 144502830 128464541 114382485 102203245 91811718
19750 91811718 82684522 74339457 66776442 60245978 54670665 49857543 45807130 42403667
19742 42403667 39405623 36453714 33351180 30324883 27838208 26231762 25332726 24608550
19734 24608550 23635582 22326295 20717456 18890302 16965305 15025282 13264491 11968479
19726 11968479 11220757 10809929 10510667 10352472 10267678 10009266 9431971 8788701 8445295
19717 8445295 8367963 8315077 8048081 7667013 7380191 7204594 7074025 6825861 6357766 5743244
19707 5743244 5303684 5084610 4875262 4688757 4696124 4835845 4845057 4553736 4119900 3904065
19697 3904065 3904937 3875674 3745103 3496397 2978311 2210579 1438020 846384 386995 106994
19687 106994 226242 778924 1594848 2296835 2559059 2524108 2611282 3046061 3926531 5170593
19677 5170593 6475245 7510248 8210159 8820233 9247413 9125230 8437930 7417993 6407464
19668 6407464 5778549 5700822 5867101 6093015 6789920 7949268 8925250 9273029 9137018
19659 9137018 8767602 8211697 7437372 6589544 5948732 5750394 5757594 5469030 4913247 4485196
19649 4485196 4493178 4968697 5579010 6007981 6149721 5737454 4802088 3783527 2964662 2387426
19639 2387426 2096716 2080631 2187672 2416677 2913484 3837262 4916589 5606271 5785656
19630 5785656 5929391 6535200 7291210 7356612 6523061 5327664 4161519 3112271 2395290
19621 2395290 2165766 2195236 2274127 2536272 2973084 3269696 3539805 4054366 4395100 4289797
19611 4289797 3982061 3653744 3264567 2902108 2624228 2429764 2478137 2647205 2691752 2607408
19601 2607408 2474317 2281836 1814035 1144631 591088 193683 84025 414355 876327
19592 876327 1125448 1197834 1320275 1642480 2112910 2393541 2339945 2166672 2033606 2081385
19582 2081385 2471281 3197779 4130739 4992389 5457728 5577525 5652204 5653660 5432125 4884106
19572 4884106 4048842 3406016 3090083 2847394 2643371 2601474 2728330 2671252 2399619 2387763
19562 2387763 2757513 2986913 2733849 2298145 2136144 2383806 2655655 2579949 2207795 1668218
19552 1668218 1168134 874164 840344 1119256 1561491 1831949 1798366 1718238 1858981 2099686
19542 2099686 2114418 1686913 1103736 866826 916898 1060016 1382090 1726977 1754871 1568534
19532 1568534 1341400 949894 459827 44836 -245549 -519112 -956569 -1608157 -2366118
19523 -2366118 -2902586 -2878760 -2212098 -1126589 -17763 710032 910734 746397 350700
19514 350700 -125768 -462646 -487653 -150753 433586 1222430 2181739 3200456 4083060 4544156
19504 4544156 4570900 4340891 3919827 3409366 3097533 3164029 3417732 3404257 2930216 2302716
19494 2302716 1905482 1734247 1550695 1226293 855110 636581 547063 470281 432250 419179
19484 419179 234415 -25854 -134605 -270631 -623378 -990892 -1177354 -1143615 -892802 -595238
19474 -595238 -470343 -545565 -585005 -431427 -249060 -183893 -215848 -276309 -256439 -79070 -46487
19463 -46487 -515924 -1259507 -1700923 -1375813 -298356 1228452 2754245 3602217 3747856
19454 3747856 3544531 3029735 2352700 1828887 1551070 1379446 1027947 476461 33741
19445 33741 -146094 -341187 -561598 -413075 185012 926524 1278513 1038934 783526 1005092
19435 1005092 1639982 2508634 3366944 4073955 4633473 4930645 4855898 4628910 4429855 4087537
19425 4087537 3482470 2868155 2604638 2531399 2403254 2345791 2385793 2410585 2403116 2315491 1976825
19414 1976825 1225853 225993 -613029 -1132097 -1476186 -1617778 -1345819 -537520 467118
19405 467118 1188749 1514872 1602955 1604651 1352661 974787 948281 1414289 1950668 2265329
19395 2265329 2496694 2738685 2839391 2587236 2095859 1719822 1596312 1500491 1321326 1030944
19385 1030944 379206 -454730 -1029864 -1190178 -954441 -396236 311816 873191 1161910
19376 1161910 1367660 1643407 1843255 1978559 2276556 2807919 3300265 3365281 2933203 2361190
19366 2361190 2223431 2649880 3304999 3938123 4394526 4501240 4204033 3604213 2867010
19357 2867010 2169293 1717708 1767025 2329419 3074278 3619349 3891832 3951205 3943404 3878407
19347 3878407 3544714 2994443 2488386 2454569 2850992 3055418 2775687 2280834 2116466 2339595
19337 2339595 2527488 2413245 2054758 1618443 1337250 1330327 1597435 2176813 2881321 3372617
19327 3372617 3416716 3159974 2963525 2921165 2925584 2881645 2634920 2147850 1632452 1521934
19317 1521934 1969661 2383913 2228730 1721595 1217867 913335 774511 493039 -84091
19308 -84091 -887194 -1685200 -2118583 -1995887 -1458058 -677683 41706 363695 316866 51127
19298 51127 -420162 -1065171 -1717052 -2228399 -2667418 -2865373 -2488961 -1539452 -153945 1177477
19288 1177477 1867819 1927199 1706891 1548304 1692389 2190419 3018803 3777750 4141233 4103290
19278 4103290 3700923 3204751 2905555 2712507 2275304 1646360 1277504 1332780 1652611 1863816
19268 1863816 1630708 983193 163187 -617019 -1178656 -1429985 -1324870 -865483 -93661
19259 -93661 915342 2101642 3264465 4003373 4068523 3761904 3486212 3330539 3297028 3207080
19249 3207080 2904203 2422518 1885559 1445689 1082258 611424 164370 -143489 -474500
19240 -474500 -809882 -1061392 -1093667 -610870 47478 191307 -228668 -818706 -1382315 -1778918
19230 -1778918 -1687425 -1277770 -1133406 -1444207 -1908957 -2101928 -1829347 -1170458 -96165
19221 -96165 1249274 2340038 2883572 2859344 2505829 2061284 1531883 1216489 1317733 1707162
19211 1707162 2286796 2723773 2698394 2288165 2023256 2095057 2005512 1320457 305906 -385910
19201 -385910 -395470 219557 1337711 2657784 3712611 4166520 3831890 2900606 1930818
19192 1930818 1321015 1125917 1191673 1348718 1242369 740268 286802 -621 -301394 -649696
19182 -649696 -941975 -1117476 -1331830 -1396986 -934360 -27156 779888 973978 612763 340406
19172 340406 531018 840599 709321 90467 -623053 -1297661 -1938292 -2253679 -2023838 -1483752
19162 -1483752 -948258 -560453 -367662 -445025 -690224 -643412 -339426 -212718 -124917 311535
19152 311535 1053510 1612511 1743572 1576732 1223377 645758 121117 -19885 -21970 -145992
19142 -145992 -185860 78941 475568 757785 1067499 1529054 2010930 2274954 2279440 1901579
19132 1901579 1066325 99467 -609830 -991777 -1193783 -1248944 -1110943 -1013993 -1252428 -1804970
19122 -1804970 -2329481 -2481137 -2183221 -1579429 -985973 -641020 -529076 -466002 -359577 -339381
19112 -339381 -510163 -632117 -525233 -262744 138658 761225 1618123 2512581 3085724 3041049
19102 3041049 2623877 2239994 2127966 2173588 2168371 2204356 2162760 1889127 1555582 1283361
19092 1283361 1237249 1558969 1924996 1930462 1834171 2151950 2832933 3555448 4005987 4018352
19082 4018352 3684224 3229896 2801431 2267288 1594212 1178891 1266658 1551853 1679765 1637285
19072 1637285 1390391 889559 288535 -200476 -204182 328335 903848 1312601 1706984 1959538
19062 1959538 1920660 1654513 1233678 875412 783729 760034 593812 535359 742690 1155541
19052 1155541 1691182 2155880 2413341 2452345 2208190 1529726 586038 -204094 -444612 -171054
19042 -171054 175490 357368 401414 247771 -35728 38463 815853 1954713 2766696 2988104
19032 2988104 2966162 3098128 3270823 3164936 2852445 2644649 2702908 2833011 2780177 2595321
19022 2595321 2550785 2840405 3285902 3599960 3746519 3842783 3998482 4157891 4177334 4229486
19012 4229486 4529187 4811116 4566615 3793954 3023497 2515160 2093410 1492597 823682
19003 823682 479345 360341 181251 67819 228756 678298 1121408 1243788 1036918 566362
18993 566362 -47859 -467835 -455906 -245575 -363820 -866400 -1328235 -1355231 -906664 -308565
18983 -308565 242172 659944 829501 838365 837758 861023 831843 564380 10940 -676161 -1236010
18972 -1236010 -1325457 -930544 -522667 -423028 -689927 -1063239 -1424746 -1785808 -2095563 -2489054
18962 -2489054 -2799085 -2679021 -2167336 -1614965 -1241382 -953100 -745709 -675333 -639631 -680342
18952 -680342 -1077213 -1779616 -2262438 -2283614 -2035245 -1732561 -1424222 -1011896 -433047 30519
18942 30519 14358 -580754 -1563907 -2411219 -2750670 -2679265 -2742766 -3056706 -3194032 -2929707
18932 -2929707 -2325717 -1614091 -1153612 -1061642 -978973 -634352 -116027 347855 650174 861366
18922 861366 958100 841392 511612 74875 -188297 -147388 43685 366553 825185 1274351
18912 1274351 1511899 1315693 858388 634795 849998 1323034 1782422 2136620 2495545
18903 2495545 3000378 3557017 3991080 4115584 3875233 3266512 2227378 994923 29357
18894 29357 -320177 -101054 296630 687210 1022455 1327621 1552886 1458730 1152920 955255
18884 955255 987986 1104415 824508 -36931 -1200147 -2238369 -2900503 -3070825 -2683633
18875 -2683633 -2180390 -2228729 -2737418 -3099164 -3048464 -2620894 -2025126 -1375234 -523701 373607
18865 373607 1026583 1460949 1479206 1101086 741780 555496 421606 262426 360459 792584
18855 792584 1279280 1646774 1760216 1574775 1221596 1103471 1283744 1388073 1239526 742263
18845 742263 -132301 -1203584 -2019850 -2352980 -2462669 -2625393 -2812081 -2785447 -2612013 -2209911
18835 -2209911 -1214459 229249 1585226 2295251 2148997 1451565 770769 327281 -286400
18826 -286400 -1240756 -2083077 -2292272 -1757515 -815159 42047 475789 516221 373352 54793
18816 54793 -383570 -469696 127451 1022442 1488397 1183793 282051 -712401 -1483198 -1976385
18806 -1976385 -2235821 -2577442 -3023739 -3058094 -2379450 -1384184 -639892 -247867 -26487 248197
18796 248197 732078 1491441 2508073 3396131 3883185 4021604 3872248 3655674 3627275 3749964
18786 3749964 3655934 3106746 2573949 2543663 2744043 2723066 2191021 1128522 17075 -675488
18776 -675488 -1054512 -1368372 -1673248 -1895324 -1943641 -1939278 -1980212 -1964701 -1756773 -1470626
18766 -1470626 -1419796 -1750223 -2241895 -2634149 -2959444 -3153514 -3113106 -2884989 -2556044 -2177101
18756 -2177101 -1805465 -1575463 -1644785 -1877031 -1772901 -1082354 -65014 588832 463966
18747 463966 -63751 -473953 -538057 -290453 132297 605687 855132 718479 312351 -88865
18737 -88865 -310939 -472955 -614543 -548558 -221883 180031 333494 73604 -411081 -775367
18727 -775367 -891306 -620756 229013 1460213 2586202 3286305 3601273 3469933 2621829
18718 2621829 1226975 -189605 -1361576 -2390365 -3067395 -3113555 -2639151 -1929989 -1197194
18709 -1197194 -567096 -59813 290016 495723 779853 1206954 1453240 1245977 505738
18700 505738 -643538 -1774899 -2459483 -2532367 -2193895 -1694777 -1266229 -1276601 -1653666 -1883135
18690 -1883135 -1806204 -1663998 -1789177 -2319176 -2845154 -2981094 -2723863 -2248663 -1688836 -1163223
18680 -1163223 -830319 -601812 -275574 255899 982183 1651236 1934256 1758901 1312010
18671 1312010 809845 466205 460866 586246 700439 987837 1579191 2334753 3012796 3292625
18661 3292625 2935633 2260092 1535462 704893 -131069 -706783 -836557 -555271 -134432
18652 -134432 161706 326577 513193 943328 1774771 2501117 2447868 1738875 800946 -182026
18642 -182026 -998535 -1451646 -1488096 -1260930 -887485 -384980 162370 625079 792926 623689
18632 623689 719714 1674161 3034671 3701214 3131539 1852469 675497 -85616 -587831
18623 -587831 -721110 -191337 844119 1878864 2501985 2421330 1499288 24777 -1326974
18614 -1326974 -1817962 -1378838 -544424 167620 478427 546979 715646 932175 989543 816368
18604 816368 363869 -293363 -1055243 -1758209 -2125385 -2061381 -1719660 -1205870 -697821 -300173
18594 -300173 84975 487367 781651 768740 562496 556484 748516 704444 224193 -328799
18584 -328799 -672233 -1019309 -1422394 -1649000 -1628515 -1402788 -992153 -572524 -267205 139051
18574 139051 1037144 2267717 3059500 3119414 2662027 1906840 1252154 1013821 1013697 964288
18564 964288 970339 1159117 1208984 870835 341344 -194837 -687011 -1102537 -1431105 -1595227
18554 -1595227 -1565855 -1407836 -1247863 -1049478 -748568 -154044 694559 1432046 1876777 2035338
18544 2035338 1963899 1732277 1255965 617909 150534 -89260 -124577 144895 673610 1050932
18534 1050932 734416 -280955 -1476917 -2451601 -3275877 -3943266 -4084256 -3538781 -2807066
18525 -2807066 -2374694 -2039167 -1492453 -879200 -780993 -1356858 -2068162 -2556877 -2861760 -2995629
18515 -2995629 -2979813 -2863087 -2528266 -2064842 -1671020 -1345723 -1063849 -750375 -514921 -577074
18505 -577074 -874611 -1205770 -1540979 -1964736 -2403833 -2654388 -2481262 -1999622 -1481017 -963326
18495 -963326 -443805 -109660 -75280 24909 459521 967576 1212422 1339072 1669296 2015163
18485 2015163 1893238 1274014 696778 441249 456688 666348 710403 364598 -190884 -699032
18475 -699032 -1164025 -1689909 -2149281 -2258201 -1977102 -1803443 -2217609 -2960118 -3524083 -3712823
18465 -3712823 -3443408 -2593682 -1382420 -233093 794835 1542507 1670172 1255086 836286
18456 836286 727098 610243 243673 -244770 -756586 -1126179 -1307541 -1351349 -1087094 -605496
18446 -605496 -156996 298062 627003 552753 27527 -734136 -1461725 -1954985 -1998998 -1640522
18436 -1640522 -1116173 -594967 -303863 -262479 -292954 -291348 -390636 -715394 -1005281 -799983
18426 -799983 -142349 417269 632782 628744 702252 994659 1151006 915397 514122 206735
18416 206735 44640 99974 413792 687411 734961 679391 609934 408629 -70465 -758167
18406 -758167 -1291304 -1366823 -1228987 -1353840 -1650908 -1844862 -2000147 -2070893 -1870471 -1272824
18396 -1272824 -415726 434830 1281020 2079769 2489171 2274977 1624138 801237 -246433
18387 -246433 -1369270 -1998365 -1866403 -1322714 -866225 -871325 -1187774 -1387032 -1358095 -1071682
18377 -1071682 -632915 -550938 -880652 -1158107 -1341312 -1537384 -1514263 -951042 -115587 144570
18367 144570 -497803 -1451369 -1959306 -1835332 -1437305 -1138791 -924035 -493635 99704 560238
18357 560238 681167 620283 597467 444582 44549 -235342 -89320 161272 157376 -34218
18347 -34218 -171804 -179096 -12168 350236 851978 1229682 1060836 209489 -868783 -1607531
18337 -1607531 -1892336 -1732232 -1332463 -962533 -626227 -271976 -59639 -269961 -857302
18328 -857302 -1360264 -1508449 -1409709 -975668 -216291 523933 1001968 1306233 1692744 2157259
18318 2157259 2630108 2914844 3068738 3358019 3548606 3476819 3319324 3349044 3596985 3815533
18308 3815533 3842197 3488528 2698057 1443636 129150 -603792 -643260 -226773 143143
18299 143143 218142 274691 619834 1138501 1462029 1591189 1671190 1756775 1770382 1425926
18289 1425926 564556 -447799 -1069721 -1189252 -792309 -78452 260843 -39825 -403735
18280 -403735 -320391 170362 675362 901925 900839 660940 166766 -355584 -637190 -727061
18270 -727061 -785841 -881483 -1131824 -1564465 -2171439 -2832831 -3292598 -3399090 -3153261 -2778589
18260 -2778589 -2545465 -2413658 -2282813 -2354202 -2610232 -2796516 -2775356 -2462819 -1851663 -1203133
18250 -1203133 -665142 -30913 603198 887484 929392 1056130 1303187 1516854 1462884 1054145
18240 1054145 482885 -12722 -224511 -90231 198199 231911 -70177 -387681 -360166 -15542
18230 -15542 234467 195267 115546 421031 1097581 1573255 1398377 841869 490620 389905
18220 389905 334612 297722 184008 -50145 -241634 -108410 498917 1374646 2165041 2501195
18210 2501195 2092948 1143305 174039 -312210 -240499 107621 502881 728424 643767 467269
18200 467269 557092 986325 1613718 2041228 1942606 1556521 1283775 1367614 1708142 2011726
18190 2011726 2100494 1900448 1505997 1167925 1137358 1427711 1803461 1926620 1574334 871332
18180 871332 153908 -287446 -286999 222208 964632 1494007 1590041 1394092 1148918 800776
18170 800776 231067 -432362 -1064195 -1532510 -1705870 -1856491 -2437777 -3274461 -3697383 -3429251
18160 -3429251 -2751645 -2086605 -1629248 -1507221 -1742896 -2249071 -2948530 -3565740 -3835095
18151 -3835095 -3918303 -4016979 -4260881 -4567166 -4543363 -3856773 -2579190 -1164469 -47738
18142 -47738 530495 550664 250450 49114 116596 77259 -561976 -1460916 -2012175 -2331443
18132 -2331443 -2882033 -3565907 -3831743 -3708473 -3733140 -4107489 -4380316 -4163369 -3718586 -3219183
18122 -3219183 -2471447 -1559892 -867938 -560408 -637655 -986987 -1428760 -1828604 -1986905 -1881373
18112 -1881373 -1595160 -1128507 -447918 368305 1054054 1411609 1650110 1826996 1685372
18103 1685372 1047442 110819 -731584 -1451621 -2011925 -2223793 -2048453 -1698691 -1510007
18094 -1510007 -1509678 -1554998 -1651337 -1779343 -1975769 -2254449 -2421701 -2296004 -2014713 -1889475
18084 -1889475 -2111601 -2465837 -2578838 -2449228 -2230223 -1811425 -1108212 -391139 148512
18075 148512 664758 1163565 1322227 885975 -28938 -930242 -1344094 -1374607 -1345887 -1369149
18065 -1369149 -1375043 -1404659 -1462738 -1409962 -1156329 -879132 -903338 -1253925 -1637106 -1768248
18055 -1768248 -1630644 -1324107 -889051 -412133 139060 905573 1830251 2605330 2941504
18046 2941504 2648443 1926593 1300652 850569 554126 470909 660142 1035373 1379365 1426041
18036 1426041 1183225 878563 663638 752610 1043849 1371136 1761304 2197339 2479674 2510417
18026 2510417 2445263 2464080 2430974 2004151 1210665 555429 388098 592175 872611 1040839
18016 1040839 1060265 957143 846931 917279 1329410 1919423 2389638 2593289 2670121 2693038
18006 2693038 2615932 2616097 2688025 2759682 2899870 3068821 3038451 2632204 1890895 996909 118145
17995 118145 -374396 -375675 -209402 -222473 -515501 -949566 -1313907 -1415014 -1295174 -1117707
17985 -1117707 -1086252 -1342148 -1688259 -1829673 -1810049 -1790895 -1785476 -1776167 -1652295 -1307781 -950146
17974 -950146 -696628 -397705 -164485 -150917 -127268 -64949 -147632 -323853 -494774 -742249
17964 -742249 -828006 -553549 -88502 492414 1107947 1677369 2178053 2804815 3571216 4162947
17954 4162947 4381777 4346794 4155087 3627236 2685674 1678950 1054445 761605 534763
17945 534763 291032 163101 -63520 -705549 -1469748 -1833898 -1667054 -1123735 -535742 -321734
17935 -321734 -529755 -710013 -592392 -323101 -136100 -208047 -497053 -854249 -1023284 -828091
17925 -828091 -411018 -106197 -241479 -845133 -1455816 -1726660 -1765632 -1588240 -1326974 -1187299
17915 -1187299 -1057757 -833259 -560247 -380033 -212504 263100 998099 1650274 2087379
17906 2087379 2407842 2672173 2869933 3040560 3097248 2790941 2069002 1096846 86327
17897 86327 -801231 -1413730 -1510149 -1162416 -1048650 -1546977 -2197382 -2398447 -2191244 -1784766
17887 -1784766 -1157510 -591534 -501626 -854038 -1282189 -1583493 -1645025 -1361337 -888757 -404848
17877 -404848 120674 577225 726996 595662 451949 550181 812416 935577 724411 104380
17867 104380 -618026 -877366 -636081 -325078 -280149 -415677 -479093 -281204 150922 542315
17857 542315 1004357 1765742 2411813 2622992 2471005 1823614 572174 -972970 -2345083
17848 -2345083 -3218964 -3714473 -4121090 -4153298 -3565439 -2523105 -1390969 -577711 -206814
17839 -206814 -11005 106003 174433 487262 1186355 1716418 1544173 826709 -312529 -1689270
17829 -1689270 -2755037 -3286648 -3470077 -3506143 -3497851 -3450997 -3190355 -2461263 -1567666 -1138437
17819 -1138437 -1214602 -1384282 -1497974 -1568339 -1490865 -1220737 -767518 -313962 -265825 -592876
17809 -592876 -964532 -1231456 -1439217 -1499939 -1198645 -425346 579169 1353482 1650222 1544441
17799 1544441 1330944 1443428 1958659 2381322 2547113 2669837 2958713 3420386 3942613
17790 3942613 4521516 5034481 5410638 5796119 5952250 5608970 5172577 5105935 5347367 5641914
17780 5641914 5770221 5550656 5042262 4430433 3759696 2957054 1936038 1098823 807778
17771 807778 625624 128044 -591569 -1098897 -1160933 -859763 -285604 378293 985697 1548079
17761 1548079 2031170 2143073 1645041 681149 -463319 -1525015 -2384991 -2907860 -2826239
17752 -2826239 -2089093 -1170517 -656542 -484818 -237025 188117 540186 694101 659534 427134
17742 427134 3911 -646159 -1461211 -2088364 -2350325 -2592869 -2747490 -2307281 -1221256
17733 -1221256 9139 901806 1269695 1315790 1456323 1793521 2133525 2270689 2046322
17724 2046322 1505913 851846 388038 232748 124125 -88545 -326123 -683510 -1224915
17715 -1224915 -1678022 -1749938 -1376260 -544802 568977 1340123 1328577 855649 462965 299002
17705 299002 320994 442981 382123 -161533 -1146951 -2178597 -2723425 -2513433 -1866323 -1368143
17695 -1368143 -1266520 -1228447 -966245 -711036 -550524 -274452 -88572 -301572 -767060 -1270476
17685 -1270476 -1654302 -1962702 -2346228 -2550224 -2270053 -1654171 -1068498 -427093 391581
17676 391581 1019905 1155621 963212 788353 688455 460287 53976 -301230 -311566 192677
17666 192677 939116 1556520 1965592 2237932 2321207 2195534 1889880 1348339 498828 -534984
17656 -534984 -1361233 -1719475 -1620774 -1316509 -1051407 -873405 -706783 -452914 -121070 205738
17646 205738 499431 775473 919886 885600 703695 424770 208629 284027 570415 898339
17636 898339 1347298 1944078 2480408 2944932 3286256 3035148 2167935 1202654 370202 -362730
17626 -362730 -788442 -626842 34707 779431 1280432 1432869 1371951 1242544 1092098 1086940
17616 1086940 1265802 1434090 1360300 1008655 592956 6140 -787843 -1322542 -1217662 -798941
17606 -798941 -689040 -1015896 -1550279 -2053173 -2311143 -2328265 -2311300 -2419144 -2822236 -3448758
17596 -3448758 -3815933 -3874923 -3926196 -3870823 -3489789 -2850387 -2291581 -2090927 -2195446 -2336460
17586 -2336460 -2488227 -2732599 -2927222 -2989122 -2889174 -2514051 -2013966 -1639419 -1271438 -839678
17576 -839678 -480724 -384953 -665183 -1017884 -1345199 -1911361 -2712561 -3624977 -4457384 -4996785
17566 -4996785 -5279409 -5452103 -5526722 -5440226 -5127219 -4574789 -3762957 -2729892 -1855426 -1410023
17556 -1410023 -1315327 -1326256 -1373352 -1519335 -1714276 -1597182 -932029 3703 681209 837741
17546 837741 587610 92637 -426314 -850167 -1128944 -1088761 -627707 -79378 35824 -137144
17536 -137144 -241400 -202520 104593 585644 960541 1222519 1524653 1749275 1437303 656430
17526 656430 111838 84270 224686 283230 24198 -710695 -1682474 -2486678 -2872152 -2794519
17516 -2794519 -2573160 -2704383 -3223586 -3753511 -4074267 -4189799 -4081321 -3681205 -3095292
17507 -3095292 -2589738 -2169638 -1714170 -1332132 -1109919 -962769 -791864 -585584 -448630
17498 -448630 -359568 -327397 -412295 -774976 -1367197 -1887079 -2290719 -2787149 -3036798 -2672308
17488 -2672308 -2013118 -1464956 -1032846 -523156 -92943 -236941 -976473 -1814950 -2306545
17479 -2306545 -2318293 -1897680 -1302325 -939727 -773697 -477112 -44213 131231 -86357 -419068
17469 -419068 -557967 -344865 -17009 -4570 -405292 -813158 -844641 -496766 -68729 165044
17459 165044 294011 185971 -412644 -1295854 -1899072 -1877187 -1610012 -1551698 -1697590 -1937685
17449 -1937685 -2149917 -2325413 -2542399 -2519505 -1871267 -676433 518196 1288018 1628896
17440 1628896 1559701 1272821 1019911 678678 89543 -597808 -1299182 -2027691 -2561555 -2604985
17430 -2604985 -2149703 -1535473 -964528 -478633 -183782 -299046 -890531 -1622370 -2119540
17421 -2119540 -2200615 -1932447 -1574908 -1508067 -1809664 -2094583 -2205365 -2315057 -2555693 -2967211
17411 -2967211 -3368493 -3588324 -3718049 -3683967 -3230037 -2243578 -852425 665364 1891026
17402 1891026 2485376 2592566 2570567 2677939 2968477 3198518 3206093 2914254 2337209 1692328
17392 1692328 1204486 817782 460112 205007 52310 -46976 -197691 -410783 -418470 -96918
17382 -96918 334689 550427 500643 685547 1294006 2006911 2586914 2980159 3083152 2677619
17372 2677619 1842924 1128370 730390 288224 -348021 -1041483 -1558462 -1621611 -1274057 -716877
17362 -716877 -65635 374832 490399 679269 1270421 2198449 3222039 3953924 4083002
17353 4083002 3806126 3498238 3178640 2555819 1468090 196276 -947542 -1807827 -2345209
17344 -2345209 -2519603 -2441583 -2224549 -1879434 -1683212 -1898899 -2327678 -2751749 -3037675 -3023709
17334 -3023709 -2736722 -2310481 -1931861 -1511149 -964424 -588093 -531648 -777560 -1175720 -1297679
17324 -1297679 -966798 -407087 55980 253184 246020 157078 123945 150090 126354 340562
17314 340562 1072409 1841493 2002081 1594588 1089575 688332 215399 -434308 -1058889 -1376000
17304 -1376000 -1146989 -462195 181540 496152 454683 156323 -220950 -371910 -288342 -347485
17294 -347485 -572581 -833002 -1284501 -1868347 -2290258 -2511186 -2742359 -2842845 -2742073 -2938221
17284 -2938221 -3707462 -4691052 -5420582 -5548776 -5087486 -4377925 -3878062 -3780376 -3781006 -3589392
17274 -3589392 -3180899 -2424824 -1363200 -519286 -21401 127080 -151402 -562794 -818331
17265 -818331 -870516 -842061 -1001279 -1484761 -2070174 -2373104 -2362679 -2330561 -2450675 -2573947
17255 -2573947 -2475988 -2127504 -1725733 -1550750 -1547382 -1348704 -972732 -589247 -364337 -434770
17245 -434770 -517097 -342052 50723 526141 688106 383615 3169 -105580 -112979 -283616
17235 -283616 -310265 161720 857202 1392974 1625566 1464696 904922 159296 -360787 -451248
17225 -451248 -376280 -234343 69483 307228 232806 81441 128019 247128 367910 594297
17215 594297 754532 695780 620680 590124 687434 1103177 1534344 1502642 1082875 564131
17205 564131 18347 -450232 -590432 -378202 10773 330192 342685 86417 -306932 -641104
17195 -641104 -813290 -927024 -978403 -840531 -550850 -387270 -419289 -475764 -631249 -1114530
17185 -1114530 -1894682 -2434209 -2402161 -1987135 -1643386 -1517722 -1351916 -993997 -498239 -36840
17175 -36840 303939 493963 378213 -127939 -963921 -1693336 -1778708 -1474083 -1440285 -1809095
17165 -1809095 -2082978 -1835897 -1058906 -53047 883933 1330331 1165406 721765 109195
17156 109195 -573041 -985892 -1155828 -1104603 -785880 -450711 -265145 -314688 -620209 -1056879
17146 -1056879 -1467650 -1852239 -2115025 -1896713 -1321402 -864067 -522865 18534 735220
17137 735220 1201649 1197510 917768 666848 828453 1508091 2464743 3291434 3672212 3558991
17127 3558991 3204993 2803469 2318018 1752246 1108503 397059 -210415 -643631 -1170860
17118 -1170860 -1920252 -2590644 -3009250 -3210892 -3263600 -3137035 -2670068 -2005722 -1461882 -1197717
17108 -1197717 -1189106 -1207869 -1112862 -1029648 -962194 -888337 -937169 -1010122 -734810 -124123 471645
17097 471645 996783 1551647 2129498 2747736 3277372 3506173 3407549 3056094 2427991 1584358
17087 1584358 968772 691208 500406 353674 321367 316653 112125 -435645 -1319390 -2410227
17077 -2410227 -3405395 -4077285 -4283572 -4028899 -3553513 -3161630 -3031775 -3087063 -3134030 -2998310
17067 -2998310 -2673505 -2214095 -1563791 -795587 -168209 261870 510113 541304 382610 107472
17057 107472 -99882 58369 586220 1215904 1567737 1414709 942405 509377 236091 -38791
17047 -38791 -550489 -1312392 -2088823 -2639759 -2817894 -2773428 -2796501 -2900546 -2854340 -2686745
17037 -2686745 -2456807 -2063916 -1609171 -1176006 -1043356 -1375201 -1744401 -1794916 -1659632 -1563102
17027 -1563102 -1599996 -1808480 -2131981 -2504143 -2704142 -2595798 -2206373 -1686548 -1298310 -1165643
17017 -1165643 -1223216 -1221996 -902042 -287839 330234 605979 558477 499059 534385 385439
17007 385439 27766 3114 455963 907461 966810 642258 141541 -355071 -753345 -994677
16997 -994677 -1021035 -833303 -513017 -189722 -49754 -212252 -622607 -1234683 -1933347 -2446025
16987 -2446025 -2472745 -1967371 -1228343 -537180 5113 350910 465768 538974 676463 700973
16977 700973 633174 774915 1201269 1605287 1644197 1285988 747393 268439 -194235 -860114
16967 -860114 -1496239 -1823674 -1964396 -1860281 -1639675 -1725427 -1922416 -1852133 -1630597 -1427408
16957 -1427408 -1119786 -628832 -140320 77317 -172152 -896833 -1708695 -1892582 -1318415
16948 -1318415 -451545 537525 1623260 2441828 2592389 2055976 1033570 -90748 -892745
16939 -892745 -1397494 -1757975 -2173723 -2689264 -2955157 -2883919 -2669198 -2465274 -2398094 -2328038
16929 -2328038 -2080954 -1790492 -1497732 -1306014 -1383322 -1517369 -1267612 -473728 578006
16920 578006 1453349 1848668 1674742 1086413 311034 -397626 -996293 -1516699 -1882787 -1884431
16910 -1884431 -1399433 -886617 -878430 -1257742 -1370410 -913455 -31985 1110765 2196940
16901 2196940 2836266 2800853 2233852 1614527 1205842 923769 788118 795952 804561 699841
16891 699841 548168 583454 610485 323984 84419 234039 561873 673037 346020 -243382
16881 -243382 -683227 -803566 -681924 -408757 -124881 -12547 -413243 -1337774 -2496908
16872 -2496908 -3651577 -4402745 -4496049 -4109802 -3730353 -3659883 -3773859 -3823101 -3695324 -3427264
16862 -3427264 -3149173 -3040647 -3029743 -2848623 -2276887 -1419081 -615003 -164293 -73626 32682
16852 32682 412157 818134 808565 326928 -225808 -433843 -303221 -106666 44011 305125
16842 305125 732460 1118463 1343700 1646235 2125983 2556899 2834530 3023409 3089739 2946687
16832 2946687 2637939 2281479 2125223 2267923 2562688 2748737 2731686 2538080 2161107 1566979
16822 1566979 804285 147713 -270873 -550323 -689412 -680956 -585304 -307491 162382 466706
16812 466706 337243 -227888 -777448 -835584 -498641 -147488 -70843 -465343 -1120135 -1579545
16802 -1579545 -1611977 -1153810 -364280 377834 1085403 1927132 2574767 2710822 2326731 1731322
16792 1731322 1123543 306586 -651333 -1340715 -1570948 -1421867 -1215984 -1178563 -1196648 -1151442
16782 -1151442 -1004154 -825612 -772723 -910629 -1214897 -1497062 -1567891 -1507802 -1339412 -953940
16772 -953940 -478087 -328016 -659565 -1117780 -1277896 -1214432 -1167416 -1029725 -727568 -371977
16762 -371977 -25999 381924 887058 1374576 1665134 1481159 746774 -73923 -673181 -1073353
16752 -1073353 -1291684 -1350879 -1251553 -797441 99108 1004135 1341253 1034560 434594 -239022
16742 -239022 -956115 -1676376 -2407217 -2939115 -3054097 -2719625 -2091110 -1568613 -1348164 -1511221
16732 -1511221 -2123864 -2849562 -3230496 -3039590 -2277073 -1060647 268736 1267505 1689691
16723 1689691 1499392 780534 -733 30858 1152418 2419751 2985204 3058125 3023111 2764115
16713 2764115 1960642 714441 -522723 -1388486 -1742714 -1742252 -1880043 -2387383 -2843113 -2762666
16703 -2762666 -2170080 -1532031 -1232113 -1474072 -2242959 -3092202 -3493809 -3174225 -2398758
16694 -2398758 -1695506 -996299 -8082 1011588 1618200 1768825 1751458 1852489 2132530
16685 2132530 2511753 2978046 3471093 3662818 3217929 2292121 1280696 426721 -320113
16676 -320113 -1142087 -1944080 -2331013 -2106854 -1472918 -765659 -532014 -812257 -1003324 -768101
16666 -768101 -342953 -64601 88553 143813 -148279 -850742 -1619618 -2316809 -3037939 -3769828
16656 -3769828 -4515280 -5179178 -5465569 -5386885 -5093028 -4648580 -4068328 -3298724 -2589273 -2338844
16646 -2338844 -2692991 -3244755 -3367086 -3033122 -2425074 -1617207 -948741 -617861 -627551 -960145
16636 -960145 -1316111 -1275505 -894997 -495609 -199618 -145217 -396949 -821042 -1186359 -1231301
16626 -1231301 -1122936 -1297871 -1709920 -1995985 -2108742 -2262878 -2479031 -2742952 -3063609
16617 -3063609 -3272231 -3226237 -2971651 -2464174 -1668930 -736866 -37994 265235 475821 728897
16607 728897 772081 439075 -136265 -704834 -1205776 -1773417 -2410843 -2938727 -3181286 -3070635
16597 -3070635 -2747848 -2392182 -1948812 -1620956 -1859034 -2510724 -3005609 -3039041 -2488309 -1453058
16587 -1453058 -273288 826005 1695944 2292794 2655197 2606697 2236298 1868992 1496536
16578 1496536 867574 -85731 -1034823 -1688205 -2086332 -2345578 -2429575 -2293384 -1965469 -1459118
16568 -1459118 -913745 -509022 -401331 -471374 -525982 -625885 -733220 -793605 -940273 -1240683
16558 -1240683 -1692533 -2245172 -2559232 -2265514 -1549668 -851438 -403641 -246581 -99332
16549 -99332 147185 198275 -209212 -885128 -1244754 -1120167 -879417 -765569 -607861 -435668
16539 -435668 -590925 -1066147 -1432271 -1448623 -1241380 -931700 -515200 -129894 -46565 -212306
16529 -212306 -381942 -283012 156045 504572 491415 261987 74253 -10641 -213438 -729068
16519 -729068 -1330075 -1609806 -1533970 -1322945 -1161718 -872777 -311100 221845 535866 537881
16509 537881 296732 309683 796176 1569713 2530162 3308548 3360632 2747308 1826856 841078
16499 841078 251969 259265 464430 471384 229111 -149184 -245572 212005 895661 1228580
16489 1228580 1010858 657329 493218 324103 -85272 -627435 -949270 -1106410 -1282901
16480 -1282901 -1275953 -969556 -487107 -36494 192971 -39323 -746989 -1587817 -2156207 -2297492
16470 -2297492 -1952172 -1218777 -425562 207212 507627 320746 -223257 -790077 -1249426
16461 -1249426 -1530213 -1498970 -1113290 -536542 -43009 374823 759121 1244524 1900465 2481380
16451 2481380 2812139 2862807 2633046 2221488 1580780 765490 -17361 -564101 -717779 -687751
16441 -687751 -672672 -753839 -1044168 -1479311 -1655498 -1246329 -381690 355953 606074 515736
16431 515736 502302 870942 1367402 1578019 1356887 1124234 1199418 1434917 1608931 1660668
16421 1660668 1359392 580132 -412352 -1307252 -2130148 -3043127 -3618334 -3305096 -2114639
16412 -2114639 -467165 1068773 2111233 2613687 2661149 2401456 2233227 2307373 2323321
16403 2323321 1887336 1098543 458914 63909 -223633 -202711 98972 128774 -369781 -1071143
16393 -1071143 -1586801 -1848549 -1894776 -1949197 -2220108 -2411233 -2314490 -1996434 -1213496 69956
16383 69956 1136949 1569289 1780368 2133418 2607753 3106965 3488275 3738264 3831722 3714884
16373 3714884 3527044 3376959 3223870 3171126 3482230 4000643 4247353 4084101 3791553 3530051
16363 3530051 3162783 2531791 1707036 883889 178113 -469897 -1159961 -1866164 -2514880
16354 -2514880 -3021630 -3344541 -3693730 -4173553 -4463911 -4380927 -4048923 -3759833 -3705365 -3934546
16344 -3934546 -4309210 -4407419 -4082523 -3746334 -3747175 -3909978 -4018989 -3857248 -3310923 -2830929
16334 -2830929 -2664566 -2387524 -1865399 -1233333 -648489 -453370 -763897 -1297928 -1626600
16325 -1626600 -1484136 -955772 -336738 130576 335807 172288 -448055 -1299127 -1871930
16316 -1871930 -2033445 -1831350 -1333876 -608926 156785 716400 907113 580441 -121205
16307 -121205 -791868 -1234013 -1576268 -1840274 -1660183 -1020433 -399392 -90053 -215219 -581667
16297 -581667 -893607 -1077998 -995785 -409627 473328 1021143 848974 40959 -936995 -1601574
16287 -1601574 -1774276 -1591435 -1320410 -1132515 -1011741 -948329 -844824 -409336 217026 608518
16277 608518 633143 629441 998402 1567653 1982254 2261163 2205882 1784040 1444717 1434007
16267 1434007 1562157 1435782 938818 264061 -411143 -1015484 -1541149 -2094725 -2705335
16258 -2705335 -3440745 -4280279 -4900739 -5142526 -4946532 -4410744 -3815100 -3427808 -3249737
16249 -3249737 -2927851 -2313627 -1733705 -1555613 -1785025 -2109485 -2268983 -2262341 -2112237 -1794914
16239 -1794914 -1337810 -861861 -692075 -1008007 -1314823 -1016888 -377028 219164 916356
16230 916356 1640064 2050566 2201512 2234973 2131861 2091856 2128557 1759506 896425 85319
16220 85319 -373671 -506773 -640512 -980804 -1353994 -1415121 -1186991 -1016787 -977256 -1003130
16210 -1003130 -1122565 -1112360 -811050 -508474 -579324 -912831 -1000780 -686395 -84244 718270
16200 718270 1643137 2515205 3217122 3720880 3801658 3411890 2791468 2141701 1464067 730985
16190 730985 52630 -380710 -320714 286300 1163081 1835654 2018350 1866487 1501418 870808
16180 870808 167211 -349392 -576238 -533329 -497158 -620788 -756185 -879151 -1283868 -1971403
16170 -1971403 -2589928 -2921728 -2801384 -2350725 -1830855 -1267444 -608036 -62056 131477
16161 131477 105381 18411 -45920 32273 128872 206956 429856 829404 1176648 1254392 1204200
16150 1204200 1318239 1632495 2095746 2642455 2981224 3046062 2877606 2436357 2015985 1966024
16140 1966024 2147413 2102585 1660511 1017569 467903 305861 576641 958529 1206468 1204638
16130 1204638 1017617 935916 964816 820657 383796 -52679 -322799 -172371 610815 1630702
16120 1630702 2398164 2568237 2086137 1022043 -365628 -1575477 -2216221 -2120196 -1547762
16111 -1547762 -974849 -554205 -179755 -79593 -499834 -986551 -1130851 -1079943 -1126248 -1253936
16101 -1253936 -1316378 -1031115 -355159 98780 -147296 -739221 -1123242 -1115965 -710280 -143273
16091 -143273 153767 180710 350305 683280 842438 673102 201194 -403762 -953133 -1190566
16081 -1190566 -876874 -209531 402948 892614 1232785 1269571 1122428 1090937 1329031 1701336
16071 1701336 1934339 1839870 1445950 791027 -20246 -637012 -901489 -912518 -662876 -147469
16061 -147469 468284 851034 736077 138642 -515046 -814321 -932564 -1083814 -1020756 -358603
16051 -358603 888983 2258505 3405133 4279434 4755085 4663078 4100744 3500994 3276209
16042 3276209 3358523 3558012 3633176 3434570 3108784 2711528 2080160 1223725 500926 314921
16032 314921 903917 1967424 2704947 2678163 2192208 1526310 867870 484421 418404 664551
16022 664551 1129252 1537026 1581255 1239880 735861 407908 420905 703247 1019082 1150236
16012 1150236 1142188 1213618 1374831 1286000 899287 571369 484309 586584 854469 1174883
16002 1174883 1331870 1414327 1530558 1528502 1352652 1042764 734155 634281 802614 1064851
15992 1064851 1170846 1014144 681558 438730 629587 1122393 1458630 1565625 1675317
15983 1675317 1720613 1502690 1038159 517354 212433 199748 111793 -445549 -1275919 -1914998
15973 -1914998 -2093543 -1879758 -1505935 -1366631 -1646178 -2026531 -2172661 -1983591 -1708381
15964 -1708381 -1560484 -1471546 -1244391 -751169 -128219 402095 763096 901712 739010 293988
15954 293988 -149598 -212728 95481 444166 654038 851286 1202541 1437769 1175543 648936
15944 648936 85533 -559206 -1151059 -1566759 -1660059 -1271158 -688156 -459086 -425359 -59808
15934 -59808 697456 1462578 1738438 1380836 847573 560232 244177 -315363 -864829 -995971
15924 -995971 -573244 193872 829272 1039552 946183 738413 512574 419215 635116 964143
15914 964143 965022 613241 336984 524326 1041180 1376081 1010333 -973 -979236 -1413771
15904 -1413771 -1207622 -640839 -121849 213832 435399 632639 828884 864376 749771 738826
15894 738826 926898 1268933 1529470 1467851 1112554 577951 -225006 -1016912 -1215820 -994555
15884 -994555 -826944 -882786 -942584 -626733 -13339 591382 1112140 1568744 1818037 1746780
15874 1746780 1473031 1249189 1279561 1431950 1345764 1071065 1047849 1426340 1859706 1989550
15864 1989550 1716413 1170448 541610 52528 -160959 -162866 -35772 141874 218394 80395
15854 80395 -223497 -627311 -985088 -1143653 -1077617 -884508 -542882 -101606 413627 1120695
15844 1120695 1762052 1820191 1352696 926673 971704 1564506 2435908 3118427 3236170 2913628
15834 2913628 2357875 1559021 709311 172407 36024 193936 469317 471447 29788 -748517
15824 -748517 -1676223 -2409134 -2647706 -2454261 -1933012 -1122947 -84752 994569 1657126
15815 1657126 1614808 1100976 484974 254517 647967 1423402 2235095 2825961 3126485 3123712
15805 3123712 2905772 2744990 2527351 1722722 182821 -1694113 -3320032 -4376550 -4788140
15796 -4788140 -4494991 -3616320 -2482330 -1470091 -829739 -482435 -165171 267518 594085
15787 594085 540186 120573 -376951 -710533 -884287 -1027815 -961761 -425110 200261 399808
15777 399808 16015 -731266 -1225589 -1165754 -708583 -96481 324240 292520 73021 47428
15767 47428 229574 621128 1241435 1994646 2632118 2890942 2773049 2443382 2031631 1726965
15757 1726965 1619817 1536629 1178829 505629 -381105 -1201384 -1530189 -1209656 -470085 250795
15747 250795 859763 1408008 1609497 1310708 730817 98771 -471628 -952120 -1388004 -1782423
15737 -1782423 -2129670 -2317452 -2206575 -1839087 -1164266 -324899 248812 374737 172870
15728 172870 -40275 -59586 -4414 -203267 -691519 -989858 -846161 -577414 -342338 -14778
15718 -14778 416675 709200 751181 598199 404516 417767 469465 291963 59742 22511
15708 22511 262735 647290 819406 693990 316580 -187627 -489419 -593957 -661752 -663516
15698 -663516 -666818 -863640 -1439434 -2243137 -2714599 -2743139 -2607227 -2452721 -2310541 -2092173
15688 -2092173 -1728306 -1307855 -976584 -785572 -833659 -1070333 -1143580 -982360 -869165 -867394
15678 -867394 -764747 -505273 -369837 -507040 -867417 -1271155 -1587831 -1673919 -1229773 -463212
15668 -463212 172993 505209 406468 473 -259181 -284939 -402046 -719082 -1041720 -1109155
15658 -1109155 -1135500 -1497307 -1912492 -1966640 -1755062 -1579852 -1592967 -1719210 -1632198 -1131730
15648 -1131730 -608541 -314512 -398 362042 609108 556397 100956 -518968 -1090100 -1559326
15638 -1559326 -1878087 -2149721 -2385380 -2339598 -2017520 -1545813 -999984 -600663 -442071 -343348
15628 -343348 -85212 430535 1005798 1429745 1723208 1818108 1711508 1466024 1098553 630463
15618 630463 160181 -227965 -429706 -360960 -15560 634998 1423416 1959338 2040818 1734446
15608 1734446 1164777 356539 -507972 -1044853 -1038321 -691574 -238995 225550 564465 611032
15598 611032 408413 1086 -722779 -1238947 -907350 -53174 637374 923835 852256 583534
15588 583534 286761 51639 -215597 -441432 -462914 -369961 -363554 -397864 -470505 -672169 -770784
15577 -770784 -692164 -925166 -1567034 -2079254 -2435870 -2963576 -3435620 -3463707 -3122293 -2650477
15567 -2650477 -2234509 -2051112 -1897496 -1537365 -1182101 -931945 -529781 -52319 183592
15558 183592 282373 340879 293528 36273 -662299 -1611017 -2240020 -2254831 -1680781 -861054
15548 -861054 -44120 656666 1181274 1467547 1444594 1082408 453836 -77710 -281265 -404178
15538 -404178 -633619 -824229 -825896 -637804 -594239 -852361 -1142857 -1403930 -1741993 -2089879
15528 -2089879 -2539545 -3163336 -3912513 -4647728 -5061699 -5065660 -4930078 -4770841 -4527574 -4040577
15518 -4040577 -3197044 -2261269 -1629562 -1504992 -1801772 -2306509 -2686049 -2720087 -2531895 -2323546
15508 -2323546 -2057011 -1562677 -1049135 -636035 -221531 38207 48829 17149 204233 433110
15498 433110 254539 -269807 -698573 -909219 -857307 -548139 -306299 -460332 -908701 -1322102
15488 -1322102 -1642840 -1876485 -1899572 -1781354 -1659427 -1445637 -1032620 -722134 -832941 -1246353
15478 -1246353 -1793419 -2281045 -2491014 -2264387 -1715145 -1187085 -881257 -621772 -225861
15469 -225861 303253 761346 773149 196537 -635293 -1368742 -1887870 -2308407 -2616906 -2564389
15459 -2564389 -2182435 -1827274 -1659137 -1789844 -2364374 -3098066 -3448732 -3175800 -2350378
15450 -2350378 -1291745 -428536 48272 178014 -132777 -806019 -1347985 -1418871 -961764
15441 -961764 -216128 396580 646335 629412 426715 8474 -490545 -881369 -1130577 -1254273
15431 -1254273 -1190213 -978307 -718595 -448829 -354751 -476883 -729669 -915560 -920103 -995601
15421 -995601 -1096047 -796907 -62775 517494 611590 558373 476080 370930 480876 803224
15411 803224 1020405 940635 740401 782562 1031296 1053974 758827 356978 -41989 -465897
15401 -465897 -921379 -1346854 -1490023 -1269588 -1015921 -813141 -499889 -162101 -56759 -377967
15391 -377967 -1057226 -1814327 -2293760 -2187022 -1694022 -1345963 -1252656 -1172775 -1069980 -1079049
15381 -1079049 -1198963 -1412800 -1600323 -1511962 -1048557 -124526 1308055 2977197 4251028
15372 4251028 4740913 4596638 4375179 4268298 4023333 3535107 2982890 2532311 2173918
15363 2173918 1773973 1294818 962405 876157 829069 483851 -149295 -562007 -407358 213369
15353 213369 975926 1603705 1821326 1477987 633771 -441643 -1326609 -1851862 -2099505
15344 -2099505 -2083597 -1914117 -1769255 -1593251 -1160094 -375487 487699 1276941 1914687 2319022
15334 2319022 2618186 2866100 3066648 3148846 2922352 2511953 2278625 2307294 2499196 2870930
15324 2870930 3318795 3341764 2713556 2057386 1894460 1981625 1923203 1860603 2083025 2528496
15314 2528496 2972749 3284229 3416604 3278623 2832865 2128684 1324382 599582 186145
15305 186145 218876 469748 372795 -526550 -2008638 -3543888 -4690909 -5278577 -5288370 -4905575
15295 -4905575 -4422903 -3878519 -3342758 -2867939 -2343091 -1863492 -1678200 -1776591 -2017505 -2207687
15285 -2207687 -2169465 -1895429 -1598162 -1522262 -1739084 -2126695 -2297484 -1859296 -1094469 -690597
15275 -690597 -800042 -896834 -387489 743355 1866123 2482678 2484215 2028531 1439727 947871
15265 947871 550720 278531 239546 470247 925061 1414657 1677779 1725023 1738119 1771364
15255 1771364 1817703 1726163 1440938 1174930 916707 553522 116552 -288696 -660014 -1152786
15245 -1152786 -1873602 -2673700 -3559266 -4538649 -5457773 -6152621 -6419092 -6267663 -5657478
15236 -5657478 -4681932 -3769305 -3187678 -2928441 -2710632 -2423108 -2273804 -2285195 -2219858 -1941596
15226 -1941596 -1599520 -1437492 -1522343 -1820873 -2238597 -2537383 -2547531 -2331013 -2086393 -1822582
15216 -1822582 -1412955 -982747 -771119 -775695 -820104 -697296 -334585 122538 452081 743965
15206 743965 1025665 1196321 1145118 834250 411030 230528 473005 985599 1547831 2162578
15196 2162578 2702812 2918656 2790369 2551608 2531567 2808081 3039344 2707320 1829160 684808
15186 684808 -450483 -1295791 -1630288 -1507457 -1157983 -773397 -459358 -168962 186639
15177 186639 563786 842565 908359 1160164 1912764 2788927 3445373 3766762 3987553 4288408
15167 4288408 4393258 4138550 3604395 3056456 2827423 2873011 2939939 2927427 2717006 2210157
15157 2210157 1671938 1365259 1311186 1346755 1262806 1060341 802462 553197 353584 96888
15147 96888 4665 206671 464870 615976 550094 359422 197816 -36880 -463527 -938232
15137 -938232 -1245651 -1338721 -1276009 -1209877 -1110031 -695896 -90027 114381 -361048 -1105287
15127 -1105287 -1433096 -1114300 -407353 314648 987449 1706873 2411629 2788836 2592609
15118 2592609 1986681 1283199 514466 -103180 -234959 -34417 170681 242857 116985 -49234
15108 -49234 -124257 -55110 238677 562451 588721 393246 345819 570953 842245 916531 710984
15097 710984 382556 197988 199127 342009 601848 914517 1085923 872118 348099 -221665
15087 -221665 -632168 -887512 -969483 -959085 -1052730 -1140934 -1062485 -854255 -527550 -6122
15077 -6122 670138 1324663 1788720 1961938 1865136 1503651 946910 441161 -14814 -599779
15067 -599779 -1204565 -1554225 -1721380 -1683891 -1475021 -1254373 -1195561 -1322002 -1281958 -948434
15057 -948434 -539958 -178952 204340 656795 990163 1181213 1425314 1702925 1931377 2042569
15047 2042569 2045645 2164424 2495992 2849632 2955801 2657335 1948251 1025893 247630 53919
15037 53919 336922 697514 944354 884600 510782 25664 -427704 -703312 -672377 -437249
15027 -437249 -89184 386663 928005 1416671 1942265 2645897 3300311 3569912 3316925 2718695
$$ [...]
##END NTUPLES=NMR SPECTRUM
##END=
