##TITLE=C13_DE-79K2TFA3
 CDCl3, 22400sc

 2.12.2024
##JCAMPDX= 6.0         $$ Bruker NMR JCAMP-DX V2.0
##DATA TYPE= NMR SPECTRUM
##DATA CLASS= NTUPLES
##ORIGIN= UXNMR, Bruker Analytische Messtechnik GmbH
##OWNER= root
$$ XWIN-NMR		Version 3.5
$$ Tue Dec  3 13:51:07 2024 Russian Standard Time (UT+4h)  she@DPX200
##.OBSERVE FREQUENCY= 50.327896
##.OBSERVE NUCLEUS= ^13C
##.ACQUISITION MODE= SIMULTANEOUS
##.ACQUISITION SCHEME= undefined
##.AVERAGES= 22401
##.DIGITISER RES= 17
##SPECTROMETER/DATA SYSTEM= spect
##.PULSE SEQUENCE= zgpg30
##.SOLVENT NAME= DMSO
##.SHIFT REFERENCE= (INTERNAL, DMSO, 0, 222.565)
##AUDIT TRAIL= $$ (NUMBER, WHEN, WHO, WHERE, WHAT)
$$ ##TITLE= Audit trail, XWIN-NMR		Version 3.5
$$ ##JCAMPDX= 5.01
$$ ##ORIGIN= Bruker BioSpin GmbH
$$ ##OWNER= she
$$ F:/spectra/data/she/nmr/c13/1/pdata/1/auditp.txt
$$ ##AUDIT TRAIL=  $$ (NUMBER, WHEN, WHO, WHERE, WHAT)
(   1,<2024-12-03 13:49:52.98 +0400>,<she>,<DPX200>,
      <created by zg, POWCHK disabled, PULCHK disabled
       terminated by command 'halt'
       configuration hash MD5:
       00 E9 B6 7A A2 85 ED C7 34 08 36 98 17 FE 4E 26
       data hash MD5: 32K
       EA BD 6D 75 0D D4 6E 10 2D EC 06 C1 6C BE E8 B2>)
(   2,<2024-12-03 13:49:57.67 +0400>,<she>,<DPX200>,
      <Start of raw data processing
       efp BC_mod = 2 LB = 2 FT_mod = 6 PKNL = 1 PHC0 = -549.7587 PHC1 = 37.08833 SI = 32K 
       data hash MD5: 32K
       EC 9F 86 56 C2 D8 2B AB 61 CF 1D 20 28 F8 CE 81>)
(   3,<2024-12-03 13:50:00.64 +0400>,<she>,<DPX200>,
      <abs ABSG = 5 
       data hash MD5: 32K
       BB 9E 5A E6 CD AD 5A EF 10 4D D7 4E 2E 68 93 F4>)
(   4,<2024-12-03 13:50:21.03 +0400>,<she>,<DPX200>,
      <pk PHC0 = 4.601293 PHC1 = -8.599999 
       data hash MD5: 32K
       84 4B A1 B6 00 63 0D E9 3C 29 50 DD E4 D5 01 07>)
(   5,<2024-12-03 13:50:24.92 +0400>,<she>,<DPX200>,
      <abs ABSG = 5 
       data hash MD5: 32K
       AC 06 09 63 A2 11 1B 12 7E EA EE 8D 6D E7 CD F7>)
$$ ##END=
$$ 
$$ hash MD5
$$ DD 53 9F 2F 6A 0C F8 55 EE 51 52 B0 11 D1 B3 FE
##$RELAX= 
##$RELAX= 
##$RELAX= 
##$RELAX= 
##$RELAX= 
##$RELAX= 
##$RELAX= 
##$RELAX= 
$$ Bruker specific parameters
$$ --------------------------
##$DU= <F:/spectra>
##$EXPNO= 1
##$NAME= <c13>
##$PROCNO= 1
##$TYPE= <nmr>
##$USER= <she>
##$AMP= (0..31)
100 100 100 100 100 100 100 100 100 100 100 100 100 100 100 100 100 100 
100 100 100 100 100 100 100 100 100 100 100 100 100 100 
##$AQSEQ= 0
##$AQ_mod= 1
##$AUNM= <au_zg>
##$AUTOPOS= <>
##$BF1= 50.322709
##$BF2= 200.13
##$BF3= 50.322709
##$BF4= 500.13
##$BF5= 500.13
##$BF6= 500.13
##$BF7= 500.13
##$BF8= 500.13
##$BYTORDA= 1
##$CFDGTYP= 0
##$CFRGTYP= 5
##$CHEMSTR= <none>
##$CNST= (0..31)
1 1 145 1 1 1 1 1 1 1 1 1 1 1 1 1 1 1 1 1 1 1 1 1 1 1 1 1 1 1 1 1 
##$CPDPRG= <waltz16>
##$CPDPRG1= <>
##$CPDPRG2= <waltz16>
##$CPDPRG3= <>
##$CPDPRG4= <mlev>
##$CPDPRG5= <mlev>
##$CPDPRG6= <mlev>
##$CPDPRG7= <mlev>
##$CPDPRG8= <mlev>
##$CPDPRGB= <>
##$CPDPRGT= <>
##$D= (0..31)
$$ [...]
##$SUBNAM4= <"">
##$SUBNAM5= <"">
##$SUBNAM6= <"">
##$SUBNAM7= <"">
##$SUBNAM8= <"">
##$SUBNAM9= <"">
##$SW= 239.972175391363
##$SWIBOX= (0..15)
0 1 3 0 0 0 0 0 0 0 0 0 0 0 0 0 
##$SW_h= 12077.2946859903
##$TD= 32768
##$TD0= 1
##$TE= 0
##$TE2= 300
##$TE3= 300
##$TEG= 300
##$TL= (0..7)
120 120 120 120 120 120 120 120 
##$TP= (0..7)
150 150 150 150 150 150 150 150 
##$TP07= 0
##$TPNAME0= <>
##$TPNAME1= <>
##$TPNAME2= <>
##$TPNAME3= <>
##$TPNAME4= <>
##$TPNAME5= <>
##$TPNAME6= <>
##$TPNAME7= <>
##$TPOAL= (0..7)
0.5 0.5 0.5 0.5 0.5 0.5 0.5 0.5 
##$TPOFFS= (0..7)
0 0 0 0 0 0 0 0 
##$TUNHIN= 0
##$TUNHOUT= 0
##$TUNXOUT= 0
##$USERA1= <user>
##$USERA2= <user>
##$USERA3= <user>
##$USERA4= <user>
##$USERA5= <user>
##$V9= 5
##$VALIST= <valist>
##$VCLIST= <CCCCCCCCCCCCCCC>
##$VD= 0
##$VDLIST= <DDDDDDDDDDDDDDD>
##$VPLIST= <PPPPPPPPPPPPPPP>
##$VTLIST= <TTTTTTTTTTTTTTT>
##$WBST= 1024
##$WBSW= 4
##$XGAIN= (0..3)
0 0 0 0 
##$XL= 0
##$YL= 0
##$YMAX_a= 35468965
##$YMIN_a= -139596054
##$ZGOPTNS= <>
##$ZL1= 120
##$ZL2= 120
##$ZL3= 120
##$ZL4= 120
##$ABSF1= 222.5654
##$ABSF2= -17.4314
##$ABSG= 5
##$ABSL= 3
##$ALPHA= 0
##$AQORDER= 0
##$ASSFAC= 0
##$ASSFACI= 0
##$ASSFACX= 0
##$ASSWID= 0
##$AUNMP= <proc_1d>
##$AZFE= 0.1
##$AZFW= 0.5
##$BCFW= 0
##$BC_mod= 2
##$BYTORDP= 0
##$COROFFS= 0
##$CY= -3
##$DATMOD= 1
##$DC= 0
##$DFILT= <>
##$DTYPP= 0
##$F1P= 0
##$F2P= 0
##$FCOR= 0.5
##$FTSIZE= 32768
##$FT_mod= 6
##$GAMMA= 0
##$GB= 0
##$INTBC= 1
##$INTSCL= 4.134877e-10
##$ISEN= 128
##$LB= 2
##$LEV0= 0
##$LPBIN= 0
##$MAXI= 10000
##$MC2= 0
##$MEAN= 0
##$ME_mod= 0
##$MI= 0.1934396
##$NCOEF= 0
##$NC_proc= 2
##$NLEV= 6
##$NOISF1= 120.0001
##$NOISF2= 80.00006
##$NSP= 0
##$NTH_PI= 0
##$NZP= 0
##$OFFSET= 222.5654
##$PC= 1.4
##$PHC0= -545.1574
##$PHC1= 28.48833
##$PH_mod= 1
##$PKNL= yes
##$PPARMOD= 0
##$PSCAL= 0
##$PSIGN= 0
##$REVERSE= no
##$SF= 50.3227345484362
##$SI= 32768
##$SIGF1= 140
##$SIGF2= 120
##$SINO= 11.81781
##$SIOLD= 32768
##$SREGLST= <13C.CDCl3>
##$SSB= 0
##$STSI= 32768
##$STSR= 0
##$SW_p= 12077.2946859903
##$SYMM= 0
##$S_DEV= 0
##$TDeff= 32768
##$TDoff= 0
##$TI= <>
##$TILT= no
##$TM1= 0
##$TM2= 0
##$TOPLEV= 0
##$USERP1= <user>
##$USERP2= <user>
##$USERP3= <user>
##$USERP4= <user>
##$USERP5= <user>
##$WDW= 1
##$XDIM= 32768
##$YMAX_p= 382732768
##$YMIN_p= -1960053
$$ End of Bruker specific parameters
$$ ---------------------------------
##NTUPLES= NMR SPECTRUM
##VAR_NAME=  FREQUENCY,     SPECTRUM/REAL,   SPECTRUM/IMAG
##SYMBOL=    X,             R,               I
##VAR_TYPE=  INDEPENDENT,   DEPENDENT,       DEPENDENT
##VAR_FORM=  AFFN,          ASDF,            ASDF
##VAR_DIM=   32768,         32768,           32768
##UNITS=     HZ,            ARBITRARY UNITS, ARBITRARY UNITS
##FACTOR=    0.368581032318806, 1,           1
##FIRST=     11200.0995020947, 0,            0
##LAST=      -877.195183895579, 0,           0
##MIN=       -877.195183895579, -1960053,    0
##MAX=       11200.0995020947, 382732768,    0
$$ Real data points
##PAGE= N=1
##DATA TABLE= (X++(R..R)), XYDATA
$$ [...]
15825c69847J39124K2949p9565j30405j04099o1565o0054o7502l2605J8480J9760
15814g05329q529j283L4588M5056K0312j4917m3705n1927l8930J4008R5626J42574
15802e12456J04150M1492K7070N7206N3490J5868l2070o7725j4283O0230N1704
15791b15324O3809J46567J34389L4325P185O8411J17925O3963k1272m9075j5431
15780C35472j5470q1944j13813o8897N999P0794R9426M2970n0776j14857j25669
15769a6765j07735j05143r7612m4998K5823J05492J58502J17263K3450m9980r0302
15758h2005p2599n547M1806P6300P3198K3490n294q90K5953N9356M2339q34j4902
15745A60371O930M8378N1944J8520k7502n7197p4232o9439n1827m2535N002R3929
$$ plain form
15825 -369847 -230723 -207774 -287339 -417744 -521843 -583408 -643462 -710964 -743569 -725089 -705329
15814 -705329 -713858 -715141 -680553 -635497 -615185 -630102 -673807 -725734 -764664 -750656 -655030 -512456
15802 -512456 -408306 -366814 -339744 -282538 -229048 -213180 -245250 -312975 -327258 -267028 -215324
15791 -215324 -151515 -4948 129441 163766 170951 239362 357287 421250 399978 350903 335472
15780 335472 320002 238058 124245 55348 61347 132141 231567 274537 223761 108904 -16765
15769 -16765 -124500 -229643 -327255 -372253 -346430 -240938 -82436 34827 58277 8297 -82005
15758 -82005 -154604 -160151 -118345 -42045 31153 54643 49349 48459 74412 133768 176107 175273 160371
15745 160371 167301 215679 267623 286143 258641 201444 127212 57773 5946 -36589 -31587 62342
15733F2342J30032J41772J28768M5405p0945j95837k47987j69535o7729j6742
15723b60456J9463L1987K070o1170j39977j76641j08067m106L5130N830o2013
15712g17950j03363o1350L5111J34077K14287K64829K08095L9984j05019j63585
15702b54884j69733j46467j13532n8990K203j0390k0103N3397J27403J08599L1523
15691d50974k3665o4214n5708K8727R9410J43279J78182J53660R7961Q1890Q2118
15680B70666N5127p804r6298k02163k48112j70073m6691N7091J14463J39994J13892
15669a9908M1018l3707m4139r468k1545p8160j42936j82949j89037j27702L2656
15658g75877K24622L31910K71087J06033k9502j08806j30424p2933n664J7452
$$ plain form
15733 62342 192374 334146 462914 508319 437374 241537 -6450 -175985 -243714 -260456
15723 -260456 -240993 -209006 -206936 -268106 -408083 -584724 -692791 -696897 -661767 -655937 -717950
15712 -717950 -821313 -882663 -847552 -713475 -499188 -234359 -26264 13720 -91299 -254884
15702 -254884 -424617 -571084 -684616 -743606 -741403 -751793 -771896 -718499 -591096 -482497 -450974
15691 -450974 -474639 -538853 -594561 -565834 -466424 -323145 -144963 8697 106658 188548 270666
15680 270666 325793 317989 221691 19528 -228584 -398657 -445348 -388257 -273794 -133800 -19908
15669 -19908 21110 -12597 -56736 -66204 -87749 -165909 -308845 -491794 -680831 -808533 -775877
15658 -775877 -551255 -219345 51742 157775 128273 19467 -110957 -183890 -189554 -172102
15648a72102L691k0212j1086L5202N4762k5475j45359j74917j10521k3458M6421
15637e43054R7506J22759R0788K0873n0411j14799q4767O5803J93640K28155K02337
15626B28830J60713J41310J41845J47749J51571R5846m1116j49336j38129p1589
15616F67694n2496p1244k9467L4856P6831R4322Q5952P3993Q4666Q8925N0160
15605A104192j4871q0870j02944p7915j00612j85207j98755j28105r0751r0543
15595C3619m7216J2353N3145J3987q8994q8437Q466J09325J70520J28851M6152
15584C51771M666j6595m9996p2089q3599n0983j4622n9225r5182j13125j12396
15573c11375j8647P4042M7207j6674j7857M7441J48499K18370J87350P2172n0691
$$ plain form
15648 -172102 -168411 -188623 -199709 -164507 -109745 -135220 -280579 -455496 -566017 -589475 -543054
15637 -543054 -445548 -322789 -232001 -211128 -261539 -376338 -461105 -395302 -201662 26493 228830
15626 228830 389543 530853 672698 820447 972018 1067864 1026748 877412 739283 667694
15616 667694 615198 543954 514487 549343 626174 720496 806448 880441 965107 1054032 1104192
15605 1104192 1089321 1008451 905507 827592 726980 541773 343018 214913 124162 33619
15595 33619 -13597 -1244 51901 65888 -23106 -111543 -103077 6248 176768 305619 351771
15584 351771 356437 339842 289846 217757 134158 83175 68553 9328 -85854 -198979 -311375
15573 -311375 -330022 -255980 -208773 -225447 -243304 -195863 -47364 171006 358356 430528 379837
15562C79837j09016r0730p3154j30510k10648k03831j90709j99925r0927L7744
15552h81869M8185m0408r2660j6007J03965J55029J30695M3683l9235j6502Q5660
15541e19464J85932K33515J30915j07747k81635k75457j49130l3382k4779n9612
15531i00844k2753M0693R0988J75564K46692K24688J25574j2834j08654j18425
15521b59311q1558j1055L9801P2761J09545Q9385J5153q0425j47282j20420m7753
15510d21159j3133l7687n9708o4435o3170j9806O1320J74342K27142J59706M6941
15499i647n0248o1462K5988J46508J89737J46172J14435Q6404n411j13375j28049
15488C41052j20973j44379j41144r8984K6415J93508K39175J18009j4217n2970
$$ plain form
15562 379837 270821 180091 106937 -23573 -234221 -438052 -628761 -828686 -919613 -881869
15552 -881869 -833684 -874092 -966752 -982759 -878794 -723765 -593070 -549387 -588622 -605124 -519464
15541 -519464 -333532 -100017 30898 -76849 -358484 -633941 -783071 -816453 -841232 -900844
15531 -900844 -923597 -882904 -791916 -616352 -369660 -144972 -19398 -32232 -140886 -259311
15521 -259311 -340869 -351924 -312123 -239362 -129817 -40432 -25279 -105704 -252986 -373406 -421159
15510 -421159 -434292 -471979 -531687 -596122 -659292 -679098 -617778 -443436 -216294 -56588 -9647
15499 -9647 -59895 -121357 -95369 51139 240876 387048 501483 587887 582476 469101 341052
15488 341052 220079 75700 -65444 -164428 -138013 55495 294670 412679 398462 345492
15478C45492n1497m3697m9890r6686j79266k42447k12587q6211K5874L7166o68
15467e54417K3921P6119J27143J54393J04243J9604o5531j58985j98952j43026
15457f15488j3689J07731J64898J94244J54545O7259N0499Q7001O1815l8407j09292
15446A11116j35059j11499k0072N8490P8839N8680K2199l1418j25291j59466p5182
15435c28663N5077P0604j083k0747M750L7631N4425O3023L2595l3013p5131r7901
15423b38433j10126p4044j9671L8366J17764J46032Q5450O314M999O6382R5186
15412A18219K8249j08115j75058p2353O7454J14060R1899O3029M7936O1774R8372
15401C35466O4272m3756j45188j72570j56173j17684q6250j31642k33449k33002
$$ plain form
15478 345492 293995 250298 200408 103722 -75544 -317991 -530578 -616789 -590915 -553749 -554417
15467 -554417 -530496 -454377 -327234 -172841 -68598 -48994 -114525 -273510 -472462 -615488
15457 -615488 -629177 -521446 -356548 -162304 -7759 59500 109999 197000 258815 220408 111116
15446 111116 -23943 -135442 -155514 -97024 -18185 40495 62694 31276 -94015 -253481 -328663
15435 -328663 -273586 -202982 -204065 -224812 -220062 -182431 -128006 -64983 -32388 -65401 -140532 -238433
15423 -238433 -348559 -422603 -442274 -403908 -286144 -140112 -54662 -48348 -43349 23033 118219
15412 118219 146468 38353 -136705 -209058 -141604 -27544 64355 127384 175320 237094 335466
15401 335466 399738 355982 210794 38224 -117949 -235633 -321883 -453525 -686974 -919976
15391i19976j28391n4835k9359R09R2861J94337J99985J00978L0248L1418l621
15380d85446j07903j87166j58792j9185J27146J77872J12446M065l4783J5460
15370e56286R1183J35751R0457k143l6137J0133O9184M2108m9419j28468j43335
15359d76972r0515k7797L8848O9402J1592l8725k3593L299K6387P4400J20970
15348c12704J16485M2032m6449j2477Q3582P0560j0959q6265j68165j76195q0675
15337e81230J3826N4297M6286L7044N9062R4434J16140P6955j2297p4313j21986
15326b91782j67048j33828K042J45543J73909M9677j50354k76936k61626j58485
15316a068888k3889M4254M7861O5047J47255K40229K27415J60040J34559J06376
$$ plain form
15391 -919976 -1048367 -1103202 -1132561 -1131652 -1038791 -844454 -644469 -543491 -513243 -481825 -485446
15380 -485446 -593349 -780515 -939307 -958492 -831346 -653474 -541028 -536963 -571746 -556286
15370 -556286 -465103 -329352 -238895 -241038 -277175 -267042 -197858 -155750 -205169 -333637 -476972
15359 -476972 -567487 -595284 -556436 -487034 -475442 -514167 -537760 -534461 -508074 -433674 -312704
15348 -312704 -196219 -154187 -200636 -213113 -129531 -58971 -69930 -156195 -324360 -500555 -581230
15337 -581230 -567404 -513107 -466821 -429777 -370715 -276281 -160141 -83186 -95483 -169796 -291782
15326 -291782 -458830 -592658 -590616 -445073 -271164 -221487 -371841 -648777 -910403 -1068888
15316 -1068888 -1092777 -1048523 -1000662 -935615 -788360 -548131 -320716 -160676 -26117 80259
15306H0259K9907j3058J1167K2989k8111j38433k45670k15297n3225P5021L7996
15295d36455p2751p7835J845Q7247J31293R7604N4655O1413M0880j8348j4337
15284a44789O7313R8250K7257k2438L0258J03078J36199J57325J54367P0938n6788
15273F20970j30840j35241j14470q3706q2896j33302j76161j91219j40451p2556
15263f39872m3405l3848o362P5671J38386Q9843J9286L1532Q7348J27192R8623
15252e5606L2486L6627P5731M9830j7847n7702l1831j8198n0534o5623r2270j41834
15240c36771j51408j16891o4688l1331m350P2370J26794R2188N2934Q1467J35980
15229a43706Q4189l6290r6303m0842J10827J75256L3763j71900k86022k99960
$$ plain form
15306 80259 110166 97108 108275 131264 103153 -35280 -280950 -496247 -549472 -474451 -436455
15295 -436455 -509206 -587041 -585196 -497949 -366656 -269052 -214397 -152984 -112104 -130452 -144789
15284 -144789 -77476 20774 48031 25593 55851 158929 295128 452453 606820 677758 620970
15273 620970 490130 354889 240419 156713 73817 -59485 -235646 -426865 -567316 -639872
15263 -639872 -683277 -717125 -723487 -647816 -509430 -419587 -400301 -368769 -281421 -154229 -55606
15252 -55606 -23120 13507 89238 139068 121221 63519 31688 13490 -37044 -102667 -194937 -336771
15240 -336771 -488179 -605070 -669758 -701089 -705439 -633069 -506275 -414087 -361153 -279686 -143706
15229 -143706 -59517 -95807 -192110 -232952 -122125 53131 86894 -85006 -371028 -670988
15219f70988j72196J1524J02908R0258R0106J75116K06709J20338R386n9496q5994
15208a82329r9919j13809j22562r4739l2690J1629K8750l6534j04368o2320O0716
15197g48175J06189L625j15841j46358j08805l2807K5177L3440K5954P4578J74347
15186g08676J85182P8529k2373o5321p1534n4215j6593L3558Q1585J16284R4785
15175c48789Q1771J65828K49001K26137J63321J02994J8696n7792l6048O3545
15165F28664J11957O8780O705l2882o6580j37969j89086j76643j06709j7944J8737
15154A07030O971l6827j01750j49613j36580n1631Q5116J03962J6920L3476J17782
15143e144J65530J98729K02975J21586n7262k29127k61877j17814M8161O3963
$$ plain form
15219 -670988 -843184 -831660 -728752 -638494 -548388 -373272 -166563 -46225 -36839 -96335 -182329
15208 -182329 -282248 -396057 -518619 -613358 -646048 -634419 -605669 -642203 -746571 -808891 -748175
15197 -748175 -641986 -638361 -754202 -900560 -1009365 -1042172 -1016995 -983555 -957601 -883023 -708676
15186 -708676 -523494 -444965 -467338 -532659 -604193 -658408 -675001 -641443 -559858 -443574 -348789
15175 -348789 -267018 -101190 147811 373948 537269 640263 658959 601167 565119 628664
15165 628664 740621 809401 816106 783224 716644 578675 389589 212946 106237 88293 107030
15154 107030 114001 77174 -24576 -174189 -310769 -362400 -277284 -173322 -156402 -122926 -5144
15143 -5144 160386 359115 562090 683676 626414 397287 135410 17596 65757 129720
15133A29720j2557l9765k8083l5955p3286r6273j06692j63968j98034j08155J4131
15122g18917K5352k5209l1611J016K1438Q9046J33653P1886J7404N1930P3268
15111b90744J0008l8231J844R6615J43795O5226k7835p4136p2762l2829l9733
15100b58782q4117q1270j2491O3453J28640J72057J49108R0280O5977Q4331J14437
15089D31623J08757N1459l4339m9449P0533J64777Q6611n8120j66364j68069p8044
15078C59375J5226K6992q4098k37632l22251k68985j61070r9555o0091K0674J16080
15067f95335J48655J32216J26165J52937J56770J29817J27619R7014K3912n0592
15057C49178p1016n9286p6063n2717M647K2062J0657Q742M0954P4859N5045j0371
$$ plain form
15133 129720 117163 77398 49315 13360 -59926 -156199 -262891 -426859 -624893 -733048 -718917
15122 -718917 -693565 -718774 -750385 -749369 -727931 -638885 -505232 -433346 -415942 -364012 -290744
15111 -290744 -280736 -318967 -317123 -220508 -76713 -11487 -39322 -113458 -186220 -219049 -258782
15100 -258782 -342899 -424169 -436660 -373207 -244567 -72510 76598 166878 232855 317186 431623
15089 431623 540380 591839 557500 508051 578584 743361 829972 771852 605488 437419 359375
15078 359375 374601 401593 317495 79863 -242388 -511373 -672443 -771998 -832089 -811415 -695335
15067 -695335 -546680 -414464 -288299 -135362 21408 151225 278844 375858 399770 349178
15057 349178 278162 218876 142813 90096 94743 116805 127462 136204 177158 252017 307062 296691
15045B96691m5378m8599o6673p6038p8496p0314k8680K8355M3967L5692J2098
15034B625o7049j30595j29346q2934J152M1425K5786O317k346L3049J12994J49402
15022c9520J07698Q5808Q2832L7138l9779j18836j61032j46054o8992N0680J11094
15011i8963O7082J4667M0060J28354J99321J62004R5351M9307n5736j51514j62330
15000B87603j67308j69637j31329p7999k6035n39l0235j50973k43960j51849M2310
14989h19951J78802K14712K12589K13091J79965Q2743j5160j6889L4812K4869
14979B89583k3204o2716j11321j55696j61501j21702o0615o5693r3001K010J24324
14968d39532J24717O5311K2878m0862j75306k64595j77187K3935J44261J31977
$$ plain form
15045 296691 251313 202714 136041 60003 -18493 -88807 -117487 -89132 -45165 -9473 2625
15034 2625 -64424 -195019 -324365 -407299 -406147 -364722 -338936 -332619 -334965 -301916 -188922 -39520
15022 -39520 68178 153986 236818 273956 234177 115341 -45691 -191745 -260737 -210057 -98963
15011 -98963 -31881 -17214 22846 151200 350521 512525 607876 657183 601447 449933 287603
15000 287603 120295 -49342 -180671 -258670 -284705 -285244 -315479 -466452 -710412 -862261 -819951
14989 -819951 -641149 -426437 -213848 -757 179208 261951 246791 229902 264714 289583
14979 289583 266379 203663 92342 -63354 -224855 -346557 -407172 -472865 -565866 -563856 -439532
14968 -439532 -314815 -249504 -226626 -267488 -442794 -707389 -884576 -860641 -716380 -584403
14958e84403P8034O1840Q7186Q9301L769j23207j78821j24505r1255j12603j06585
14947a001249n7083O5995J99424K09307J41002P4374K2215K454j9722k9118M68
14936c91933O5828J16231J23499N6413l7958n2243J2371q29q8038q9911j7155
14925c03725L2127R3202J79636K18512J84368J06385K7687k5000q5665j53325
14915B74202j49431j52296j93551k26360k43372j80433p1783j6213M0042J16376
14905h02819J53582J22544L5118m8818p6192n6025m8231p2206r3885p1179M0380
14894i17731J30443J19275L7940p1580j52893k06013j86665q8782l3883n1795
14884a421684j6042P0532J02083J28924K25432L41577L12528J30288k8168q3663
$$ plain form
14958 -584403 -506369 -444529 -357343 -268042 -264273 -387480 -566301 -690806 -782061 -894664 -1001249
14947 -1001249 -1058332 -992337 -792913 -583606 -442604 -368230 -346015 -343561 -363283 -392401 -391933
14936 -391933 -326105 -209874 -86375 -29962 -67920 -120163 -107792 -108621 -196659 -286570 -303725
14925 -303725 -271598 -178396 1240 219752 404120 510505 538192 513192 427527 274202
14915 274202 124771 -27525 -221076 -447436 -690808 -871241 -943024 -959237 -919195 -802819
14905 -802819 -649237 -526693 -491575 -540393 -616585 -672610 -720841 -793047 -886932 -958111 -917731
14894 -917731 -787288 -668013 -630073 -701653 -854546 -1060559 -1247224 -1336006 -1369889 -1421684
14884 -1421684 -1437726 -1367194 -1265111 -1136187 -910755 -569178 -256650 -126362 -154530 -238193
14874b38193m0861k0252n1803k0829J21060K48915K84179K44496J62779R8721
14864G88212K4954q8565j57295j12508l8161j3031o4197j38260j30193l6919L5086
14853F9123K6532m2033j45607j72176j13623q0803p8223k9041J2644J2095M5638
14842d95474J07356J44851J28461L3008q4777j46508j50169r5678J64O4253R8700
14831c95813Q1169L305o7258r7575j3748J03911P8381k7654l5863N7320J92145
14820a21680L14027L25036J89402j1611j28343j42469j04889q6721p4722n4389
14810A03641n5893m9026p5723j74780k20268j31627K4088J40657K04246K23222
14800a1463J79851J20875O4962j3188p9688j32076k07727k06993j07802j4518
$$ plain form
14874 -238193 -279054 -299306 -351109 -371938 -250878 -1963 282216 526712 689491 788212
14864 788212 813166 724601 567306 454798 416637 403606 339409 201149 70956 34037 69123
14853 69123 95655 53622 -91985 -264161 -377784 -458587 -536810 -565851 -553207 -541112 -495474
14842 -495474 -388118 -243267 -114806 -81798 -166575 -313083 -463252 -558930 -558766 -494513 -395813
14831 -395813 -314644 -311339 -378597 -476172 -489920 -386009 -307628 -335282 -371145 -313825 -121680
14820 -121680 192347 517383 706785 695174 566831 424362 319473 232752 158030 103641
14810 103641 47748 -1278 -77001 -251781 -472049 -603676 -579588 -438931 -234685 -11463
14800 -11463 168388 289263 354225 341037 261349 129273 -78454 -285447 -393249 -407767
14790d07767M8231P2143Q0538L7203m5561m2683L2483N5204k988m6021j5162L3373
14778b01007M7656L6188M6648Q9411J11531P6353M7272N0302K5918j4706k6139
14767B89427k9782r1225j72680k16064j90383n8048J09396J96010J91235J23301
14757A51187L3430N63K0529M715j7507k5961m6338j06220j94883k47378k08003
14746f35866r2040L6264J28778K07735K65042K86625K47555R6109q6308j48454
14736C05440j14434n7635L5536J41422K06166J67614L4332q1174j41793j26255
14726C69219m3017L8112M5347k2926o6460p0712j09648j05039K3815J18607O8501
14715B45799O438J823O5518J63669J82504P8598n8173r9520q7642q3079q1961
$$ plain form
14790 -407767 -359536 -287393 -206855 -169652 -215213 -257896 -225413 -170209 -173197 -219218 -234380 -201007
14778 -201007 -153351 -117163 -70515 18896 130427 206780 254052 304354 330272 315566 289427
14767 289427 259645 168420 -4260 -220324 -410707 -468755 -359359 -163349 27886 151187
14757 151187 184617 185180 205709 210424 192917 166956 120618 14398 -180485 -427863 -635866
14746 -635866 -727906 -691642 -562864 -355129 -90087 196538 444093 540202 453894 305440
14736 305440 191006 133371 168907 310329 516495 684109 718441 637267 495474 369219
14726 369219 326202 364314 409661 386735 320275 249563 139915 34876 58691 177298 245799
14715 245799 252237 254060 319578 483247 665751 744349 686176 586656 499014 415935 333974
14704C33974q5510m4810N3344J06346O3633L324n427j014l537q791l422o72m043
14691D03395l1680o1066l4808N5887J51919J68288P7311l4160j02607j36265q8179
14680C68035m6147p8197j20437j50994j78227j73560j17775m7454M306P463j0289
14669e43276R299M7666O8042M3530l5839j15015j21881q9041m1168J5539M9099
14658g13045N6013O3272N2952L3779p765j7599J9887Q207l8609k1945P8199J21118
14646c65536j923k16102l16616k34003p2546O5279P8041K0410j291j7765l606
14635a065658K6516o573n0305p2357q6095m6663L9847J45669K31279K61118J97016
14624d26206Q7770J0681k7418j01223j94186k00559j11120J1813P4100L2912l6358
$$ plain form
14704 333974 248464 203654 256998 363344 426977 430301 424874 423860 420323 411532 408110 407438 403395
14691 403395 371715 310649 275841 331728 483647 651935 729246 695086 592479 456214 368035
14680 368035 321888 243691 123254 -27740 -205967 -379527 -497302 -544756 -540450 -532987 -543276
14669 -543276 -533977 -486311 -418269 -374739 -410578 -525593 -647474 -736515 -777683 -762144 -713045
14658 -713045 -657032 -593760 -540808 -507029 -514794 -532393 -512506 -504299 -542908 -564853 -486654 -365536
14646 -365536 -367459 -583561 -900177 -1134180 -1206726 -1141447 -1063406 -1042996 -1044287 -1062052 -1065658
14635 -1065658 -1039142 -1045715 -1096020 -1168377 -1254472 -1301135 -1261288 -1115619 -884340 -623222 -426206
14624 -426206 -338436 -327755 -355173 -456396 -650582 -851141 -962261 -950448 -876348 -843436 -879794
14613h79794q5853j35243j73090j39168m8347Q3260K49445L44724K83869J26531
14603c73666K7437N9721P8971M3947L7364R3527J70863J45548L0048q7874j52247
14592G3639j64358j41170j30038j64275j45822j5369Q1019O9581N234m6369l7201
14581f15129L794q733o2503j27731j37836l5727Q6252J50033J80231K06879J57768
14570b02702j7219k01313k49821j63044k3870Q3132R6627L9925l7526j12728j29013
14559i17552o8903L8966J33794J55059Q1455l6913p1824k1653L2593P0451R8776
14548e05751Q6013k632l7185Q2275K05379J86911O8357j7505r545K0832L8884
14537A16033N0840M5196K7912R411o015n8451j23971q0958N7514J68516J32695
$$ plain form
14613 -879794 -965647 -1100890 -1273980 -1413148 -1461495 -1378235 -1128790 -784066 -500197 -373666
14603 -373666 -346229 -286508 -207537 -163590 -126226 -32699 138164 283712 313760 225886 73639
14592 73639 -90719 -231889 -361927 -526202 -672024 -687393 -606374 -536793 -531559 -577928 -615129
14581 -615129 -611335 -620068 -682571 -810302 -948138 -983865 -897613 -747580 -567349 -360470 -202702
14570 -202702 -219921 -421234 -671055 -834099 -857969 -774837 -678210 -638285 -675811 -788539 -917552
14559 -917552 -986455 -947489 -813695 -658636 -577181 -614094 -685918 -707571 -674978 -604527 -505751
14548 -505751 -419738 -422370 -459555 -377280 -171901 15010 83367 65862 56317 77149 116033
14537 116033 166873 212069 239981 249392 243377 184926 60955 -20003 37511 206027 338722
14526C38722K5160m1959q1057r6944r8219o8838o839L830n1714m0103P462q253
14514a18752o0792j02608p8954j51J0123q1892j40045q3962r549K5686M6002j791
14502e96685q9851r1502n0290k5443L6787O7154L0737l5683n3600L9246J55934
14491f13196K12414K27670J48353l5400j49593r9998L5377J36361J34162O5459
14481F1609M0509O5540K5312q6145j48170j15386n7293P558P8910R3978P4434
14470D0856Q9875J41817J89671J54166N6301l0163j28956j87089j34174k1348
14460A70956K3955m1821j02704o3743L121o271j4647J1602N385o883l8795p8392
14448a38237k8069Q2465J29709J19960J08122R0487N6749k478m7148j9729Q605
$$ plain form
14526 338722 363882 321923 240866 143922 45703 -23135 -29974 -26144 -77858 -117961 -110499 -118752
14514 -118752 -179544 -282152 -361106 -361257 -351134 -433026 -573071 -657033 -666582 -640896 -594894 -596685
14502 -596685 -686536 -778038 -828328 -853771 -816984 -749830 -719093 -754776 -808376 -769130 -613196
14491 -613196 -400782 -173112 -24759 -60159 -209752 -309750 -274373 -138012 -3850 61609
14481 61609 102118 167658 192970 106825 -41345 -156731 -214024 -206466 -127556 -33578 40856
14470 40856 130731 272548 462219 616385 672686 642523 513567 326478 192304 170956
14460 170956 194911 153090 50386 -13357 -10236 -16507 -31154 -19552 -14167 -21050 -59845 -138237
14448 -138237 -166306 -83841 45868 165828 273950 364437 421186 418708 371560 351831 360436
14437C60436k0923m4305j7205J307J3875Q1817R9957K7646l466J8170l009r4226
14425D20074j59128j26530q5701j12388j59399j66610j14723J0985J33565J43921
14415b15934N8940m2084r0358l7611J1719l3244q0098p5375l8777p548K4831Q2957
14403d42582J43342J21519N4206l724j5985K7372O2457M0622m3968j08102p4444
14392b39287L7963J40278J72985J74183J72884J33446M6718m4102j29385j86550
14382B79133j74609j41541j45222j53334j04996k9747o757r893p976P562k265
14371d89645n2090r6663j02130n6570m1070m6261L2378J23967J86142K69058K99749
14360B6865K79408K55875K06183J08486k7786j38381j62555j76839k04244k07080
$$ plain form
14437 360436 339513 295208 278003 279310 293185 375002 474959 502605 499139 517309 514300 420074
14425 420074 260946 134416 48715 -63673 -223072 -389682 -504405 -493420 -359855 -215934
14415 -215934 -156994 -199078 -289436 -327047 -315328 -348572 -428670 -504045 -542822 -550370 -525539 -442582
14403 -442582 -299240 -177721 -123515 -127239 -143224 -115852 -53395 -12773 -56741 -164843 -239287
14392 -239287 -201324 -61046 111939 286122 459006 592452 639170 595068 465683 279133
14382 279133 104524 -37017 -182239 -335573 -440569 -470316 -477073 -486966 -494942 -487380 -489645
14371 -489645 -541735 -638398 -740528 -797098 -838168 -884429 -852051 -728084 -541942 -272884 26865
14360 26865 306273 562148 768331 876817 849031 710650 548095 371256 167012 -40068
14350d0068k08174k16350j84884j05550j8725L8950O6958O5073N6773R1168J73429
14339b81400K21850J67470Q3981O2695Q7676P2129J5433r12J4099O109l3341q6998
14327C28791p5932l1377j8366L502L1408J6059l444M3556Q4071N6713j6517n4846
14315C63618k9140J0293K4298P5088J23333M8145j08987k12263k08796j37176
14305e1587n3605O308O3273J14027P8194n6348j66409j59506o3443M3423J20885
14294a24788O6041m8671n8671l5029l3009M017J1431m963q825J6800P5622J15847
14282b4198J25480J09480Q5226O2349P598k9806j3491O506K6456N7372R2346J09572
14270F14890Q9062R951n2807j09561k34384l10187k62717j49660o7874n3807o2981
$$ plain form
14350 -40068 -248242 -464592 -649476 -755026 -773751 -734801 -667843 -602770 -545997 -454829 -281400
14339 -281400 -59550 107920 191901 254596 342272 414401 429834 428922 443021 449130 415789 328791
14327 328791 252859 221482 203116 206618 238026 254085 250641 294197 378268 434981 418464 363618
14315 363618 334478 344771 369069 444157 567490 615635 506648 294385 85589 -51587
14305 -51587 -105192 -98884 -35611 78416 156610 100262 -66147 -225653 -289096 -245673 -124788
14294 -124788 -58747 -107418 -166089 -201118 -234127 -230110 -218679 -223642 -232467 -215667 -140045 -24198
14282 -24198 101282 210762 295988 358337 365935 336129 322638 329144 355600 412972 505318 614890
14270 614890 703952 713903 661096 551535 317151 6964 -255753 -405413 -473287 -527094 -590075
14259e90075o0621m1604K5519J15806J59204J23175J01664J46297K03752K63537
14249D46654K52578J49681L2024p629j8886o3868j36463k09966k08107q3640L6305
14238A88683L706j35050k19419j82349q2179K2162P0208M6331m1299j41264j72495
14227f42965q9891K5879M6335M5098Q4880J41650J63649J53323J38488P8365j1200
14216A33611n4975n8969n4891m2804p6375j10122m1347J01357K07127K10349J50486
14205C63447P7637J8920J0814J43p4610j70578k17697j74968r5398m3108l5953
14194c41351k6333J4336N7565J05686J63655J90288J34799M4795L1834O5396L7264
14183D77934o1896j70862k40568k82515k78253j75796K2168J70875J77027J46112
$$ plain form
14259 -590075 -650696 -692300 -666781 -550975 -391771 -268596 -166932 -20635 183117 446654
14249 446654 699232 848913 880937 873308 854422 790554 654091 444125 236018 152378 188683
14238 188683 192389 57339 -162080 -344429 -426608 -404446 -334238 -287907 -329206 -470470 -642965
14227 -642965 -732856 -706977 -660642 -615544 -530664 -389014 -225365 -72042 66446 144811 133611
14216 133611 78636 19667 -35224 -78028 -154403 -264525 -305872 -204515 2612 212961 363447
14205 363447 441084 460004 470818 470961 396351 225773 8076 -166892 -262290 -305398 -341351
14194 -341351 -367684 -353348 -295783 -190097 -26442 163846 298645 343440 375274 440670 477934
14183 477934 416038 245176 4608 -277907 -556160 -731956 -709788 -538913 -361886 -215774
14173b15774J39825O7249n8052j55026k55436l40353l27737j81512q982R3585
14163a242213J50136J90749J99439K11939J97423J35250M8431k4169l7158k4850
14153a95023k1664j4645n929q671R429M7923L0637j5105j1117N5752J50417J80738
14141B02742J20739O651q8269j42676j27925m7082K0390K3968k4Q19J9993p467
14129a8141q8921j07300j23922k64586l63843k91339j04952P1957J67489J72639
14119i50919J16070L7065K0946P3001J13388R9207M4246j6811p5596o3656L5243
14108e67816J15380J12109P5245Q8021J17873J01820Q9446K2112r8146j70739
14098a14695j74183j32627r2068k0845R0990J37750Q8050J4480l4413r1332o6367
$$ plain form
14173 -215774 -75949 -8700 -66752 -221778 -477214 -817567 -1145304 -1326816 -1335798 -1242213
14163 -1242213 -1092077 -901328 -701889 -489950 -292527 -157277 -108846 -133015 -170173 -195023
14153 -195023 -216687 -231332 -237261 -245932 -236503 -188580 -157943 -173048 -184165 -128413 22004 202742
14141 202742 323481 330132 241863 99187 -28738 -75820 -55430 -31462 -31486 -30667 -10674 -18141
14129 -18141 -107062 -214362 -338284 -602870 -966713 -1258052 -1363004 -1291047 -1123558 -950919
14119 -950919 -834849 -797784 -776838 -703837 -590449 -491242 -446996 -463807 -539403 -603059 -567816
14108 -567816 -452436 -340327 -265082 -177061 -59188 42632 132078 154190 56044 -114695
14098 -114695 -288878 -421505 -513573 -534418 -443428 -305678 -217628 -203148 -237561 -328893 -395260
14087c95260M2056O3847L1466K5837L5281M3428M3639N619q1234j37421j06316
14076d29058o5885n0493l8881q2315j35956o1448J21305K54521K90138K85945
14066H7873K35894J58478R4796N7119L7470P098o2886j65276j91982r3472J8271
14055A83383N8489M2096K4136N38m6351j15376j58424j09414K415M9094O3532
14044e882J11350J71005J17458q0738k34150k25185j09551J5459Q1760P4523M4573
14033c9378N5257P1939Q6774J29841J38812P1379O554M17q22m6845r2414q7942
14021B93572p4459o7033l9490K6034Q1323O6439j4147j12453j68208j64162j12583
14010b85167J354J07981J30054J48590J56843Q2464j9442r9812j58737j96068
$$ plain form
14087 -395260 -353204 -289357 -257891 -232054 -196773 -153345 -109706 -104087 -185321 -322742 -429058
14076 -429058 -494943 -545436 -584317 -666632 -802588 -864036 -742731 -488210 -198072 87873
14066 87873 323767 482245 577041 634160 671630 678728 615842 450566 258584 165112 183383
14055 183383 241872 283968 308104 308642 262291 146915 -11509 -120923 -118508 -69414 -5882
14044 -5882 105468 276473 393931 313193 79043 -146142 -255693 -240234 -158474 -83951 -39378
14033 -39378 15879 87818 174592 304433 443245 514624 521178 521595 520773 473928 381514 293572
14021 293572 219113 152080 112590 138624 219947 286386 272239 159786 -8422 -172584 -285167
14010 -285167 -283813 -175832 -45778 102812 259655 342119 322677 222865 64128 -131940
14000a31940j84973j05042l2102j1266j7345R724Q7766J22335R9764K0648r1428
13989b33859j35651j21748j13868j12061q8149J8549J40757J57250J25127J47748
13979b15905J90402K07753J86355J49561J01346O309j01571j55450j52215j23740
13969I2845j21971j41800j43632j22347j23436j58978j56092j20362q2285m4999
13959a123057m1640k6301L7460J32285J81271J44664R4106O4926j5427j28337
13949f80050j60717o6734O7296J70987K18217J67010O5046J1282Q389K3443P1147
13938a04684J56341K12755J79156O9750l7240j18281j59492j33601m0039L1385
13928E6050K3913l9697r8920r9912j00664j25530q4204M7249J73851K03559J80969
$$ plain form
14000 -131940 -316913 -421955 -454057 -465323 -482668 -472944 -385178 -262843 -163079 -142431 -233859
13989 -233859 -369510 -491258 -605126 -717187 -805336 -786787 -646030 -488780 -363653 -215905
13979 -215905 -25503 182250 368605 518166 619512 625821 524250 368800 216585 92845
13969 92845 -29126 -170926 -314558 -436905 -560341 -719319 -875411 -995773 -1078058 -1123057
13959 -1123057 -1164697 -1190998 -1153538 -1021253 -839982 -695318 -601212 -536286 -551713 -680050
13949 -680050 -840767 -907501 -840205 -669218 -451001 -283991 -218945 -207663 -199274 -175831 -104684
13938 -104684 51657 264412 443568 513318 476078 357797 198305 64704 24665 56050
13928 56050 79963 40266 -58654 -158566 -259230 -384760 -468964 -421715 -247864 -44305 136664
13917A36664J76808J03951k4861q3176j01155j33287j47436q3315M5320J32066
13907B1579J18217k8510j71470k12628k17026j90941q2131J0767Q781M4823J57883
13896e40656K20671K09671J43967O1526O882j9287l2106k9556K605P9744K05602
13885C09063L07839K59015N3224j53859k79921k57052r6859J9297K4292k9310
13875A55729o5709n6784k1881O8647K01080K69036J46980q2182k26624k30484
13865A57808j60244j03237j43019j81365p9980J35893L25802L39723J91336J9097
13855E01814o7812r6383q7941j7297J6106l1925q7804j34546j64089j16097l4179
13844c20153l3078p4357k8059O0004K6993o1337n4520j3761o2258j22089n0028
$$ plain form
13917 136664 313472 417423 392562 309386 208231 74944 -72492 -155807 -110487 21579
13907 21579 139796 111286 -60184 -272812 -489838 -680779 -762910 -752143 -743362 -698539 -540656
13896 -540656 -319985 -110314 33653 95179 102061 82774 50668 21112 23717 103461 309063
13885 309063 616902 875917 929141 775282 495361 238309 141450 160747 185039 155729
13875 155729 90020 33236 11355 80002 281082 550118 697098 614916 388292 157808
13865 157808 -2436 -105673 -248692 -430057 -510037 -374144 -48342 291381 482717 501814
13855 501814 434002 337619 249678 232381 248487 216562 128758 -5788 -169877 -285974 -320153
13844 -320153 -353231 -427588 -455647 -395643 -368650 -429987 -484507 -498268 -560526 -682615 -732643
13833g32643R4291J98402J84711Q2320J2668R697P4094Q6185k6758j32730j11796
13822b61559j913P7552Q6399Q4776P6515N0499M0712L2865L8345M1059j3710j17779
13810A33761j85966j30123n5758n3246q9677o9550K924j2453j15581j43562n0973
13799g70204P4646J39305J15106P5267J00585J42095J07142K4716k8412n1331
13789g1085j14053j86589j80091j27270n4420N9633J81797K23684J69810P9643
13779a8941J977j5224L0859K1832m4363n0686K6462J04506R2840M6109K9699M9808
13767B74878L0159k8356k8445p336j649O1928J34519R0419l3106j57468k23187
13756A12356j72938m2287O5403J01917M1217p2756j44901j25173l1061L5590J8572
$$ plain form
13833 -732643 -638352 -439950 -255239 -172919 -160251 -150554 -76460 9725 -17033 -149763 -261559
13822 -261559 -263472 -185920 -99521 -14745 61770 112269 152981 185846 224191 265250 251540 133761
13810 133761 -52205 -182328 -238086 -291332 -381009 -450559 -447635 -460088 -575669 -719231 -770204
13799 -770204 -695558 -556253 -441147 -365880 -265295 -123200 -16058 8658 -19754 -71085
13789 -71085 -185138 -371727 -551818 -679088 -733508 -673875 -492078 -268394 -98584 -18941
13779 -18941 -16964 -32188 -1329 20503 -23860 -74546 -48084 56422 149262 195371 225070 274878
13767 274878 305037 276681 248236 240900 239251 301179 435698 526117 493011 335543 112356
13756 112356 -60582 -102869 -37466 64451 105668 32912 -111989 -237162 -268223 -232633 -214061
13745b14061J6575M1282O3969J09951J19545O8479J6276l3976n1292o1496o8266
13734F986j3651Q1470J67746J88677J16593M0596J4400M624j3384o9572j25479
13723C99006j17120o6705n2907q8169r6656n9564m1850j9509O2178J35348J40321
13712A94373R1320J7880k4289p4526j49247j81933j52282q2955j7131L4031O9256
13701b75503P1443K8375m1328p3412l7086j9882m7226m7713l7250m3266k9929
13690e52777k62J8460K4400M3641J23647J98720J86823J54746J35536M6214p7911
13679C01237j52686j62688j10527n8013n1580n1781j5235J911j9536J0449P4434
13668b34015O8257j6355j15164j87780k10953j65317m1851P4240J17761J50415
$$ plain form
13745 -214061 -197486 -156204 -92235 17716 137261 205740 222016 188040 136748 75252 6986
13734 6986 -6665 74805 242551 431228 547821 588417 602817 607441 594057 524485 399006
13723 399006 281886 215181 162274 74105 -22551 -82115 -123965 -143474 -81296 54052 194373
13712 194373 285693 303573 279284 204758 55511 -126422 -278704 -361659 -378790 -344759 -275503
13701 -275503 -204060 -175685 -217013 -290425 -327511 -347393 -394619 -442332 -479582 -522848 -552777
13690 -552777 -553039 -534579 -510179 -466538 -342891 -144171 42652 197398 332934 379148 301237
13679 301237 148551 -14137 -124664 -182677 -234257 -286038 -301273 -299362 -318898 -308449 -234015
13668 -234015 -165758 -182113 -297277 -485057 -696010 -861327 -903178 -828938 -711177 -560762
13658e60762J40029P5164L3436M2352K5156l4363n4464o181N4079P5616J28348
13647h1590J52501J10791P4023P1074P2564N709j20372j67345j14685p6296o8855
13636a42481Q993J28887J14656m7837j64293j29479K3101J94276K28771J22914
13626C37508M4875K2278J6728J7472l6681r7227q5213p3115j15866j55185j56453
13615b80879j11921L966J27435K11111K12248Q4489q947K4861O1805M2910n358
13604C61720o3294n5792k7906j03395k22861k76481k22954j17452q7870q4226
13594i00511m4713L208R5642J57485J28323J02274J17123R3860L0947r436j0052
13583b35850J8329Q8300J73421J91967J57347R1053K2306k6230m8823k2110l1094
$$ plain form
13658 -560762 -420733 -345569 -312133 -269781 -244625 -278988 -333452 -339633 -285554 -209938 -81590
13647 -81590 70911 181702 255725 326799 399363 405072 284700 117355 2670 -73626 -142481
13636 -142481 -133488 -4601 110055 62218 -102075 -231554 -208453 -14177 214594 337508
13626 337508 382383 404661 421389 438861 402180 304953 219740 146625 30759 -124426 -280879
13615 -280879 -392800 -388834 -261399 -50288 161960 246449 237502 262363 324168 367078 361720
13604 361720 298426 242634 214728 111333 -111528 -388009 -610963 -728415 -816285 -900511
13594 -900511 -945224 -942016 -846374 -688889 -560566 -458292 -341169 -247309 -216362 -225798 -235850
13583 -235850 -217521 -129221 44200 236167 393514 484567 506873 480643 431820 409710 378616
13572C78616o3482m4577o5388j54097j91307j36970o6592p320P6734J38676J47856
13561A2149R0510l6686j72511k51895k67769j88537o0391J2164N2370J31570J96697
13550d82329J95359J39572R9067J03199R3521N3456J7984J6739M2850N9110L0234
13539C68762m2695j29153j47244p8740l6911q7842j04030R341J13272O9321m5660
13528a11579j15865j07858o1302j7076N0887J69795K49333J90134M9083o0475
13518B35077m8208O2777J95042K46830J93208J15452J0619j15599j85948j70857
13508E38393j01535k9567k1839j01305j64492q8051Q6867J97774J00215j02201
13498C14259j62356o5846L6114O6985Q4366J00640L1365o0194j01583p6958o872
$$ plain form
13572 378616 315134 270557 205169 51072 -140235 -277205 -343797 -351117 -274383 -135707 12149
13561 12149 102659 65973 -106538 -358433 -626202 -814739 -875130 -862966 -810596 -679026 -482329
13550 -482329 -286970 -147398 -48331 54868 148389 201845 219829 236568 279418 338528 368762
13539 368762 326067 196914 49670 -29070 -65981 -153823 -257853 -248512 -135240 -65919 -111579
13528 -111579 -227444 -335302 -396604 -413680 -362793 -192998 56335 246469 295552 235077
13518 235077 186869 249646 444688 691518 884726 1000178 1010797 895198 709250 538393
13508 538393 436858 407291 385452 284147 119655 31604 118471 316245 416460 314259
13498 314259 151903 86057 122171 189156 273522 374162 405527 345333 243750 166792 159920
13487A59920k0749r7061j08715m8477k2329o2224p9097p1334n4324n076O3096
13476c46370R9652L3461p3480q0523L3648J53619J82575J19948J9883o3173j16377
13465c7137p6098k88J1594k6582p0529p8392n2553l4597k2888L4782J33721K00520
13453a8447J26359o0168j56177j09709k8482L9709N4413j1488n6689l9634k3874
13442b84187j0043J9426K4544J996J431N6540J21645J42000J00793J9917o8395
13431A25667j30262r8960k7032m3611q4614j0088J16463J56684Q1762m8949j08129
13420g1069q3263j2805Q2807J31675J23001R6298M0017L0656J20683J69752R8474
13409G26226j8950j19659j55434j12754n2416j4091K1179N0131Q2415J41978J85852
$$ plain form
13487 159920 139171 42110 -66605 -115082 -137411 -199635 -278732 -350066 -404390 -409466 -346370
13476 -346370 -246718 -213257 -286737 -367260 -333612 -179993 2582 122530 142413 79240 -37137
13465 -37137 -113235 -113523 -101929 -128511 -199040 -277432 -329985 -364582 -387470 -352688 -218967 -18447
13453 -18447 107912 47744 -108433 -218142 -246624 -206915 -152502 -163990 -220679 -260313 -284187
13442 -284187 -294230 -274804 -250260 -248264 -246833 -190293 -68648 73352 174145 194062 125667
13431 125667 -4595 -103555 -130587 -174198 -258812 -268900 -152437 4247 86009 37060 -71069
13420 -71069 -154332 -167137 -84330 47345 170346 266644 306661 337317 458000 627752 726226
13409 726226 707276 587617 432183 319429 267013 252922 274101 324232 406647 548625 734477
13398G34477J55714L9419o5639j11912j36187j54941j30886p7007k343Q8660J19585
13387D58940P9385l5712j60228k26635k58705k64975k11867m9511J02874J39893
13377d26541J50090J66485J16237O744o1169k6397L7031J7919j549J6951k8937
13366c3136j11649j27447n1296L5543Q7177P3878m705o6192m9322O817M5383Q882
13354a86067j01782j65317j62203j21204k8865N9106O6510O1166J14118J61881
13344c02657J53723J15874R0651N9589K7627R544P328L0401M4116J1765m4370
13333B03591n4133j7820j5365n1590k6254J7608L5559O1939P6914P0317N5778
13322C56544P7795J25431J41650J26712O8962l4945j57419k34179k09699j36183
$$ plain form
13398 734477 890191 929610 863971 752059 615872 460931 330045 253038 250695 339355 458940
13387 458940 538325 502613 342385 115750 -142955 -407930 -619797 -669308 -566434 -426541
13377 -426541 -276451 -109966 6271 13015 -48154 -74551 -37520 -19601 -21150 -4199 -33136
13366 -33136 -144785 -272232 -323528 -287985 -200808 -126930 -131635 -197827 -247149 -240332 -194949 -186067
13354 -186067 -287849 -453166 -615369 -736573 -765438 -706332 -639822 -578656 -464538 -302657
13344 -302657 -148934 -33060 57591 117180 144807 154351 161679 192080 236196 247961 203591
13333 203591 149458 131638 116273 64683 38429 56037 91596 153535 230449 300766 356544
13322 356544 434339 559770 701420 828132 897094 862149 704730 470551 260852 124669
13312A24669j12374j32308j04762m5621m3508p9032o0299L9464J53195K08513
13302e2063J12893o1904j18530j5347J10836J90218K13472J45265O0711K1820
13292F07371K6571K4289Q655K8669P3852O9879P081N738N7742O0468L8476J1926
13280A020717L7115J39918J71795N1515q5980j01537m2030j5141K694m027m0532
13269A134507p7590j46112k00237k14399j90361j43214j01159n3472N074R9272
13259A12309K27186L06945K98164K18905J10780N1540L4196l3096j56544j92974
13249I77411j69014j54661j13354p2843j03114j26115l1701R0805J70208J88566
13239F56188J21015L8026M524L125L8594Q9511Q2975L3858r313p1624j11083n7150
$$ plain form
13312 124669 12295 -120013 -224775 -270396 -313904 -392936 -453235 -413771 -260576 -52063
13302 -52063 60830 -1074 -119604 -134951 -24115 166103 379575 524840 585551 607371
13292 607371 633942 658231 666886 695555 769407 839286 846367 852105 909847 970315 1008791 1020717
13280 1020717 1057832 1197750 1369545 1421060 1335080 1233543 1191513 1176372 1179066 1175039 1134507
13269 1134507 1056917 910805 710568 496169 305808 162594 61435 7963 13037 112309
13259 112309 339495 646440 944604 1163509 1274289 1325829 1360025 1326929 1170385 977411
13249 977411 808397 653736 540382 467539 364425 238310 206609 297414 467622 656188
13239 656188 777203 815229 819753 822878 861472 950983 1033958 1067816 1058503 986879 875796 818646
13227H18646L1050R5885J08186L4711n8885j56673k57313k27836m8479J07420
13217D46712J93122K59706K43642J15710M3292R8205J45866J05933J2965p2398
13207A592755j19262r4676q4762j10572p5079k6061j9319o6727j19399j14276
13197G62622r2874j31017j19792K3790J13665J18894J39024J03886k6671j71792
13187G19735k02233p1165J23033K00111J57553J20169Q2411j3329p4496l0439
13177A011350O7809J62661J91401J31915K9785j3348k5158p2995r6617q9338q6017
13166A211448p9879p3856p2609l3919N0484J17821J36804J16974M3941l8807l8101
13155A340301K5001L0955o9509j86834k28639j98909j20694q944N4468K4781j0135
$$ plain form
13227 818646 849696 945581 1053767 1088478 1029593 872920 615607 387771 339292 446712
13217 446712 639834 899540 1143182 1258892 1302184 1400389 1546255 1652188 1665153 1592755
13207 1592755 1473493 1378817 1294055 1183483 1108404 1082343 1063024 996297 876898 762622
13197 762622 669748 538731 418939 442729 556394 675288 814312 918198 891527 719735
13187 719735 517502 446337 569370 769481 927034 1047203 1129614 1116285 1041789 1011350
13177 1011350 1079159 1241820 1433221 1565136 1594921 1581573 1556415 1483420 1386803 1297465 1211448
13166 1211448 1131569 1057713 985104 951185 1001669 1119490 1256294 1373268 1417209 1378402 1340301
13155 1340301 1365302 1396257 1326748 1139914 911275 712366 591672 582728 637196 661977 651842
13144F51842M9745J53894J46288J7503r4053j00581k0738R4579J80190J96765
13134A275434J23993K5652r666k1101k1749k9123j5591L7735P4520Q3210R1527
13123A614841O5560j9469o8167j7868N4438O7004K2179R648K9948P5877Q3895
13112A917886k7015j41947j45159l7046J00478J35720P6535K6714J8925M7329
13102A972420O9821J24189K19124K37057J64916P1763J2748K8511P2649O9151
13092C042349K6041P071j3817j35774l03144l34765j48819J00458K21659J69096
13082B630355L6445l1635K1736J06841J58723J54673Q5134K3954J16594K71440
13072C574260K88350J40251j1521r776Q8037J29032L7961r8445j38982k1874J10990
$$ plain form
13144 651842 701587 855481 1001769 1019272 925219 824638 803900 898479 1078669 1275434
13134 1275434 1399427 1425079 1415413 1394312 1372563 1343440 1327849 1365584 1440104 1523314 1614841
13123 1614841 1680401 1660932 1592765 1574897 1629335 1696339 1718518 1728166 1758114 1833991 1917886
13112 1917886 1890871 1748924 1603765 1566719 1667197 1802917 1879452 1906166 1925091 1972420
13102 1972420 2042241 2166430 2385554 2622611 2787527 2859290 2872038 2900549 2973198 3042349
13092 3042349 3068390 3075461 3061644 2925870 2622726 2287961 2139142 2239600 2461259 2630355
13082 2630355 2666800 2635165 2656901 2763742 2922465 3077138 3162272 3186226 3302820 3574260
13072 3574260 3862610 4002861 3991340 3981564 4069601 4198633 4236594 4138149 3999167 3977293 4088283
13061D088283J13724L9572k8334m5721k4603j0220J0456M3208K2463L4095J35262
13050D378185J93302J94544K29203K64422K74095K28025J48279J02317R3967J03039
13040F209378R0254Q9362J16608J20012R4712J00906J42399J51331J09235K8610
13030G252807o1079j01496o1977N0036J93416L03938L64540M54518M83249M03369
13020I281321L15971K46065J75976J71000K18729K58061K69778K33661J86413
13011A1356975K68944L96062M45431M90266N83427O93009P81712Q37577Q51776
13002A6705179R01214R56275J000809J127757J250351J286200J364486J525305
12994B6117576J688240J875933K181343K572435K955158L421482L998874M605667
$$ plain form
13061 4088283 4202007 4241579 4213245 4167524 4142921 4132701 4143157 4186365 4208828 4242923 4378185
13050 4378185 4571487 4766031 4995234 5259656 5533751 5761776 5910055 6012372 6106339 6209378
13040 6209378 6299632 6388994 6505602 6625614 6720326 6821232 6963631 7114962 7224197 7252807
13030 7252807 7191728 7090232 7028255 7078291 7271707 7575645 7940185 8394703 8877952 9281321
13020 9281321 9597292 9843357 10019333 10190333 10409062 10667123 10936901 11170562 11356975
13011 11356975 11625919 12021981 12467412 12957678 13541105 14234114 15015826 15853403 16705179
13002 16705179 17606393 18562668 19563477 20691234 21941585 23227785 24592271 26117576
12994 26117576 27805816 29681749 31863092 34435527 37390685 40812167 44811041 49416708
12986D9416708N258706O038228P034735Q293260R853447J1740826J3989000J6675650
12978A28300560J9854319K3590930K7787223L2082049L5603048L6730139L3559771
12971C37508039K5262268J3136489k39783j2823410k3360511l0684055l4104674
12964B74694363l3922460l1317053k7622887k3729936k0115563j6980121j4367069
12957A06639274j2254238j0472466q861316p430636o273626n406184m745387m212200
12949D6983221l717710l161187k642807k248517j933877j716905j554499j378882
12941B8628837j292927j290290j167114r42081p87477o96650o07006m90475l57080
12932B0997737l05654l08569k86311k38300j65269k3769J99888L51224L52332
$$ plain form
12986 49416708 54675414 60713642 67748377 76041637 85895084 97635910 111624910 128300560
12978 128300560 148154879 171745809 199533032 231615081 267218129 303948268 337508039
12971 337508039 362770307 375906796 375667013 362843603 339483092 308799037 274694363
12964 274694363 240771903 209454850 181831963 158102027 137986464 121006343 106639274
12957 106639274 94385036 83912570 75051254 67620618 61346992 55940808 51195421 46983221
12949 46983221 43265511 40104324 37461517 35213000 33279123 31562218 30007719 28628837
12941 28628837 27335910 26045620 24878506 23936425 23148948 22452298 21845292 21354817 20997737
12932 20997737 20692083 20383514 20097203 19858903 19693634 19669865 19869753 20220977 20573309
12923B0573309L24789L91136N00536N66161N74302N73437O83726R12137J126197
12914B6225730J298661J394181J327045J125917R02446P72433Q20008J026599
12906C4893020J319662J694768K165963K730229L337932L951387M584603N295761
12898E9973325O157765P194532Q444283J0029724J2045587J4491328J7345461
12891A35682005K0691165K4618961K9109236L3613424L6896619L7158216L2562847
12884C50332473K2762526R637769m149941j6647699k6600268l2979214l5326603
12877B67029043l4271691l1042448k6864371k2714729j9138202j6224769j3808420
12870A02964413j1754584r988762q477078p176868o030744n051952m262243l643819
$$ plain form
12923 20573309 20898098 21289234 21789770 22355931 22930233 23503670 24187396 25099533 26225730
12914 26225730 27524391 28918572 30245617 31371534 32273980 33046413 33866421 34893020
12906 34893020 36212682 37907450 40073413 42803642 46141574 50092961 54677564 59973325
12898 59973325 66131090 73325622 81769905 91799629 103845216 118336544 135682005
12891 135682005 156373170 180992131 210101367 243714791 280611410 317769626 350332473
12884 350332473 373094999 382732768 378582827 361935128 335334860 302355646 267029043
12877 267029043 232757352 201714904 174850533 152135804 132997602 116772833 102964413
12870 102964413 91209829 81221067 72743989 65567121 59536377 54484425 50222182 46578363
12862D6578363l193283k873744k630972k414151k163554j899438j693581j576081
12854B8133559j471036j295286j059316q48275p23037o40841n53477m84955m56932
12845B0600404m28482l93643k93423j43741n0627j2222L4622R7908J70906K26255
12835A9807957K42837K35889K33780K74669L48891M02486M37735M91267N86701
12826B3062212P06358Q46650J004572J109416J211444J405457J714800K136974
12818C3197883K579131K911974L164003L464189L881588M497208N388457O514479
12810F5598912P770575R136591J0711115J2648523J5086434J8078926K1654008
12803A60685084K5786009L0212998L4231026L6577070L5505967K9534251J8855485
$$ plain form
12862 46578363 43385080 40511336 37880364 35466213 33302659 31403221 29709640 28133559
12854 28133559 26662523 25367237 24307921 23459646 22736609 22095768 21542291 21057336 20600404
12845 20600404 20171922 19778279 19484856 19341115 19290488 19278266 19312888 19410796 19581702 19807957
12835 19807957 20050794 20286683 20520463 20795132 21144023 21546509 21984244 22475511 23062212
12826 23062212 23768570 24615220 25619792 26729208 27940652 29346109 31060909 33197883
12818 33197883 35777014 38688988 41852991 45317180 49198768 53695976 59084433 65598912
12810 65598912 73369487 82506078 93217193 105865716 120952150 139031076 160685084
12803 160685084 186471093 216684091 250915117 287492187 322998154 352532405 371387890
12796C71387890N676270p474729j9124136k8184117l3507304l4838617l3079438
12789B20855819k9626663k5633758k1761804j8355289j5501656j3136933j1228952
12782H5610764r677843q345774p182508o194612n377312m676013m080672l566128
12774C6509902l141041k780319k406163j991681j602346j423707j461857j478839
12766B0223949j410403j313613j154509r89660q84777q17707o93606n31660m16651
12757A2011363l73043m08871m79830n07454n05994n05891m63640l60473l12422
12748H093745l73924m17983l61853k62992j98705j69833j68379j55570j42595
12739E841911k01048k41385j60111p5843n3575j9641j4348q1191j43097j14587
$$ plain form
12796 371387890 377064160 369589431 350465295 322281178 288773874 253935257 220855819
12789 220855819 191229156 165595398 143833594 125478305 109976649 96839716 85610764
12782 85610764 75932921 67587147 60404639 54210027 48832715 44156702 40076030 36509902
12774 36509902 33368861 30588542 28182379 26190698 24588352 23164645 21702788 20223949
12766 20223949 18813546 17499933 16345424 15355764 14470987 13653280 12959674 12428014 12011363
12757 12011363 11638320 11229449 10749619 10242165 9736171 9230280 8766640 8406167 8093745
12748 8093745 7719821 7301838 6939985 6676993 6478288 6308455 6140076 5984506 5841911
12739 5841911 5640863 5399478 5239367 5163524 5109949 5090308 5075960 4994769 4851672 4737085
12729D737085n7339p1500j31680j28533o3764J0049N1924j4132r3177j05303o4106
12718D069524N728L0784k183o6337j65615k47486k06142q4596N353J998p2477
12707C268551j14419o5777p512o628m3159o2778M085R8100J20251M0740p4756
12696C156698j30318q8053k5729m4588j62825k63958k23468j49663j15508p2525
12686A880063k2916k8579n4586k0064J3550n3393j56898j75306j07625k7650K9642
12675A276238R3931J22722J08804P1521M6060K6598k3366p1020j09902j35691
12665A405895j17424l6891M8888J6435q3150j04290l7751O2754J64124K49100
12655A567690K44755J46174M0995l6063r7163j11111q4296j14121j87698j98125
$$ plain form
12729 4737085 4679746 4608246 4476566 4348033 4284269 4294318 4346242 4332110 4238933 4133630 4069524
12718 4069524 4075252 4106036 4103853 4037516 3871901 3624415 3418273 3333677 3339030 3341028 3268551
12707 3268551 3154132 3088355 3080843 3074215 3031056 2968278 2972363 3070463 3190714 3231454 3156698
12696 3156698 3026380 2938327 2912598 2868010 2705185 2441227 2217759 2068096 1952588 1880063
12686 1880063 1857147 1828568 1773982 1753918 1767468 1714075 1557177 1381871 1274246 1246596 1276238
12675 1276238 1370169 1492891 1601695 1673216 1719276 1745874 1722508 1651488 1541586 1405895
12665 1405895 1288471 1251580 1300468 1316903 1233753 1129463 1091712 1154466 1318590 1567690
12655 1567690 1812445 1958619 1999614 1963551 1866388 1755277 1670981 1556860 1369162 1171037
12645A171037j22264m5507l3834l2552K9312Q3768N9107K899k9509j3027J8823
12634A088253J7320P743K0829J4534l2772n9661j4111O2197P3805M0868M9671
12623A268676M5097k9004q7452q1603l978J26285K62380K83232J12518r3393j68082
12612A634676q3622J9216L0518l390l4527q9316r3509p697O5202L9256p9405j55353
12600A242049j11109n574P2469P7964N3877K7774q2879k33248k63804j87847r6903
12589D92769j7898L0591M6075N0494l23r1381j72427k24512j87844n8401R6530
12578c6327J95823J91500J92991K43552K35937J59784J09447P0013k9948j61640
12568A171132k07997j09832m0299j16169j48262n4123N9545J70643J58569k7115
$$ plain form
12645 1171037 1048773 1003266 969432 936880 966192 1049960 1109067 1111966 1082457 1069430 1088253
12634 1088253 1105573 1113316 1134145 1148679 1115907 1056246 1042135 1104332 1178137 1219005 1268676
12623 1268676 1313773 1284769 1197317 1115714 1111736 1238021 1500401 1783633 1896151 1802758 1634676
12612 1634676 1551054 1570270 1600788 1597398 1562871 1473555 1380046 1372349 1437551 1476807 1397402 1242049
12600 1242049 1130940 1125366 1197835 1275799 1329676 1357450 1274571 1041323 777519 589672 492769
12589 492769 474871 505462 551537 602031 601708 510327 337900 113388 -74456 -132857 -36327
12578 -36327 159496 350996 543987 787539 1023476 1183260 1292707 1362720 1332772 1171132
12568 1171132 963135 853303 813004 696835 548573 494450 553995 724638 883207 856092
12558H56092k19466l08532k60444j15336J2075J13820K53720L15307K46579J32083
12548A025898L5217l2059q9225j41873j60412q2129N6038J18404R2325M1145k5559
12537H37770p6644o2196J7544Q1360N7176o502p4927j74278k22804j53011n8234
12526A65254j5151k4752j08157k16376j77446J3059J93376K62350J68863J6419
12516B77439l9979j8078m9829j02026j29041j27606r0337o6979m9463r193j079
12505d06171q0391j52701j11439j8144P1924J83231K54063K31143J63599P6288
12495B11402K9405M1388M8478P365l6386p7969j06153o5820m867K5488L7772L4222
12483A44325J3427r285K6385J08070J47765J39797J27544R4494J9094l9900o9499
$$ plain form
12558 856092 636626 328094 67650 -47686 -35611 78209 331929 647236 893815 1025898
12548 1025898 1061115 1029056 939831 797958 637546 555417 611455 729859 822184 863329 837770
12537 837770 761126 698930 716474 797834 855010 848508 773581 599303 376499 223488 165254
12526 165254 150103 125351 17194 -199182 -376628 -363569 -170193 92157 261020 277439
12516 277439 237460 219382 169553 67527 -61514 -189120 -279457 -346436 -395899 -405092 -406171
12505 -406171 -486562 -639263 -750702 -768846 -696922 -513691 -259628 -28485 135114 211402
12495 211402 240807 282195 330673 338038 301652 223683 117530 51710 46843 72331 110103 144325
12483 144325 157752 148467 174852 282922 430687 570484 698028 792522 811616 771716 702217
12472G02217p1069r037M1588K1099o1667j25596o6864J7079L676q4637j30419
12461B36370q1555P232O3789N1537J2662M0411J24780J53030J06927L4715p595
12450G42303M1073J16310R5169j8951j01763j14442j01850q7364n0200l9353o3436
12439D17496m4105m3866n9261l1530L961J7610J5651K7401P3885J02594J01161
12428E80997R0242M6985j6871n8782n2068j1276l2043r8402r2691n6215q6493
12417B13383j29649j07199m5398r000m427j7633J5123J29029K17305J97133J29200
12406E87867O3398l0695j30528j54745j06396n5393o6509o7822N982M5991J4137
12395A05287o4406j37308j29883q9755k9778O0760J16865J31433J33135J25456
$$ plain form
12472 702217 631148 622111 663699 684798 623131 497535 430671 447750 451426 366789 236370
12461 236370 154815 162047 225836 277373 290035 330446 455226 608256 715183 749898 742303
12450 742303 783376 899686 994855 975904 874141 759699 657849 570485 520285 480932 417496
12439 417496 373391 329525 270264 238734 242695 260305 275956 303357 377242 479836 580997
12428 580997 671239 718224 701353 642571 590503 579227 547184 448782 356091 299876 213383
12417 213383 83734 -23465 -68863 -77863 -82290 -99923 -84800 44229 261534 458667 587867
12406 587867 651265 620570 490042 335297 228901 173508 106999 39177 45159 91150 105287
12395 105287 40881 -96427 -226310 -316065 -345843 -285083 -168218 -36785 96350 221806
12385B21806O7636J8577K0884L7878J9730l5448n8923k0988Q02p7969k12917k70570
12373b89502k03919o5161K2452j4954n7025j7540L0002J1178k3246k3969l329
12362f35013J7624N9009J17244J05098J9677j633O4455J20574J14803Q8474O7399
12351A37711L2260K2249L9770L7541K4704K7487L005l495O0588J22028R7384K5141
12339F26373m3422p5819o8444l6553l1369p7377q4297l4519k1603n6944j01681
12328e655o0972P88o1189j43245j23900J2902J78410K27859J39086J821r1204
12317G4701j18592j30308j05115o0612l2724j8930j961q995k7240k8079k7622
12306d85477l8545o8087o2680n3896l9935M9231J52133K10965K20851J95648J45020
$$ plain form
12385 221806 289442 308019 328903 366781 386511 351063 292140 271152 271954 193985 -18932 -289502
12373 -289502 -493421 -558582 -536130 -551084 -608109 -625649 -595647 -584469 -607715 -631684 -635013
12362 -635013 -617389 -558380 -441136 -336038 -316361 -317994 -253539 -132965 -18162 70312 137711
12351 137711 169971 192220 231990 269531 294235 321722 324727 321232 381820 503848 601232 626373
12339 626373 582951 507132 438688 402135 370766 293389 209092 174573 152970 96026 -5655
12328 -5655 -66627 -65839 -127028 -270273 -394173 -381271 -202861 24998 164084 165905 74701
12317 74701 -43891 -174199 -279314 -339926 -372650 -391580 -393541 -402536 -429776 -457855 -485477
12306 -485477 -524022 -592109 -654789 -708685 -748620 -699389 -547256 -336291 -115440 80208 225228
12295B25228Q8101M0864J1514M743o174n6500m9976M8998J08893Q2149L6018l607
12283E30251k6388j2626K2893K1789l9451q6557o9458n7169n6114p592O5641J25957
12271D11176J16215K4636k4855l219M260l1273q8270j05941p9263m2573k6300
12260A54593j4732j8355m2893n1158l2599n547j8495q3250j50094j55137q2006
12249d99673N526N9087O1716j1372o7791L404J44324K55022L18104L47157L16222
12238I31726K05709O5259J4821L9505J8741n9088j33715j49217p4733K2303J5104
12227H96415j17442k62713l29830l09302k10202r6427k8236K9455O5330N5554
12217c07398K5276j0814L1939J19761J55645J67206J82047J48547N2194n0293
$$ plain form
12295 225228 313329 354193 365707 370450 364276 307776 257800 306798 415691 497840 533858 530251
12283 530251 503863 491237 514130 535919 496468 409911 340453 283284 227170 219578 285219 411176
12271 411176 527391 552027 527172 523953 528213 496940 408670 302729 223466 180893 154593
12260 154593 139861 121506 78613 27455 -5144 -10691 -29186 -112436 -262530 -417667 -499673
12249 -499673 -494147 -435060 -373344 -384716 -452507 -449103 -304779 -49757 268347 615504 931726
12238 931726 1137435 1202694 1217515 1257020 1275761 1216673 1082958 933741 859008 881311 896415
12227 896415 778973 516260 186430 -122872 -333074 -429501 -457737 -428282 -362952 -307398
12217 -307398 -282122 -292936 -260997 -141236 14409 181615 363662 512209 564403 514110
12207E14110j11626j08738j07108j83424k48241j81905n9514m435J19L2429P8304
12196c80029N5153P578K0585O7428Q8528N8276J6841J9271N1418K9611j5772m9416
12184c0528p5168l9847O5188J24659O4076k1415j4625K4881j8839j49639k32981
12173c04238j62576k9600P0689J31182J63190J50874Q4872Q783j7223J270K3666
12162A20889K6911L2930P1477P5013J5074o7411j10173j06996o5202k3093J4679
12151a5902M4411L5355L0235M0276K4726m68q167L248L6826N4600L2702M0690
12139C18532M634j16923k42265k61060j05218P9061J69404K05487K14356J26180
12129C92188m3413j85585j69610m4758K4193J4307L2555J08950J34989N0420p1551
$$ plain form
12207 514110 402484 293746 186638 3214 -245027 -426932 -486446 -490881 -490762 -458333 -380029
12196 -380029 -324876 -317298 -296713 -229285 -140757 -82481 -65640 -46369 5049 34660 18888 -30528
12184 -30528 -105696 -145543 -80355 44304 108380 86965 72340 97221 78382 -71257 -304238
12173 -304238 -466814 -496414 -425725 -294543 -131353 19521 104393 113176 95953 97223 120889
12162 120889 147800 180730 252207 327220 342294 274883 164710 57714 -7488 -30581 -15902
12151 -15902 28509 63864 94099 134375 159101 158633 150466 153714 190540 245140 277842 318532
12139 318532 323166 206243 -36022 -297082 -402300 -323239 -153835 51652 266008 392188
12129 392188 348775 163190 -6420 -51178 -26985 -12678 19877 128827 263816 314236 242685
12118B42685j42538j38516q5302m0462L750L5310M4538N0067K8670J0946J8604
12107B7752O1320J04875R2602K0965n2085m2442K1125P5084J08416J64043K10228
12096G91883J34444p4187k78660l76733m02579l29950j67529k3709J3456k3694
12086g37258j4540J02333K25789K44026J62723N9793j3751o1186l3791O4201J33655
12075A31994Q9066j91L3166J19070R2719l9503j68328k24779j76799k4797J23498
12064d4884K04605K26021J68452O1534q5809j85365j63415j25635j11906m2175
12054i8577P4661J14029M0096J9059J09318J56004J15676P0723J5458l0676l6453
12043E49318j21600k05692j55567q3777p4873n6273K1178L8974l6976p8659m7799
$$ plain form
12118 242685 100147 -38369 -123671 -164133 -160383 -125073 -80535 -30468 -1798 9148 27752
12107 27752 89072 193947 286549 307514 255429 212987 234112 309196 417612 581655 791883
12096 791883 926327 852140 573480 196747 -205832 -535782 -703311 -727020 -713564 -737258
12086 -737258 -751798 -649465 -423676 -179650 -16927 42866 29115 -32071 -65862 -1661 131994
12075 131994 221060 220869 254035 373105 465824 426321 257993 33214 -143585 -168382 -44884
12064 -44884 159721 385742 554194 615728 529919 344554 181139 55504 -56402 -98577
12054 -98577 -23916 90113 130209 149268 258586 414590 530266 600989 616447 585771 549318
12043 549318 427718 222026 66459 -17318 -92191 -148464 -127286 -88312 -125288 -203947 -251746
12032b51746J7985P7552O2406K8366Q5694J77046J81163J27081P4528n2197k31273
12021B96605k72424j29103K2988Q9825Q9266Q2156Q1226R1935J39794J14036m316
12010F01988r3080r4968J1938J68962K31797J45607J0392o7897j48392k13075
12000E53272j55407n6103k2189m9018q9372j11997o4050L9891R6080R7101M0850
11989B79058r5488k38880k51329j53664l9626N071k2665m1386l0629k8841l9033
11978f57412o479J19812K35736K00178P8878J3046M960m6822j38626j04928M2744
11967b58913Q1852M996m6730m1692n5451j25601j23479j8658N6638O1493M4436
11956d21109K7979K0612L7177L8860Q909O165N9020Q4345N2951N6303N9620N0871
$$ plain form
12032 -251746 -233761 -156209 -93803 -65437 20257 197303 378466 505547 580075 527878 296605
12021 296605 24181 -104922 -81934 7891 97157 179313 260539 352474 492268 606304 601988
12010 601988 508908 413940 425878 594840 826637 972244 982636 914739 766347 553272
12000 553272 397865 341762 319573 270555 181183 69186 5136 45027 141107 238208 279058
11989 279058 183570 -55310 -306639 -460303 -499929 -494858 -517523 -558909 -589538 -618379 -657412
11978 -657412 -663891 -544079 -308343 -108165 -29287 -16241 -11281 -58103 -196729 -301657 -258913
11967 -258913 -177061 -172065 -218795 -260487 -315938 -441539 -565018 -583676 -527038 -465545 -421109
11956 -421109 -393130 -372518 -335341 -296481 -287572 -281407 -222387 -138042 -85091 -28788 30832 81703
11944H1703P8829N8372k5168p0209o7396n7198o0264n0944J3524J28957K04879
11933B35085J71983N3560o8505j06802j22187j60351j16638N0212K25030K92757
11923D54144K35564J08984m0073j72348k17494j53746j08646j11943n5928R2130
11913C0644K22699K37210J52796N7797J7723q151q9294j57173j61480j17280n2817
11902A32674M1162J03759P8013N8202Q2921M9638o573N752L2111L3173L6281M1411
11890F88524Q1867J12602Q7077O4950l1549j98293k53935j83179j25156j03198
11880A39710n5249l722k2291q0594j24606j13064m6614p080P234L2377N7912P3340
11868a42647N9042m105o7118o1753O991R1292J61434J35614P053n5342L8935J77894
$$ plain form
11944 81703 160532 218904 193736 123527 56131 -1067 -61331 -112275 -98751 30206 235085
11933 235085 407068 460628 392123 285321 163134 2783 -113855 -63643 161387 454144
11923 454144 689708 798692 758619 586271 368777 215031 106385 -5558 -61486 30644
11913 30644 253343 490553 643349 701146 718869 710718 621424 464251 302771 185491 132674
11902 132674 173836 277595 355608 413810 496731 546369 539796 545548 577659 610832 647113 688524
11890 688524 770391 882993 970070 1035020 1003471 805178 551243 368064 242908 139710
11880 139710 84461 80739 58448 -22146 -146752 -259816 -306430 -313510 -306276 -273899 -215987 -142647
11868 -142647 -83605 -87710 -154828 -216581 -209590 -118298 43136 178750 185803 130461 169396 347290
11856C47290K81452L19800K30508M7087j01979j31402o4627k0068l3929l2021
11846H42111r657L8923J17801J91003K72930L18565K79988J93490J57866J95702
11836B598722J72988N6558o4861q1123K101Q6052J57623K77128L68527L72021
11826C945736L53794L56423L67560L96849M40658M62732M35979L42896K85126
11817G387753L32097L15491J61101l3269k00585l60795n13789o23072o09294m47455
11807E408183k94518l06698m16100m68736l96505k14057l9131Q507j12922k84520
11797B883503l27300k76645k04888j12328k8384n86L253N8235J04589J03150N1973
11786B254572m4509j43026k52797l30329l17398j91898n178Q0849q216j60814
$$ plain form
11856 347290 628742 948542 1179050 1226137 1124158 992756 928129 908061 874132 842111
11846 842111 832454 871377 989178 1180181 1453111 1771676 2051664 2245154 2403020 2598722
11836 2598722 2771710 2828268 2763407 2682284 2684385 2770437 2928060 3205188 3573715 3945736
11826 3945736 4299530 4655953 5023513 5420362 5861020 6323752 6759731 7102627 7387753
11817 7387753 7719850 8035341 8196442 8163173 7962588 7601793 7088004 6464932 5855638 5408183
11807 5408183 5113665 4806967 4390867 3922131 3525626 3311569 3272438 3280945 3168023 2883503
11797 2883503 2556203 2279558 2074670 1962342 1933958 1933372 1936625 1994860 2099449 2202599 2254572
11786 2254572 2210063 2067037 1814240 1483911 1166513 974615 969437 1050286 1042070 881256
11776H81256k30688j77345m6560J02731J52754Q6686L7552O0246J01909J03629
11766A072170M8548k0564o880L6249K607m7966m4423J6669R3817Q4940L5434O2783
11754A333384J35696J28868N6785r983p9979r2410J4986J74752K55715K25660
11744B143474K03400K35761K68794L26780M26070M88655N51192O88928Q09854
11735F142908Q43081Q18782P23175N38349L94551L13914J57732J8189P1906K46270
11725A0268857M25839N51380O17591O98643Q04545Q94991R55888R56865Q38367
11716A7012966O14872M24559K77324J46795O4544q032j33920l42276n31929o07770
11706A6917133o02119o17548o68642p92043r23501r40167r08019q80584q15711
$$ plain form
11776 881256 650568 473223 426663 529394 682148 768834 806386 866632 968541 1072170
11766 1072170 1120718 1100154 1093274 1129523 1132130 1084164 1039741 1056410 1150227 1235167 1270601 1333384
11754 1333384 1469080 1597948 1654733 1644750 1564771 1472361 1487347 1662099 1917814 2143474
11744 2143474 2346874 2582635 2851429 3178209 3604279 4092934 4644126 5333054 6142908
11735 6142908 6985989 7804771 8527946 9066295 9460846 9774760 9932492 9950681 10022587 10268857
11725 10268857 10694696 11246076 11863667 12562310 13366855 14261846 15217734 16174599 17012966
11716 17012966 17627838 18052397 18329721 18476516 18541060 18533028 18399108 18056832 17524903 16917133
11706 16917133 16315014 15697466 15028824 14236781 13313280 12373113 11465094 10584510 9768799
11697I768799p23207o36969n26562m08684l26396k80412k38713k30450l34238
11688F063168n05681o24529o71474o66488n96948m62938k95891j46940o2607n0287
11678A979385o9539j7737J08913K26389K70131K84371K57696M6038k92931n28186
11668B264530n69719m82238k99829j34309n6786l6845m479j067l6475l1923N73
11657F11433j0645p9538j32853q4669n367j3577q4033p8706J6316P7878Q0010
11646B96249Q6744Q7483P2491Q3174R7115J04095N5719n0495j02530r2448q9976
11635E47621n0442O8496J29928L6095j03985j40307q2291n1992o3519q9005q7089
11624A13510q9473j64490j67984l3039R9543J51017J56229J28078J09466J43277
$$ plain form
11697 9768799 9045592 8408623 7882061 7473377 7146981 6866569 6627856 6397406 6063168
11688 6063168 5557487 4932958 4261484 3594996 2998048 2535110 2239219 2092279 2029672 1979385
11678 1979385 1909846 1892109 2001022 2227411 2497542 2781913 3039609 3085647 2792716 2264530
11668 2264530 1694811 1212573 912744 778435 721649 684804 680325 679258 642783 610860 611433
11657 611433 600788 521250 388397 303728 298361 284784 200751 122045 138361 216239 296249
11646 296249 382993 470476 542967 626141 723256 827351 883070 832575 730045 637597 547621
11635 547621 497179 565675 695603 731698 627713 487406 405115 353123 289604 200599 113510
11624 113510 24037 -140453 -308437 -341476 -241933 -90916 65313 193391 302857 446134
11614D46134J52571O6253m5952r5312j11164j53032k22189k03151j31229q1383
11604c78454l8788p321j0616o7317j08306k1222J42516K40011J94111Q5728K4455
11593E4797L6551Q5014R6239O5045N733r4541j63118j46725j08629j05799j04025
11582c79458p4964l3094P3406J90398J72028Q6827M6563q941j07037j86720k63491
11571d84483k93087j62847R41P2036J11811K19831L21268K73601J08239k9088
11561A38222p7592r6343j19072j02743n0440J966N6553O7888J0953l7570j5119
11550b23297J5188M6853N8244p268q2130q0424j2622N2413J34192K23394K85289
11539D09832K87871K27015J50854N0154n0707n6219j4551n1433j23196j10346
$$ plain form
11614 446134 598705 664958 619006 523694 412530 259498 37309 -165842 -297071 -378454
11604 -378454 -417242 -424563 -435179 -502496 -610802 -632024 -489508 -249497 -55386 30342 54797
11593 54797 91348 176362 272601 337646 343379 248838 85720 -61005 -169634 -275433 -379458
11582 -379458 -454422 -487516 -414110 -223712 -51684 35143 81706 72765 -34272 -220992 -484483
11571 -484483 -777570 -940417 -939476 -867440 -755629 -535798 -214530 59071 167310 138222
11561 138222 60630 -35713 -154785 -257528 -307968 -306002 -249449 -181561 -170608 -208178 -223297
11550 -223297 -208109 -161256 -103012 -110280 -192410 -272834 -285456 -233043 -98851 124543 409832
11539 409832 697703 924718 1075572 1125726 1075019 1018800 1004249 952816 829620 719274
11529G19274l6866j620J7467N4181N6738L6443l2216j28445j91438k53147k78546
11518c8175k05486r1821K5518J35472J73965J22338N8584L5704L6563L6535Q949
11507B98146K944p716k7007J4117R0279J19588P0572M376n213O2075J87218K44548
11495A053927J87630J44874J19322R599j21438j59704j39749j63261k01369j88550
11485E41281j37545n8068K046k8762p1122o6338n4165n9821p1355m5562j5670
11474f5081k0666j6600M5387J60672K32116K34375K03668J59042N3423q7130j93521
11463G05685l07644l89972l13098j18567O616K0131k3990p1115n7648n9532j19312
11452g28446j05930M842J40280K18666K34626K12238J24400J3749l3092k2066
$$ plain form
11529 719274 682408 680788 698255 752436 809174 845617 813401 684956 493518 240371 -38175
11518 -38175 -243661 -335482 -309964 -174492 -527 121811 180395 216099 252662 289197 298146
11507 298146 301090 293374 266367 280484 370763 490351 560923 565299 560086 622161 809379 1053927
11495 1053927 1241557 1386431 1505753 1515352 1393914 1234210 1094461 931200 729831 541281
11485 541281 403736 345668 347714 318952 247830 181492 127327 67506 -3849 -49411 -65081
11474 -65081 -85747 -102347 -56960 103712 335828 570203 773871 932913 986336 899206 705685
11463 705685 398041 8069 -305029 -423596 -416980 -396849 -420839 -491954 -549602 -609134 -728446
11452 -728446 -834376 -829534 -689254 -470588 -235962 -23724 100676 114425 81333 59267
11442E9267m6569j54603k04345j74355j49860r4554J5561J23688J68712J69907
11432b87151J20427M1311n8336j61296j75560m8939J08441J24473J9268m3751
11422c61113l928L9225M6638O9800J37144K18998K56502K62427K71088K42811
11412A179592J38676N4954M5183N9719J10620J21634L3986r2147j96454k31653
11402A224110j96210j36099j18948j27962q8333J1438M2726o4417j80495j67120
11392A98690k0840J29964J82555J42173K6753j01282j25377n0058q481k6179n3262
11381B94656p6936r5012j35610j47919q2762j7814j3136m158N0408R6015Q4946
11370d7322P6128M2921l8451q4047n1396P465j3259r4761j69984j59421j6137
$$ plain form
11442 59267 12698 -141905 -346250 -520605 -670465 -765019 -749458 -625770 -457058 -287151
11432 -287151 -166724 -125413 -183749 -345045 -520605 -569544 -461103 -336630 -317362 -361113
11422 -361113 -365041 -325816 -279178 -209378 -72234 146764 403266 665693 936781 1179592
11412 1179592 1318268 1373222 1418405 1478124 1588744 1710378 1744364 1652217 1455763 1224110
11402 1224110 1027900 891801 772853 644891 556558 567996 610722 546305 365810 198690
11392 198690 177850 307814 490369 632542 659295 558013 432636 382578 374097 347918 294656
11381 294656 217720 122708 -12902 -160821 -243583 -261397 -274533 -278691 -228283 -132268 -47322
11370 -47322 28806 71727 33276 -50771 -102167 -94702 -107961 -202722 -372706 -532127 -548264
11359e48264J17609J43883J58351K38697K39190R8583l4948j24935j72878j21584
11349f296M0015J90663K00215J09098J5253K1908Q9877R0465L845q4925j19580
11338E50538j01995l7471j4749q4262j60564j27534k857Q3486Q4892L2371l4527
11327A87328j09236j95073k15450j69957p6196L6649P8123N8136L5137K8605K2361
11316c19573l1546j14992r7498L5135J21872N5844o0785q8702p7353n6044O490
11305f27152J9887p771M4155J73828K82375L23565K75087J24923k6094j44524
11295D38279k60116k71004j57534m4626J602L2384Q6844J32984J00253l4219j30535
11284a05688q4950l2610o6656r0145m7265N086M033j2198K5705J00381J34671
$$ plain form
11359 -548264 -430655 -286772 -128421 110276 349466 448049 413101 288166 115288 -6296
11349 -6296 33719 224382 424597 533695 548948 570856 660733 751198 755043 670118 550538
11338 550538 448543 411072 396323 312061 151497 23963 21106 104592 189484 221855 187328
11327 187328 78092 -116981 -332431 -502388 -578584 -541935 -463812 -405676 -370539 -341934 -319573
11316 -319573 -351119 -466111 -563609 -528474 -406602 -350758 -411543 -500245 -577598 -633642 -627152
11305 -627152 -607265 -615036 -570881 -397053 -114678 208887 483974 608897 582803 438279
11295 438279 178163 -92841 -250375 -295001 -293399 -261015 -174171 -41187 59066 24847 -105688
11284 -105688 -190638 -223248 -289904 -380049 -427314 -422228 -418195 -430393 -404688 -304307 -169636
11273a69636J26995K4672j43546k11651j40834m4559L1076J22686K20317K48026
11263F3546J48351p5304k89660l04966j10055Q7182J35543J01279M9979j9968
11253b14073r6968j29912m7287Q7061J53587K00335K31457K42029K10504Q5844
11243G22577l3258m2620q5602k49749l54175k88332j41020q33P3237O8856J2638
11232c18281o1165j32500j71828r8207N5539J79285J63716J8201j06747p9999
11222e51986o690o086J3292O7193R1823R0135Q1728P2124M1931j5527r5320j34307
11210c51690n9357P5379J47289J66316J76106J42454N1527p7138j97171k60348
11200a86633k50602j70769n0148P0428J15972Q2053N6371K9091q401l2621k93
$$ plain form
11273 -169636 -42641 -17969 -161515 -373166 -514000 -558559 -527483 -404797 -184480 63546
11263 63546 211897 136593 -153067 -458033 -568088 -480906 -345363 -244084 -194105 -214073
11253 -214073 -311041 -440953 -488240 -401179 -247592 -47257 184200 426229 636733 722577
11243 722577 689319 646699 561097 311348 -42827 -331159 -472179 -473012 -399775 -330919 -318281
11232 -318281 -379446 -511946 -683774 -781981 -726442 -547157 -383441 -365240 -471987 -551986
11222 -551986 -558676 -564762 -551470 -484277 -392454 -302319 -220591 -148467 -106536 -122063 -217383 -351690
11210 -351690 -411047 -335668 -188379 -22063 154043 296497 348024 270886 73715 -186633
11200 -186633 -437235 -608004 -658152 -587724 -471752 -389699 -333328 -304237 -312638 -345259 -345552
11189c45552M7804M3063J1594p943j1529M1749J27506J97761K68632K69120J74435
11178H16640R2846K8045j07593k20806j90720r1772J844Q372o8686j70657k56170
11167a58657k53191j37347j9854P091M6586J36326J96953J70687R7756N4304J3616
11156A54270k6392m4011m0447j2488M9125J03880Q8588N6344O7207K6902q0571
11145C42407j69518j97837j59328o9876j2078j8921K85N1811P2724N6547J3624
11134i0160l2544k9648j0857M180J1484k9557o6497m0982k9707n6029p5350m4342
11122d90009L3381J02188O1349r0253j64427p9001M1486O6663J8902k9363o1917
11111e91001k0519K5082K4404O3187R3731L1086j21446k30602k18814j31367j2186
$$ plain form
11189 -345552 -297748 -254685 -243091 -251034 -262563 -220814 -93308 104453 373085 642205 816640
11178 816640 909486 937531 829938 609132 418412 326640 328484 336856 268170 97513 -158657
11167 -158657 -411848 -549195 -569049 -561958 -515372 -379046 -182093 -11406 86350 140654 154270
11156 154270 127878 83867 43420 30932 80057 183937 272525 328869 396076 422978 342407
11145 342407 172889 -24948 -184276 -254152 -266230 -285151 -284866 -233055 -160331 -103784 -90160
11134 -90160 -122704 -152352 -163209 -159029 -147545 -177102 -243599 -284581 -314288 -370317 -445667 -490009
11122 -490009 -456628 -354440 -293091 -383344 -547771 -626772 -585286 -518623 -499721 -529084 -591001
11111 -591001 -611520 -586438 -562034 -498847 -405116 -374030 -495476 -726078 -944892 -1076259 -1088445
11100a088445O8955P8595M9455n4889k18377k62981j26077O3897J92712K38511
11090a058644K17908J97601J90734J31203k1183j90198k51053j74798p1716M6723
11080i83423J79555K08642J38632N8340K2160j6418l8691k0662N5244J81099K56746
11069D1224K57872J94019O7553j9361m4906j00188j81129k05415j26875m5972
11059a63178n8680j45831j88635j07484q962K5142R1179J51991J44482R1846N80
11048a67550q7227j32563j71608j88756j33131n3428k0367L7279K57325N04251
11038a55775N27157L49867J17714o8864j32876j12303o7109l9254q4617j50518
11028A83422j24782j6094N2488Q228r5559j19880l6517J4707m9548j60154j74735
$$ plain form
11100 -1088445 -1019490 -940895 -891440 -946329 -1164706 -1427687 -1553764 -1489867 -1297155 -1058644
11090 -1058644 -840736 -643135 -452401 -321198 -342381 -532579 -783632 -958430 -1030146 -983423
11080 -983423 -803868 -595226 -456594 -398254 -376094 -392512 -431203 -451865 -396621 -215522 41224
11069 41224 299096 493115 560668 541307 496401 396213 215084 9669 -117206 -163178
11059 -163178 -221858 -367689 -556324 -663808 -672770 -647628 -556449 -404458 -259976 -168130 -167550
11048 -167550 -254777 -387340 -558948 -747704 -880835 -934263 -954630 -917351 -660026 -155775
11038 -155775 371382 721249 838963 770099 637223 524920 457811 418557 333940 183422
11028 183422 58640 42546 95034 103262 7703 -112177 -148694 -133987 -183535 -343689 -518424
11017e18424p7081L8789J12518J00221K4313O966R2305J77292J63585J7531j91277
11006e3262k70163j36194O0016J86917J38331l0682p5886L2839J45717J64283
10996A61916J24807Q7342J3237p9820j45492j68749j37349p7674n6862p3051j08502
10985d60197j21874p4753j0614L0051P2048J37570K06728K28401J70040O2125
10975B39525l4916r0791q6015o3491q7997j20733j02585p3657l8963J7596O7239
10964c74788J16774R4009j5646n4716N0725K23292L27462K84828J43765M7774
10954H43479J6993m918j5761k7460j03569k20599k70972j69313R221J05259N7493
10943B19853m2703o4728R723Q0314P7972L6982K888K3929J01966J38046O1414
$$ plain form
11017 -518424 -595505 -556716 -444198 -343977 -319664 -312698 -220393 -43101 120484 138015 -53262
11006 -53262 -323425 -459619 -399603 -212686 -74355 -105037 -180923 -148084 -2367 161916
10996 161916 286723 374065 387302 307482 161990 -6759 -144108 -221782 -278644 -351695 -460197
10985 -460197 -582071 -656824 -667438 -637387 -565339 -427769 -221041 7360 177400 239525
10975 239525 204609 113818 27803 -35688 -123685 -244418 -347003 -420660 -459623 -442027 -374788
10964 -374788 -258014 -164005 -179651 -234367 -183642 39650 367112 651940 795705 843479
10954 843479 860472 855554 839793 812333 708764 488165 217193 47880 57101 162360 219853
10943 219853 177150 112422 122145 202459 280431 317413 320301 344230 446196 584242 645656
10932F45656j6837l9006k0859k0140m2154j4558K0940K2348J4910k5895p5725
10921D48680j07896j49965j64454j27749p6692k2814J1310k4184j14906j91241
10911e19911j87640j50826j27155o1218L0886J47666K23521J86770P1617l0866
10901d17156r2475j41443j29662m3168k8407o2188l9971M5905J42608J75776J15342
10890d74839M7518N4383N8548L057l0117k5430J532N7800O8085k1384j05156o8474
10878d34477L5427J31502J86434J66202J11756P3973M8253L7803L7486L9242L6195
10867D69796k5925j59715k92136k71985j59894j62079j98799j09655J2517N4654
10857h43221O3805R6750J63471J90180J47964J06855O3553o7425k30125k55172
$$ plain form
10932 645656 628819 589813 568954 548814 506660 492102 513042 535390 550300 524405 448680
10921 448680 340784 190819 26365 -101384 -178076 -200890 -189580 -213764 -328670 -519911
10911 -519911 -707551 -858377 -985532 -1046750 -1015864 -868198 -644677 -457907 -386290 -417156
10901 -417156 -509631 -651074 -780736 -823904 -852311 -914499 -954470 -908565 -765957 -590181 -474839
10890 -474839 -427321 -372938 -314390 -311333 -341450 -366880 -365348 -307548 -239463 -260847 -366003 -434477
10878 -434477 -399050 -267548 -81114 85088 196844 270817 319070 356873 394359 433601 469796
10867 469796 443871 284156 -7980 -279965 -439859 -601938 -800737 -910392 -897875 -843221
10857 -843221 -779416 -682666 -519195 -329015 -181051 -74196 -10643 -78068 -308193 -563365
10847e63365j57635o0894n894j953l406P1764J48775J11818M2384M2443P1626
10836c04337Q0066M0492l9621j07831p6755M5033J46324J96808J77873N3528r9489
10825A12091j82055j94209j56551j11652j29725j18079n5675k9766k0190M2368
10815h43443J17742J26619J21103J61488J77881J25873O4688L3451K9064K4955
10805A39421o9976k13718k44240j49148n9428n6558m3512q837j1540l2701n764
10794g56001O7103O5484O841l4314m5170q7669j41129p6113K7298K8283l489M0295
10782i08581J07540J18084R0489J3259r1840j29099n1067Q4043J30730P0521N105
10771e60816M426k7509j55981j83362m6481N1286M5606M0139Q7870J59317J76234
$$ plain form
10847 -563365 -721000 -781894 -787788 -789741 -793147 -721383 -572608 -460790 -418406 -375963 -304337
10836 -304337 -224271 -183779 -223400 -331231 -407986 -362953 -216629 -19821 158052 211580 112091
10825 112091 -69964 -264173 -420724 -532376 -662101 -780180 -835855 -865621 -885811 -843443
10815 -843443 -725701 -599082 -477979 -316491 -138610 -12737 51951 85402 114466 139421
10805 139421 69445 -144273 -388513 -537661 -597089 -653647 -697159 -705996 -717536 -750237 -756001
10794 -756001 -688898 -623414 -616573 -650887 -696057 -783726 -924855 -1000968 -973670 -945387 -948876 -908581
10782 -908581 -801041 -682957 -592468 -579209 -671049 -800148 -851215 -767172 -636442 -565921 -560816
10771 -560816 -556390 -583899 -739880 -923242 -969723 -918437 -872831 -832692 -744822 -585505 -409271
10760d09271J25868Q6037K3574n8067j00551n0855N0844R3982P4218O8118Q1304
10749a4799R1175J19447J41498N6011p7147j65967k24457k72714k68112k02069
10739h17134j39856q8674l6757J1642J8016l4188o0955l359O3589O0940K5459
10728a001277k6315l1358Q5120K16132K55839K58026K34947J77009J05832L0999
10718C04954K6648Q3671K8980j12515j54274r5984p437O3146N1467l1840j77509
10707b0693k95511k42293r6744j8484m4504q7342q6042p282Q9743J49730J62279
10696d97143J01056M7258O7585J26473J32230M3305o4489p0355q858r648m5170
10685a77756j4452J8752k8049p6025j9472P3578P0789L692m1166n7317p5210j6846
$$ plain form
10760 -409271 -283403 -197366 -173792 -231859 -332410 -383265 -332421 -238439 -164221 -96103 -14799
10749 -14799 76376 195823 337321 393332 316185 150218 -74239 -346953 -615065 -817134
10739 -817134 -956990 -1045664 -1082421 -1070779 -1052763 -1086951 -1147906 -1151265 -1087676 -1026736 -1001277
10728 -1001277 -1027592 -1058950 -973830 -757698 -501859 -243833 -8886 168123 273955 304954
10718 304954 331602 415273 444253 331738 177464 81480 74043 137189 188656 156816 -20693
10707 -20693 -316204 -558497 -655241 -673725 -718229 -805571 -891613 -898895 -809152 -659422 -497143
10696 -497143 -396087 -348829 -281244 -154771 -22541 20764 -43725 -114080 -122938 -132586 -177756
10685 -177756 -192208 -173456 -201505 -277530 -297002 -223424 -152635 -148943 -190109 -247426 -322636 -339482
10673c39482J18180J38065Q722n5177j4253j3833l1361j8522j5729L801M7273
10662a72316O5623R4249J44331J52595R2384R618q9115j81939k15459k21328k20916
10651e42273j34039p702K6767L892K0115J10908K22381K50243Q8219j74255l11794
10640d47538k67531j50953k9323Q2762J45411J32378N3113j6252N2663J91383
10630b53887K07446R5401n000j0516L6473N5612K6662m550K238m270m1124n2270
10618E2215r7251j67894j55565n5547O0905J13890J17259J29939J17180R3188
10608B08319P4496N1822O0285M2980p1999j76496j29864o518J7848o3029j10632
10597a02788q9958q4550q1118l1072L4878Q1198Q7586Q1195Q6650O5316n544j08674
$$ plain form
10673 -339482 -221302 -83237 -74515 -129692 -143945 -157778 -189139 -207661 -223390 -219589 -172316
10662 -172316 -106693 -12444 131887 284482 376866 386484 297369 115430 -100029 -321357 -542273
10651 -542273 -676312 -684014 -657247 -653355 -633240 -522332 -299951 -49708 38511 -135744 -447538
10640 -447538 -715069 -866022 -895345 -812583 -667172 -534794 -481681 -497933 -445270 -253887
10630 -253887 -46441 48960 43960 33444 69917 125529 152191 147641 149879 145609 104485 52215
10618 52215 -45036 -212930 -368495 -424042 -363137 -249247 -131988 -2049 115131 208319
10608 208319 282815 334637 394922 437902 365903 189407 59543 53025 70873 7844 -102788
10597 -102788 -192746 -277296 -358414 -389486 -354608 -273410 -185824 -104629 -17979 47337 41793 -66881
10585f6881j86870j89756j10263l1177k260j5991n3034l0579N7700J07657J45762
10574c75692K13968K31376J47528K2809m0514o3696j01881j21463j14506j15743
10564c17814r3112l3973M5129J39601K34843K33220O7754j03801j31906q8750
10554d8809m6130l2089k7009k2183l8395j5171O3496J21575P1430j0326k3870
10543g481k7605o1682o5660j8272J4250M9093O3043M7397M2250j1414r9358j48539
10531b23978j31855n5974J7216J928n5841o7694m309J20194J69902N8611o5879
10520b37679q6918o8658p8418k8413J31253K71050K77259J72025O3074k7262j63223
10509B24090k41060j84339j31113j35266p8553O7634J87820J77478Q3779O4522
$$ plain form
10585 -66881 -253751 -443507 -553770 -584947 -587207 -603198 -656232 -686811 -629111 -521454 -375692
10574 -375692 -161724 69652 217180 239989 199475 135779 33898 -87565 -202071 -317814
10564 -317814 -410926 -444899 -399770 -260169 -25326 207894 275648 171847 39941 -48809
10554 -48809 -94939 -127028 -154037 -176220 -214615 -229786 -166290 -44715 26715 16389 -7481
10543 -7481 -35086 -96768 -162428 -180700 -166450 -117357 -54314 -6917 35333 23919 -75439 -223978
10531 -223978 -355833 -411807 -394591 -392663 -448504 -516198 -520507 -400313 -230411 -171800 -237679
10520 -237679 -324597 -393255 -471673 -500086 -368833 -97783 179476 351501 414575 387313 224090
10509 224090 -16970 -201309 -332422 -467688 -546241 -478607 -290787 -113309 -29530 34992
10499C4992R2029Q1220Q40r3260r0459j4968k9803j56670k64013j97397j9015
10488f56504J10238J90592K42520K52008K06730J03279m285o3380j21503j54661
10478A05034j17444m3042N4518J40194J68016J16552J4099j7607L2660M9433K0711
10467E23124N54k567j1900k9057l45M4368k6444k05322l09790k79061k32272j93431
10455g22143j43554j19540q5399m0665l2453l0935k1714L3921J57880K49048K31140
10444e24414J19246k6537r5306n7356K833K4505M4757N6941O6258J00351J09999
10433a78723P0432M2472N9265L5194l6811o6974j2291J07208J76620J38530L5192
10422C70114p1735j34339j41185q6650J9437R4209N2652p6126j76797k01993j72734
$$ plain form
10499 34992 127021 208241 209081 115821 25362 10394 -19409 -176079 -440092 -637489 -656504
10488 -656504 -546266 -355674 -113154 138854 345584 448863 444578 381198 259695 105034
10478 105034 -12410 -55452 -934 139260 307276 423828 437927 420320 452980 502413 523124
10467 523124 523678 521111 509211 480154 479809 524177 497733 292411 -17379 -296440 -528712 -722143
10455 -722143 -865697 -985237 -1070636 -1111301 -1143754 -1174689 -1196403 -1162482 -1004602 -755554 -524414
10444 -524414 -405168 -431705 -527011 -584367 -581534 -557029 -512272 -455331 -389073 -288722 -178723
10433 -178723 -108291 -65819 -6554 28640 -8171 -75145 -87436 19772 196392 334922 370114
10422 370114 298379 164040 22855 -63795 -44358 49851 102503 26377 -150420 -352413 -525147
10411e25147r8108j7797N0668J14387J49119J12611J1040q8095j16573o3110M559
10400d66446m111k6932q325n975L5195J69347K77470K42513J05873J6161M4315
10389C79085J59204K30110K01617J25929L0064q7575j96316k14569j23793j6686
10379D87070j3666j19209j84110j29100n1041k9799j9457M450k319k7146l7387
10368a21714l8013l739O0888N6988l294k3405k1997m8176n4930j8838K9128m666
10356a91768j05520r8222K5637J26088J13781M8155J4647O190N0797P7023j179
10345F5629r8635j46098j03582K6469J54720K24781J97978J08046M6332J4287
10335D89927M0534J02494R8464N0781L1452K3135j1285o0538j14772j43579j38781
$$ plain form
10411 -525147 -623255 -641052 -590384 -475997 -326878 -214267 -203227 -291322 -407895 -471005 -466446
10400 -466446 -470557 -497489 -505814 -511789 -476594 -307247 -29777 212736 318609 334770 379085
10389 379085 538289 768399 970016 1095945 1126009 1038434 842118 627549 503756 487070
10379 487070 473404 354195 170085 40985 -10056 -39855 -59312 -54862 -57181 -84327 -121714
10368 -121714 -159727 -163466 -102578 -45590 -48884 -72289 -94286 -142462 -197392 -216230 -187102 -191768
10356 -191768 -297288 -395510 -369873 -243785 -130004 -81849 -67202 -61012 -10215 66808 65629
10345 65629 -33006 -179104 -282686 -256217 -101497 123284 321262 429308 475640 489927
10335 489927 530461 632955 731419 782200 813652 836787 825502 764964 650192 506613 367832
10324C67832j21733o7669L2466J49229J95094J14740k2265q4581j5035Q5205P9370
10313G12653l60q2499j48526j50111j17413j24210j55284j36448o1510O5988J48084
10302d9636R7022O4726J15214J48034J76381J78034L6001j83209k90858k32191
10292E9518q7869M4082J60424K54799K71127K03848J37929P8392r472r2264j60190
10281H60324j86606j72194j63151j21373l9785L4659R4075P1800Q051J8415K6743
10270D30958j8583k6595Q640K3783K219l0366k8010L2545N1257j3973l0273N4833
10258D56435J02632O6722J23q1918j36952r5395o24K0785l2237j04755r8640p471
10246H8705M0712L5802P0918J43377J55960R3955K8672J7597O4304J23453J47264
$$ plain form
10324 367832 246099 178430 210896 360125 555219 669959 647694 563113 548078 633283 712653
10313 712653 712293 629794 481268 331157 213744 89534 -65750 -202198 -263708 -197720 -49636
10302 -49636 47386 112112 227326 375360 551741 729775 765776 582567 291709 59518
10292 59518 -28351 15731 176155 430954 702081 905929 1043858 1122250 1112778 1020514 860324
10281 860324 673718 501524 338373 217000 177215 211874 305949 377749 385800 404215 430958
10270 430958 412375 385780 394420 418203 420422 390056 362046 394591 445848 431875 401602 456435
10258 456435 559067 625789 625912 543994 407042 311647 311023 331808 299571 194816 96176 88705
10246 88705 129417 165219 236137 379514 535474 629429 658101 675698 740002 863455 1010719
10235A010719N3956r9373j75868j30886j4263P2863M0276o7267j58952k26075
10225C05130k41191k01697j09788R764J22931K15294K23143J12823m9248j31522
10215B55639o2418Q2570J69475J60912J42699J53558J29666J1562j55714k51455
10205F36494j99557p4327Q679J8314P960L8961J14186K20354L14844L15328K77581
10194A678817K46134J71725L7636j14770j90163j58854j03570o1395J8903J14450
10184A638913R8603n0418j96031k38043j81811l7985J33789K22210K20434J56482
10174A766143P8426M5131J2532m8569r7364j30892j48822j25309j18279j65453
10164A067544j95921j60192j04341n9696p1981j31484j32295n7159Q106J1505
$$ plain form
10235 1010719 1064675 965302 789434 658548 644285 717148 757424 690157 531205 305130
10225 305130 63939 -137758 -247546 -237782 -114851 100443 323586 436409 387161 255639
10215 255639 193221 275791 445266 606178 748877 902435 1032101 1043663 887949 636494
10205 636494 436937 362610 371289 389603 397563 436524 550710 771064 1085908 1401236 1678817
10194 1678817 1924951 2096676 2134312 2019542 1829379 1670525 1566955 1505560 1524463 1638913
10184 1638913 1737516 1687098 1491067 1253024 1071213 1033228 1167017 1389227 1609661 1766143
10174 1766143 1844569 1889700 1902232 1853663 1756299 1625407 1476585 1351276 1232997 1067544
10164 1067544 871623 711431 607090 547394 475413 343929 211634 154475 162581 174086
10154A74086L0071M9940j0292p4068m9709M1602J33368J67316J09092K4187K9178
10143F24771J00640J26596P1267j7361r4579j22984p2204j2781P685M0986N1494
10132G03530J5318k3246l2962r836K9505N1735Q6897J08327J06942J09779N7599
10121A203588j6307j7924O8364J24269J46137J56637J40522J36465J32101J14775
10111B188627J12621J11547P1788l552l4803j194K1819K8146N8014J24931K08213
10100B886157K02178P3447l6050j7302N9152N6454j4496n4842o2085k0813Q3640
10089C155440J56810J54873J32930J54114J65430J03125K1216l8632l2018M8458
10079D021746J26955J48565R7318o083o7359n2295j5117m2501j83069l67443m46370
$$ plain form
10154 174086 204157 254097 243805 169737 120028 161630 294998 462314 571406 595593 624771
10143 624771 725411 852007 923274 905913 811334 688350 616146 603365 611050 652036 703530
10132 703530 718848 695602 662640 652804 682309 734044 820941 929268 1036210 1145989 1203588
10121 1203588 1187281 1169357 1237721 1361990 1508127 1664764 1805286 1941751 2073852 2188627
10111 2188627 2301248 2412795 2484583 2481031 2446228 2445034 2466853 2494999 2553013 2677944 2886157
10100 2886157 3088335 3161782 3125732 3108430 3167582 3224036 3209540 3154698 3092613 3071800 3155440
10089 3155440 3312250 3467123 3600053 3754167 3919597 4022722 4043938 4005306 3973288 4021746
10079 4021746 4148701 4297266 4394584 4388501 4321142 4268847 4253730 4211229 4028160 3660717 3214347
10068C214347l48959j60985j7541L7755O1955O7382M9772J6598m0110l2523N2720
10057B900411L1813o7418j12478j36872j78250j58903q4946p9622j53492k75103
10047A685140l42338k62273r7874N5428M9083j45326k78436k52174j87350j45227
10037G8653o7082P1507J68387J22565m316r0210r6998p8330o5442j8771K8006
10026D7969M7864M9983o272j5341P9559J83317K27055K13676J47351K5109o1439
10015I38831l6505O08q3253k01257k32887j91444j29574j33558j90982j40642
10005d00663L6566J80781J39707J6906P423Q4821J48011J45197N7198n6729j19192
9994B40026j54347j80316j68674j00573J6342J28016K15091K78612K63555J86338
$$ plain form
10068 3214347 2865388 2704403 2686862 2724617 2786572 2853954 2903726 2920324 2880214 2847691 2900411
10057 2900411 2932224 2864806 2752328 2615456 2437206 2278303 2193357 2113735 1960243 1685140
10047 1685140 1342802 1080529 982655 1038083 1087166 941840 663404 411230 223880 78653
10037 78653 11571 83078 251465 374030 369714 279504 182506 104176 38734 19963 47969
10026 47969 95833 145816 139544 124203 203762 387079 614134 827810 975161 1000270 938831
10015 938831 902326 902934 819681 618424 385537 194093 64519 -69039 -260021 -400663
10005 -400663 -364097 -183316 -43609 -26703 -19280 65541 213552 358749 415947 359218 240026
9994 240026 85679 -94637 -263311 -363884 -347542 -219526 -4435 274177 537732 724070
9984G24070R3948K992m7414m8761l0788N238M8863N0433L6391J7086j8201o3684
9972G70173l9289M3261N0725L2787O5807O4010J682r3915j66489j54055j07026
9961D67671r2892j24707j17656k1565J00022J69048J95890J96356J62867J25300
9951A060334Q4098K7608Q194L5456R890o6120j05181j04164k6510J03286J37515
9940A164406O8119j3446o8785o8923k5591L084K8136O5092M6865o7813j36979
9929I94165p8231q8O3744J50037J82676J40227M6221n2300j24102j47145r3371
9918A081833l125O5414J09623J62353J76128J17663J7560m6290l6348J1536M5997
9907A702344r809q7079p5111k773P3451J03499O1625j0157q3749q4254p745M1473
$$ plain form
9984 724070 818018 821010 773596 724835 694047 699285 748148 798581 834972 852058 833857 770173
9972 770173 730884 774145 824870 857657 923464 987474 989156 895241 728752 574697 467671
9961 467671 374779 250072 132416 110851 210873 379921 575811 772167 935034 1060334
9951 1060334 1144432 1172040 1180234 1215690 1225580 1159460 1054279 950115 923605 1026891 1164406
9940 1164406 1232525 1219079 1150294 1081371 1055780 1058864 1087000 1152092 1198957 1131144 994165
9929 994165 915934 915846 979590 1129627 1312303 1452530 1498751 1446451 1322349 1175204 1081833
9918 1081833 1078708 1144122 1253745 1416098 1592226 1709889 1727449 1681159 1644811 1656347 1702344
9907 1702344 1692535 1605456 1530345 1527572 1601023 1704522 1766147 1755990 1672241 1587987 1580242 1621715
9895A621715J7510j8922R215O9368Q7020R2921P9157J9696j760J6157k0793r7375
9883A873909k01320l06756l15128k01001m1331P2177R1942L8055n2496j30287
9873H27764j55644j45078j58521j65801p3372R3383J90881J35075k8957j77663
9863C42067k00690j08280P274R8261J46173J23049P6649M6733n0988j85904k06972
9852H7372j47125q2263J4922J03013J14375P9181K2905j5958k6027l604K8138
9841A74929M52m4575J2677Q5241O0248L5229O6142Q7485Q8780Q0741Q5559Q7975
9829H20883O7287K9716m068J2689N8699P8508N8426O5203J15895J65136J47214
9818A615588O3096n442R717O0285J16605J42389O8071O612N8439J67625K79076
$$ plain form
9895 1621715 1639225 1620303 1629518 1698886 1785906 1878827 1957984 1977680 1975920 1992077 1971284 1873909
9883 1873909 1672589 1365833 1050705 849704 808373 880550 972492 1010547 958051 827764
9873 827764 672120 527042 368521 202720 129348 222731 413612 548687 519730 342067
9863 342067 141377 33097 40371 138632 284805 407854 484503 531236 480248 294344 87372
9852 87372 -59753 -142016 -127094 -24081 90294 169475 192380 176422 150395 146791 174929
9841 174929 175381 130806 143483 228724 288972 324201 390343 477828 566608 647349 732908 820883
9829 820883 888170 917886 913818 926507 985206 1063714 1122140 1187343 1303238 1468374 1615588
9818 1615588 1678684 1673242 1682959 1743244 1859849 2002238 2070309 2076921 2135360 2302985 2582061
9807B582061L59224L34614K07149R2696N0053M2037J1435k7170m126P0343R6377
9796C814693L5102j5245j9677q029k2388q7702j55661j57491p9630q976O963O381
9784C308340n053m0502r5873j38637j68952j84521j24481k3313k6012j87948l65314
9773A947734m03227k78294m9985J38996J79805J42682J12370O1690n0114j45020
9763A656637j55778j38928j38839j13970j300J79139K63343J79216P0867r403
9753A790984j12949j84778k10201k80910l49066l17163k27801j34483o0828l7330
9743a24525n1416m8261j2720L531J2707O241j1836j8336k0069j1629j476K2968
9731b54821R5586K08965K74663K41363J58611R8064O9899m5022j96623k39235
$$ plain form
9807 2582061 2941285 3275899 3483048 3575744 3625797 3667834 3679269 3652099 3647973 3718316 3814693
9796 3814693 3849795 3834550 3814873 3806844 3784456 3696754 3541093 3383602 3303972 3294996 3301959 3308340
9784 3308340 3303287 3262785 3166912 3028275 2859323 2674802 2550321 2527008 2500996 2313048 1947734
9773 1947734 1544507 1266213 1216228 1355224 1535029 1677711 1790081 1851771 1801657 1656637
9763 1656637 1500859 1361931 1223092 1109122 1107822 1286961 1550304 1729520 1800387 1790984
9753 1790984 1678035 1493257 1283056 1002146 653080 335917 108116 -26367 -87195 -124525
9743 -124525 -175941 -224202 -236922 -233391 -220684 -214443 -226279 -244615 -264684 -276313 -277789 -254821
9731 -254821 -159235 49730 324393 565756 724367 822431 892330 847308 650685 411450
9721D11450j99555j30422p5441q4522j31795j03016M0803J59216K09460K24771
9711C20949J45757M3136o540J0512M3802K9393q698o2011r6639p6632l0828k439
$$ plain form
9721 411450 211895 81473 6032 -78490 -210285 -313301 -272498 -113282 96178 320949
9711 320949 466706 509842 503302 513814 557616 587009 578311 516300 419661 343029 312201 309762
$$ [...]
##END NTUPLES=NMR SPECTRUM
##END=
